##TITLE=1H_DE-80H_X3
 200.13MHz, d2o
 8 sc
 
 19ns.26.2.2025
##JCAMPDX= 6.0         $$ Bruker NMR JCAMP-DX V2.0
##DATA TYPE= NMR SPECTRUM
##DATA CLASS= NTUPLES
##ORIGIN= UXNMR, Bruker Analytische Messtechnik GmbH
##OWNER= pz
$$ XWIN-NMR		Version 3.5
$$ Wed Apr 22 10:44:29 2026 Russian Standard Time (UT+4h)  Yarkov@DPX200
##.OBSERVE FREQUENCY= 200.1313
##.OBSERVE NUCLEUS= ^1H
##.ACQUISITION MODE= SIMULTANEOUS
##.ACQUISITION SCHEME= undefined
##.AVERAGES= 8
##.DIGITISER RES= 18
##SPECTROMETER/DATA SYSTEM= spect
##.PULSE SEQUENCE= zg30
##.SOLVENT NAME= DMSO
##.SHIFT REFERENCE= (INTERNAL, DMSO, 0, 15.3723)
##AUDIT TRAIL= $$ (NUMBER, WHEN, WHO, WHERE, WHAT)
$$ ##TITLE= Audit trail, XWIN-NMR		Version 3.5
$$ ##JCAMPDX= 5.01
$$ ##ORIGIN= Bruker BioSpin GmbH
$$ ##OWNER= Yarkov
$$ C:/Bruker/XWIN-NMR/data/yarkov2/nmr/H-C/1/pdata/1/auditp.txt
$$ ##AUDIT TRAIL=  $$ (NUMBER, WHEN, WHO, WHERE, WHAT)
(   1,<2026-04-22 10:43:42.10 +0400>,<Yarkov>,<DPX200>,
      <created by zg, POWCHK disabled, PULCHK disabled
       configuration hash MD5:
       00 E9 B6 7A A2 85 ED C7 34 08 36 98 17 FE 4E 26
       data hash MD5: 16K
       D5 B1 A7 31 A1 C8 A1 09 54 64 C2 4D 48 AC A5 1B>)
(   2,<2026-04-22 10:43:49.50 +0400>,<Yarkov>,<DPX200>,
      <Start of raw data processing
       efp BC_mod = 2 LB = 0.25 FT_mod = 6 PKNL = 1 PHC0 = -5302.316 PHC1 = 11.42193 SI = 16K 
       data hash MD5: 16K
       09 3C F6 5C 6C 3F FF D1 87 DD F9 54 19 A3 27 3B>)
$$ ##END=
$$ 
$$ hash MD5
$$ 37 23 CF 3A 6A B3 6C 62 CE 27 A5 CF 76 52 59 C8
##$RELAX= 
##$RELAX= 
##$RELAX= 
##$RELAX= 
##$RELAX= 
##$RELAX= 
$$ Bruker specific parameters
$$ --------------------------
##$DU= <C:/Bruker/XWIN-NMR>
##$EXPNO= 1
##$NAME= <H-C>
##$PROCNO= 1
##$TYPE= <nmr>
##$USER= <yarkov2>
##$AMP= (0..31)
100 100 100 100 100 100 100 100 100 100 100 100 100 100 100 100 100 100 
100 100 100 100 100 100 100 100 100 100 100 100 100 100 
##$AQSEQ= 0
##$AQ_mod= 1
##$AUNM= <au_zg>
##$AUTOPOS= <>
##$BF1= 200.13
##$BF2= 200.13
##$BF3= 200.13
##$BF4= 200.13
##$BF5= 200.13
##$BF6= 200.13
##$BF7= 200.13
##$BF8= 200.13
##$BYTORDA= 1
##$CFDGTYP= 0
##$CFRGTYP= 5
##$CHEMSTR= <none>
##$CNST= (0..31)
1 1 145 1 1 1 1 1 1 1 1 1 1 1 1 1 1 1 1 1 1 1 1 1 1 1 1 1 1 1 1 1 
##$CPDPRG= <>
##$CPDPRG1= <>
##$CPDPRG2= <>
##$CPDPRG3= <>
##$CPDPRG4= <mlev>
##$CPDPRG5= <mlev>
##$CPDPRG6= <mlev>
##$CPDPRG7= <mlev>
##$CPDPRG8= <mlev>
##$CPDPRGB= <>
##$CPDPRGT= <>
##$D= (0..31)
0 0.7 0 0 0 0 0 0 0 0 0 0.03 0 0 0 0 0 0 0 0 0 0 0 0 0 0 0 0 0 0 0 0 
##$DATE= 1776840221
##$DBL= (0..7)
120 120 120 120 120 120 120 120 
##$DBP= (0..7)
150 150 150 150 150 150 150 150 
##$DBP07= 0
##$DBPNAM0= <>
##$DBPNAM1= <>
##$DBPNAM2= <>
##$DBPNAM3= <>
##$DBPNAM4= <>
##$DBPNAM5= <>
##$DBPNAM6= <>
##$DBPNAM7= <>
##$DBPOAL= (0..7)
0.5 0.5 0.5 0.5 0.5 0.5 0.5 0.5 
##$DBPOFFS= (0..7)
0 0 0 0 0 0 0 0 
##$DE= 6
##$DECBNUC= <off>
##$DECIM= 32
##$DECNUC= <off>
##$DECSTAT= 4
##$DIGMOD= 1
##$DIGTYP= 9
##$DL= (0..7)
0 120 120 120 120 120 120 120 
##$DP= (0..7)
$$ [...]
##$SUBNAM2= <"">
##$SUBNAM3= <"">
##$SUBNAM4= <"">
##$SUBNAM5= <"">
##$SUBNAM6= <"">
##$SUBNAM7= <"">
##$SUBNAM8= <"">
##$SUBNAM9= <"">
##$SW= 18.0517328524113
##$SWIBOX= (0..15)
0 0 2 0 0 0 0 0 0 0 0 0 0 0 0 0 
##$SW_h= 3612.71676300578
##$TD= 16384
##$TD0= 1
##$TE= 0
##$TE2= 300
##$TE3= 300
##$TEG= 300
##$TL= (0..7)
0 120 120 120 120 120 120 120 
##$TP= (0..7)
150 150 150 150 150 150 150 150 
##$TP07= 0
##$TPNAME0= <>
##$TPNAME1= <>
##$TPNAME2= <>
##$TPNAME3= <>
##$TPNAME4= <>
##$TPNAME5= <>
##$TPNAME6= <>
##$TPNAME7= <>
##$TPOAL= (0..7)
0.5 0.5 0.5 0.5 0.5 0.5 0.5 0.5 
##$TPOFFS= (0..7)
0 0 0 0 0 0 0 0 
##$TUNHIN= 0
##$TUNHOUT= 0
##$TUNXOUT= 0
##$USERA1= <user>
##$USERA2= <user>
##$USERA3= <user>
##$USERA4= <user>
##$USERA5= <user>
##$V9= 5
##$VALIST= <valist>
##$VCLIST= <CCCCCCCCCCCCCCC>
##$VD= 0
##$VDLIST= <DDDDDDDDDDDDDDD>
##$VPLIST= <PPPPPPPPPPPPPPP>
##$VTLIST= <TTTTTTTTTTTTTTT>
##$WBST= 1024
##$WBSW= 4
##$XGAIN= (0..3)
0 0 0 0 
##$XL= 0
##$YL= 0
##$YMAX_a= 422075
##$YMIN_a= -430972
##$ZGOPTNS= <>
##$ZL1= 120
##$ZL2= 120
##$ZL3= 120
##$ZL4= 120
##$ABSF1= 0
##$ABSF2= 0
##$ABSG= 0
##$ABSL= 0
##$ALPHA= 0
##$AQORDER= 0
##$ASSFAC= 0
##$ASSFACI= 0
##$ASSFACX= 0
##$ASSWID= 0
##$AUNMP= <proc_1d>
##$AZFE= 0.1
##$AZFW= 0.1
##$BCFW= 0
##$BC_mod= 2
##$BYTORDP= 0
##$COROFFS= 0
##$CY= -3
##$DATMOD= 1
##$DC= 0
##$DFILT= <>
##$DTYPP= 0
##$F1P= 0
##$F2P= 0
##$FCOR= 1
##$FTSIZE= 16384
##$FT_mod= 6
##$GAMMA= 0
##$GB= 0
##$INTBC= 1
##$INTSCL= 3.241238e-09
##$ISEN= 128
##$LB= 0.25
##$LEV0= 0
##$LPBIN= 0
##$MAXI= 10000
##$MC2= 0
##$MEAN= 0
##$ME_mod= 0
##$MI= 1.114404
##$NCOEF= 0
##$NC_proc= -6
##$NLEV= 6
##$NOISF1= 3.799351
##$NOISF2= 2.8
##$NSP= 0
##$NTH_PI= 0
##$NZP= 0
##$OFFSET= 15.37228
##$PC= 1
##$PHC0= -5302.316
##$PHC1= 11.42193
##$PH_mod= 1
##$PKNL= yes
##$PPARMOD= 0
##$PSCAL= 0
##$PSIGN= 0
##$REVERSE= no
##$SF= 200.130029904655
##$SI= 16384
##$SIGF1= 3
##$SIGF2= 2
##$SINO= 0.751879
##$SIOLD= 32768
##$SREGLST= <19F.Aceton>
##$SSB= 0
##$STSI= 16384
##$STSR= 0
##$SW_p= 3612.71676300578
##$SYMM= 0
##$S_DEV= 0
##$TDeff= 16384
##$TDoff= 0
##$TI= <>
##$TILT= no
##$TM1= 0
##$TM2= 0
##$TOPLEV= 0
##$USERP1= <user>
##$USERP2= <user>
##$USERP3= <user>
##$USERP4= <user>
##$USERP5= <user>
##$WDW= 1
##$XDIM= 16384
##$YMAX_p= 288172801
##$YMIN_p= -2864836
$$ End of Bruker specific parameters
$$ ---------------------------------
##NTUPLES= NMR SPECTRUM
##VAR_NAME=  FREQUENCY,     SPECTRUM/REAL,   SPECTRUM/IMAG
##SYMBOL=    X,             R,               I
##VAR_TYPE=  INDEPENDENT,   DEPENDENT,       DEPENDENT
##VAR_FORM=  AFFN,          ASDF,            ASDF
##VAR_DIM=   16384,         16384,           16384
##UNITS=     HZ,            ARBITRARY UNITS, ARBITRARY UNITS
##FACTOR=    0.220516191357247, 1,           1
##FIRST=     3076.45488028837, 0,            0
##LAST=      -536.261882717414, 0,           0
##MIN=       -536.261882717414, -2864836,    0
##MAX=       3076.45488028837, 288172801,    0
$$ Real data points
##PAGE= N=1
##DATA TABLE= (X++(R..R)), XYDATA
$$ [...]
14069 -16448 -299719 -106010 -108109 -110460 -242142 -380592 -440017 -290417 -277752 -92752 -477234
14058 -477234 -543089 -140229 -146666 -475507 -48715 11833 -204365 145987 57156 -552005
14048 -552005 -597306 -446727 -418940 -478860 9838 288498 -67036 -54551 75210 -181422
14038 -181422 -344717 -1350 -411287 -799412 -516829 -136079 -169103 -218320 -271268 -276685
14028 -276685 -495030 -558437 -174059 -62245 -266664 98084 -177438 -200408 -273976 -164287
14018 -164287 -522657 -195735 -478161 -455993 -725510 -453278 -145859 -209636 -705616 -610633
14008 -610633 -383212 -812814 -691049 -289770 -228273 -229906 135335 244035 -100782 -245092
13998 -245092 65279 -135762 -180632 -168892 -108349 -387567 -344247 -75542 -109117 -497456
13988 -497456 -181217 -431579 -493722 -409052 -690876 -400707 -398481 -105113 27965 -445533
13978 -445533 -169796 -18385 -457747 -728680 -514710 -676910 -683366 -512836 -174617 -681190
13968 -681190 -382539 5540 57419 -83284 -351825 -325735 -584289 -271862 -50065 59400
13958 59400 -321375 -374433 -384906 -501871 -278000 64058 -446327 -182122 -55957 -295598
13948 -295598 -160496 33199 103473 -63189 -192414 -53692 -209834 -263537 1334 -196719
13938 -196719 -433387 -583095 -644171 -604846 -450681 -333844 54004 -104213 -22905 268305
13928 268305 138834 -112842 -218992 -167215 -227190 -490517 -319621 -326354 -305672 9729
13918 9729 -180328 -228609 -221114 -282239 -172975 -251227 -180156 -12871 -203656 -226582 34852
13907 34852 -474812 -106376 -4779 7167 -9038 43481 -96011 -449363 -430663 2465
13897 2465 -55973 -42698 -135327 -206088 -181851 -214444 -276838 -482772 -287508 -521339 -693032
13886 -693032 -792122 -849212 -327022 -182924 -133943 165374 -268766 -398362 -564476 -639180
13876 -639180 -470471 -445911 -465774 30624 156376 -132467 -378646 -201463 -64337 68111
13866 68111 -211167 -538305 -702625 -396383 -475074 -29519 30642 -452535 -192091 -138837
13856 -138837 -4518 -92211 -430142 -440519 -615388 -633555 -94210 -136919 -361173 -421824
13846 -421824 -47264 168599 6414 -316342 -414648 -548849 -320059 -172932 -69862 113842
13836 113842 -265661 -180673 228005 363564 175348 237680 -292534 -433024 -707775 -375360
13826 -375360 -358107 -135304 -320516 -254006 -562333 -295215 -14890 -220304 22797 69653
13816 69653 -489701 -482794 -324180 -383088 -4856 -73637 -64491 -330211 -103731 -280270 -210195
13805 -210195 -518525 -302771 -233623 -303507 -368652 -311765 -812752 -412775 160820 349943
13795 349943 -159545 -221957 -435058 -251643 -255347 -254123 -412513 -300131 -161041 -184392 -247512
13784 -247512 -451812 -337718 -234041 -282332 -407828 -673353 -1106775 -543077 -189058 249358
13774 249358 200352 -4889 -435475 171317 489075 -5035 3504 -19045 -469836 -348377
13764 -348377 -334161 -240973 -86284 -221605 -178061 -261280 -286531 162854 131865 67863 -37426
13753 -37426 -329024 -705497 -373458 -18227 -329986 -299894 -119452 -145327 83438 227330
13743 227330 -341480 -279950 -417472 21656 44729 -261251 -349037 -618949 -520246 -32991
13733 -32991 -144548 45951 -336394 -711432 -592091 -194691 313806 265762 -136041 -603153
13723 -603153 -578895 -423051 -249395 -332333 -67120 -349172 -96030 140148 -19471 -506345
13713 -506345 -461109 -414052 -162245 -485961 -528465 -454272 -548745 -393507 -441500 -633839 -318753
13702 -318753 -235407 -634976 -455398 -258572 -28376 442491 699106 216640 -595003 -718945
13692 -718945 -491288 -924375 -576670 -505196 -561684 -476715 -60070 -367622 -341161 20448
13682 20448 205495 -178272 -378367 -305925 -381958 -357096 -39007 -39930 -183999 -73148 -320189
13671 -320189 -202921 -324356 -133967 -114470 -130836 116848 -196388 -404385 -119725 -319389
13661 -319389 -285993 -105564 39248 30606 -47406 -385210 -566548 -556416 -258097 -3706
13651 -3706 -43235 -150774 -341806 -390232 -124246 -257411 -227816 -203920 -552071 -599720 -589364
13640 -589364 -236530 -127991 85061 124212 -276158 -517266 -290204 -360154 71607 326366
13630 326366 -192202 -248740 -258988 313798 562784 116246 -131678 -337103 -197843 275993
13620 275993 189243 -388732 -799982 -570314 -397578 -218375 193078 -91672 -190049 353557
13610 353557 467538 380447 -57911 -185983 37362 -318735 59387 146392 -334545 -594510
13600 -594510 -375675 -582331 -471167 -412931 -338626 -162874 -163258 227526 331644 364765 304720
13589 304720 -28671 -33144 -483524 -460965 -842975 -794878 -303713 -286851 -304325 -601067 -697439
13578 -697439 -569856 -199516 -191709 -288792 -366709 192439 225811 151786 -218145 -266054 -143846
13567 -143846 -492656 -753530 -900173 -942754 -862622 -484453 -158066 -465862 -297491 -326001
13557 -326001 -125149 137072 -165428 -438568 -227883 -79907 -508734 -385796 -615774 -833236
13547 -833236 -621769 -521716 -129265 -459259 -360979 -197302 -82662 28834 197445 -135802
13537 -135802 -317359 -178494 -130445 78497 -106172 -324366 -731440 -401965 -273379 -373508
13527 -373508 -485020 -470307 -211338 -185428 88976 -89147 -348485 -52227 -91029 32736
13517 32736 -462806 -390307 -502122 -649303 -394088 -368772 -670334 -501556 -572087 -512370
13507 -512370 -720802 -711931 -364696 -230813 -111317 -353103 -535256 -591899 -650595 -500653
13497 -500653 -178171 -431034 -279748 -436332 -420485 -484456 -541767 -312591 -304901 -745827
13487 -745827 -1000929 -794230 -685810 -199742 99201 108342 -40382 -112164 -568170 -664356
13477 -664356 -260126 -301318 -521647 -732711 -394578 -382146 -457421 118728 -187675 -605618
13467 -605618 -446333 -446677 -323878 -616615 -716446 -393124 -415507 -159182 263370 -154634
13457 -154634 -237223 57917 -241919 -227836 172119 -145365 -558568 -669573 -666400 -692677
13447 -692677 -430641 146 92590 -127474 -150514 -7956 -187102 -100512 228290 214940
13437 214940 -484234 -539987 -652077 -593296 158988 96876 12706 -351854 -158273 23890
13427 23890 -168122 -144575 -37257 -735557 -643246 -209276 -290615 -599972 -565931 -122545
13417 -122545 -453347 -651241 88571 -71597 -242638 -251185 -309708 -337284 -146628 -66202
13407 -66202 -357070 -561697 -650831 86439 -125364 -4216 -52776 -221091 -243905 550181
13397 550181 248886 -280609 -281092 -218026 -91432 77252 -386869 -57452 -114630 -156911 218885
13386 218885 115756 27813 259746 244896 -254553 -302567 -614420 -732660 -627768 -164171
13376 -164171 -181029 146511 -213613 17653 3244 -28188 23597 232394 -446243 -520571
13366 -520571 -309380 -416177 -236382 -135747 -273093 -254602 38263 237370 -5314 -332837
13356 -332837 -258915 -191330 -6530 -32447 -321579 -347694 -903077 -288203 84636 -359820
13346 -359820 1209 -191945 -660603 -587953 49325 -430154 131580 61674 -339982 -549098
13336 -549098 -281519 -319667 -51847 -5588 -228497 -279909 -623767 -263079 45204 -682753
13326 -682753 -398522 -202171 -437691 -472693 -110624 -460523 -933342 -324461 -27968 -11318
13316 -11318 14595 -344317 -420686 -566866 -372108 -5489 -280932 -373469 -559783 -730371
13306 -730371 -556245 -233779 106287 60867 -102989 -124463 -551881 -373013 -330574 -7618
13296 -7618 -118030 -319121 -401473 -580117 -490980 -586953 -505116 -414344 -544025 -420720 -525463
13285 -525463 -395143 -127058 -158502 -374851 -161110 -304814 -575881 -578319 -920336 -501764
13275 -501764 -654203 -373345 -50948 -181485 -342654 -692542 -169641 -176745 -15943 -81557
13265 -81557 -99123 -179725 -358676 -235727 -265879 -496560 -694292 -849440 -403792 -435105
13255 -435105 -271100 -26482 -390551 -358691 -190368 -166003 -148680 -371360 -134703 -272515
13245 -272515 -489614 -125522 -490706 -438529 -762418 -598010 -628598 -466406 -134403 -274384
13235 -274384 -73820 98897 248321 -382389 -497091 -395900 -575576 -522118 -374026 -327152
13225 -327152 -549068 -312826 31835 -275366 74006 -4147 -486923 -298027 -110563 -519270
13215 -519270 -681233 -664195 -675625 -508425 -131381 384794 186727 1418 -352208 -370853
13205 -370853 -414574 -451275 -562966 -911232 -559937 -446328 -263003 52553 -160417 89287
13195 89287 245938 11364 -252587 -519424 -657208 -423189 -630818 -286604 -571979 -888313
13185 -888313 -199428 -92677 8196 -33460 -222530 -254108 -221854 -320313 -508656 -661232
13175 -661232 -412678 -453566 -366192 -111165 18275 74100 -238066 -271954 -177196 -466276
13165 -466276 -242563 -519151 -505438 -417658 -473222 -560609 -409697 -514468 -203504 -186701
13155 -186701 -112767 208820 -221216 -370570 -189393 -343628 -464916 -402993 -300256 -536942
13145 -536942 -765514 -826126 -673368 -124187 -73204 -452124 -626736 -58296 195856 93216
13135 93216 -28739 80684 -207806 -112573 -447493 -442368 -666510 -417413 122315 -187509
13125 -187509 -21574 5914 -466936 -93727 -249839 -506905 -585834 -221647 -236218 -393021
13115 -393021 -356417 163086 -146928 27859 -148352 -149633 -194531 -137950 -228661 -579680 -546067
13104 -546067 214101 203883 92395 54110 -535399 -175257 294972 -28053 -438927 -261291
13094 -261291 -451417 -228953 -376273 -438884 -428966 -531352 -589222 -305214 -607706 -416568
13084 -416568 -151503 251243 170162 -109849 61661 -20529 -345866 -379642 -598887 -477281
13074 -477281 -197620 -516258 -501647 -557664 -450763 -412939 -152797 -33984 188657 -37945
13064 -37945 -176413 198505 -301670 -65881 -235386 -388623 -447855 -223726 -54297 -42571
13054 -42571 -599905 -169562 -403765 -372778 -367700 -462139 -816128 -560482 -157396 181227
13044 181227 16723 -29033 -271720 -218441 29810 -555483 -450521 -108874 -213269 74352
13034 74352 -93644 -189532 196929 -32576 -108563 -11402 -60995 -347541 -497770 -570086 -694847
13023 -694847 -531612 -493372 -255494 -52746 -329567 148649 65554 -112619 -223485 -25136
13013 -25136 189484 -136606 -519682 -654884 -946096 -234965 -36116 -427127 -411766 -648783
13003 -648783 -254501 -148796 -143163 -37196 -295908 -283171 106752 54764 -344540 -116283
12993 -116283 276136 305849 -24122 -135945 -508986 -533829 -312779 -55251 -167567 -236427
12983 -236427 -448389 -428184 -440573 -21273 -209907 -192241 -202 51758 -404503 -71032
12973 -71032 21287 -76159 -149690 193237 135494 -404816 -203127 -340245 -154372 -127794 -339607
12962 -339607 -362133 -209373 4982 -509038 -467542 -41912 39276 -142900 -105215 -224623
12952 -224623 -376448 -389614 64902 236918 -473558 -296899 -149609 -148101 -196350 -292684
12942 -292684 -464317 -381636 -279107 -396162 -397205 -395231 17381 -24061 -92849 15561 -297283
12931 -297283 -245368 -358787 -249355 -606880 -653173 -37909 -88015 -6993 -31353 225762
12921 225762 270696 250269 -19481 -204018 -544842 -672155 -580004 -1013750 -543124 -572713
12911 -572713 46622 -54382 -61339 -275452 33206 79808 279054 56190 -143377 -144777
12901 -144777 -210767 144680 104977 -188548 -156036 -290415 -120672 -211818 -364961 -231775
12891 -231775 -172297 -113685 -405753 -267470 -426589 -123454 -501911 -536903 -326281 -203300
12881 -203300 -310761 5312 171934 -524937 -410781 -279916 -168448 -449685 -196343 58766
12871 58766 -145990 -225624 -459112 -477017 -605346 -435545 -452633 -663757 -556724 -445296
12861 -445296 -307657 84995 74564 -309753 -741134 -353953 -269792 -697134 -752145 -259899
12851 -259899 -221823 -122917 -163993 -420619 -461566 -471586 -368943 -328599 -316603 -607700 -455576
12840 -455576 -92599 -33373 -150359 -270451 -100404 -24026 -282250 -89389 -7263 57598
12830 57598 -207476 101440 -79712 -82558 -257762 204380 266389 54513 -254627 -599702
12820 -599702 -424482 -738508 -706164 -676126 -347487 -203268 -122470 69131 235790 228908
12810 228908 162652 19869 -182708 -228673 -425051 -221032 20355 -142452 182378 18109
12800 18109 -83936 -317330 -515237 -276969 -551540 -525803 -101345 -441252 -358031 -304769
12790 -304769 -28796 50148 33046 -124614 -269781 -335257 -299154 -649483 -680411 -427941
12780 -427941 -299691 -294422 -457028 -364936 -266498 -215889 -135309 -120695 -328479 -327895 -104019
12769 -104019 -257090 -303884 -608510 -489457 -336376 -78099 -212769 -395390 -296571 -302247
12759 -302247 295608 349667 124887 -56647 -15262 59233 -342490 -357732 -225449 -482269
12749 -482269 -468724 -724048 -648886 -395681 -245320 57832 40088 368936 271001 -93925
12739 -93925 -208867 -458486 -406152 -512981 -257402 -144416 -332238 -440862 -202925 102242
12729 102242 131711 -135447 -171545 -36196 -169402 -455499 -257877 -385000 -462462 -385719
12719 -385719 -357183 14015 -398319 -502470 -357209 -478955 -251894 -188469 -392727 -480809
12709 -480809 -330075 -822679 -501799 52360 31731 -356509 -247870 -211531 -326462 -429243
12699 -429243 -52531 -429575 -854441 -536637 -235389 -384725 -298224 186787 -323187 -440195
12689 -440195 -111901 -450804 -662124 -936824 -710441 -465275 -367025 -9308 -69923 -67527
12679 -67527 124598 -192340 -676426 -264061 -94862 -374526 -594529 -356547 -320054 -409038
12669 -409038 -326304 -118553 -552034 -274548 141188 166974 -216945 -75060 -160323 -224931
12659 -224931 -78254 -90198 -590082 -499235 -560027 -710937 -621555 -578386 -357266 -415560 -326272
12648 -326272 -655251 -805166 -593498 16790 -217405 -512501 -240649 -320153 74195 -165608
12638 -165608 -253283 -403387 -510588 -363127 -597375 -388490 -296170 -212707 -105399 253281
12628 253281 -153283 -183734 87279 -33489 -391781 -770466 -748653 -617187 -257229 -770875
12618 -770875 -674192 -564877 -481736 -266799 -358233 -320254 -627926 -720703 -552133 -111890
12608 -111890 -376476 -243795 -220174 -424732 -281074 -303432 -38678 142077 -183964 -361937
12598 -361937 -540435 -442685 -400006 10489 -41179 -202523 -206188 -119390 -88686 -76719 -152444
12587 -152444 -202471 -323550 -570951 -590527 -409530 -369562 -368665 -472372 -116001 -109893 -49052
12576 -49052 -42713 -412243 -312832 -379529 -395013 -251752 -215746 -600310 -749764 -377829 379653
12565 379653 66565 -148337 -297916 -356897 -74779 -109153 -89820 -498685 -725627 -377808
12555 -377808 -482203 -267992 12557 -295078 -155654 -165141 -327309 -659654 -871150 -569222
12545 -569222 -259782 -40834 -97918 -132389 97137 184710 267313 327208 66093 -81399
12535 -81399 -296570 -143758 -520727 -468326 -24368 130214 -223001 -472919 -582195 -420877
12525 -420877 -282413 155856 -127405 -457755 -114606 -500207 -295382 -219243 -290152 -107236
12515 -107236 -258305 -113332 -255907 -322581 18350 147111 -57159 -133011 -16399 -275915
12505 -275915 -325938 -216179 -249071 -165098 82746 204156 163018 53703 -177924 -446395
12495 -446395 -256305 -156722 -319361 -146032 -131493 -233296 -249353 -79783 174797 -131849
12485 -131849 -307438 -419500 -589644 -364009 -358473 -448815 -458000 -245975 -223013 -286977 -73343
12474 -73343 -263957 -477807 -73108 -97494 -433033 3944 78575 -376580 -397603 -496037
12464 -496037 -684149 -435006 -16702 60441 -40167 -253830 -344811 -72543 -103353 -31869
12454 -31869 -302324 -680571 -364071 -463264 -463524 -81693 4744 257399 98010 -65384 -117949
12443 -117949 -283528 -751072 -528358 -486360 -364277 -394027 -374979 -211761 -404501 -176189
12433 -176189 66621 76744 -45926 -222469 -540280 -624226 -126455 -66652 -338096 -571680
12423 -571680 -435912 -981097 -212699 177674 -49326 -466630 -733416 -481934 -765902 -614853
12413 -614853 -201092 -228875 -128456 -133032 -473753 -51051 -86221 -31618 -32918 -358353 -864478
12402 -864478 -785707 -475374 170019 -101058 -379037 -216815 -276820 -396260 -346805 -303965
12392 -303965 -438528 -347145 -383889 -217575 -205750 -328969 -248201 -13247 -171609 -117067
12382 -117067 -539708 -347346 -326089 -538692 -310407 -511577 -271250 -95628 -316427 -279887
12372 -279887 -193872 -405290 -336766 -363415 -3189 -738354 -720192 -521321 -482072 5560
12362 5560 -90338 101606 181871 -78003 351235 -95608 -151104 72147 -472565 -900074
12352 -900074 -665029 -555788 -421388 -175568 -22411 -163876 -389911 -208014 -276341 -507694
12342 -507694 -235293 -317977 -338869 -158800 186612 -99220 26238 133252 130596 -280772
12332 -280772 -408304 -276230 -717096 -621777 -556970 -535237 -672951 -274392 -131710 -693634
12322 -693634 -664037 -310404 -399179 -344620 157545 167844 -44174 375016 278922 -313035
12312 -313035 -541429 -152723 -467422 -440179 -394317 -243587 -318681 -251297 162715 -72114
12302 -72114 -275020 14843 -91523 -266420 -426459 -384666 -467109 -225488 -266929 -612404
12292 -612404 -875022 -588097 -334177 -245795 -47450 105055 -5964 107791 103063 -134457
12282 -134457 -576067 -370385 -382601 -196898 -192547 -618390 -831368 -319317 -75122 -45531
12272 -45531 -262551 -247302 -130030 121466 410017 298939 86766 -168812 -190793 -40693
12262 -40693 -333988 -731864 -925649 -1042388 -490731 -626947 -611283 -552915 -305577 -468682
12252 -468682 -315784 11527 -69197 -412684 -397479 -374782 -165738 -210411 -357782 -422546
12242 -422546 133762 291661 494219 73797 -155745 -501101 -596635 -152535 -511761 -737583
12232 -737583 -526774 -260300 -333574 -156367 -329732 -210103 -389270 -488257 -525466 -475035
12222 -475035 -613853 -698976 -274971 -372474 -250504 -95388 -24818 129146 -143423 -646638
12212 -646638 -439931 -235979 -212485 -1064 -7396 -688570 -751128 -340207 -251487 -110354
12202 -110354 -91591 -541273 -507455 -324822 -160074 -155982 -168792 -74805 -292583 -642736 -481672
12191 -481672 -554051 -933781 -538380 -319009 -273215 -457518 89413 -216984 -487467 -421128
12181 -421128 -487901 -541899 -434961 -261014 -34495 -101092 130156 309618 126811 161456
12171 161456 165104 -165822 -538410 -746646 -569013 -519566 -333444 -252866 -646345 -352974
12161 -352974 -245485 -159943 -91689 -152557 -443459 -505479 -178605 -329415 -449792 -499755
12151 -499755 -417136 -225977 -55210 260526 271773 -201964 -316103 -179641 -255297 -47456
12141 -47456 150302 -172539 -413652 -711686 -741531 -356608 -45551 78103 -413913 -286620
12131 -286620 -266075 -235822 -318427 98496 -393165 -564063 -434931 -183918 -370033 -456809
12121 -456809 -702432 -379726 -209432 -121670 -395610 -307024 -395885 -386449 -205832 -123
12111 -123 -48750 -141944 -432604 -727285 -798118 -818000 -171706 -115754 -3234 -386446 -342546
12100 -342546 -273540 -72163 27125 -244591 -539704 -505410 -688622 -523637 -674214 -661957
12090 -661957 -960639 -698901 -354148 -192863 -37684 173349 14844 -36790 -283256 -246512
12080 -246512 -445060 -318787 -575796 -618218 -450059 -271883 -117007 -125773 -184693 -90377
12070 -90377 -318937 -608129 -280657 -242643 -309740 -275687 -232049 -226038 -276582 -186411 -438951
12059 -438951 -591107 -576972 -181416 -52121 -63466 -172937 -821484 -940383 -597300 -533037
12049 -533037 -293911 -136343 -179369 -277034 23492 44895 207991 68686 24597 -386659
12039 -386659 -992512 -615570 -66951 96432 -275353 -51876 -486491 -539818 -273157 -288094
12029 -288094 -485488 -718582 -17617 89801 -142857 -315276 -524283 -363140 -471575 -188795
12019 -188795 -588649 -822244 -762593 -699261 -777220 -376004 43237 53049 -181401 148615
12009 148615 135064 -35895 164341 349404 -24202 -564242 -528658 -440609 -728709 -222521
11999 -222521 -344278 -399387 -545132 -471773 -290379 -219573 10599 -206253 -411631 -267000
11989 -267000 -250216 -219341 -278831 -115618 -417839 -999756 -378474 -108053 -130334 127283
11979 127283 45319 -138176 -152594 -206381 -122104 -366588 -422138 -626602 -425377 444099
11969 444099 266378 -52783 -275966 -43709 165355 -76070 71597 -344685 -833923 -688147
11959 -688147 -550418 -693654 -512805 -235633 -414296 -518112 -502850 -414549 -328653 110214
11949 110214 -78194 -366961 -598529 -202771 70242 29831 97862 -271756 -385491 -126651
11939 -126651 -165774 -365133 -546896 -512222 -324575 -90708 -8251 -321145 -611152 -629637
11929 -629637 -539501 -531133 -263620 -325306 -625151 -762048 -547283 -493421 -312934 -242986 -224476
11918 -224476 -461591 -160061 -76110 80177 52534 225847 228521 36946 -402680 -440771
11908 -440771 -542157 -224108 -80158 -84020 -209849 -650632 -473904 -288529 -415835 -402930
11898 -402930 -262958 -150285 -30317 106223 11667 -558456 -479002 -73348 -132314 -140046
11888 -140046 -262213 -389613 -657971 -240650 422206 -246612 -482719 -445109 -538441 -290651
11878 -290651 -150598 103626 23446 -184345 -153650 -136030 -395727 -201409 -384578 -71409
11868 -71409 -157240 -184333 -494798 -706314 -123453 -454360 -572619 -75226 -100445 -252822
11858 -252822 -373722 -335064 -411117 -412852 -445158 -329453 -391342 -157419 -189430 -91447 108021
11847 108021 136291 455667 -77479 75651 48497 -171446 15340 245287 -47760 -138821
11837 -138821 -229767 -570142 -512675 -369006 -366733 -34957 35972 -126365 81 -136785
11827 -136785 -348740 211080 -48311 -26266 165376 1408 -46513 97518 29738 19646
11817 19646 -217787 -212837 -152666 -236846 -536915 75357 -102067 103468 175192 192361 -501426
11806 -501426 -676513 -422449 -233973 21765 -74835 -370274 -284728 -205313 70701 201993
11796 201993 -95744 -182834 -161349 -220679 -356280 -496023 -464482 -588548 -388236 -47542
11786 -47542 -207204 -283387 -217056 -158216 -210383 -195582 -431074 -290321 -628636 -226340 -102376
11775 -102376 -254490 -117034 1602 -391364 -13125 -209318 -313450 -222439 -172006 -379572
11765 -379572 -369353 -342269 -420070 -355069 -449641 -249863 -62765 -368511 -350035 -155940 11858
11754 11858 -38371 -466047 -600842 -566214 -19989 123192 29340 181196 -280060 -481261
11744 -481261 -344776 -248962 -663570 -783319 -805565 -527935 -259057 14729 -48125 -108372
11734 -108372 -159658 -296919 -344487 -618424 -562947 -155248 -255226 -85032 138445 -121002
11724 -121002 -308250 -197913 -595983 -733659 -322159 -128843 -506542 -393465 -247785 -556554
11714 -556554 -342010 -19097 -30134 -230111 70237 -169382 -206566 -83981 153718 -387599
11704 -387599 -460348 -329707 -649969 -551159 -104625 100682 -131036 -503467 -139367 -292373
11694 -292373 -500121 -153350 -255980 -221444 -28785 229203 355161 323017 323715 -46516
11684 -46516 86088 18514 -623837 -78782 -221500 -238455 -258527 -392959 -112023 -137106
11674 -137106 19872 -356638 -349562 -257678 -262776 -124579 133424 172262 -87724 -263299 -69444
11663 -69444 -125076 -547145 -385611 -395421 -343668 273378 134175 135047 -333892 -304934 -330782
11652 -330782 -294017 -525051 -392950 -76720 71152 -118385 -31142 -50662 -120154 198025
11642 198025 -446726 -351538 -275138 -295729 -117474 157048 -34545 -627173 -745737 -207536
11632 -207536 -446617 -415483 -785040 -495220 -228586 -259094 -179304 -354073 -323776 -177055
11622 -177055 -513882 -759238 -298616 -262239 -281645 188597 -77348 -425057 -407164 -55075
11612 -55075 -335047 -246616 4385 -215656 -464217 -353712 -266968 -630353 -452794 -553083
11602 -553083 -701663 -1019212 -732106 -437581 -230992 -103911 28805 70468 -247827 -222835
11592 -222835 -263719 -250573 -259510 -221198 -244701 -633422 -422496 -432873 -332692 -520881 -537693
11581 -537693 -587077 -471401 -289161 -458614 -630237 -627895 -299601 -83373 -355725 -450126
11571 -450126 -513666 -467649 -65335 -441837 -352650 -692504 -679583 -354561 -308462 -646452
11561 -646452 -597438 -329292 -16072 96338 -10061 -154083 -619197 -321268 -141981 -214544
11551 -214544 -478406 -534386 -641730 -510844 -307929 -200972 -379920 -206384 -122079 -624340
11541 -624340 -621276 -316267 -543504 -413435 -397375 -237988 -178851 -200767 -222642 -345717 -313528
11530 -313528 -511561 -632362 -600409 -137943 -167573 -243145 -7793 -26185 76647 -163512
11520 -163512 -417361 -485929 -371413 -401654 -191353 144525 218247 20522 -77211 50570
11510 50570 -235680 -428707 -491243 -316144 -472643 -307361 -168584 -354094 -502782 -406318
11500 -406318 -321409 -114614 -242419 -239095 -165242 -15448 244106 149093 -222922 -591703
11490 -591703 -750758 -545962 -368434 -93562 -38556 -79020 366743 207055 -262808 -339842
11480 -339842 -425779 -490627 -633514 -653392 -644218 -587332 -861 473644 214384 -144652 -176843
11469 -176843 -178866 -405635 -520544 -144026 -392834 -115033 183776 -124482 -41231 126174
11459 126174 279235 540552 -34763 -395736 -841658 -1091124 -601241 -407480 -247027 -464269
11449 -464269 -506488 -291801 -146246 28820 -45109 -168756 -318354 -405772 -218252 -257296
11439 -257296 -143097 146112 -110818 -340393 -96861 -433944 -884574 -965217 -668173 -725562
11429 -725562 -482653 -157846 -66217 -25812 207388 252740 -89154 78280 395914 -138552
11419 -138552 -474840 -223133 -587775 -810253 -405131 -147178 -207586 -217199 -235358 -305144
11409 -305144 -143576 -155366 -175129 -332918 -453410 -332016 -373292 -319799 -49012 -301156
11399 -301156 -115988 -132622 -201118 -367314 -229778 -88892 -116673 -63715 -111922 -167609 -78680
11388 -78680 -204355 -86686 -176015 -566188 -172421 93435 17031 51689 57441 -237295 -384726
11377 -384726 -282763 -567208 -470204 -249977 -489165 -312285 -466902 -22432 -134563 -97593
11367 -97593 155612 682098 285673 261429 36136 -237908 -427749 -118691 -677172 -892000
11357 -892000 -998433 -899393 -324985 295059 -39720 -4406 -54483 61951 -76024 -515647
11347 -515647 -424249 -266661 -504526 -221451 -65678 -478771 -307626 -212226 -17599 -243566
11337 -243566 -578719 -779321 -392522 -321438 -349747 -210082 -471051 -149563 348133 -36252
11327 -36252 118671 -107120 -323001 -378104 -418173 -764935 -744084 -663773 -289135 -170440
11317 -170440 -2927 -117743 -320653 -456778 -394330 -354851 -437259 -952845 -923216 -1027888
11307 -1027888 -809497 -564231 -322579 -371307 -110085 -265448 -155597 -397264 -156997 -141293
11297 -141293 -316158 -109763 -310826 -312051 -381609 -609391 -423021 -364848 -313493 -493512
11287 -493512 -441050 14090 -348891 -746486 -398125 -453844 -484181 -283812 -587047 -772450
11277 -772450 -745349 -481795 -341192 -319113 -382754 -617246 -465892 -341583 -102936 -242004
11267 -242004 -601743 -283919 -285276 -663407 -607544 -807717 -974226 -276029 -158105 179971
11257 179971 -87405 -79634 -137783 -252012 -238418 -552604 -592799 -266935 -329817 -409568 -399528
11246 -399528 -235985 -20413 -20437 87523 -181291 -431414 -221177 -422003 -191764 -188475 -456061
11235 -456061 -440154 -489692 -586329 -259804 -480336 133358 344001 160429 -209920 -360298
11225 -360298 -168315 -317127 -271489 -1571 -639455 -655349 -451061 -484212 -141666 107290
11215 107290 -61234 -198089 -359350 -366954 -363799 -216086 -402395 -490369 -384892 -239005
11205 -239005 -283185 -302637 -223007 -129576 59549 71666 38167 -321146 -297299 -219371 -459154
11194 -459154 -746706 -510473 -781829 -481765 -315377 -121382 -86982 -65964 95478 9981
11184 9981 -638629 -222767 -483184 -553882 -1336 -224878 -573765 -17408 71454 -176848
11174 -176848 -400862 -425713 -412697 -367647 -108919 -180858 -196596 -541096 -350800 -229367
11164 -229367 -275907 -73951 -312022 -547538 44466 -99441 -6181 -309534 -512831 -709936
11154 -709936 -719451 -272307 -226218 -314116 -102852 -62505 141250 -86347 -485293 -458573 -802346
11143 -802346 -903960 -651363 -482548 -239265 -138739 -303451 -76331 -195933 -100248 -528190
11133 -528190 -197954 -262989 -272083 -147755 -280115 -594969 -645886 -728438 -417993 -146027
11123 -146027 -732982 -590716 -506090 -192583 182803 -299322 -505655 -584011 -803667 -772463
11113 -772463 -550056 -214519 -168461 -198069 -228158 -276289 -604267 -429442 -515730 -740157
11103 -740157 -265219 -412757 -360575 45433 143523 -412499 93034 131046 -357852 -683351
11093 -683351 -710768 -826052 -726332 -280028 -331959 -263730 -453062 -356796 -146687 -300161
11083 -300161 -173650 -52912 -256974 -369460 -355476 -285528 -164907 -146523 -355885 -453483
11073 -453483 -461646 -436206 -239585 -170867 -527318 -487816 -385445 -280849 -143654 -309850
11063 -309850 -736325 -723656 -392275 -86185 -287340 -180905 -516737 -491115 -441834 -182059
11053 -182059 -309116 -444847 -561739 -140830 -659461 -549391 -445751 -335541 -232658 -270871
11043 -270871 -768196 -517797 -366555 -219719 -37169 -374368 -360865 -78668 102939 96846
11033 96846 63870 -388940 -222199 -111817 -299200 -544111 -361935 -241183 -414717 -151356
11023 -151356 211324 -220619 -291111 -427796 -350170 -479041 -625482 -631410 -516478 -498591
11013 -498591 -88063 -484250 -177885 91812 127759 329248 631872 185259 -177199 -612275
11003 -612275 84402 452377 13888 -234871 -494589 -248897 213479 -38135 -223202 -645133
10993 -645133 -633402 -517793 -415035 -248332 -338803 -109122 340565 335803 -135898 -231481
10983 -231481 -555828 -505556 -230140 -59184 -466472 -464340 -394511 -324149 -45043 -82222 -415746
10972 -415746 -502011 -264076 122493 -249695 56499 105419 -43981 138164 313528 -270946
10962 -270946 -356053 -338449 28444 40315 -308044 -411692 -643062 -106121 117206 -250151
10952 -250151 -514557 -427868 66280 249721 396082 91371 -402650 -402972 14658 -501951
10942 -501951 -480019 -117598 -139757 192405 380959 280635 204829 369550 17309 -218255
10932 -218255 -390838 -16259 -407328 -357492 -164053 -55923 -115123 -147877 -408414 -683049
10922 -683049 -467718 245100 147813 -137937 -428459 -126564 79264 136735 -145129 -397855
10912 -397855 -601948 -230874 216020 87757 204683 -174494 -322977 -244198 -178073 -263995
10902 -263995 -215183 -206904 -336925 -746652 -424240 -408051 -59440 -257810 -351953 -559176
10892 -559176 -576825 -329745 138910 -252 263811 94554 -77343 -321980 -419031 -371487
10882 -371487 -884428 -659355 -697321 -317535 -207115 -135540 -8530 14928 400915 433259
10872 433259 -340411 -241404 -472590 -319011 -348694 -296283 -298339 -66375 -301993 -72882
10862 -72882 -85581 -164315 -279110 40480 42954 -317259 -389695 -287593 -235330 -162808 -99162
10851 -99162 -598528 -463547 -395719 -212040 -318498 -94535 -10703 7554 -33353 -182314
10841 -182314 -231270 -225909 -27840 -262206 -641885 -549549 -327738 -54068 70821 357762
10831 357762 59387 -79318 -175700 30063 -432577 -274207 -395098 -590233 -390547 -184395
10821 -184395 106765 119879 202214 -227262 -294973 -332898 -111751 -347187 -616206 -790613
10811 -790613 -755817 -7401 38397 -14216 115729 -232084 -161395 49491 -223974 -136426
10801 -136426 -487480 -551751 -723367 -453938 -556653 -290552 237525 251951 35814 94116
10791 94116 448528 293155 121485 -158272 -189447 -442511 -377999 -289879 -406195 -311601
10781 -311601 -107114 -84262 170448 352231 -18044 8222 151623 -277508 -495739 -538236
10771 -538236 -443040 -443647 -89689 188537 -31239 -194675 249244 330129 -103595 366636
10761 366636 140820 -182664 -418747 -193239 -72799 52128 241875 -156692 -394424 -90819
10751 -90819 -305092 -67225 -22956 210252 317107 128217 267897 53095 13343 -352722
10741 -352722 -72608 -378475 -324976 -308125 -4361 -97469 -68349 95372 -190611 -666271
10731 -666271 -323774 -479293 -713098 -727513 -566551 -369761 -106388 76477 430796 155762
10721 155762 250379 79312 -238900 -263159 -292709 -380028 -589147 -550466 -552911 -602518 -323894
10710 -323894 -141869 -381313 -418519 -50051 43757 -17831 229743 -300898 -300590 -264047 -163560
10699 -163560 -175021 -244270 -407720 -252454 -136632 43185 150398 -81924 -113896 -390386
10689 -390386 -600709 -604106 -690552 -121263 -104268 46787 -79597 111775 451154 220358
10679 220358 -63641 22441 -304949 -486646 -338561 -612644 -464600 -245529 49221 -46388
10669 -46388 248291 97681 39613 -125350 -170026 -146755 -243440 -476667 -215675 -202897 -235198
10658 -235198 20776 -77460 -289787 1638 -56103 -391492 -250178 -22563 -162823 -112721
10648 -112721 -140621 -298821 -325646 -340888 -117482 -32709 -50498 -307524 -341807 -765579 -339265
10637 -339265 -575071 -865050 -968279 -677774 -357821 -53541 -40209 523973 341369 148585
10627 148585 -100010 -228255 -76574 -182248 -414756 -320611 -429687 -416972 -391053 -259657
10617 -259657 5743 -349531 -83828 184592 338604 6509 -8921 158885 -217834 -225840
10607 -225840 -118150 -183701 -110182 -358853 -55691 22009 -176715 109402 -67748 -176310
10597 -176310 -12538 -76986 -161519 72140 50046 -194723 -258994 -120958 -91273 -531389
10587 -531389 -310657 -290970 230430 355916 232366 139152 -323336 -371356 -237074 -186560
10577 -186560 -313440 19157 -351418 -276940 159695 -124979 -345387 -352731 -239552 -344090
10567 -344090 -299410 -392165 -219155 -316232 -296219 6584 -268412 -758764 -618905 -237496
10557 -237496 -249518 -278819 -296884 -313203 -154439 -249868 -130399 -260797 -557477 -682184
10547 -682184 -306361 -147357 -140619 -354172 -993348 -817994 -219230 -459125 -487953 -388774
10537 -388774 -532975 -623889 -405467 188769 22311 -446279 -292707 -9279 -56198 -93196
10527 -93196 -218912 -309616 -490472 -359029 -126380 -748198 -667657 -487452 -617034 -210271
10517 -210271 -330159 -662047 -183137 127755 411526 194447 -403169 -287092 -123707 -467535
10507 -467535 -44814 -263175 -609600 -704021 -416196 -349401 -634895 -641017 -391638 -117404
10497 -117404 -38750 24232 -413183 -339085 -228293 -1261 -441335 -798824 -419524 -279736
10487 -279736 -132888 -40317 -220121 -179362 -343214 -37757 -648658 -571673 -634341 -293264
10477 -293264 164776 61628 -21289 -111799 -465579 -301212 -268909 -435139 -477819 -488860
10467 -488860 -288594 -452863 -407946 -334003 -182053 5819 -388847 -108427 -125579 -375296
10457 -375296 -141851 -253187 -607705 -44543 122736 -424734 -260629 -744110 -829572 -516978
10447 -516978 -308150 -178718 -515103 -601015 -342340 -444653 -33817 -68907 53051 19259
10437 19259 -154835 -13417 -41874 -480014 -80180 -141180 -243608 -460698 -561387 -687049
10427 -687049 -546997 -265839 -247969 -271953 -389638 -266465 -116771 -406040 -612340 -475181
10417 -475181 -409635 -327650 -360044 -575856 -533700 -337663 -142829 -264451 -114157 -54418
10407 -54418 -395114 -311724 -107969 11695 -575218 -660313 -292442 -337334 -644965 -267168
10397 -267168 -301215 -273894 -427693 -376496 65518 86056 9771 529295 25976 41042 121130
10386 121130 -501876 -790483 -841624 -611459 -517147 -592111 -303747 -373555 -524187 190720
10376 190720 88518 40636 81487 4083 -172670 -617429 -386405 -49542 -548894 -343218
10366 -343218 -223445 -714903 -844883 -423468 -191961 -43802 -18512 250070 -210236 -401550
10356 -401550 -409824 -594847 -509885 -342557 -73004 -623496 -608716 -404452 -314264 -495956
10346 -495956 238 -192581 -290293 -166268 -289049 -127492 -221349 -452360 59979 -263984
10336 -263984 -580328 -404702 -333650 -623684 -618147 -468806 -5996 183823 48636 -237861
10326 -237861 -437091 -457421 -203353 53865 -258826 -196616 -976875 -746099 -663774 -408207
10316 -408207 -270823 -469660 -376597 -244096 -230567 -172820 -87796 -201493 -205704 1513 -96930
10305 -96930 38993 -231095 -141021 -379635 -363862 -62404 145001 -56737 -226753 -470250
10295 -470250 -642361 -738947 -544385 -272775 -200744 -40283 -560947 -526890 -308148 -51698
10285 -51698 -207505 -558516 -198392 -143779 -609253 -295078 -176753 -444642 -220234 -110771
10275 -110771 -480369 -304784 -530478 -284387 -232287 -383657 -81848 -205772 -170958 -390751
10265 -390751 -808579 -455501 -183488 -332182 74339 -193329 -223324 -275511 -204671 -69372
10255 -69372 -248055 -435601 -382729 -189367 -447951 -487709 -378155 -387695 -271315 -616577
10245 -616577 -376853 -337192 -392779 -272390 -83699 -131936 -271947 -116146 -15043 -174776
10235 -174776 -568216 -205564 -198774 53662 -96065 219245 108645 -41321 -275848 -351440
10225 -351440 -350323 -221588 -925890 -724929 -245401 139279 501388 133243 -83200 -341521
10215 -341521 -500574 -224333 -278068 -354310 -255727 -271653 -71747 239709 490206 144133
10205 144133 217769 -149041 -629949 -753833 -727834 -92625 -183079 -261708 -115953 -558370
10195 -558370 -355361 -366016 -163240 46449 -119365 -204285 -176826 -324054 -218363 -278287
10185 -278287 173916 13 -264690 -256801 -60146 -476037 -329910 -147029 -267937 -268731
10175 -268731 -337814 -504762 -460656 -40152 -227347 -354658 -211034 -434403 -395940 -256326
10165 -256326 -222917 -147656 -128042 -126895 -161151 -356868 -307405 -98586 -234190 -493617 -353572
10154 -353572 -193677 -148581 -40488 -165322 -47106 -138717 -84330 82784 -337541 -230948
10144 -230948 -222042 -280050 -261944 -183875 -202698 -492409 -328109 -184472 -81410 -234616 279494
10133 279494 125402 -423382 -631871 25937 10768 -108068 -372026 -563110 -659176 83884
10123 83884 351897 162698 -115156 -258489 -530813 -646959 -496109 -524127 -382832 -38229
10113 -38229 8286 -277214 -44271 6232 40073 68606 79192 363247 403577 -53946 -154664
10102 -154664 154363 -282232 189424 472412 278336 128382 85089 229348 241963 563030
10092 563030 571613 425107 25661 -9974 -29570 23750 -79029 160690 190750 104987 474054
10081 474054 390198 -119617 48053 176426 323588 658907 486626 -23667 92531 190894
10071 190894 530983 731359 1164807 819601 676850 388287 48785 214601 343499 646702
10061 646702 429761 468152 249133 359572 729443 710277 565282 723231 514242 -9941
10051 -9941 -626943 -374148 -88860 -84606 347252 71873 -266 89406 728283 853851 664640
10040 664640 281559 311539 134415 -272890 -269591 -306217 -392282 59959 82805 -17451 2397
10029 2397 232887 460526 287750 347281 272802 -217972 -471791 -485380 -314483 -480891
10019 -480891 -261177 314816 -318585 -713218 -151240 410079 482259 584730 44503 -128620
10009 -128620 -168007 -133593 19374 31625 171552 53693 -553033 -321209 215681 486721
9999 486721 656197 454957 542595 237000 649292 926641 529868 574273 660884 534223
9989 534223 636980 154338 -384689 -292239 -405963 60699 -91977 -261291 -138835 64510
9979 64510 274502 450794 475429 390226 450689 305661 -119460 -192202 -358945 -596767 -575683
9968 -575683 -225083 -42311 -9045 5927 163612 -42640 239942 672944 561146 102596
9958 102596 -97182 -212514 -438822 -337367 -9226 -148828 -340524 17646 57109 -92128
9948 -92128 -47241 375074 473524 28571 137429 403031 -111334 -85687 165147 -83664
9938 -83664 213871 319167 68554 -44308 -78275 279184 375633 251527 654161 727832
9928 727832 556159 423024 45057 -33018 -118371 381418 601275 416079 118014 -70666
9918 -70666 -98375 154514 445379 506372 -95363 -133398 171320 -10616 162410 695007
9908 695007 390372 -227768 -171049 -71878 279636 90608 158477 208056 307255 422675 266093
9897 266093 -234495 -256231 208386 161133 211313 631493 772437 679391 718415 853909 551432
9886 551432 310178 507152 565278 574910 616040 728843 1123263 804460 812028 1160096 503551
9875 503551 704849 482475 210676 60126 592553 822096 454221 364149 366518 683964
9865 683964 910612 1048801 1000588 592457 770475 1341839 1017102 1165956 1160850 748073
9855 748073 931781 1315860 1268431 832532 580544 779825 639572 786988 887386 1197981
9845 1197981 1513420 1392099 1627608 1825313 1381989 1484909 1216271 1161959 1286752 1014532
9835 1014532 1087140 1212106 1412259 1398086 1373415 1671196 1935582 2162024 2083227 1761062
9825 1761062 2082087 2005061 1963841 1696737 1511419 1774075 1421161 1683503 1935240 1823017
9815 1823017 1805080 1975026 2149969 2078207 2457952 2661543 2539985 2748369 3010547 2568313
9805 2568313 2680379 2854171 2656750 2411297 2397461 2930661 3200093 3292560 3981512 3511279
9795 3511279 3778960 4114650 4001699 3917921 4071696 4401499 4106807 3892420 4238348 4117976
9785 4117976 4457735 4618439 4504114 4606872 4606197 5090175 5537104 5626442 5427262 5526260
9775 5526260 6253602 6350808 6696766 6843839 6914765 7337224 7923090 8622483 8907997 8951551
9765 8951551 9604014 10133262 10792263 11747813 12226146 12627239 13569897 14676671 15858960
9756 15858960 17496409 19434418 21884919 24855850 29843728 36011245 43568279 52078981
9748 52078981 60083493 67075959 74357298 82010505 88225059 90735221 90849582 90278295
9740 90278295 89265674 85836483 80942902 75922581 70814694 66028869 62022152 58748402
9732 58748402 56093479 53758951 51656214 49803638 49274095 50703978 53587315 60051705
9724 60051705 70720458 83731480 95934813 104594241 109523335 111328873 114418072 120663851
9716 120663851 128670512 136889435 144688503 149737068 151587913 151897491 151732537 149647543
9708 149647543 144071815 136865577 129592035 123386152 116707693 108007276 99654800 92278016
9700 92278016 86835846 81806495 77371468 73962716 69819719 64767708 59934635 55903726
9692 55903726 52788634 51396490 52251657 54718060 60634989 70880626 85134911 101411480
9684 101411480 115700591 125176444 128886064 128354240 125418446 118685062 109895607 98931854
9676 98931854 85405143 72399283 60250457 50291863 42191092 35573601 30976662 27413314
9668 27413314 24420052 22054832 20301730 18655177 17416830 16598237 15629586 15014064 14902377
9659 14902377 14442303 13389566 12964593 12018556 11126805 10333602 10611823 10405126 9540858
9650 9540858 9314090 9285956 8716763 8644476 8218262 8141000 7427558 6865926 6702438 6621412
9640 6621412 6513183 6594999 6009995 5366654 5366377 5478763 5369830 5494947 5603144 5256922
9630 5256922 5277231 5173070 5153371 4864479 4545670 4590785 4381886 4060377 4201280 4144826
9620 4144826 3600381 3770929 3946725 3608959 3045079 3136934 3174038 3086695 3183435 3842840
9610 3842840 3585200 3233414 3257457 2950039 3030188 3462571 3849530 3126925 2750261 2751962
9600 2751962 2674108 2707359 2905147 2807127 2196640 2175054 2570158 2731890 2460749 2350715
9590 2350715 2104339 2070711 2109635 1885404 1759372 1513672 2070720 2571989 2375600 2165429
9580 2165429 1798602 1645616 1807293 1933809 2115945 1638448 1627632 1586252 1641223 1600095
9570 1600095 1982364 2081593 1796217 1371597 1525306 1481261 1556586 1802874 1594698 1430358
9560 1430358 1440895 2021993 1903647 1822413 2009894 1863374 2026394 2111697 2117144 1953726
9550 1953726 1620952 2027158 1682689 1054520 1141482 1008840 689255 1160585 1182820 933470
9540 933470 985390 1596356 1628229 1175318 1403551 1557504 1613988 1178567 1335764 1144172
9530 1144172 1172575 1431639 1665420 1186687 1228518 1356581 1347490 1259803 1490910 1092123
9520 1092123 841521 1190809 1324261 816340 864502 941088 847697 848070 1190700 1034676 736424
9509 736424 896231 1223725 532604 284494 686668 984423 835210 761210 888415 370284
9499 370284 680549 963250 1006555 817657 1057466 1017233 958735 876390 954963 780231 762023
9488 762023 1123102 1054881 504291 780686 1090030 935156 1134858 1280261 1007222 740065
9478 740065 530520 594713 214671 398416 760316 608007 199424 501094 571276 490588
9468 490588 729612 704000 314878 190424 663801 1023543 240835 385161 726952 428403
9458 428403 423746 603592 607205 241551 169680 191067 329578 530355 567562 783166 428791
9447 428791 717697 1002910 1357434 1164234 905337 735261 519990 172613 467622 297980
9437 297980 149921 611738 807027 1091136 868324 1009460 602823 839892 833224 690659
9427 690659 191984 391965 580088 573610 452991 530781 240108 190232 214589 490125 307879
9416 307879 509234 557743 504839 611414 801598 815265 651948 1192873 1083115 747417
9406 747417 556155 725611 718464 1319173 1029138 914655 591461 854947 935591 1466218
9396 1466218 1194539 701965 412082 375715 416846 803362 752699 878957 1051792 779291
9386 779291 782190 941175 796072 758897 657841 660249 976807 852405 1119594 876802 851664
9375 851664 745483 1022645 823880 932052 740584 998388 849738 1121318 1050166 1172378
9365 1172378 913085 918542 1117377 1225290 1201266 1346209 1471812 1412289 1094132 1494809
9355 1494809 1767580 1850168 1535808 1626044 1372835 1608862 1788858 1673505 1616108 1513213
9345 1513213 1952972 1911199 1643023 2126585 1886469 1547089 1790186 1297254 1304472 1416528
9335 1416528 1767414 1717263 1829685 2018351 2100828 2067184 2136099 1549934 1559398 1212003 2031932
9324 2031932 2238585 2104120 2318048 2222067 1826330 2325271 2372157 2368573 2330292 2115740
9314 2115740 1668351 1507093 2014267 2190700 1907414 1655076 1353377 1709924 1942759 2190456
9304 2190456 2156714 1988075 2044222 1950493 1644367 2044398 1866574 1836545 2113771 2398022
9294 2398022 2503153 2236641 2349282 2411024 1986027 2016494 2250202 2351207 2544653 2212451
9284 2212451 2473776 2369234 2719592 2767168 2815013 2823585 2468479 1925160 2197913 2238628
9274 2238628 2336920 1925815 1867843 1841965 1906589 2236313 2560500 2729552 2694240 2564481
9264 2564481 2565123 2710496 2445218 2231957 2370950 2408181 2353782 2284714 2337479 2261871 2615005
9253 2615005 2661714 3155200 2913502 2639182 2673131 2696518 2790648 3003561 3106898 3024608
9243 3024608 3099376 2755750 3150582 3392645 3761332 3436059 3376679 3679459 3408004 3698641
9233 3698641 3785902 4264079 4198740 4216424 4428898 4685013 4739176 4749100 4716271 4615264 4965036
9222 4965036 5240939 5468794 5674226 5856105 5985653 6075299 6554437 6725813 7001409 7401508
9212 7401508 8346971 9530817 10548238 11447535 11908956 12449049 12733636 12923556 13292041
9203 13292041 13268396 12991756 12973482 12541797 12575001 12474037 12675947 14060465 15041314 15933736
9193 15933736 16270923 16197570 16931560 17678373 18874281 19468392 19716231 19772320 19593371 19940224
9183 19940224 20547473 21051815 22069129 23479472 24707902 26450059 29388301 33641449
9175 33641449 40917890 50025909 60422705 70398944 78332786 84322375 90641898 98103091
9167 98103091 106115542 110634576 111866153 110213152 107562915 105108316 104618539 106558331
9159 106558331 109904205 113164054 115460409 115801995 115782327 117839506 122511707 130570660
9151 130570660 139696457 148447779 158686849 171789362 183769847 187950343 184133060 177441116
9143 177441116 169705858 158906200 143132893 124310044 105789991 90322391 78140484
9136 78140484 68611933 61406460 56208784 52916201 52144264 52962590 56202062 61511214
9128 61511214 68567503 75810264 80143794 82295873 83798375 85899361 88190229 88757931
9120 88757931 86799997 81544310 75036524 67777859 61198114 55558402 51147465 47884157
9112 47884157 46431483 46701354 48562402 51243421 53825388 56543463 59179548 61226004
9104 61226004 63731241 65846263 67208456 67999109 68921033 69066115 69569723 70304175 72003901
9095 72003901 76200341 83110802 91531596 99680352 106369564 109175210 107919276 104329040
9087 104329040 99445605 94303494 90561041 87868550 85260261 81891880 77441930 71576483
9079 71576483 64109771 57322272 52428878 48017877 44944052 42569626 41319480 40988700
9071 40988700 41261412 41403509 41921703 42783605 43657213 44581728 45722143 47109894 49101638
9062 49101638 52615525 58932460 66760174 75559935 83462027 89584283 93851357 96349058
9054 96349058 97309540 97086253 95928471 92858050 87927439 80742933 71777786 61674818
9046 61674818 52615197 44942843 38916253 34234432 30704565 27824322 25445013 23909752
9038 23909752 22594849 21653338 20668026 19987628 19735224 19193621 18688211 18254677 18458848
9029 18458848 18370111 18515124 18442940 18096227 18528329 19535612 20335376 21291669 22149810 22479096
9019 22479096 22895775 23221890 23772847 23375233 22870986 23252486 23617458 23453620 23759121
9010 23759121 23917695 23698024 24310736 24863718 25740716 27781024 30352030 33623415 37452043
9001 37452043 41063183 44375262 47996706 54168001 61734548 67785951 69854990 67417005
8993 67417005 62440521 57644953 53745389 51210548 49295377 49519192 51526185 54638868
8985 54638868 59044170 64003053 68328367 71956325 75024155 78477410 81752687 86632041
8977 86632041 93874807 102680774 114166484 128231131 144804576 161878222 174950259
8970 174950259 180566525 180956198 180987652 184379512 191085800 199657730 208359716 217766313
8962 217766313 226478181 233563054 235871959 230720871 219496854 203770813 185607490 167210783
8954 167210783 149090637 133708036 121229853 111975175 107016590 104452420 104442251 107110219
8946 107110219 110271307 115928968 124331938 135205788 146926905 159268500 171181574
8939 171181574 181991418 189317026 191988402 188362912 180462048 170798786 161841662 154977621
8931 154977621 151231233 151261438 157936139 174388158 205843108 246246306 281559671 288172801
8923 288172801 269468982 238559734 203417568 174186485 149408343 129678909 112377094
8916 112377094 98593417 86257724 76968085 69887691 65642867 63277263 63827164 66824938
8908 66824938 71246802 74066644 75609591 75747713 75404624 74432587 72335053 67874087 61798778
8899 61798778 54984179 48344669 42197983 37172726 33229229 30623873 27755564 25691357
8891 25691357 24218187 22286151 21256707 20509521 19616516 18373956 17782793 17425960 17086376
8882 17086376 16561321 15664264 14632233 14125773 13917878 13466992 13087282 12627077 12271137
8873 12271137 11810627 11806604 11905359 11392502 10772775 10656490 10278624 9694001 9780974 9617922
8863 9617922 9184935 9073626 8848806 8797928 8526810 8866424 8663912 8298600 8293013 8210294
8853 8210294 7932591 7774617 7355221 6826623 6744716 6563147 6777974 6553187 6464134 6222264
8843 6222264 6191943 6144010 6030365 5904224 5502785 5370113 5416944 4958379 5214402 5082492
8833 5082492 4910872 4891007 4683661 4738123 4566395 4212099 4292795 4368556 4225063 3877287
8823 3877287 3973447 3996106 4018754 4114733 4224259 4090876 3812396 3680840 3729915 3541661
8813 3541661 3671619 3417877 3295159 3274791 3429154 3150073 3196527 3849280 3498681 3238641
8803 3238641 3274355 3219287 3102931 3242134 3223708 3104912 2517540 2817745 2644617 2675303
8793 2675303 2798465 2648495 2556500 2521533 2552303 2136756 2174086 2390122 2323448 1702005
8783 1702005 1826249 2104332 1861874 1945697 2260746 1869601 1762143 2045709 2361131 2282143
8773 2282143 2275005 2111332 2135789 1785489 1912595 1933254 1525371 1557658 1442947 1494010 1610284
8762 1610284 1741157 1771647 1499068 1732391 2088151 2232499 2110057 1769666 1883836 1677971
8752 1677971 1642071 1991565 1795255 1488554 1582432 1276959 1280177 989135 1125864 1451022
8742 1451022 1605894 1627251 1709057 1711912 1995938 2424588 2214434 1808295 1855976 1531772
8732 1531772 1604742 1107986 1097334 947529 1170029 1207622 1335878 1320594 1214441 1437311
8722 1437311 1675342 2097538 1955846 1635917 1340998 1085111 1166499 1191803 1216886 902920
8712 902920 938180 1263153 1062642 1716949 2017907 2132141 1909908 1966916 1785970 1246298
8702 1246298 907000 1382533 1070781 1059907 938986 693044 569313 1043276 1529360 1619912
8692 1619912 1365131 1161161 940444 955129 1102350 1210442 739637 624980 836358 805240
8682 805240 1112650 1273472 1274321 979587 667883 824634 726904 880784 609481 619109 810241
8671 810241 912323 942560 834847 704672 405728 475095 615492 725703 778518 884909
8661 884909 1058346 1232539 1175411 783178 361799 368545 255463 311607 415314 658588
8651 658588 588049 458377 516112 921511 611039 352189 496319 676085 643321 835698
8641 835698 1051996 995648 897047 893136 751740 466056 289544 495309 346219 745127
8631 745127 732413 487003 814023 1059560 1027820 728016 876366 759142 750687 630667
8621 630667 550664 650709 435453 765782 976998 719985 1054210 1186491 704846 813987
8611 813987 993003 1349255 1387387 1336733 1174764 952469 1210072 1529934 1287704 853806
8601 853806 597522 805731 884667 1143965 1553291 1162203 1045397 1279544 1250172 1014882
8591 1014882 971455 935521 755178 723589 511847 358761 245003 380933 607380 675893
8581 675893 533458 818015 621620 478402 763357 866185 1126578 1193176 1166426 1335113
8571 1335113 1272531 1101457 1002165 1144873 476087 202372 511526 60184 202884 693299
8561 693299 613244 623697 1010625 886487 330877 188081 705315 598318 340775 -17182
8551 -17182 67550 -74701 96096 657960 273643 -26139 340129 210364 393928 701222
8541 701222 703483 122320 276104 511844 200811 -74697 182397 52891 -191119 -109365
8531 -109365 57594 426620 262376 236898 -111726 -243458 148894 371532 485338 675458
8521 675458 456035 240568 521997 429777 421543 110850 43874 -161135 -315187 -14577
8511 -14577 193919 531304 464859 324440 356129 246065 334995 -112562 -122936 -173713 93254
8500 93254 620236 764134 256490 348834 318254 428580 98863 -393557 183554 41351
8490 41351 277655 352761 114775 325494 398187 283006 473852 176270 224733 33253
8480 33253 81449 628758 263413 392335 558448 270117 129088 -188888 54944 266989
8470 266989 133371 229284 21395 -5286 136575 78051 -3606 -84071 33576 217376 14642
8459 14642 185560 237713 395731 353717 102036 241992 64101 75599 426454 797609
8449 797609 784620 1072554 817448 654519 556944 608292 543799 305305 19058 109766 62699
8438 62699 600701 620621 377199 139378 106069 39969 406323 244841 21366 -242298
8428 -242298 157002 79423 -32954 319314 181822 301497 118696 529403 585500 62636
8418 62636 -183489 -314394 -545309 -145844 -385863 -413526 -473182 135081 42439 -35121 442939
8407 442939 -176507 -407922 390871 480850 268163 349980 182100 698485 297719 252963
8397 252963 -28759 -182999 -430488 -531786 -426628 -766680 -261165 262641 134027 238450
8387 238450 184810 81981 306740 266915 68225 258659 211878 328090 276078 -410794
8377 -410794 -86501 -286100 -309995 24168 20041 -548798 -431167 -120039 -63271 -116101 267684
8366 267684 515567 269220 256165 -266771 -220982 159852 -132753 12062 -279408 -60128
8356 -60128 48805 -102706 407796 514229 303089 338322 360999 -44710 -103163 382225
8346 382225 359406 146369 172132 -93971 -4587 326236 -246857 -422426 -223007 -72759
8336 -72759 89537 330801 603113 -60910 110979 265482 220051 327345 96231 147696
8326 147696 234537 -221202 -565540 -299609 -270999 -272963 -573099 -200216 180584 -63747
8316 -63747 310144 558282 152126 450183 782037 211986 79040 99267 189512 73463
8306 73463 217735 202574 95581 544719 511557 18328 -399593 -55250 250962 -242168
8296 -242168 -503852 -52167 -736070 -332358 45460 184248 315050 532965 515189 330128
8286 330128 -54174 -50845 9324 227980 277219 -149340 9524 232250 188397 -367168 -56896
8275 -56896 -19328 27135 230178 266146 163413 599658 387823 341985 161143 -450216 -101084
8264 -101084 -224784 -198756 -29359 -429952 334100 290305 185293 86403 168521 297482
8254 297482 478582 424846 127461 -46241 -119377 -84061 -454234 -836636 -951607 -582183
8244 -582183 -337167 -135443 -88840 -180687 109834 -69873 -7631 91874 326338 -79102
8234 -79102 217041 371938 -112615 -238256 -880809 -557100 -420949 -646919 -240449 -123321
8224 -123321 20785 311439 256787 378141 395710 -168522 -36948 -88057 -127777 175824
8214 175824 181381 96245 422377 150890 -342491 -126890 -28576 -354550 -684421 -217415
8204 -217415 564462 497425 164895 316473 -429694 -357178 163205 388084 -66921 25275
8194 25275 814187 1891351 -2454217 -2864836 -1038183 -1444836 -498401 -226676 -525844
8185 -525844 -1143806 -605326 -378691 -215608 -73116 105174 -273212 -163143 182307 -271721
8175 -271721 -847228 -203448 179843 -555631 -1110838 -617917 -483554 -320520 156725 186650
8165 186650 262064 -62185 -87293 454429 -381847 -55942 -241221 -633883 -458828 -493370
8155 -493370 -864991 -563299 -51804 -238336 -182942 -333757 -266727 -163073 -437789 -382631
8145 -382631 -76489 -10512 131074 298827 165132 229457 -202811 -78103 -93103 -53746
8135 -53746 149758 -424729 -238903 -534327 -224431 -282960 -276888 -176427 -98045 -114442 93035
8124 93035 248633 90309 202820 59950 -124045 -485223 -324597 -295474 6990 439573
8114 439573 510963 103038 52525 -12537 77495 -209578 -244124 -252781 -230096 163737 460212
8103 460212 155262 173221 428840 -403254 -129856 94520 -67545 -336414 -93428 -123498
8093 -123498 85022 -50229 176108 208449 133857 -275063 -431351 -268528 72441 -72294
8083 -72294 -1777 -348615 -359102 -547208 -184366 4372 -72920 -138279 -136188 -326860 -69857
8072 -69857 481787 79860 -268038 -56049 15893 -372710 -292753 -277351 -129314 -338531
8062 -338531 -126078 -106209 -195264 -401273 -183714 -271375 -243441 -190983 -206198 -432945 -97381
8051 -97381 -157567 -190075 -253233 -39632 -274760 -51771 -275130 18473 89518 183196 446730
8040 446730 577957 170980 233197 -318547 -958265 -928154 -420402 -324287 -348369 137146
8030 137146 70426 448437 574851 459936 407708 -125829 -322720 -350193 -391877 -467444 -248698
8019 -248698 41156 -58569 258199 -60387 -123912 -43491 50063 81351 383787 -121139 63595
8008 63595 -153871 -343065 -260339 -229459 54184 -126721 19264 -343531 -188430 -181172 -508103
7997 -508103 -29081 -62814 -419026 -480103 -40455 -152561 13133 245025 197595 129185
7987 129185 265080 386609 178789 134557 -82012 -377346 -503005 -418701 -107928 -599709
7977 -599709 -372559 87975 -65395 -85189 241605 97953 -40382 167282 -276678 -154427
7967 -154427 -146882 -175592 -334938 -384117 -340503 -504428 -509551 -362387 216695 -262198 -97507
7956 -97507 114841 -48589 -30467 -84640 -132592 -258885 -125389 -76729 -143542 12980 -99010
7945 -99010 9324 195097 143439 -89866 -249075 -327060 -128333 -165588 -21689 -315077
7935 -315077 -603113 -189682 -111801 -80850 -235550 -370839 -500210 -132103 -117403 -485094
7925 -485094 -332415 -178157 -611357 -589867 -745285 -260824 -214144 -106746 394593 -81138
7915 -81138 -397398 -234221 -175493 -470625 -429568 -473971 -840152 -672922 -121519 73600
7905 73600 41912 117914 -356814 -284664 -299045 -13807 -137684 -415119 -103135 -192537 -138666
7894 -138666 -176759 -161571 -323630 -29942 173296 60576 -301268 -319714 -297600 -379416 -119180
7883 -119180 -347084 -422311 -372142 -118991 -179662 -200699 -298033 -269594 -248763 -85711 -245422
7872 -245422 -426220 -240702 63603 93733 78747 50363 -120245 -193053 -237890 -257061 -5366
7861 -5366 -135875 -547040 81113 -22272 -24727 131708 153237 266958 85906 -365118 -431854
7850 -431854 -641955 -559940 114349 66107 6341 200033 -136687 -440782 -115421 -38661
7840 -38661 -399010 -28005 -43230 -319415 -286094 -300281 -11144 -250275 -271125 -506065 -523429
7829 -523429 -759604 -91182 232976 187713 192166 -43580 -196883 -259375 101232 35364 73746
7818 73746 -34163 -61412 -542228 -225623 -89877 -394158 86839 251363 479556 275902
7808 275902 303670 422434 -71841 -140125 4057 -351874 -769545 -629903 -374255 -320988
7798 -320988 418181 706336 406481 273790 -235488 -529649 -206397 52790 -74603 -424388
7788 -424388 -593995 -58043 -325620 -70100 276136 -206788 -473390 -141746 -46578 71985
7778 71985 -37509 -67027 10649 -20126 -119919 -176192 -238121 -472441 -387508 99713 -191540
7767 -191540 180874 249184 -79088 -68542 -263028 -73254 -89068 -72355 -228077 -640558
7757 -640558 -526048 -116543 -241193 -482819 -188615 -163112 -296061 -311246 179077 263206
7747 263206 -440574 -123632 182637 -218961 -85871 -366589 -528776 -504838 -342355 -151585
7737 -151585 -159340 337422 158086 -331461 -160776 47063 -71710 -286935 -173068 -135104
7727 -135104 -575557 -463716 -81715 -231422 -317134 1788 -58919 -202678 -36554 147990
7717 147990 159607 196646 77888 -207455 -395918 -176730 -618432 -102932 196174 -65605
7707 -65605 -560750 -657126 -383433 -156162 179224 66555 -299916 -404539 -292990 236111
7697 236111 301298 243816 -179701 -622131 -286645 -640275 -587721 -136560 68925 76028 325485
7686 325485 70429 -244231 -496932 -338597 -319223 -344839 -60218 -77925 -188190 -145807
7676 -145807 58859 28848 501862 88842 -385696 -467313 -422426 -394205 -525825 -315842
7666 -315842 -332691 -47201 435329 186464 -198212 -178049 29585 -195490 -56601 -34205
7656 -34205 -434627 -503015 -666029 -358511 -228282 325799 669012 151204 247160 -50298
7646 -50298 -457615 -190930 -235111 -12202 -251693 -325764 113215 -327639 267213 233886
7636 233886 -70187 31608 -386721 -815232 -656182 -560013 -266459 -290904 -93543 211593
7626 211593 377393 572499 275069 288211 293614 -109173 122701 118745 -294496 -331832 -276099
7615 -276099 -139074 -151886 -39480 155577 43685 -165285 159148 302105 423839 6763
7605 6763 271998 -15761 346985 330677 -38460 -326621 -88780 -44535 -169818 15584
7595 15584 86693 -361657 -124012 157617 284667 283015 279817 504377 440433 291928 60807
7584 60807 363820 -33848 -20314 -147302 -559920 -580739 -264311 -104701 186458 252299
7574 252299 194721 420982 310529 270582 355189 -40888 -210699 -240857 -471427 -419545 -78403
7563 -78403 -246348 -460057 -155709 -156362 -99651 -78004 28090 258361 494120 165008 -6400
7552 -6400 -492456 -482908 -610659 -754447 -261137 -452598 -459317 -107039 -15256 80057 191454
7541 191454 265077 695797 -60378 -479758 -883315 -689971 -424648 105219 362866 3831
7531 3831 -163630 13721 125570 414705 214227 -94189 100182 -41864 -460195 -690398
7521 -690398 -555917 -56828 -60499 164539 133727 -503778 -461352 -156770 408178 16553
7511 16553 -98730 -371298 -355382 -568339 -153611 -175627 -534912 -406244 -590653 -680628
7501 -680628 -510130 -335340 -356134 54923 111063 -10526 -246666 -31344 56354 -468017
7491 -468017 -218915 -49835 -186577 21650 260308 -148799 -223925 -178005 -538467 -410334
7481 -410334 -431871 -287977 -535250 -419024 -69644 65129 177662 -91040 -158183 -347333
7471 -347333 -390910 -302036 -865335 -676033 -491641 -369535 13967 -74673 -151958 -86844 -97015
7460 -97015 225239 390474 -173922 -149231 -133148 -200530 -151135 -92465 -440811 182477 338125
7449 338125 254190 102437 -13496 226556 196371 115100 57369 35763 -371620 -290332 -52391
7438 -52391 109051 440617 289743 224806 -22886 -199248 -392072 -310319 -322464 -523932
7428 -523932 -456855 -581630 -203666 66218 341713 181025 184414 128712 -90337 -490684
7418 -490684 146655 -58472 -311472 -161676 -397499 -234862 -268916 -87895 -125249 -585973
7408 -585973 275488 340198 50219 67269 -26647 -247805 35733 351867 121842 -281891
7398 -281891 -208614 -200852 -199644 -132933 -308558 -497438 -351415 -83612 96806 -14546 98295
7387 98295 250962 16619 260251 273383 -243580 -492687 -469436 -453506 -45437 -18645 -444800
7376 -444800 -545236 -307021 -65326 13551 -135853 -77038 264918 -117098 -50601 325732
7366 325732 216095 279650 372326 321300 -183528 -336460 -336698 -74389 -126668 -138208 -429283
7355 -429283 -145648 226441 298036 -140086 -122340 -70467 -26643 -433315 -311985 -310331 -452297
7344 -452297 -194263 162088 -267588 -199625 218703 -130607 -613033 -521827 -545522 -391863
7334 -391863 -461307 -428580 -938763 -1256468 -738824 -458952 -96699 -1211 -18107 318842
7324 318842 388797 373638 -154440 -481187 -421819 -712900 -795395 -566166 -365728 -272713 -104578
7313 -104578 63202 164426 -170108 165182 -163253 -298510 -29719 -146514 -271643 -525823
7303 -525823 -463814 -387999 -225548 43209 -195499 -511112 -322600 77034 7385 -182359
7293 -182359 -434778 -429478 -477182 162863 -102306 142635 373218 -118439 -25342 -155732
7283 -155732 -279892 -144952 -259259 -149537 -409498 -307987 -149055 -137531 -319701 93961
7273 93961 269067 256312 -9886 90598 -163326 -41042 404579 -74051 -697706 -777620
7263 -777620 -599523 -912742 69232 109740 -332629 141217 315727 -24234 -27689 -92682
7253 -92682 -138174 -490310 -787913 -449391 -317555 -458397 -430344 -731968 -382167 -267964
7243 -267964 146307 -220260 -77851 115354 -36870 -127883 84308 99406 -71613 -168612
7233 -168612 36635 138931 -390320 46465 162230 -101493 -383182 -379902 -387581 -428315 -371546
7222 -371546 -356481 -228 212334 188409 -191783 -268082 25205 -212347 136149 154734
7212 154734 -315206 -627585 -388476 65343 -26900 -398633 -94532 -150174 -280392 100729
7202 100729 145434 11152 181428 -239846 -339355 -112101 39479 -65543 34872 -41602
7192 -41602 15140 203944 168268 -134104 -75947 -440245 -443573 101248 406356 343773 327012
7181 327012 135945 -155391 -259515 241582 -275654 -423730 -386900 -301401 -358311 -101746
7171 -101746 257743 66187 160007 425623 325831 70416 234394 507996 486000 294593
7161 294593 453745 -174630 -689310 -321719 -159568 41491 -96569 -94158 -205406 -196054
7151 -196054 34939 111179 128022 195499 54449 -357374 183032 246400 398000 221347
7141 221347 342607 -201696 -129608 -260151 -53857 128029 145919 -61628 10571 -304798
7131 -304798 -229874 -312781 -14925 -57038 -224765 -295317 -302692 -447434 -325586 -338694 21516
7120 21516 180155 339387 -9784 -374909 -249026 -76407 -103371 -290656 -177043 -509175
7110 -509175 -808856 -90182 106931 -139396 -139800 -552557 -352738 -462364 -300274 -247897
7100 -247897 -528867 -216178 265511 244146 21327 214371 27315 -227725 251760 447500
7090 447500 -28624 13623 -240625 -816961 -346819 -463549 -502442 -483349 -529994 -445957 -551658
7079 -551658 -226202 363501 99752 -522878 -109658 -244605 -253431 -298495 -6777 -100800
7069 -100800 8003 441676 93849 -78352 -353392 -142411 -408098 75197 -258605 -290596
7059 -290596 -153263 -281202 -580061 -483282 -367973 -403829 -480647 -325447 -535257 -641437
7049 -641437 -507765 -233958 -189884 -109693 -76695 -86744 -145641 -316859 -383131 -353609 -346071
7038 -346071 -537131 -810182 -848293 -363287 -302413 -214332 -155150 -282543 -119331 -228098
7028 -228098 -151991 -326272 -101768 -103497 -182438 62498 -279716 -366758 -245049 14410 -248729
7017 -248729 -605276 -560327 -272143 27419 -149616 -109382 -93102 -174248 21478 115044 26959
7006 26959 -60953 -432162 -426511 -275483 -265926 -341403 -35285 -54307 253945 143395 277791
6995 277791 265964 86656 -191741 -275324 -366165 -401900 -492701 -504359 -347824 -178145 46973
6984 46973 -14004 143941 -56309 -162497 -185099 -115747 -146042 -332297 -229895 -103322 -369706
6973 -369706 106482 -30805 -277402 -199250 -222367 -244808 -226965 -209264 -403025 30326 430067
6962 430067 245282 19073 91003 181536 -40076 -405556 -716178 -628844 -855923 -182589
6952 -182589 -99713 -85858 2869 103550 385239 352365 459858 -7627 -563324 -464211 -471733
6941 -471733 -650208 -155408 -109086 -423036 -155496 -62380 238842 383493 551966 110822
6931 110822 -214011 -418027 -202214 44244 -88595 -15737 -205116 -572286 -231977 -286288
6921 -286288 -98879 -159592 -178045 -251751 -258311 -21194 258121 98481 346609 98558 -252127
6910 -252127 -317418 -523789 -323279 -334221 -322535 -163235 -551458 -211278 95235 249350
6900 249350 7850 -123768 -169568 -232648 -180694 -170945 -279420 -286438 69541 -152612 -50840
6889 -50840 -341254 130402 314212 52686 171104 -148640 -557256 28316 210929 -229364
6879 -229364 -496358 -301630 -500366 -410870 -240616 81497 -201561 -59163 26619 188575
6869 188575 -119515 181816 431912 -197318 -55209 -297182 -284565 30418 269279 111011
6859 111011 -119650 58360 91337 -169427 91903 -97223 -364558 -217128 69829 223302
6849 223302 263033 193116 120485 -227266 -224586 62144 183433 -30453 -311976 -150044 -193309
6838 -193309 -71309 -39618 237382 181354 -40262 -84428 -117608 -286283 -188751 -207266 8609
6827 8609 -89469 -268811 -162900 -49891 28314 270427 270702 111038 -161376 -211780 -307818
6816 -307818 -165451 56969 40208 -14243 -116895 -138973 114108 -1874 -27903 -186172
6806 -186172 -138826 -79217 106536 18890 32739 421624 247589 -209622 127545 -68111
6796 -68111 -358770 -282193 -83819 -117349 207563 152759 126192 -326351 -191606 108067 -185072
6785 -185072 -181992 -369190 -308633 -396653 -69872 141994 -150704 -185767 290775 -86846 170157
6774 170157 65243 221235 -9980 -93520 64785 93360 -178684 -84297 -354149 -300748
6764 -300748 -402 300900 156214 -243617 -439658 -186749 29090 426597 259041 92421
6754 92421 -226343 -132555 129943 -91987 76753 219130 65318 -206843 28950 -14707
6744 -14707 -5884 -185339 52048 -186096 -126955 332097 225216 -12066 -263925 423988
6734 423988 450599 145347 123606 -196574 -323480 47842 477625 111269 13920 341473
6724 341473 309651 290065 449581 541450 365829 504167 753431 797719 325264 85627
6714 85627 510924 130175 288766 518218 115086 -64614 95693 243298 540824 914614
6704 914614 760214 358242 -159434 298255 509678 145273 -289559 -296877 -126589 -5725
6694 -5725 412196 523047 -30247 183372 642107 589711 458552 891372 704876 548409
6684 548409 430022 384101 124842 302434 802500 350579 415890 443387 855183 319372
6674 319372 483007 670980 242064 512547 916557 667311 176658 66394 422139 500920
6664 500920 812845 788494 577259 194191 289333 212908 243822 425756 793270 399634
6654 399634 402130 808568 616350 884155 951123 508451 376370 521344 650127 593670
6644 593670 309903 551714 726719 838570 844775 616278 240806 218848 243012 721462
6634 721462 692131 618354 832437 1113977 890868 976537 662779 392114 661767 775420
6624 775420 784994 835829 624672 573277 825529 934126 1036309 921497 1063182 1090381 1166337
6613 1166337 996240 1190959 1253204 1186491 1549753 1916571 1752553 1560154 1725554 1770254
6603 1770254 2081044 2384035 2637720 2613949 2680091 2577891 2656065 3023365 3699747 3615751
6593 3615751 3346851 3011418 2817871 2859506 3183570 3307358 3089649 3343126 3528592 3726750
6583 3726750 3853734 3962920 3971275 4330966 4634066 5113797 5389723 5923326 6777949 7296491
6573 7296491 7326969 7417197 7777960 7654982 7184042 7215550 7219817 7413550 7852918 7989147
6563 7989147 8053071 7796373 7568837 8155575 7917696 7676839 7950728 8344096 8750310 9204717
6553 9204717 9490573 9429738 9568745 10096344 9750664 9774461 10246593 11016939 11484754 12104741
6543 12104741 12996709 13620511 14456217 15164713 15152495 14337771 14027924 13834133 13273296 12585912
6533 12585912 12389400 11614164 11160452 11103010 10989944 10794215 10690827 10969742 10990754 11022659
6523 11022659 11605631 12175948 12532234 12572992 13094154 13456477 13994269 15192606 16088013
6514 16088013 16356909 16724247 17199546 16804206 16527743 15793688 15291741 14715285 14240959
6505 14240959 13567730 12783200 12741823 12729307 12765969 12731861 13067772 13036685 12314617 11951479
6495 11951479 11215265 10139261 9523840 8900695 8517520 8268017 8031813 8077553 8442656
6486 8442656 8510545 9029611 8636651 8246039 8096370 7416894 7043282 6788806 6362960 6037536
6476 6037536 5895880 5428796 5327128 5058715 4805893 4498774 4739814 4669124 3983134 4374339
6466 4374339 4171178 4071448 4095641 3749906 4162953 4192000 4445219 4200913 4148512 4524166
6456 4524166 4754370 4734898 5005886 4802108 4458874 4703879 5347951 5803622 5622792 6476790
6446 6476790 7757346 8792539 10246013 11920482 12913114 13761752 13697929 13342432 12151963
6437 12151963 11457702 10433735 9863131 8889342 8519342 8781787 9508351 10291485 11507432
6428 11507432 12436911 13851209 14697330 14069613 13803988 12420691 11308339 10397962 9366114
6419 9366114 8961187 8255137 7646751 7271121 7172684 7003139 6812666 6740590 6797480 6516027
6409 6516027 6581654 6601111 6903986 7759328 7765970 8282247 8544715 8961987 9914077 10781444
6399 10781444 11927819 13551723 14741948 16623579 18918395 21128259 23214259 23907515
6391 23907515 23526209 22655478 20732439 18830836 16815323 15167507 13657834 12461672
6383 12461672 11466164 10772169 10111415 9397897 8779881 8461690 7927400 7757332 7738293 7504442
6373 7504442 7338554 7919743 8251428 8570595 8874166 8789241 8917910 9573844 10055047 10845492
6363 10845492 11759003 12339262 13823952 14702329 15286274 15692014 15474233 15442366 14897515
6354 14897515 14292156 13485619 12634717 12164475 11393635 11123667 10877806 10704061 10858904
6345 10858904 10693197 10734703 11053812 11175985 11425432 12469251 12529293 13021387 13693490 15125698
6335 15125698 16552617 18702272 20641361 22946985 25954315 29647231 34029837 38665279
6327 38665279 43693661 47913235 50149613 50694639 49755254 46660944 43124891 39108465
6319 39108465 35266197 31262346 28446817 26143601 23839997 22273960 21172106 20013542
6311 20013542 19405301 19360371 19397461 19586236 20764713 22507756 23959860 26154873 28001632
6302 28001632 28977899 29691050 30189531 30354736 30494537 32067344 34357099 36718433 39966510
6293 39966510 43017890 45577098 47286646 47980130 47808444 46396800 44911079 43654942
6285 43654942 42427585 41963971 42833458 43887667 45071011 46728967 48680146 50658379
6277 50658379 52264918 53139160 51966738 50023344 47562214 45204071 43570811 41837139
6269 41837139 41087978 41385940 42903351 45561702 49032885 52874091 57116921 61944546
6261 61944546 66847763 71930977 77463087 82084144 86393762 89633748 92753962 94399740
6253 94399740 95818742 96495465 96223286 93615081 89418126 83611262 77701126 71728583
6245 71728583 66563768 63101356 60726459 59829453 60473001 63697574 68529082 74426884
6237 74426884 80595275 85335850 88323096 89006270 87459796 83914301 79211251 74145740
6229 74145740 68389400 62863537 58081590 53709022 50002387 46884729 43809909 40497339
6221 40497339 36916009 33922919 30979080 28072720 25613119 23614758 22018175 21143991
6213 21143991 20510837 20073393 19969421 20045505 19763958 19098149 18353004 17108118 16305902
6204 16305902 15610431 15173100 14588054 14510583 14619791 14508677 14813979 14684884 14924728 15738787
6194 15738787 16452623 17529645 18872092 20444527 21978082 22699353 23603076 23374074 22912510
6185 22912510 22121944 20625881 18856249 17319525 15937385 14796471 13676562 12985370
6177 12985370 12119745 11747073 11827513 12154706 12381580 12855043 13708471 14489669 15023413 16323577
6167 16323577 16471957 16962790 17104577 16812913 16101538 15171043 13618973 12089087 11121206
6158 11121206 9913427 8944380 8180176 7733170 7107489 6509958 5988755 5659835 5449421
6149 5449421 4986676 5057776 4807630 4427919 4383407 4565236 4463732 4354439 4074674 4032079
6139 4032079 4194497 4388094 4343576 3717781 3708385 3946095 4094905 4225645 4083607 3670062
6129 3670062 3676693 3343750 3155297 3113513 2916419 3184619 3287980 2948789 2970295 3067167
6119 3067167 2914873 3120814 3168694 2552332 2468641 2374455 2400101 2503799 2831766 2801933
6109 2801933 2648666 2541752 2625746 2547321 2402347 2736297 2540758 2533278 2424780 2242875
6099 2242875 1965723 1853996 1877635 2038232 1920956 2004515 1800456 1822336 2410875 2544200
6089 2544200 2469018 1809354 1668941 1741229 1950511 2038985 2016459 1867033 1629945 1646916
6079 1646916 2053037 1670993 1697102 1727209 1663720 1837611 1785056 2024373 2072744 1935236
6069 1935236 2106212 1943776 1977620 1865419 2025929 1964481 2206784 2265725 1922998 1882893
6059 1882893 2008619 1878905 2017368 1984756 2062020 2247922 2445651 2645457 2565530 2640614
6049 2640614 3100018 3196842 3806173 4072451 4188319 4507513 4727739 4474694 4194867 4554757
6039 4554757 4430288 4558922 4748506 4348839 4405851 4530373 4530389 5141891 4793968 5154600
6029 5154600 5726615 6158034 6911945 7315657 7595889 8332306 9020180 9371638 9979328 10118497
6019 10118497 9993459 9901065 9707133 9782550 9774944 9571937 9424820 9414040 9682787 10343580
6009 10343580 10959197 11288924 11552487 11926369 12431050 13036721 13195877 13298942 13949647
6000 13949647 14166111 14623378 14909062 14795961 14421297 14268926 14001490 13669345 13748112 14152305
5990 14152305 14313944 14902609 15175463 15494755 15672220 16320154 16291900 15923066 16101019 15950213
5980 15950213 16012838 16199265 15808162 15378546 15400966 14945713 14741422 14265951 13968812 14438337
5970 14438337 14629487 14911431 15268674 15076585 15181937 15754096 15821956 16097418 15971517 15355886
5960 15355886 14871611 14476281 13979940 12709505 12482187 11547052 11610243 11171508 10910228
5951 10910228 10192262 10014319 10065924 10483888 10302374 10486453 10430287 10627050 10815710 10974952
5941 10974952 10752383 10181536 9714004 9395480 8608333 7982761 7732103 7438077 7173727
5932 7173727 6846443 6466908 5920679 5785727 5631569 5612669 5043461 4877775 5071842 4667701
5922 4667701 4289521 4701593 4733998 4847173 5117743 4743069 4225287 4321289 3878301 3733270
5912 3733270 3530415 3346567 3073243 3321228 2960084 2525054 2572117 2482833 3077293 2823215
5902 2823215 2989846 2519909 2028105 2282664 2224798 2290009 2443538 2557976 2094042 1586146
5892 1586146 1561799 1318670 1660573 2145884 1925492 1642242 1784498 1833949 1650218 1986204
5882 1986204 2318103 1901297 1746600 1869197 1691500 1578875 1466665 2113796 1910242 1720861
5872 1720861 1387284 1001799 758804 1185169 1370831 1423891 1629070 1212038 1000733 1327802
5862 1327802 1187896 1184097 1398626 1041646 1357947 1663370 1661312 1641824 1453982 1322722
5852 1322722 1082994 1455143 1250354 1109617 969314 1403758 981929 1227643 1274298 966842
5842 966842 787213 669588 1001766 661742 459154 999539 1041031 1039659 1067428 1375818
5832 1375818 785237 754725 1374759 1205516 924118 889533 936829 821606 1344298 1371262
5822 1371262 1374814 1201728 1236325 1247586 947715 771130 703302 387160 602439 1149796
5812 1149796 756410 800643 1351638 1560684 1828845 1727844 1431542 886803 640420 1167731
5802 1167731 1196040 1165415 885475 838408 914520 1226570 954680 946683 1158923 930874 1053980
5791 1053980 1006370 820639 929116 1140456 1446394 1313904 938921 1000895 750347 777602
5781 777602 1124632 1421537 885233 1049504 919021 1115854 963351 1107209 872332 846009
5771 846009 1147554 1051213 955416 877848 1034515 1224002 1384336 1696831 1226190 863830
5761 863830 795244 1048454 1206578 1502353 1220147 1092831 1277528 1021405 1236605 971295
5751 971295 1052100 1041786 1020430 1084985 1255009 1434304 1278337 1352702 1194570 977612 803943
5740 803943 859320 1066626 996807 694693 641293 778895 673293 1059300 1380947 1198209
5730 1198209 1025573 791491 1309050 1054491 1232018 1294839 1029857 903163 865349 977795
5720 977795 789436 722530 936911 850181 1095529 1388351 917380 623135 1168534 1521026
5710 1521026 1205356 951039 1142929 683083 266009 720802 790812 601758 501345 874040
5700 874040 1120822 1096543 1319691 1354203 1186421 1195618 1046733 777655 936937 959655 1092515
5689 1092515 819651 1158564 1007349 581936 775167 1084947 967271 810613 990099 1131573
5679 1131573 1797731 1630246 1551724 1394072 1180539 856572 1471663 1366848 1311468 791423
5669 791423 856248 1192593 1015205 1368368 995474 628739 1217488 1102412 1285037 1209168
5659 1209168 1207406 1253209 1427415 1362068 1260269 1021335 726332 866901 900857 1100739
5649 1100739 1005333 1099597 1050991 1012559 1033418 820790 1237220 870643 863543 1071952 941706
5638 941706 646238 588353 694874 775022 791241 792973 1154461 1004104 939312 1360045 1560029
5627 1560029 1660352 1558055 1134444 1097258 1376883 887927 1152827 1275453 840451 1008956
5617 1008956 825251 909595 957422 858685 1109992 1235153 1082197 1355741 1460408 1437128
5607 1437128 1250461 1070796 976711 978739 699718 1025554 658646 743201 1046088 1094023
5597 1094023 1517411 1553625 1453289 1192908 1319182 1663419 1279217 1343636 923312 709957
5587 709957 1182802 1179487 1105796 1207014 814609 870712 1285642 1275295 1787679 1519288 1288424
5576 1288424 1277833 1462082 1419469 1438267 1253598 1251875 1458893 1196217 898958 716368
5566 716368 466023 584375 801982 776632 418076 589302 646157 1081679 1411639 1740138
5556 1740138 1437908 1288389 1518754 936089 1075298 992748 960132 1002681 930339 1020116
5546 1020116 1079939 827171 1528391 1464395 1481637 1087955 1146681 1124413 1251144 1334681 1198467
5535 1198467 1338245 1594718 1141572 1480254 1696307 1486268 1501446 1614281 1617584 1478879
5525 1478879 1087716 1315644 1566931 1134024 1362432 1404997 1611098 1550755 1675671 1606832
5515 1606832 1409338 1000352 1398243 1477334 1421179 1590754 1932374 1508006 1530149 1452391
5505 1452391 1116936 1402872 1399560 1159921 1128295 962978 1211959 1135278 1732288 1959017
5495 1959017 1437376 1505859 1458340 1486026 1355219 1475223 1459990 1244303 1340324 1508306
5485 1508306 1177445 974206 1153380 1199822 945577 1394459 1058370 875006 847718 994587
5475 994587 832141 898652 920106 1240828 997240 1307466 1193160 925330 759947 1344179
5465 1344179 1251221 1265206 1492232 1379652 1188282 1353005 1546627 1236813 1082147 999268
5455 999268 1108970 983466 1199136 1493471 1793080 1259642 1493151 1144269 986460 1156333
5445 1156333 1192786 1043999 866424 1025481 1309321 1116826 1237024 1147379 934325 427060
5435 427060 998949 1293642 1019804 874463 803158 937610 1110105 1032433 1233381 1112159
5425 1112159 1114557 1241143 942583 834674 1381772 1055328 749221 891658 1085902 770051
5415 770051 1218833 1439495 1048343 580251 1059589 1003753 911624 814722 519271 1005604
5405 1005604 852024 1096063 1132068 1103772 1102936 1109771 1269067 1141276 804794 1017286 1266244
5394 1266244 1479118 1396469 1208659 1474145 1517837 1285535 1234855 1288136 1253439 1093368
5384 1093368 1088874 1000255 1038134 1206510 1404770 1594244 1274300 1033469 1112194 1380885
5374 1380885 1511006 1600348 1513104 1650449 1770536 1687452 1934100 1613815 1747344 1759843
5364 1759843 1996858 2160413 1893956 1484299 1390499 1786935 2200996 2498479 2631576 2721321
5354 2721321 2839561 3222974 3397189 3579185 3914134 3440419 3400586 3304267 3019743 3286003
5344 3286003 3589036 3905859 4494799 4953220 5430393 5472291 5788307 6121648 6695894 7273549
5334 7273549 7516121 7148215 7177332 6990053 7194648 7463250 7043914 6919521 6845770 7438299
5324 7438299 8210150 8660238 8892341 9460920 9884127 10324693 10187843 9615979 9325706 8938044
5314 8938044 8957514 8857899 8521295 7813356 7374342 6866919 6796187 7150816 7493776 7596027
5304 7596027 7427481 7355509 7639439 7934663 7842325 7758859 6846819 6402052 5868414 5776772
5294 5776772 5328995 4722218 4649095 4074992 4080128 4148744 4139721 3985611 4302306 4058396 3964463
5283 3964463 3739631 3317132 3088807 2278484 2562563 2641440 2481279 2281644 1960510 1920079
5273 1920079 1868576 2316564 2466281 1889969 1139594 1175242 1174364 1492977 1806435 1911124
5263 1911124 1814234 1389252 1609633 1636056 1664838 2005045 1902255 1607556 1749483 1968457
5253 1968457 1743205 1869822 1798212 1819945 1654799 1853851 2057199 1250803 1447068 1799146
5243 1799146 1904707 1740059 1468106 1300400 987900 1128969 1357154 1506226 1842722 2134603
5233 2134603 1980279 1766780 1949645 1534554 1424989 1416897 1457065 1316775 1368321 1843785
5223 1843785 1752001 1457180 1205482 1225049 1600715 1702403 1600174 1332878 1388413 1455597
5213 1455597 1447555 1444872 1285796 1291878 1216802 1254848 1578113 1329425 1459373 1692823 1752569
5202 1752569 1519534 1218051 1217923 1545165 1586512 1789052 1636600 1571944 1447908 1345376
5192 1345376 1395998 1362207 1256323 1244130 1296637 1750622 1690334 1710802 1911940 1909947 1720307
5181 1720307 1664931 1652041 1415413 1059236 1009856 1163922 1099763 1617595 1739668 1740266 2155787
5170 2155787 2393688 2591854 1917874 2048282 2286600 2130015 2213979 2145473 1934995 1492282
5160 1492282 1916623 2172074 2414275 2124775 1929975 2103572 2127720 2351443 2202816 1738224
5150 1738224 1782070 1772289 1798639 1791646 1607500 1363130 1364155 1920809 2787345 2361293 2440711
5139 2440711 2461735 2228307 2316313 2010955 2177525 2008875 1831850 2001649 2094068 2050096
5129 2050096 2469931 2780254 3061858 3112427 2942206 2997672 3494117 3527004 3021678 2886210
5119 2886210 2826074 2755272 3043721 2936416 2704838 2828186 2747652 3025541 2990120 3124991
5109 3124991 3086982 3357669 3337675 3615139 3363771 3016467 2827169 2827930 2473523 2684559
5099 2684559 2881859 2271328 2084548 2085295 2181498 2649046 2303905 1888296 1655279 1698044
5089 1698044 2076948 2264992 2147203 1892351 1850306 2336183 2132529 2457107 2195687 1920436
5079 1920436 2294422 2698453 2644196 2754666 3167598 3707056 3952366 4169953 4186988 4065926
5069 4065926 4036637 4382476 4344848 4230755 4652051 4630346 4155599 4085466 4226330 3697897
5059 3697897 3770971 3735520 4014968 3944145 4273875 4363269 3912304 3714063 4325391 4072330
5049 4072330 3918259 4129523 3947075 3712084 3999024 4297991 4163901 4014333 4200096 3858383
5039 3858383 3608313 3530643 4012163 3779767 3861267 3918408 3644512 3278372 3113746 2914547
5029 2914547 2638759 2807895 2742732 2963239 2964992 3186117 3595670 3858247 4295334 4419282
5019 4419282 4199453 4180431 4159660 3874469 3604365 3737424 3984310 3968712 3733820 3368063
5009 3368063 3448039 3888860 4362847 4644053 5274742 5696128 6448203 7453684 8477322
5000 8477322 8199834 8365945 7891773 7330689 6635617 6136300 5978835 5874841 5574280 5366039
4990 5366039 5610155 5704411 5860631 6011477 6114348 6879044 7431070 7936709 8512366 8228836
4980 8228836 8153596 7653304 7246122 6482087 5976223 5476729 4950676 4770475 4628474 4201538
4970 4201538 4147361 4143950 4142247 4017199 3984120 3967439 3752231 3549369 3586484 3644393 3625696
4959 3625696 4092983 4469782 4408635 5161192 5602908 5675373 5785796 6222086 6558516 7025645
4949 7025645 7808712 8875271 9916181 11036784 11663640 12207922 11776652 11319797 10900246
4940 10900246 9880551 8822413 8121766 7744394 7374409 7536605 7395462 7549729 7839680
4931 7839680 8175118 9249333 10158976 11035582 12050010 12204078 12010130 11378579 10183881
4922 10183881 9464657 8722217 7933807 7673848 7197338 6586580 5895316 5044901 4691730
4913 4691730 4748504 4481075 4346649 4083691 3836825 4123261 4599873 4653270 4280590 4190004
4903 4190004 4192392 4273763 4525918 4630024 4617790 4988047 5101106 5022388 5224492 5072007
4893 5072007 5128066 5070700 5104164 5203304 5222545 5141344 5021823 4932211 4631238 5172499 5144680
4882 5144680 5177509 5246856 5776800 6014183 6390225 5907265 5702593 5877258 5965642 6127276
4872 6127276 6410282 5987226 5701322 5797898 5910149 5727405 5483363 5126952 5263145 5931224
4862 5931224 6639374 7631594 8345656 9755090 11740002 12904597 13216834 13221397 12295388
4853 12295388 11339886 10294806 9293491 9019098 8514395 8196509 8025637 7704858 8033198
4844 8033198 8422304 9393781 11218881 12774253 14614804 16454822 18046513 19745139 20951390
4835 20951390 20624887 19654694 18628800 17310971 16260787 15521888 14940896 13720327 13111209
4826 13111209 12340725 11611767 11046677 11185540 11284326 12261098 13701653 15981597 17563070
4817 17563070 18874418 19190169 18856175 18116059 17548437 16521045 15637033 14342131 13445177
4808 13445177 12417460 11568800 10799473 10267638 9373205 9071394 8802165 8760213 8891086
4799 8891086 9055099 8968267 9154633 9316140 9436063 9763546 9747537 9333223 8934465 8435272
4789 8435272 8223778 8441046 8090693 8132698 8178593 8191627 8614730 9371166 10209475 10617640
4779 10617640 11451936 13206111 14349394 16300084 17998324 19083146 19277834 19046602 18576530
4770 18576530 17647923 16429733 15639932 14138469 13623783 13584412 13357846 13017833 13637205
4761 13637205 13361309 14091778 14826032 16103146 17330494 18455901 19098121 18943943 18223408
4752 18223408 17465008 16394630 15563520 15056054 13850995 12699747 11783847 11511126 11338855
4743 11338855 10820073 10105770 9406248 9283363 9701457 9961427 9909176 9996206 9982195 9758867
4733 9758867 10446014 10625367 10940174 10929666 11600547 12362702 12958888 14427815 15826807
4724 15826807 17043940 18906263 20333521 21209485 21626596 21110599 20068000 19060921 17879969
4715 17879969 17165100 16172069 14740557 13896147 13002846 12235450 11909011 11430310 10997419
4706 10997419 10769871 10915916 10979479 10201554 10550022 10914507 11431514 11291451 11121072 11275030
4696 11275030 11515487 12139630 13023993 13467455 14273273 15445287 17105804 19123065 21283244
4687 21283244 23034447 25372213 27033404 27749170 27858050 26934560 25404396 23737120 21702725
4678 21702725 19685969 18278979 16526323 15319945 14080121 13506451 12753924 12322493 12537423
4669 12537423 12710986 12604647 12873073 13054278 13263339 13649322 13778155 13922206 13269021
4660 13269021 12611245 12951559 12630077 12930787 12853597 12603955 12882422 13603659 14564928 15504484
4650 15504484 16098767 17585409 19385493 21592884 23020624 23924068 23859692 22686967 20965033
4641 20965033 19297652 17605880 16351697 16002175 15828662 16721405 18104225 20373630 22359515
4632 22359515 23570205 24589724 25068269 24751083 24585884 24234022 23659980 23977392 23728555
4623 23728555 22649428 21498074 19663931 17729255 15705691 14377703 13283742 12413896
4615 12413896 12603335 13298498 14086304 14487896 14771768 14273487 13921382 12751724 11690945
4606 11690945 10680032 9745978 9134183 8461032 8325283 8233777 8005158 8111070 8316344
4597 8316344 8653691 9415438 10245881 10944626 11570061 11834219 11754378 11200907 10290251 9783229
4587 9783229 8905766 8206390 7786578 7245389 6823230 6703031 5888541 5423657 5126456 4956967
4577 4956967 5033006 4873915 4624675 4320774 4408132 4978513 4363636 3961696 3660028 3594786
4567 3594786 4236531 4366066 4058682 4064603 3543653 3797262 3847604 3753211 3466130 3119738
4557 3119738 2995150 3196941 3111891 3537725 3605253 3601286 3564818 3030334 3136153 2994141
4547 2994141 3110734 3127591 3098133 3192960 3018511 3013797 3102801 2829329 2841347 3215622 3361760
4536 3361760 3026342 3230059 3063446 2912156 3056308 3029366 3128871 3242723 2872437 2805350
4526 2805350 2751277 3046915 3501048 2808727 3027725 3362915 3805410 3810011 3874441 3748407
4516 3748407 3318146 3450325 3369776 2959010 2721337 2788747 2391861 2631791 2934049 2865848
4506 2865848 2568452 2573171 2499417 2433954 2083284 2487576 2304393 2148564 2125038 2577233
4496 2577233 2773908 2985568 3160461 3100345 3343165 3812121 4042652 4102558 4108002 4181599
4486 4181599 3768903 3444707 3616976 3241958 3307984 3467564 3147730 2786089 2461802 2655645
4476 2655645 2636305 2309282 2425347 2446192 2527181 2331806 2357464 2545050 2654200 3156720
4466 3156720 3260566 3170558 3344560 3667980 4086795 4330724 4142449 3953238 3787345 3809419
4456 3809419 4047346 3852297 3711213 4073864 4214225 4117987 4127430 4266528 3901017 3445516
4446 3445516 3581409 3778875 4133510 4299367 4562038 4446484 3599597 3656464 3497782 3132311
4436 3132311 3002971 2600545 2712985 2515203 2710252 2570272 2188303 2309271 2522347 2198969
4426 2198969 2188859 2299797 2432348 2447400 2470971 2536151 2408292 2285876 2538525 2342365
4416 2342365 2037490 2501261 2575355 2208103 2410539 2226229 2030950 1628913 1760981 1759971
4406 1759971 1364726 1444220 1406544 1395894 1606207 1553701 1489051 1487704 2035419 1846872 1957804
4395 1957804 1713050 1507062 1349741 1423027 1743810 1700707 1936461 2081919 2120845 1920714
4385 1920714 1987535 1803478 1734094 1847681 1960097 1882576 1987162 2116686 2132051 2385101
4375 2385101 2361148 1860534 2036917 2207547 2009183 1895281 1995123 1704308 1950755 1958738
4365 1958738 2019191 1455548 1724692 2017258 1893656 2284716 2347082 2216676 2003028 1854016
4355 1854016 1900253 1383303 1341494 1517896 1884664 1880905 1760499 2000001 1773676 2179604
4345 2179604 1960474 1986353 2109429 1788922 1708616 1773267 1914176 1857035 2359376 2502145
4335 2502145 2505640 2642451 2424800 2481986 2991173 2701156 2154392 2390418 2752919 2854258
4325 2854258 2890474 3279546 3162934 3104147 3325981 3506421 3413884 3001822 3111565 2897054
4315 2897054 2814405 2966651 2970736 3244273 3086668 2966090 2899937 3264120 3324805 3311274 3346061
4304 3346061 3173252 3079267 3027809 3305006 2755949 2699508 2805998 2666137 3071188 2881880
4294 2881880 2694246 2767841 2874668 3197984 3573701 3399343 3830343 3803606 3611590 3469593
4284 3469593 3628787 3565324 3589188 3582856 3559806 3659496 3337408 3383203 3578291 3547997 3516316
4273 3516316 3564954 3296911 3165227 3204772 3174375 2844319 3458796 3548612 3376662 3397036
4263 3397036 3648305 3511295 3840258 4560567 4517830 4511228 4910551 4846948 4921334 5216590
4253 5216590 5658702 6002936 6639966 7472530 8551132 9228288 10348984 12365823 14734115
4244 14734115 16696653 19627314 21761356 23228563 24656961 25123346 25587055 26183909 27029972
4235 27029972 27837904 28678263 29015783 29641765 29820010 30464204 31156619 31818772 31775195 31467242
4225 31467242 30834447 29955687 29354477 29321050 29163241 28533444 27257240 25267351 22682943
4216 22682943 20327250 17890075 15495800 13767041 12355457 10680846 9775790 8611500
4208 8611500 7903866 7105463 6683116 6388286 5803265 5638208 5433048 5156780 4782173 4870862
4198 4870862 4374414 4166656 4685856 4727370 5002605 5312690 5277362 5195718 5311318 4675405
4188 4675405 4211119 4018386 4138438 4002468 3747509 3857714 4140501 4182812 4274098 4569358
4178 4569358 4034264 3802462 4306515 4368149 4564909 4686497 4627937 4780306 4857236 4922894
4168 4922894 4394200 4572701 4621606 4721129 4857899 4622472 4210789 4308802 4468890 4824594
4158 4824594 4830074 4916908 4626808 3747720 3524339 3445946 3210076 3364389 2822963 2882752
4148 2882752 2686072 2845937 3019547 2875424 3104853 3437993 3523691 3795779 3923099 3720888
4138 3720888 3925557 4159917 4290354 4064669 3455935 2994247 2893493 2891957 3074724 3230373
4128 3230373 3375156 3486882 3310648 2894730 2695438 2518861 2595237 2812011 2904864 2542907
4118 2542907 2567011 2451181 2757661 3007134 3145417 3217054 3296158 2952102 2881563 3077718
4108 3077718 2916851 3040408 3023019 3183143 3307795 2906016 2749712 2856966 2910922 3206111
4098 3206111 3132441 3183077 2909196 2932386 3218855 3256022 3424184 3847034 3839291 4253782 4691380
4087 4691380 4824014 6177868 8218580 10722554 12765302 12782912 11298176 10112242 8878678
4078 8878678 7439149 6336520 5711726 5077521 4838983 4757265 4228557 4455641 4547374 4160211
4068 4160211 4148491 4193493 3856555 3989756 4107801 3911201 3801203 3813531 3807716 3779502 3679521
4057 3679521 3808301 3722697 3626296 3681254 3336238 3203104 3226985 3441872 3467106 3281827
4047 3281827 3645606 3768002 3632353 3841088 4019905 3339937 3733766 3631579 3284224 3537617
4037 3537617 3434994 3341310 3222262 3231318 3389591 3272257 3589269 3887529 3487092 3904356
4027 3904356 3929273 3429291 3658594 3625697 3505607 3656454 3884116 4307407 4317898 4649003
4017 4649003 4619037 4275711 4127033 4397735 4589187 5047609 5671456 6124712 6433547 7348196
4007 7348196 8232186 8772727 8893970 9258748 9207254 9393295 9510360 9760762 9981594 9687695
3997 9687695 9294476 9110868 8602261 8190260 7445347 7289785 7662929 7340891 7427557 7589125
3987 7589125 7721617 7661715 7731559 7916330 8402013 8686778 8870500 8727507 8789907 8688478
3977 8688478 8814622 9283390 9339115 9209510 8677237 8701404 8154511 7605469 7030713 6416050
3967 6416050 6068537 5909634 5775081 5717338 5543969 5576137 5701573 5548563 5098383 4997143
3957 4997143 5062824 5230524 5184223 5467001 5537031 5211408 5542651 5086086 4338444 4029763
3947 4029763 3876931 3517728 3895681 3918927 4051671 4181564 4065003 4032000 3936388 4100690
3937 4100690 4125328 4197604 4324625 4058149 3904141 3526913 3965258 3980553 3844560 4046349
3927 4046349 4139322 3874054 4301033 4428106 4330139 4267226 3668600 3995847 3879063 3916849
3917 3916849 4113964 4081815 4462768 4745931 4536013 4330946 4286477 3994677 4303589 4728097
3907 4728097 4454055 4401215 4225760 4206913 4280070 4652462 4386440 4199692 4408207 4496418
3897 4496418 4643262 4558624 4640094 4618966 4645970 4794114 4984180 5027927 5352872 5518877
3887 5518877 6077047 6029738 5849123 5896292 5563341 6023470 6387372 6454584 7041351 7100039
3877 7100039 7159959 7424464 7784170 7943926 8191997 8427144 8751264 8937385 8732162 8825541
3867 8825541 9181650 9278004 9685219 10041864 10145125 10691183 11466691 12048264 13277967 14274596
3857 14274596 14524703 15275918 16071511 16597011 17097929 17737901 18465259 19241752 19275011 19506790
3847 19506790 19941866 20283596 20796104 21327945 21824119 22643750 23746691 24653169 26008024
3838 26008024 27358526 28743768 30012120 31756287 33032410 33463351 34032495 34203283 34429659
3829 34429659 34728751 34676906 34303763 33758783 32775735 31710759 31200914 30553077 29858401
3820 29858401 29322602 28934089 28308134 28301413 28885598 29129866 29331904 28965923 28763994 28187027
3810 28187027 27172319 26471274 25573564 24642716 23736129 22717146 21596048 20928713 20245800
3801 20245800 19502638 18784731 18162670 17870745 17818316 17699233 17657508 17654095 17459719 17960934
3791 17960934 18184477 18485933 18851059 19271022 19488645 19225183 19346623 19394085 19295749 20045286
3781 20045286 20144120 20438716 20743644 21647521 22428494 22840304 23343826 24023533 24072170 24049688
$$ [...]
##END NTUPLES=NMR SPECTRUM
##END=
