##TITLE=1H_DE-80H_X3
 200.13MHz, d2o
 8 sc
 
 19ns.26.2.2025
##JCAMPDX= 6.0         $$ Bruker NMR JCAMP-DX V2.0
##DATA TYPE= NMR SPECTRUM
##DATA CLASS= NTUPLES
##ORIGIN= UXNMR, Bruker Analytische Messtechnik GmbH
##OWNER= pz
$$ XWIN-NMR		Version 3.5
$$ Mon Apr 20 10:31:20 2026 Russian Standard Time (UT+4h)  Yarkov@DPX200
##.OBSERVE FREQUENCY= 200.1313
##.OBSERVE NUCLEUS= ^1H
##.ACQUISITION MODE= SIMULTANEOUS
##.ACQUISITION SCHEME= undefined
##.AVERAGES= 8
##.DIGITISER RES= 18
##SPECTROMETER/DATA SYSTEM= spect
##.PULSE SEQUENCE= zg30
##.SOLVENT NAME= CDCl3
##.SHIFT REFERENCE= (INTERNAL, CDCl3, 0, 15.4461)
##AUDIT TRAIL= $$ (NUMBER, WHEN, WHO, WHERE, WHAT)
$$ ##TITLE= Audit trail, XWIN-NMR		Version 3.5
$$ ##JCAMPDX= 5.01
$$ ##ORIGIN= Bruker BioSpin GmbH
$$ ##OWNER= Yarkov
$$ C:/Bruker/XWIN-NMR/data/yarkov2/nmr/H-C/1/pdata/1/auditp.txt
$$ ##AUDIT TRAIL=  $$ (NUMBER, WHEN, WHO, WHERE, WHAT)
(   1,<2026-04-20 10:30:28.78 +0400>,<Yarkov>,<DPX200>,
      <created by zg, POWCHK disabled, PULCHK disabled
       configuration hash MD5:
       00 E9 B6 7A A2 85 ED C7 34 08 36 98 17 FE 4E 26
       data hash MD5: 16K
       09 1E B9 55 E6 43 8D 03 FB 52 45 64 76 45 6F 07>)
(   2,<2026-04-20 10:30:39.51 +0400>,<Yarkov>,<DPX200>,
      <Start of raw data processing
       efp BC_mod = 2 LB = 0.25 FT_mod = 6 PKNL = 1 PHC0 = -5305.771 PHC1 = 21.62193 SI = 16K 
       data hash MD5: 16K
       70 4A FC AB 1B AE CB 46 65 9D EB 05 A7 1B 47 43>)
$$ ##END=
$$ 
$$ hash MD5
$$ B7 41 82 A9 35 7A A8 26 23 BF 33 5A 9A 3D 6B 88
##$RELAX= 
##$RELAX= 
##$RELAX= 
##$RELAX= 
##$RELAX= 
##$RELAX= 
$$ Bruker specific parameters
$$ --------------------------
##$DU= <C:/Bruker/XWIN-NMR>
##$EXPNO= 1
##$NAME= <H-C>
##$PROCNO= 1
##$TYPE= <nmr>
##$USER= <yarkov2>
##$AMP= (0..31)
100 100 100 100 100 100 100 100 100 100 100 100 100 100 100 100 100 100 
100 100 100 100 100 100 100 100 100 100 100 100 100 100 
##$AQSEQ= 0
##$AQ_mod= 1
##$AUNM= <au_zg>
##$AUTOPOS= <>
##$BF1= 200.13
##$BF2= 200.13
##$BF3= 200.13
##$BF4= 200.13
##$BF5= 200.13
##$BF6= 200.13
##$BF7= 200.13
##$BF8= 200.13
##$BYTORDA= 1
##$CFDGTYP= 0
##$CFRGTYP= 5
##$CHEMSTR= <none>
##$CNST= (0..31)
1 1 145 1 1 1 1 1 1 1 1 1 1 1 1 1 1 1 1 1 1 1 1 1 1 1 1 1 1 1 1 1 
##$CPDPRG= <>
##$CPDPRG1= <>
##$CPDPRG2= <>
##$CPDPRG3= <>
##$CPDPRG4= <mlev>
##$CPDPRG5= <mlev>
##$CPDPRG6= <mlev>
##$CPDPRG7= <mlev>
##$CPDPRG8= <mlev>
##$CPDPRGB= <>
##$CPDPRGT= <>
##$D= (0..31)
0 0.7 0 0 0 0 0 0 0 0 0 0.03 0 0 0 0 0 0 0 0 0 0 0 0 0 0 0 0 0 0 0 0 
##$DATE= 1776666628
##$DBL= (0..7)
120 120 120 120 120 120 120 120 
##$DBP= (0..7)
150 150 150 150 150 150 150 150 
##$DBP07= 0
##$DBPNAM0= <>
##$DBPNAM1= <>
##$DBPNAM2= <>
##$DBPNAM3= <>
##$DBPNAM4= <>
##$DBPNAM5= <>
##$DBPNAM6= <>
##$DBPNAM7= <>
##$DBPOAL= (0..7)
0.5 0.5 0.5 0.5 0.5 0.5 0.5 0.5 
##$DBPOFFS= (0..7)
0 0 0 0 0 0 0 0 
##$DE= 6
##$DECBNUC= <off>
##$DECIM= 32
##$DECNUC= <off>
##$DECSTAT= 4
##$DIGMOD= 1
##$DIGTYP= 9
##$DL= (0..7)
0 120 120 120 120 120 120 120 
##$DP= (0..7)
$$ [...]
##$SUBNAM2= <"">
##$SUBNAM3= <"">
##$SUBNAM4= <"">
##$SUBNAM5= <"">
##$SUBNAM6= <"">
##$SUBNAM7= <"">
##$SUBNAM8= <"">
##$SUBNAM9= <"">
##$SW= 18.0517328524113
##$SWIBOX= (0..15)
0 0 2 0 0 0 0 0 0 0 0 0 0 0 0 0 
##$SW_h= 3612.71676300578
##$TD= 16384
##$TD0= 1
##$TE= 0
##$TE2= 300
##$TE3= 300
##$TEG= 300
##$TL= (0..7)
0 120 120 120 120 120 120 120 
##$TP= (0..7)
150 150 150 150 150 150 150 150 
##$TP07= 0
##$TPNAME0= <>
##$TPNAME1= <>
##$TPNAME2= <>
##$TPNAME3= <>
##$TPNAME4= <>
##$TPNAME5= <>
##$TPNAME6= <>
##$TPNAME7= <>
##$TPOAL= (0..7)
0.5 0.5 0.5 0.5 0.5 0.5 0.5 0.5 
##$TPOFFS= (0..7)
0 0 0 0 0 0 0 0 
##$TUNHIN= 0
##$TUNHOUT= 0
##$TUNXOUT= 0
##$USERA1= <user>
##$USERA2= <user>
##$USERA3= <user>
##$USERA4= <user>
##$USERA5= <user>
##$V9= 5
##$VALIST= <valist>
##$VCLIST= <CCCCCCCCCCCCCCC>
##$VD= 0
##$VDLIST= <DDDDDDDDDDDDDDD>
##$VPLIST= <PPPPPPPPPPPPPPP>
##$VTLIST= <TTTTTTTTTTTTTTT>
##$WBST= 1024
##$WBSW= 4
##$XGAIN= (0..3)
0 0 0 0 
##$XL= 0
##$YL= 0
##$YMAX_a= 178288
##$YMIN_a= -232596
##$ZGOPTNS= <>
##$ZL1= 120
##$ZL2= 120
##$ZL3= 120
##$ZL4= 120
##$ABSF1= 0
##$ABSF2= 0
##$ABSG= 0
##$ABSL= 0
##$ALPHA= 0
##$AQORDER= 0
##$ASSFAC= 0
##$ASSFACI= 0
##$ASSFACX= 0
##$ASSWID= 0
##$AUNMP= <proc_1d>
##$AZFE= 0.1
##$AZFW= 0.1
##$BCFW= 0
##$BC_mod= 2
##$BYTORDP= 0
##$COROFFS= 0
##$CY= -3
##$DATMOD= 1
##$DC= 0
##$DFILT= <>
##$DTYPP= 0
##$F1P= 0
##$F2P= 0
##$FCOR= 1
##$FTSIZE= 16384
##$FT_mod= 6
##$GAMMA= 0
##$GB= 0
##$INTBC= 1
##$INTSCL= 3.241238e-09
##$ISEN= 128
##$LB= 0.25
##$LEV0= 0
##$LPBIN= 0
##$MAXI= 10000
##$MC2= 0
##$MEAN= 0
##$ME_mod= 0
##$MI= 1.114404
##$NCOEF= 0
##$NC_proc= -6
##$NLEV= 6
##$NOISF1= 3.799351
##$NOISF2= 2.8
##$NSP= 0
##$NTH_PI= 0
##$NZP= 0
##$OFFSET= 15.4461
##$PC= 1
##$PHC0= -5305.771
##$PHC1= 21.62193
##$PH_mod= 1
##$PKNL= yes
##$PPARMOD= 0
##$PSCAL= 0
##$PSIGN= 0
##$REVERSE= no
##$SF= 200.130015130561
##$SI= 16384
##$SIGF1= 3
##$SIGF2= 2
##$SINO= 0.751879
##$SIOLD= 32768
##$SREGLST= <19F.Aceton>
##$SSB= 0
##$STSI= 16384
##$STSR= 0
##$SW_p= 3612.71676300578
##$SYMM= 0
##$S_DEV= 0
##$TDeff= 16384
##$TDoff= 0
##$TI= <>
##$TILT= no
##$TM1= 0
##$TM2= 0
##$TOPLEV= 0
##$USERP1= <user>
##$USERP2= <user>
##$USERP3= <user>
##$USERP4= <user>
##$USERP5= <user>
##$WDW= 1
##$XDIM= 16384
##$YMAX_p= 296469373
##$YMIN_p= -2378543
$$ End of Bruker specific parameters
$$ ---------------------------------
##NTUPLES= NMR SPECTRUM
##VAR_NAME=  FREQUENCY,     SPECTRUM/REAL,   SPECTRUM/IMAG
##SYMBOL=    X,             R,               I
##VAR_TYPE=  INDEPENDENT,   DEPENDENT,       DEPENDENT
##VAR_FORM=  AFFN,          ASDF,            ASDF
##VAR_DIM=   16384,         16384,           16384
##UNITS=     HZ,            ARBITRARY UNITS, ARBITRARY UNITS
##FACTOR=    0.220516191357247, 1,           1
##FIRST=     3091.22827373578, 0,            0
##LAST=      -521.48848927, 0,               0
##MIN=       -521.48848927, -2378543,        0
##MAX=       3091.22827373578, 296469373,    0
$$ Real data points
##PAGE= N=1
##DATA TABLE= (X++(R..R)), XYDATA
$$ [...]
5997A610598k71423j5086K20151J82358o49841J30127M5272P9487l7812k94001
5987I99830q1997J08652L47520J12154r5000J52233j99779l97764j33270j00179
5977G12400R5053j7543N26019j012j51163l26950j06733M8950J84281J13204o1199
5966A015307k77163P4354j20986m0917L75310J58761J4956l21093m41947k54205
5956A82377j89155L54494J27684J26130K30151N4684n6039l24358P4835K4009
5946F04812r6128k25433n82J52832K40942R9675J71410P021J1055J33021j78085
5935I20540l87329k68070J04099J75129J21985M2392m4588N4667K03087r4717
5925H27195m50395m27853K22445J35959n3254J55120Q0o0448M14005L16444j10977
$$ y = [1610598, 1339175, 1324089, 1544240, 1726598, 1076757, 1206884, 1252156, 1331643, 1293831, 999830, 917833, 1026485, 1374005, 1486159, 1391159, 1543392, 1343613, 945849, 812579, 712400, 807453, 789910, 1315929, 1314917, 1163754, 836804, 730071, 779021, 963302, 1076506, 1015307, 738144, 812498, 691512, 650595, 1025905, 1184666, 1199622, 878529, 436582, 182377, -6778, 347716, 475400, 601530, 831681, 886365, 830326, 505968, 580803, 604812, 508684, 283251, 282669, 435501, 676443, 776118, 947528, 954549, 965604, 1098625, 920540, 533211, 265141, 369240, 544369, 666354, 708746, 664158, 718825, 921912, 827195, 376800, -51053, 171392, 307351, 254097, 409217, 409297, 348849, 762854, 1079298, 968321]
5914I68321l40188q9225k42019j76391O7240k3459j0603K17655K69754j3230r2923
5903E34932k18964j24829j91946K66584p9790J71647L23394R5147l10917j45039
5893C20219L90241j62474k69461J94759j62994j61944J92926K46841j76763j9493
5883C91857J53684j09955j78791L95758K40155K09593j94745k22923l68989r6487
5873B19157K81138j75586Q6589L31618l50249j89017J26839j387j27012k63390
5863f1300J22212o4854L00377K20524k47152m0548K48204N1141m2908j95946L09015
5852E98765l4256p0613m13193j66599L04313K05187k74122K49572M8575K46104
5842F93733J33356O4081n04953m03730J19724K1705L8963L20209J36284r8554
$$ y = [968321, 628133, 538908, 296889, 120498, 187738, 164279, 153676, 371331, 641085, 627855, 534932, 315968, 191139, -807, 265777, 185987, 357634, 681028, 776175, 465258, 320219, 710460, 547986, 278525, 473284, 310290, 148346, 341272, 588113, 411350, 391857, 545541, 435586, 256795, 652553, 892708, 1102301, 907556, 684633, 315644, 219157, 500295, 324709, 411298, 742916, 392667, 203650, 330489, 329102, 202090, -61300, 60912, -3942, 296435, 516959, 269807, 229259, 477463, 528604, 485696, 289750, 598765, 564509, 493896, 80703, -85896, 218417, 423604, 149482, 399054, 447629, 693733, 827089, 891170, 386217, -17513, 102211, 123916, 162879, 483088, 619372, 520818]
5832E20818j62366p5470l38458l97795K00643K63578K42562k24669k80973N7053
5822a95077N68181K95155m22748p9876J94061J39528r3557l65690j87206j9515
5812a66744L87786N58839l32037r3732L15537Q7628l28952n70765L09756K12476
5802C79792j67745J55439j48109J118k73374j19670L65233O2800J81041k54711
5792A81814r0288M74376N2455k14315o0799N3915M4350l4336J28072k48615j75166
5781A11463M8058J30040m434Q3061l79110m34755O0071P39706L94392J65230j34871
5770G78851m41731n19936j80374P20527L43878j11117j90932l7969L26827L54230
5760A042254O4568m45387k32164J34649R8194m61162j55131K06524L90365L55705
$$ y = [520818, 358452, 282982, -55476, -453271, -252628, 10950, 253512, 28843, -252130, -195077, 373104, 668259, 245511, 165635, 359696, 499224, 405667, 39977, -147229, -166744, 221042, 779881, 447844, 354112, 669649, 757277, 428325, -142440, 167316, 379792, 212047, 367486, 219377, 220495, -52879, -172549, 192684, 255484, 436525, 181814, 91526, 565902, 618357, 404042, 343243, 397158, 441508, 407172, 535244, 286629, 111463, 159521, 289561, 285127, 368188, -10922, -445677, -385606, 354100, 748492, 913722, 778851, 337120, -182816, -363190, 357337, 701215, 590098, 399166, 361197, 688024, 1042254, 1106822, 661435, 429271, 563920, 662114, 200952, 45821, 252345, 642710, 998415]
5750I98415M38975J68185k336O7672j36416p74210n23573K84779K71152n6060
5740G36583k22193k98854J28947K03787j39347m64744K58356L10655k40043m42994
5730a69847J77012K27256L15824M24901j45864n14991k57318L3585Q0270M40825
5720F11653M25678M66603P36283J393131R63787j66267p47301o55040m08608n00979
5710B118940m67767k20856k47349q3508l7529L6717k3467o1282O8043n8067k06561
5699H17314J9400o4581m04999m08801J37068P32848M61030K25825j23382L1746
5689A423468M0502J5834N48945Q46818J034538P66013n4372o93319p44008n90439
5679B593980n41377o81458j45668k43509l62669Q9162J88813k37253l10947j39086
$$ y = [998415, 1437390, 1605575, 1603239, 1670911, 1534495, 760285, 236712, 521491, 792643, 736583, 514390, 215536, 344483, 548270, 408923, -55821, 202535, 513190, 273147, -169847, 7165, 234421, 550245, 975146, 829282, 314291, 56973, 90558, 170828, 611653, 1037331, 1503934, 2240217, 3633348, 4597135, 4430868, 3683567, 3028527, 2619919, 2118940, 1651173, 1430317, 1182968, 1099460, 1061931, 1098648, 1075181, 1013899, 1081942, 1023875, 817314, 836714, 772133, 367134, -41667, 95401, 828249, 1289279, 1515104, 1391722, 1423468, 1463970, 1479804, 2028749, 2875567, 3910105, 4676118, 4621746, 3928427, 3184419, 2593980, 2052603, 1371145, 1225477, 981968, 619299, 708461, 897274, 660021, 349074, 209988]
5669B09988L04815K82436K24478p3556k18482k33359J42304j55292p7810L6321
5659D41843K63041J87543K09176J01628L6171p0836o7528K74720j24553l9154
5649A212051p4673R4268m9105n62289N237J82292Q3917k67334k05599l2216L3776
5638D20325k12898J51180L76801k10079l8397L1372L31402k80493l38675r0438
5628A40100J81830J12143r3188j52192r1727K60268p9189N7396r2649l1911m2994
5617A67887o5995L213K75804j68743k82147j27647K81571N34408j48807Q3503
5607E53047j13633k06438r2977J30353M5024K59451j0410l68097k49578J12104
5597E8846N08694L7432j65217k85801R433J07554K3302k94448M377L40774P1738
$$ y = [209988, 514803, 797239, 1021717, 948161, 729679, 496320, 638624, 483332, 405522, 441843, 704884, 892427, 1101603, 1203231, 1239402, 1168566, 1101038, 1375758, 1251205, 1212051, 1137378, 1231646, 1182541, 620252, 625489, 807781, 891698, 624364, 418765, 386549, 420325, 207427, 358607, 735408, 525329, 486932, 518304, 849706, 569213, 230538, 140100, 321930, 434073, 340885, 188693, 96966, 357234, 278045, 335441, 242792, 210881, 167887, 101892, 105105, 380909, 212166, -69981, -197628, 83943, 618351, 469544, 553047, 439414, 232976, 139999, 270352, 315376, 574827, 564417, 196320, -53258, 58846, 567540, 604972, 439755, 153954, 163387, 270941, 294243, -205, 4172, 344946, 416684]
5586D16684n0559q8832q7563j42309K5561K38317k89397K7682j54773O4742J25342
5575H4895N12102P8669J25233j22164k57718j02178j11656k78967J50006O97232
5565G75454J24536k8029m38460K55829l24404l56598J80945J78230j38188K8262
5555B57577m1785Q4585j91649p9770L4368K9310L69041K13966k07464k06365k43394
5544A8420R3743l3527K22627Q0804j4640j49927K96070J12602j23711k46370m26820
5533a70729k9737P14112n4438r2733k64466K7889R9977l1926J43290j4401l00754
5522B6084K42243k0242O1561J36642k831j01531j46834P9918j98313j01506J18268
5511I3459o3676n8188J49790O1177K75558j32216K27124j8043K57296k31463l70143
$$ y = [416684, 366125, 277293, 189730, 47421, 72982, 311299, 21902, 49584, -105189, -40447, 84895, 596997, 675666, 800899, 678735, 421017, 318839, 207183, -71784, 78222, 775454, 899990, 871961, 433501, 689330, 364926, 8328, 189273, 367503, 229315, 257577, 215792, 300377, 108728, 28958, 63326, 92636, 461677, 675643, 468179, 261814, 18420, 112163, 78636, 301263, 382067, 367427, 217500, 513570, 626172, 502461, 256091, -170729, -200466, 513646, 459208, 366475, 102009, 129898, 229875, 197949, 341239, 326838, 26084, 268327, 248085, 309646, 446288, 443457, 341926, 195092, 275010, 76697, -24809, 93459, 29783, -28405, 121385, 182562, 458120, 325904, 553028, 534985, 792281, 560818, 190675]
5500A90675k04878J37241M35297N7148n24365k16870J04950M95030J87021j32812
5490E28437M4512k28547r6935K34044K8024j32039k94364j81591L64894L65479
5480F31914j78359k78292k20604J6632j83581M11370L55253L7060k10067P9516
5470D60842J00546n7924l3354j04411O0669k04210j47526j11639K00157L46286
5460E09436o6397p4319j26338l94751k8738J35045J14684j92279J96802J96474
5450B69619K19446j98887N9793N5279K10172m9724L5860n9503l55445l69251j85040
5439c67681N31102L16026J15128l41565j75925p2403K51876r7716o2750k31114
5429a35022R5975r282J24525J50257j33622J25072J66629K55390j90835k46343
$$ y = [190675, -14203, 123038, 558335, 615483, 91118, -125752, -20802, 474228, 661249, 528437, 572949, 344402, 247467, 481511, 509535, 377496, 83132, -98459, 266435, 631914, 453555, 175263, -45341, -28709, -212290, 199080, 554333, 591393, 381326, 460842, 561388, 503464, 470110, 365699, 426368, 222158, 74632, -37007, 163150, 509436, 443039, 368720, 242382, -152369, -181107, -46062, 68622, -123657, 73145, 269619, 489065, 290178, 349971, 405250, 615422, 565698, 601558, 542055, 186610, -182641, -367681, 163421, 479447, 594575, 253010, 77085, 4682, 256558, 158842, 96092, -135022, -39047, -48329, 76196, 226453, 92831, 217903, 384532, 639922, 449087, 202744]
5419B02744l11258J18950J93395K73154Q4508l72936k94296J5209k7991k82601
5409d01122j21616L50552M45972j24157j77620l20054K20882N28606m3919k53216
5399A04308j06381k21828J59652r2667N68806j0681r2691J47968m9438k31668
5389A75380k30899K23480N87146K93135j89166j62716j08648K803m32671k23483
5379f5639J94643L38760O2455r3479r6964k97750O2945J14349Q9774J22409l90632
5368D0871M1702q5039J16252L1453q2400J64767K72709k22361n0711M8053J44060
5357D19356k03239l55123M50938K09764J29369l14616J54977j04867j05415L8558
5347C19702M609K15320L0710o2829j43253L76076K78015l33673m38504J94459
$$ y = [202744, -108514, 10436, 203831, 476985, 561493, 188557, -105739, -90530, -118521, -401122, -522738, -172186, 273786, 149629, -27991, -348045, -127163, 401443, 357524, 104308, -2073, -223901, -64249, -156916, 411890, 401209, 308518, 456486, 407048, 175380, -55519, 167961, 755107, 1048242, 859076, 696360, 587712, 590515, 157844, -65639, 129004, 467764, 530219, 436740, 339776, 42026, 104971, 219320, 309094, 431503, 40871, 82573, -2466, 113786, 145239, 62839, 227606, 500315, 277954, 227243, 275296, 419356, 216117, -139006, 311932, 521696, 651065, 336449, 491426, 386559, 281144, 319702, 324311, 539631, 570341, 507512, 364259, 740335, 1018350, 684677, 246173, 440632]
5337D40632j95974K13685N3348j67875J00757K81526j6143o19776o5834N26886
5327E51232k14170n60306j73791j55967K49998N25083J91198m81756k81170n332
5317c54981l5272J10476L33548K68835j36371j81888K80136K61202M19397k57557
5307G07525m02008p2091j18369J53855m7298K83173k30911j15703J15774L02885
5297E76832j42197K82941Q4878j61783j33527p6427J60565O0620K59219J89797
5287A100918j50242k19042j20987j7819k98908j27809o8352N4372K25418j03421
5277B74128j81398L7592J6024J03903J34745K13654q8263m12002J9669P19O1145
5266A79916L34775J36240r140P0258J9931l13230n07629K10386M14779j17682
$$ y = [440632, 244658, 458343, 511691, 343816, 444573, 726099, 709956, 90180, 24346, 551232, 337062, -223244, -397035, -553002, -303004, 222079, 413277, -68479, -349649, -354981, -390253, -279777, 53771, 322606, 186235, 4347, 284483, 545685, 965082, 707525, 305517, 233426, 115057, 268912, 221614, 504787, 273876, 158173, 273947, 576832, 434635, 717576, 802454, 640671, 507144, 430717, 591282, 651902, 911121, 1100918, 950676, 731634, 610647, 592828, 293920, 166111, 97759, 152131, 377549, 274128, 92730, 130322, 146346, 250249, 384994, 598648, 510385, 98383, 118052, 118771, 179916, 514691, 650931, 641791, 712049, 731980, 418750, -88879, 121507, 536286, 418604]
5256D18604k38353j03853K14398L18593Q4002j11100j97394j53173n08820p9694
5246c56790P6626J37065j32060J5789N74067M06467J11859j21986l09775M3067
5236D44329L1102j8100K139l7153n9187N1008J79539Q9692k36337K3312k19353
5225B50991L8220n1863j8734J07511p116K88475k48263L8597L48011j2649k39439
5214D93741j70488p4659k30958k37603M12762L36721J64582J72403l70196k26326
5204B69979p3946J48518P9751j30911J00854J53628O4133l9272M6743p1964J6512
5193E64025K7124k56484k41904J14615J52620p2552l33075j28759M86251K35761
5183E47622J61892k73021r6234q4474m0303l568q6827Q0366J92828J38304J38351
$$ y = [418604, 180251, 76398, 290796, 609389, 693391, 582291, 384897, 231724, -277096, -356790, -280164, -143099, -275159, -259370, 314697, 721164, 833023, 711037, 401262, 444329, 475431, 457331, 459470, 422317, 363130, 414138, 593677, 683369, 447032, 470344, 250991, 289211, 237348, 218614, 326125, 319009, 607484, 359221, 397818, 745829, 733180, 493741, 323253, 248594, 17636, -219967, 192795, 529516, 694098, 866501, 496305, 269979, 196033, 344551, 424302, 293391, 394245, 547873, 612006, 572734, 619477, 547513, 564025, 591149, 334665, 92761, 207376, 359996, 287444, -45631, -174390, 311861, 547622, 709514, 436493, 340259, 255785, 215482, 211914, 125087, 205453, 398281, 536585, 674936]
5172F74936m22445l11162P5933K98847L30722m16013l39930J80715L62070K08896
5162F42569o69114l28715K49058K70192K69494r8526L81865L71770k77916m43109
5152C67568l3722k5113P35j54119K64146j3058l13437j03403m7833K00850M8410
5141A91024J67495k98141J35592L81937K68996j67673m69178J06465O8920J63936
5131E49373J82977M14778J79738j98013n11391l06231j9615K2109J51839l30077
5121A35487J5297Q8431K05914j86464R9817K10721r9245l73382l02516M90080
5111B84140M04195J63764k21226O1758P9590o3928j69244M8699j0073J61364J3594
5100G52633j24018L4347R5305r3398j23396p3013K07155N9043j4800j98900j31671
$$ y = [674936, 252491, -58671, 17262, 316109, 646831, 230818, -109112, 71603, 433673, 642569, -26545, -355260, -106202, 163990, 433484, 334958, 716823, 1088593, 810677, 367568, 333846, 308733, 309468, 155349, 419495, 406437, 93000, -10403, -58236, 142614, 191024, 358519, 60378, 195970, 577907, 846903, 679230, 210052, 316517, 385437, 549373, 732350, 1147128, 1326866, 1128853, 617462, 311231, 291616, 313725, 465564, 135487, 150784, 239215, 445129, 258665, 358482, 569203, 469958, 96576, -205940, 284140, 688335, 852099, 630873, 692631, 772221, 708293, 539049, 587748, 577675, 739039, 752633, 628615, 662962, 758267, 664869, 541473, 468460, 675615, 734658, 719858, 520958, 389287]
5089C89287k35565L20716j86801j12763R2923J4384M01918K26457K67853l03240
5079H75169l34913l54176m190J00360K85488R4536Q9758Q0965j25298j00146j14672
5068D92881j63457k38625n0257j23095j05181P0756J41317M56833J08340L32084
5058I21596K73915l10545k90794l88257J86353K08490J76792L00222J57547m03284
5048H32035L15006j37551j88430o90154K8067K24074J97202j67370o7787R9264
5038D44356o6235O6330n0281J18715l3407J86689K83908N9198j15511L47626J04187
5027A345575j88218l26256J23840m9874k92545m1791R2422l05747L06838j22326
5017E41918j54045j43351N757k42169M1286M96329K44424m7415J25928J19183
$$ y = [389287, 153722, 474438, 287637, 174874, 267797, 282181, 684099, 910556, 1178409, 875169, 540256, 186080, 181890, 282250, 567738, 662274, 752032, 832997, 707699, 607553, 492881, 329424, 90799, 40542, -82553, -187734, -116978, 24339, 481172, 589512, 921596, 1195511, 884966, 594172, 205915, 392268, 600758, 777550, 1077772, 1235319, 832035, 1147041, 1009490, 821060, 130906, 158973, 383047, 580249, 412879, 345092, 444356, 378121, 444451, 394170, 512885, 479478, 666167, 950075, 1009273, 893762, 1241388, 1345575, 1157357, 831101, 954941, 905067, 612522, 570731, 663153, 357406, 664244, 541918, 387873, 244522, 250279, 8110, 49396, 545725, 790149, 742734, 868662, 987845]
5007I87845j32836j66779j90012l2981M94208P21487k54495n17372m1864m0641
4997H26560l97870J76330M39030M65159j39983j5635j71069l32852J25046P3162
4987A047878o6475j54771K04255K37787J83900Q020P919l33176q8654r6629K03445
4976A153499K74544K44241j24854J29426L07564K5178l27059P8192L67561Q5128
4966B213420j72094L0453J05050K92958M17191K94166L10748P51483J034221J548924
4956F826520J583631J640767J119768Q03567L05230j038525j095689j096405r24644
4947H124220r60749m46936k49189m59113J7082N17349L64446L39888J192355J510980
4937I950333J655015J211549N6273q37275j233920j136594j234904r70243j231982
$$ y = [987845, 855009, 688230, 498218, 465237, 959445, 1680932, 1426437, 909065, 867201, 826560, 428690, 605020, 1044050, 1509209, 1369226, 1353591, 1182522, 849670, 974716, 1047878, 981403, 826632, 1030887, 1268674, 1452574, 1460594, 1468513, 1135337, 1046683, 950054, 1153499, 1428043, 1672284, 1547430, 1676856, 1984420, 2009598, 1682539, 1760731, 2128292, 2213420, 2041326, 2071779, 2176829, 2469787, 2886978, 3181144, 3491892, 4243375, 5277596, 6826520, 8410151, 10050918, 11170686, 11974253, 12279483, 11240958, 10145269, 9048864, 8124220, 7163471, 6716535, 6467346, 6008233, 6025315, 6542664, 6907110, 7246998, 8439353, 9950333, 11605348, 12816897, 12873170, 12035895, 10801975, 9665381, 8430477, 7460234, 6228252]
4928F228252q70834m61210J98226k21139n49831l40730l35945n0213n967j19079
4918C471530j84572J73523J03441k51630m12979K71169N25503N20600L47874O0908
4908D625367K3090N36316N70562Q83881J212222K032935K082526K211249K514589
4899A6692737K104054J02284j181890j387547j679159j634519j744885j267337
4891A0003738p54118q3486J73233j20946M65321J123909J204573J776831K266132
4882A6055187J833255N65737l05651j452211k042358j950520j047269j275594
4874A0380576j063034p44533m13663k24942Q2280j97803O2336N17144M11949j29678
4864H680632n48432m29250n17787k24216n01020p59681l27307Q9677l46k02785
$$ y = [6228252, 5357418, 4896208, 5094434, 4873295, 4323464, 3982734, 3646789, 3596576, 3590609, 3471530, 3286958, 3460481, 3563922, 3312292, 2899313, 3170482, 3695985, 4216585, 4564459, 4625367, 4648457, 5184773, 5755335, 6639216, 7851438, 9884373, 11966899, 14178148, 16692737, 18796791, 18899075, 17717185, 16329638, 14650479, 13015960, 11271075, 10003738, 9249620, 9166134, 9339367, 9218421, 9683742, 10807651, 12012224, 13789055, 16055187, 17888442, 18454179, 18148528, 16696317, 14653959, 12703439, 11656170, 10380576, 9317542, 8573009, 8159346, 7934404, 8016684, 7818881, 7881217, 8398361, 8810310, 8680632, 8132200, 7702950, 7185163, 6960947, 6459927, 5700246, 5372939, 5462616, 5462270, 5259485]
4854E259485Q68059R72205O25687L41624R09191N07930R19805J80546l18669l85983
4844I879880L37394Q22791M60004N02798K80480L70251O88842O21154L06425K44434
4834A4514453N41034L11323M60414l3222K40118k02858q3008K29662J87216M78751
4824A6643883K20998K70851o7548N39532J02855N47920M15468J245016J022323
4815B0941298J118316J884144J808927R68400m6737k24076j078472j887551j845352
4806B1638897j606799j483465j611871j058482o82834k30309J46279N66388J129264
4797A6807068K145152K222290K609063J985864J137302J69088p38176r85517j078973
4788B4273161l25624J5238m82341q45177r10348r49170n12519m95399o66877l57539
$$ y = [5259485, 6127544, 7099749, 7725436, 8067060, 8976251, 9484181, 10403986, 10584532, 10265863, 9879880, 10217274, 11040065, 11500069, 12002867, 12283347, 12653598, 13342440, 13963594, 14270019, 14514453, 15055487, 15366810, 15827224, 15794002, 16034120, 15831262, 15748254, 15977916, 16165132, 16643883, 16864881, 17135732, 17068184, 17607716, 17710571, 18258491, 18673959, 19918975, 20941298, 22059614, 23943758, 25752685, 26721085, 26674348, 26450272, 25371800, 23484249, 21638897, 20032098, 18548633, 16936762, 15878280, 15195446, 14965137, 15111416, 15677804, 16807068, 18952220, 21174510, 23783573, 25769437, 26906739, 27075827, 26337651, 25352134, 24273161, 23947537, 23962775, 23480434, 22635257, 21724909, 20775739, 20263220, 19767821, 19100944, 18743405]
4778A8743405J58914N00488k2716K2167k42809N1558r6993l0971J31121K99268
4768A9513432M22478k46832q33706j010872j005990r54384j150603q22631r01419
4759A3009473r83354j255506r47863n74240n99083n54650m87388o56658o41549
4750F309182n9052M5107J84376k34512O7058k8833L10723N23574K89889P42217
4740H149729R70836J237064J456688J272889R66548J06235m90555r86631j345799
4731A1337004j374709j098001o77138l85606p76006j174033n08731K60930K71019
4722E874729k93615m45353l68418J48809O8859K6221j75630j50092J00929J5351
4712D801790N00284O2541m2474J95290J88125L42166L46932N60371R80553J282598
$$ y = [18743405, 18902319, 19402807, 19380091, 19402258, 19159449, 19211007, 19114014, 19083043, 19214164, 19513432, 19935910, 19689078, 18855372, 17844500, 16838510, 15884126, 14733523, 13910892, 13009473, 12026119, 10770613, 9822750, 9248510, 8649427, 8094777, 7607389, 6950731, 6309182, 6250130, 6295237, 6479613, 6245101, 6312159, 6283326, 6594049, 7117623, 7407512, 8149729, 9120565, 10357629, 11814317, 13087206, 14053754, 14159989, 13669434, 12682803, 11337004, 9962295, 8864294, 8187156, 7801550, 7025544, 5851511, 5342780, 5603710, 5874729, 5581114, 5135761, 4767343, 4916152, 4985011, 5011232, 4835602, 4685510, 4786439, 4801790, 5302074, 5364615, 5322141, 5517431, 5705556, 6047722, 6394654, 6955025, 7935578, 9218176]
4702I218176J770757J504013J562980J801646J798573J874038J799031J517429
4694B2846643R48954O50649Q9925j594854k558549k541634j971554j366430o85988
4685A3817162o70968n70153m11541N1247m86737n25033m26231o04440o39768o05106
4675H928432n04728j074084n64892L08335M08241l3517l53690M5751p8990Q2550
4665G163408l8233L2367P22495J231848J817764J807639K126489K121523J544042
4656A8529342K52141o14224j467379j222156j377284j345810p55250o6883j40994
4647A1791503k77478l1236O02463Q11781Q18082P27323J085878J285796Q41420
4638A7655532M1762j141954r96495j392525j088946j291054j145139j265524q90762
$$ y = [9218176, 10988933, 12492946, 14055926, 15857572, 17656145, 19530183, 21329214, 22846643, 23795597, 24446246, 24536171, 22941317, 20382768, 17841134, 15869580, 14503150, 13817162, 13146194, 12576041, 12164500, 12215747, 11729010, 11203977, 10777746, 10173306, 9533538, 8928432, 8423704, 7349620, 6784728, 7093063, 7501304, 7467787, 7114097, 7159848, 7080858, 7163408, 7125175, 7157542, 7880037, 9111885, 10929649, 12737288, 14863777, 16985300, 18529342, 18781483, 18167259, 16699880, 15477724, 14100440, 12754630, 11999380, 11932497, 11791503, 11514025, 11482789, 12085252, 12897033, 13715115, 14442438, 15528316, 16814112, 17655532, 17697294, 16555340, 15558845, 14166320, 13077374, 11786320, 10641181, 9375657, 8484895]
4629H484895q18551o23617m22341m86992n03421k29598M00513p8186l52186l79766
4619D990750k37858M4292L32075O4316j92475O926M71588K20995J39390L00746
4609F140745N17729J68658R33608R65152J202311J213639J466825J414987r1062
4600A3932592j000881j439469j230067q45361r78228r62007l80512o02697l55616
4591F137754o87498l83846l67674m6215j40173l40612m67142P9421l71658j7665
4581C394692J04255l8377k41835J82700K33176k43259j61044J76743j66284k28791
4571C011976J26597M24791o9255k62896Q6012r2398J4712k06956K66306j31614
4561C167275L29720l10083o13786l16235J84722p9805j59880k32322M56521L52184
$$ y = [8484895, 7666344, 7042727, 6620386, 6133394, 5629973, 5400375, 5800888, 5722702, 5370516, 4990750, 4752892, 4797184, 5129259, 5193575, 5001100, 5008026, 5479614, 5700609, 5839999, 6140745, 6658474, 6827132, 7760740, 8725892, 9928203, 11141842, 12608667, 14023654, 13932592, 12931711, 11492242, 10262175, 9416814, 8438586, 7476579, 7096067, 6493370, 6137754, 5450256, 5066410, 4698736, 4652521, 4512348, 4171736, 3704594, 3784015, 3412357, 3394692, 3498947, 3460570, 3218735, 3401435, 3634611, 3391352, 3230308, 3407051, 3240767, 3011976, 3138573, 3563364, 3494109, 3231213, 3317225, 3224827, 3239539, 3032583, 3298889, 3167275, 3496995, 3186912, 2573126, 2256891, 2441613, 2361808, 2201928, 1969606, 2426127, 2778311]
4551B778311K01288p9602m44050n4623R1170N6876j36785J24292M00253M7533
4541B984663l79311r1442l3364J21217m18966j96481J1502N9349J58935L95759
4531B611861K03604m21251m26389K50940O73581l17063l62143l02372K72650Q7633
4521B271051L96525J48461j08335O469j04581l23645k97535j79114J11481K50225
4511B171002R6426j62338J24086J61847J29560k17831K40743K10144j05287m24981
4501B223371n3989j1619k58130j51517o1656O09130M69497n8752o49587j94262
4491A862486l7286J23174o5150K64230j40497Q6433J87702j11140K92420j73743
4481B288629K77883O3182L2468l39736n61450o9804K47091L82691K06718Q5632
$$ y = [2778311, 2979599, 2899997, 2455947, 2401324, 2492494, 2549370, 2412585, 2536877, 2937130, 2984663, 2605352, 2513910, 2480546, 2601763, 2182797, 1986316, 1997818, 2057167, 2216102, 2611861, 2815465, 2394214, 1967825, 2218765, 2892346, 2575283, 2213140, 1910768, 2183418, 2271051, 2667576, 2816037, 2707702, 2714171, 2609590, 2285945, 1988410, 1809296, 1920777, 2171002, 2267428, 2105090, 2229176, 2391023, 2520583, 2302752, 2543495, 2753639, 2648352, 2223371, 2169382, 2157763, 1899633, 1748116, 1686460, 2295590, 2765087, 2706335, 2056748, 1862486, 1825200, 1948374, 1883224, 2147454, 2006957, 2093390, 2281092, 2169952, 2462372, 2288629, 2566512, 2629694, 2662162, 2322426, 1760976, 1691172, 1938263, 2320954, 2527672, 2613304]
4471B613304n46925R1406J20660k38195l47810J60834J53261j15566K12213R1291
4461B194473O3993J9363J17340L2753j67222K00418l78496n0645q575N9600N8931
4450B141933k8845k03643q7694J76600M91722P6827n18217p8819O2361P2815m14067
4439A690973k12743L49473L03676j43433K30227J12382m42001k56226K71955M86019
4429B390302j13808k13311j41844K65288k18352K83585o5545o9699j65191J87441
4419B138866N45948m52241m57739o4772L17344L83300j52327k93269J29224L16934
4409B411268l9185o03046l28524L84701L1583P9532L04488l75733k40085Q2803
4399A707802M40518k16301L76854J49554l9292k25273j24177J65205k53814J72956
$$ y = [2613304, 2066379, 2157785, 2278445, 2040250, 1692440, 1853274, 2006535, 1890969, 2103182, 2194473, 2258466, 2277829, 2395169, 2427922, 2260700, 2461118, 2082622, 2031977, 2023402, 2083002, 2141933, 2113088, 1909445, 1821751, 1998351, 2490073, 2566900, 2048683, 1969864, 2032225, 2105040, 1690973, 1478230, 1827703, 2131379, 1987946, 2218173, 2330555, 1888554, 1632328, 1904283, 2390302, 2276494, 2063183, 1921339, 2186627, 1968275, 2251860, 2186315, 2116616, 1951425, 2138866, 2684814, 2232573, 1774834, 1710062, 2027406, 2410706, 2258379, 1965110, 2094334, 2411268, 2372083, 1769037, 1440513, 1825214, 1856797, 1936329, 2240817, 1865084, 1624999, 1707802, 2148320, 1932019, 2308873, 2458427, 2419135, 2193862, 2069685, 2234890, 1981076, 2154032]
4389B154032N256j28431j40499l1128J68686L14024k09691m68515l81351L90779
4379A673162L80475J2875m9827N6352J6535J81081J35185p361m002k30294k40586
4368A923595j06490O9884P5054K5053k31676J96501M25104k01175o9803l0616
4358B075431j93832k73179j14897N89712l0065K76442J84701l15083m26577j09810
4348A662843J97760l3121Q265j6761j06426l46642K89155L52913L53574L0209
4338B391769l38916J84590J29030N5189l2636M8056p6787N3680J42348J2934j77511
4327B391746P6337J9988q1591k57761M6691K51153L34782J20941j82332j487L73658
4316C092125k47944J99185O41915M24972M19364P83480Q94058M19719K24818N60945
$$ y = [2154032, 2159288, 2030857, 1890358, 1859230, 2027916, 2341940, 2132249, 1663734, 1282383, 1673162, 2053637, 2066512, 2016685, 2073037, 2089572, 2270653, 2405838, 2398477, 2394475, 2164181, 1923595, 1817105, 1886989, 1962043, 1987096, 1755420, 1951921, 2377025, 2175850, 2106047, 2075431, 1881599, 1608420, 1493523, 2083235, 2053170, 2329612, 2514313, 2199230, 1772653, 1662843, 1860603, 1827482, 1835747, 1818986, 1712560, 1365918, 1655073, 2007986, 2361560, 2391769, 2052853, 2237443, 2366473, 2421662, 2389026, 2437082, 2360295, 2413975, 2556323, 2569257, 2391746, 2468083, 2488071, 2406480, 2148719, 2195410, 2446563, 2781345, 2902286, 2719954, 2718467, 3092125, 2844181, 3043366, 3685281, 4110253, 4529617, 5313097, 6207155, 6626874, 6851692, 7412637]
4306G412637J31023M2037j6386l24425m94617k02566L86651j218j94351j01972
4296F636813N81598Q10421N52095N80802K77364K55971K55981j03085Q5614k16003
4286I717571j9140L66316j64259k81538p88020r30897l6668p3489J68355l11513
4276G646718j25099L89547N18790P10737K96645J80645K51323q9207m91393l84601
4266H904105j65707O4304j01490O5572N2455J32994J02540q0912J71711j05918
4256I039654j06080L09477M54218Q04885O88725J072428Q51528Q83976O35045
4247A4633856j30402k52412j85047J55889l16639Q7923J04818L6644J07809L90071
4237A4632510J85931j05674k1594J26851q3614j3465L38290N44309P93495O02907
$$ y = [7412637, 7543660, 7585697, 7569311, 7244886, 6750269, 6547703, 6934354, 6933136, 6738785, 6636813, 7218411, 8028832, 8580927, 9161729, 9439093, 9695064, 9951045, 9847960, 9933574, 9717571, 9698431, 10064747, 9900488, 9618950, 8830930, 7900033, 7863365, 7789876, 7958231, 7646718, 7521619, 7911166, 8429956, 9140693, 9437338, 9617983, 9869306, 9780099, 9288706, 8904105, 8738398, 8802702, 8701212, 8766784, 8819239, 8952233, 9054773, 8973861, 9145572, 9039654, 8933574, 9243051, 9697269, 10502154, 11190879, 12263307, 13114835, 13998811, 14633856, 14503454, 14251042, 14065995, 14221884, 13905245, 13993168, 14097986, 14134630, 14242439, 14632510, 14818441, 14712767, 14691173, 14818024, 14734410, 14720945, 15059235, 15603544, 16397039, 16999946]
4227A6999946j63884m73113p11096o35049j180267j135823p09296k80909l56577
4218A1353932l53053j49902J92557J17171J97557R2661k77422m05970k24512L4831
4208A0577850k27187l69455k6299J62289q1180k6094L2621l10730o49598p06229
4198H375988l50496k50129L43384K65495m7578J766L26793R30313R7871M51723
4188A0145130K11463L73120k52247j09955k19031j60563K61751N092j41856o90715
4178I422189n29073o95294k94875j98000l41858k87981L05833P51786O23401M21762
4168I177890O2918j88347o02832m36202p42002r35416m68212o12869k61692q2784
4158D910452L2718k49550p30349k83348j98943j34010L56m9390J03005l5075q3593
$$ y = [16999946, 16836062, 16362949, 15651853, 15016804, 13836537, 12700714, 11991418, 11710509, 11353932, 11000879, 10850977, 11043534, 11160705, 11358262, 11450923, 11173501, 10767531, 10543019, 10577850, 10350663, 9981208, 9954909, 10117198, 10036018, 10009924, 10042545, 9731815, 9082217, 8375988, 8025492, 7775363, 8118747, 8384242, 8336664, 8338430, 8665223, 9595536, 9693407, 10145130, 10356593, 10729713, 10477466, 10367511, 10148480, 9987917, 10249668, 10254760, 10112904, 9422189, 8893116, 8197822, 7902947, 7704947, 7363089, 7075108, 7380941, 8132727, 8756128, 9177890, 9240808, 9052461, 8449629, 8013427, 7271425, 6336009, 5867797, 5254928, 4993236, 4910452, 4943170, 4693620, 3963271, 3679923, 3480980, 3346970, 3347326, 3297936, 3400941, 3365866, 3282273]
4147C282273r1652o5094L30899j20745n2971l33666J1260J12393L67524N321l29462
4136C116080j82219O4688m1319j06295m5440k61560l64558R5587N70098j28503
4126B716559k84233n4656K67247j23140m10973k2840J00809P6408K81874k98227
4116B248828M15872j98417j54134k35274J83491L49269R7325l3450J74864j15722
4106B732652J78947m067l50688n1454l4183L62967o5118J59369m10758q1028m373
4095B432266r8140l96330K54486N09881K78447m12990l51566m88018J31478L68013
4085B227527M20960m4833l92909K57718K0051k1824J52775k85648m4476j57338
4075B132003M3682J1294k95716J82684j90684L2102K75964R6851o0538k86193
$$ y = [3282273, 3190621, 3125527, 3456426, 3335681, 3282710, 2949044, 2960304, 3072697, 3440221, 3445542, 3116080, 2933861, 2998549, 2957230, 2850935, 2805495, 2543935, 2179377, 2274964, 2845062, 2716559, 2432326, 2377670, 2644917, 2521777, 2110804, 2087964, 2188773, 2265181, 2547055, 2248828, 2664700, 2466283, 2312149, 2076875, 2260366, 2609635, 2706960, 2673510, 2848374, 2732652, 2911599, 2907532, 2556844, 2505390, 2471207, 2834174, 2769056, 2928425, 2517667, 2436639, 2432266, 2334126, 1937796, 2192282, 2702163, 2980610, 2567620, 2216054, 1728036, 1859514, 2227527, 2648487, 2603654, 2210745, 2468463, 2488514, 2466690, 2619465, 2333817, 2289341, 2132003, 2175685, 2186979, 1891263, 2073947, 1883263, 1915365, 2191329, 2288180, 2227642, 1941449]
4065A941449l5936L81515l54467m7441l27896N10075M14133K74053l10842l97383
4055B047260j48592K8736J49521J61678p8786K0563k7798m7777j58353j36122
4045A810330N52161J28337k10282l87157k63488N5885J42178j19202k57131m65693
4035I85938M97236M01021K47663l1399J8404j13005k55388P5568K92702P6921
4025B195661k8214l34450J99751j68190j13891j45899J73873M02897r0832j52858
4015A937848j76820n62689K55469L33643N2127P6887J72740J61330k92546j63111
4005A794878J46275o9821l8064K3292o5773L33429J89386L2091o37924L30433
3995B038202J58342j86043k1200L60962J29049l30178k78699M3834j20721J89572
$$ y = [1941449, 1905513, 2287028, 1932561, 1885120, 1557224, 2067299, 2481432, 2755485, 2444643, 2047260, 1898668, 1927404, 2076925, 2238603, 2159817, 2180380, 2152582, 2104805, 1946452, 1810330, 2362491, 2490828, 2280546, 1893389, 1629901, 1685786, 1827964, 1708762, 1451631, 985938, 1483174, 1884195, 2131858, 2100459, 2118863, 2005858, 1750470, 1826038, 2118740, 2195661, 2167447, 1832997, 2032748, 1864558, 1750667, 1604768, 1778641, 2181538, 2090706, 1937848, 1761028, 1198339, 1453808, 1787451, 1839578, 1916465, 2089205, 2250535, 1957989, 1794878, 1941153, 1871332, 1833268, 1856560, 1790787, 2124216, 2313602, 2345693, 1707769, 2038202, 2196544, 2010501, 1989301, 2350263, 2479312, 2149134, 1870435, 1914269, 1793548, 1983120]
3985A983120o449k69373l9076K11955K03020l92485m31468K38115M18780J61671
3975B077810j44123j1832K01556j44870n80493l9206K40212Q1589K55224K20122
3965B155989j69347k26154n812m224J34529K0623N31352k00650K33036O0638j45252
3954B384728K82032N16202L56506l97306m25467M02703L20684k6689Q6367j19570
3944C380190K64281K10339K51779q1911L33568J30701M00277J44733O10454J61395
3934E805806J76563O4109L11891k05014K16152k7748j40437n5223l6808n17968
3924E591323l12680P02173O89218Q9083L4868K66133M90434M28413j45241m53102
3914G380622m50371M76647j83077m80208j70352M02573L09349l55617o72031l146
$$ y = [1983120, 1976671, 1707298, 1668222, 1880177, 2083197, 1690712, 1259244, 1497359, 1916139, 2077810, 1933687, 1921855, 2123411, 1978541, 1398048, 1358842, 1599054, 1680643, 1935867, 2155989, 1986642, 1760488, 1754676, 1750452, 1884981, 1905604, 2436956, 2236306, 2469342, 2529980, 2384728, 2666760, 3182962, 3539468, 3142162, 2716695, 3119398, 3440082, 3413393, 3499760, 3380190, 3644471, 3854810, 4106589, 4024678, 4358246, 4488947, 4889224, 5033957, 5644411, 5805806, 5982369, 6046478, 6358369, 6153355, 6369507, 6341759, 6201322, 6146099, 6109291, 5591323, 5278643, 5980816, 6670034, 6759117, 6793985, 7060118, 7550552, 7978965, 7833724, 7380622, 6930251, 7406898, 7223821, 6743613, 6573261, 6975834, 7285183, 6929566, 6257535, 6254389]
3904F254389Q20197J104835J45164O1490K44631M01300M5095L6849k39989j41066
3894H732895k47761O8947l6188j44504j69665L82485N62928O64444M50142N76187
3884A0839910J248341J366168L18785k48691n52562J45968q2160J4211k67686
3875A2782284l88142n85468k27173J89550M82363M18222O38556M92366O55446
3866A4458004Q83978N25557K68173M00980N04800K69665l83751o67375n54993
3857A5705038j37562q1407n84647k71422l12116K66157m0044L52462K54253L91794
3847A5542506M0441L21521K53356k2945k77931K56238P03350N81379j0667j54467
3837A7232781M7817K46436M61362O64805K98088k8332j55036l15115o20360l30743
$$ y = [6254389, 7074586, 8179421, 8324585, 8386075, 8630706, 9032006, 9077101, 9113950, 8873961, 8732895, 8485134, 8554081, 8517893, 8373389, 8203724, 8586209, 9149137, 9813581, 10263723, 10839910, 12088251, 13454419, 13773204, 13524513, 12971951, 13117919, 13035759, 13049970, 12782284, 12394142, 11808674, 11581501, 11771051, 12253414, 12671636, 13310192, 13802558, 14458004, 15341982, 15867539, 16135712, 16536692, 17041492, 17311157, 16927406, 16260031, 15705038, 15567476, 15486069, 14901422, 14630000, 14317884, 14584041, 14543997, 14896459, 15150712, 15542506, 15582947, 15904468, 16157824, 16134879, 15856948, 16113186, 16816536, 17397915, 17387248, 17232781, 17280598, 17527034, 17988396, 18653201, 18951289, 18922957, 18767921, 18452806, 17832446, 17501703]
3827A7501703j25040m99284n71848l85149L3207J52259L91720P65466P95824Q15995
3817A8874853R35599R49438J315262J516202J578279J467739J761502K213003
3809C0611877K069345K068833K375252K319434J016037N08522L87516q7901j552840
3800C9716075j747059j553510j542396j355096j031237l39820L89386R32324J374610
3791C4843277J020568J608193K040906K475645K531941K188269J883852J670387
3783E0263038R99874l82753j051836j882157k802232l822411l466649l080206
3775C4774668k469883k088326j448544r23850o89830n95210k71173M16237P74051
3766B7478140P69086R25052O61000O17693k45362j045843j755406j933825j752431
$$ y = [17501703, 17376663, 16877379, 16305531, 15920382, 15953589, 16105848, 16497568, 17263034, 18058858, 18874853, 19810452, 20759890, 22075152, 23591354, 25169633, 26637372, 28398874, 30611877, 32681222, 34750055, 37125307, 39444741, 40460778, 40969300, 41356816, 41268915, 39716075, 37969016, 36415506, 34873110, 33518014, 32486777, 32146957, 32536343, 33468667, 34843277, 35863845, 37472038, 39512944, 41988589, 44520530, 46708799, 48592651, 50263038, 51262912, 50880159, 49828323, 47946166, 45143934, 41321523, 37854874, 34774668, 32304785, 30216459, 28767915, 27844065, 27154235, 26559025, 26287852, 26704089, 27478140, 28247226, 29172278, 29833278, 30450971, 30205609, 29159766, 27404360, 25470535, 23718104]
3757B3718104j797356j660957j266010p10522o64883j08577L20423N23194J44369
3748A8497785L20076j9017J507l26460q22148j181343j227439p75619j043705
3739A3423637p48261l97409J94938J10641L2153r9910M94438M25007L49823J39727
3729A3924784j22854K92939j74385m52656l64445l9797j69506m84197l85134o31843
3719A1392906q31286r19125j60438o26705o40638m79890k32956j88031k17028
3710G096809K93437r3562q2059J84573O38544K38224q7634m4452k27031n68119
3700G348730p90677j86623l91802m14891m8169K16024o0064l86691l8728j42177
3690E104932l15139l19249j38373k86571K42848k6760l36683l30224K53441J45574
$$ y = [23718104, 21920748, 20259791, 18993781, 18283259, 17618376, 17509799, 17830222, 18353416, 18497785, 18817861, 18798844, 18800351, 18473891, 17651743, 16470400, 15242961, 14467342, 13423637, 12675376, 12277967, 12472905, 12583546, 12615699, 12515789, 13010227, 13435234, 13785057, 13924784, 13801930, 14094869, 13920484, 13467828, 13103383, 13063586, 12894080, 12409883, 12024749, 11392906, 10561620, 9642495, 9482057, 8855352, 8214714, 7734824, 7501868, 7313837, 7096809, 7390246, 7296684, 7214625, 7399198, 8037742, 8275966, 8188332, 8143880, 7916849, 7348730, 6558053, 6371430, 5979628, 5564737, 5516568, 5732592, 5672528, 5285837, 5247109, 5104932, 4789793, 4470544, 4332171, 4045600, 4288448, 4261688, 3925005, 3594781, 3848222, 3993796]
3680C993796j13962l4592j85380r960K4031n4066j2851K62346L96643O3746m69077
3669C860674k00204R6982m4972n2770n46417j63535J03598J88877R221j59929
3659C091525Q8923l55490o9695q5900K12190j59004L84784L9876k94672k96821
3649B555716N1483K07290n8931J7625j61579j6728q3282J20877l67584N4699J17728
3638B437314m2589L7642M19666M64700k58476m97888l07452k3239J59859j3960
3628B375577P7101N725J7709l13749N463K05517K26444k40345k86265j2857L56451
3617B416771K59276J5816k38344k03372Q1612m05527m94754m6073M40715N04114
3607B330234j32131k11038j15922J92346j61938n26785j99235L14403M71626K40322
$$ y = [3993796, 3879834, 3845242, 3659862, 3649902, 3673933, 3619867, 3607016, 3869362, 4266005, 4329751, 3860674, 3660470, 3757452, 3712480, 3659710, 3113293, 2949758, 3053356, 3242233, 3251454, 3091525, 3180448, 2824958, 2755263, 2669363, 2881553, 2722549, 3107333, 3147209, 2852537, 2555716, 2607199, 2814489, 2755558, 2773183, 2611604, 2594876, 2511594, 2632471, 2264887, 2319586, 2437314, 2394725, 2432367, 2852033, 3316733, 3058257, 2560369, 2252917, 2229678, 2389537, 2375577, 2452678, 2458403, 2476112, 2162363, 2167826, 2373343, 2599787, 2359442, 2073177, 2060320, 2416771, 2676047, 2691863, 2453519, 2250147, 2331759, 1926232, 1431478, 1385405, 1826120, 2330234, 2198103, 1987065, 1871143, 2063489, 1901551, 1374766, 1175531, 1489934, 1961560, 2201882]
3597B201882P3192r8012l7282l76767j63092L16200M41940k14805l31251k12546
3587A599459K94975j39584j36033r4823M1054K43953J31199k32147q2558J36230
3577A761725K22090p1781k33254L73609J67271R6742j73569K0599K56114m01114
3567B018432j54373Q8946K68312O8644p7167k0875J49812J97114L2953o0973K75468
3556B786293L25023K6798L05330M04552L44375J51633J64056J42562R4802N70592
3546E316016L09199J35240M0461J78142n3012j1639J45678L72024J69293r9096
3536F502306j74812J86272J62934q8469K08568O98671J367335N71801K09044K15431
3526I859081M11437O05644K4938l76551m45022K04006N29647K34740k03612K12803
$$ y = [2201882, 2275074, 2177062, 2139780, 1763013, 1599921, 1916121, 2358061, 2143256, 1812005, 1599459, 1894434, 1754850, 1618817, 1523994, 1565048, 1809001, 1940200, 1708053, 1625495, 1761725, 1983815, 1912034, 1678780, 2052389, 2219660, 2316402, 2142833, 2163432, 2419546, 2018432, 1864059, 1953005, 2221317, 2289961, 2212794, 2191919, 2341731, 2538845, 2571798, 2510825, 2786293, 3111316, 3138114, 3443444, 3847996, 4192371, 4344004, 4508060, 4650622, 4745424, 5316016, 5625215, 5760455, 5800916, 5979058, 5926046, 5914407, 6060085, 6432109, 6601402, 6502306, 6327494, 6513766, 6676700, 6588231, 6796799, 7495470, 8862805, 9434606, 9643650, 9859081, 10270518, 10876162, 10901100, 10524549, 10079527, 10283533, 10813180, 11047920, 10844308, 11057111]
3516A1057111j66756l81994l12950l6055Q926p98608Q7276Q6499O115k00030J23195
3505I472729n02252k86778J02724J63414m1917K32178K99533J88012L67461P74210
3495A0769314K11727K88881N38594J95113m00690l53384n22507l4054J44537K81366
3485A1118897J23421p337L43788k26850J1435L44758Q4074J15903O65531N50320
3475A3123940M16640L052O54129N16305M26423L36491J97662l1262N37996R49590
3465A7130966J223583J332530J727162J212720m40659j143088j430407j534802
3457A8078005j192382o14713r00952j261343j028257j58713k12957m78668o59458
3448A1570562p76396n82610j67009k69464l55125k91492o84711l60859k32250
$$ y = [11057111, 10890355, 10508361, 10195411, 10159356, 10168282, 9369674, 9456950, 9543449, 9549564, 9349534, 9472729, 8970477, 8683699, 8786423, 8949837, 8907920, 9140098, 9439631, 9627643, 9995104, 10769314, 10981041, 11269922, 11808516, 12003629, 11602939, 11249555, 10727048, 10692994, 10837531, 11118897, 11242318, 11234981, 11578769, 11351919, 11363354, 11708112, 11792186, 11908089, 12573620, 13123940, 13540580, 13543632, 14197761, 14714066, 15140489, 15476980, 15674642, 15643380, 16181376, 17130966, 18354549, 19687079, 21414241, 22626961, 22186302, 21043214, 19612807, 18078005, 16885623, 16270910, 15369958, 14108615, 13080358, 12921645, 12708688, 12230020, 11570562, 10794166, 10211556, 10044547, 9775083, 9419958, 9128466, 8443755, 8082896, 7850646]
3439G850646k07873p00056n44515j40782J01824J93259N09262O60774O57792N63738
3429H944069k54889n25018m08430k86213n98858k94607j23641l26298M3176L14060
3419F483351J17415j1058N34646O03620J71441j02247j36735j40371L9317M75308
3409H034687M35357N0954O9278J06186j94520k75661J03412J7544j29010Q0749
3399H298976K49527j72078j62361M54367P11761J79362P1392J041027J168594
3390A1840567O80048N54795M50299J80815j00812l92888p55108r81716p69847
3381A0706153l84003n45613q28115m16754l6999k30486Q4379L36698M78656l40056
3371H823860l22589L8070j4408M1382M1716K19515l8200K28342M81717N38007
$$ y = [7850646, 7642773, 6942717, 6398202, 6257420, 6359244, 6552503, 7061765, 7722539, 8380331, 8944069, 8689180, 8164162, 7755732, 7469519, 6870661, 6576054, 6452413, 6126115, 6169291, 6483351, 6600766, 6589708, 7124354, 7727974, 7899415, 7797168, 7660433, 7520062, 7559379, 8034687, 8470044, 8520998, 8590276, 8696462, 8501942, 8226281, 8329693, 8347237, 8218227, 8298976, 8548503, 8376425, 8214064, 8668431, 9380192, 9559554, 9630946, 10671973, 11840567, 12520615, 13075410, 13525709, 13706524, 13605712, 13212824, 12457716, 11476000, 10706153, 10322150, 9776537, 8948422, 8531668, 8494669, 8264183, 8348562, 8685260, 9163916, 8823860, 8501271, 8539341, 8524933, 8566315, 8608031, 8827546, 8789346, 9017688, 9499405, 10037412]
3361A0037412M65871N12878k87633m15824j07486l20451r2655n6095L74103O0446
3351A0170566M09965M21807M23289P37769M40002l28485m24135K54264L3382l35269
3341A1803155J2597O16902L8840q0029M8603O41512L55695l70819q38188m15334
3331A1812934L05216R8220J41292N4198J83080L61347L42567J91480J58037J57825
3321A3806196M96663L67225k53377q0416R6836K10796n57927p71274o55720l18120
3311A2340882m8115j81387m60976q22432n58951k26315j85314l05036p5458K51406
3301I728304K85796L31265j05634M48608O02364N15427J85850M3480j41266p9396
3291A1814798j23573j86087l93576m69157m88885j066544o35994k54615o0984
$$ y = [10037412, 10503283, 11016161, 10728528, 10312704, 10205218, 9884767, 9792112, 9736017, 10110120, 10170566, 10580531, 11002338, 11425627, 12163396, 12603398, 12274913, 11850778, 12105042, 12138424, 11803155, 11815752, 12432654, 12471494, 12391465, 12440068, 13081580, 13437275, 13066456, 12228268, 11812934, 12118150, 12216370, 12357662, 12411860, 12594940, 12956287, 13298854, 13490334, 13648371, 13806196, 14302859, 14670084, 14416707, 14336291, 14433127, 14643923, 14085996, 13314722, 12659002, 12340882, 12292767, 12111380, 11650404, 10827972, 10269021, 10042706, 9857392, 9552356, 9476898, 9728304, 10014100, 10345365, 10239731, 10688339, 11290703, 11806130, 11991980, 12035460, 11894194, 11814798, 11691225, 11505138, 11111562, 10642405, 10153520, 9086976, 8450982, 8196367, 8135383]
3282H135383m86457o95927m44554k10994J40833K490n2352j44988M39333N40204
3272G222971J46375J90626L79224P11883q1201l17860k92693k02839k78580j42671
3262G335235r21421p16908l78071Q1425k2929m07848l1790m2962o4219k70573
3252D559939j50259o5359J57365k08041P7234J27941R1529m39644k50338K59270
3242D159637n1578o2582p6547j21294j84574J82057N8220l06236l35575k0681
3232C240847j66192k59597j83810J35837M8309J98463N8641N5004J2008L71710
3222C511220J51586J78949j88846l05990O9101K46351J51386p4711O6825K03124
3212D008995r7947o0122l81318k89928j99745j45762j6352j46501j20070K7237
$$ y = [8135383, 7648926, 6952999, 6508445, 6297451, 6438284, 6440774, 6388422, 6243434, 6682767, 7222971, 7369346, 7559972, 7939196, 8651079, 8569878, 8252018, 7959325, 7756486, 7477906, 7335235, 6413814, 5696906, 5318835, 5400260, 5377331, 4969483, 4937693, 4894731, 4830512, 4559939, 4409680, 4344321, 4501686, 4293645, 4370879, 4498820, 4590349, 4150705, 3900367, 4159637, 4108059, 4045477, 3968930, 3847636, 3663062, 3845119, 3903339, 3597103, 3261528, 3240847, 3074655, 2815058, 2631248, 2767085, 2815394, 3013857, 3072498, 3127502, 3139510, 3511220, 3662806, 3841755, 3652909, 3346919, 3416020, 3662371, 3813757, 3739046, 3805871, 4008995, 3911048, 3850926, 3469608, 3179680, 2979935, 2834173, 2817821, 2671320, 2551250, 2578487]
3202B578487M1105o0139J12191k9988J26153l49982L93218J51906M33j53346R4583
3191B904621J08666l81885r8657M72762J86707j1632k64762j73971j58133K62003
3181B845719O65200M95061o2742L4008K25606N47462K00557N9857j68810k98342
3171D543576k65827J52648O54161K13673p6747k2972j2139R7007J55221L77006
3161E815607M30580J6503J1558m0962L18718M01663K18334m3799M9262J75920
3151G353384O02424P21360J327601J268044J367676J241631J130021N85160L36251
3142A5933552l97519r35404j270807j112984n57707o43196l22934k67340J48464
3133A0574125K09992J38767l5486J4572O01147O76466P18526R29385J292966J198249
$$ y = [2578487, 2619592, 2559453, 2671644, 2641656, 2767809, 2417827, 2811045, 2962951, 2963384, 2810038, 2904621, 3013287, 2631402, 2532745, 3005507, 3192214, 3180582, 2915820, 2741849, 2583716, 2845719, 3510919, 4005980, 3943238, 3977246, 4202852, 4750314, 4950871, 5010728, 4841918, 4543576, 4277749, 4430397, 5084558, 5298231, 5221484, 5198512, 5186373, 5283380, 5438601, 5815607, 6246187, 6262690, 6274248, 6233286, 6552004, 6953667, 7172001, 7128202, 7177464, 7353384, 7955808, 8677168, 10004769, 11272813, 12640489, 13882120, 15012141, 15597301, 15933552, 15536033, 14600629, 13329822, 12216838, 11659131, 11015935, 10693001, 10425661, 10574125, 10784117, 10922884, 10887398, 10901970, 11503117, 12179583, 12898109, 13827494, 15120460, 16318709]
3123A6318709J451805J612325K077084K355040L037674M006114M757626O224439
3115D1840816Q237538J1620857J5952639K0125200K3617495K4344568K1545097
3108A67284210J4871917O733080n61193m539830m406992j351252J993511M322954
3100A84346405M633973L830852L207228M536378P494741R149197Q386707L081047
3092B28666528l985597j1350378j7027839j9575604j8810220j5538732j1615672
3085A30762486p685560k834714K669634R346383J7133361K6154046L3897041L7699373
3077B47142050L2523249J6804074m682041k2556785l2273538l4012503l0578908
3070A72365598k5054321j9835298j5474789j1593578r170161p504933o204289
$$ y = [16318709, 17770514, 19382839, 21459923, 23814963, 26852637, 30858751, 35616377, 41840816, 50078354, 61699211, 77651850, 97777050, 121394545, 145739113, 167284210, 182156127, 188889207, 188328014, 183788184, 179381192, 178029940, 180023451, 184346405, 188980378, 192811230, 196018458, 200554836, 208049577, 217198774, 225585481, 228666528, 224680931, 213330553, 196302714, 176727110, 157916890, 142378158, 130762486, 123076926, 120242212, 122911846, 132258229, 149391590, 175545636, 209442677, 247142050, 279665299, 296469373, 291787332, 269230547, 236957009, 202944506, 172365598, 147311277, 127475979, 112001190, 100407612, 91237451, 83732518, 77528229]
3063G7528229n336244m677179m029199l025128k731326k172662r99268K37680
3055E4794903L70766J33588l10642l56520l77380J468617M582109Q199874J2060161
3046H0565476J6176893J7376281J2947123L812092n545256j0995808j2275324
3039A02061477j1339111r614040p645939o210453n675338n451454m964269m565340
3031D6595533l957436l643668k779672k693894j793074j520472j033397o51248
3023B8522672j80488Q5014Q20426R77885Q25194J975o13891r70579r29823j222391
3013B7315994j505325j808698j269961j333312q62197r32807q01716r59117m52201
3004A7390660l84470l51542j8511M02059N51678K94551P15238O27507M06932L40073
$$ y = [77528229, 72191985, 67514806, 63485607, 60460479, 57729153, 55556491, 54557223, 54794903, 55165669, 55299257, 54988615, 54632095, 54254715, 55723332, 60305441, 68505315, 80565476, 96742369, 114118650, 127065773, 130877865, 125332609, 114336801, 102061477, 90722366, 81108326, 73462387, 67251934, 61576596, 56125142, 51160873, 46595533, 42638097, 38994429, 36214757, 33520863, 31727789, 30207317, 29173920, 28522672, 28342184, 28427198, 29247624, 30225509, 31050703, 31052678, 30438787, 29468208, 28538385, 27315994, 25810669, 24001971, 22732010, 21398698, 20536501, 19603694, 18801978, 17842861, 17390660, 17006190, 16654648, 16636137, 17038196, 17589874, 17884425, 18599663, 19227170, 19634102, 19974175]
2994A9974175K62474k85101j64333n42780p00295o30537k96976j66525n2541K90541
2984A7688102Q46330J090430J554352J778276J863960J673978J467275P32821
2976B8695524m55896j047832j356478j997054k303507k061478j117324j003499
2968A7352456m11298O7965n5052L08949P97171R49539N58897P30241Q36583N4094
2958B1189545o33506j021641j518719j706976j188439j342961j035260p39983
2950A2002060l38986m26810n57000l85242j77884L0908K41147J91190L92716M46696
2940A1418795J008207P35753M56263M46443K69227l79577m91247m87244o38231
2931A2338389q65633o57712k42388n50942k22243l26973R672m3503L29445Q50026
$$ y = [19974175, 20236649, 19951548, 19787215, 19244435, 18544140, 17913603, 17616627, 17450102, 17397561, 17688102, 18534432, 19624862, 21179214, 22957490, 24821450, 26495428, 27962703, 28695524, 28239628, 27191796, 25835318, 23838264, 21534757, 19473279, 18355955, 17352456, 16941158, 17009123, 16954071, 17263020, 18060191, 19009730, 19568627, 20298868, 21135451, 21189545, 20556039, 19534398, 18015679, 16308703, 15120264, 13777303, 12742043, 12002060, 11663074, 11236264, 10679264, 10294022, 10116138, 10147046, 10388193, 10579383, 10972099, 11418795, 12427002, 13162755, 13619018, 14065461, 14334688, 13955111, 13463864, 12976620, 12338389, 11472756, 10815044, 10572656, 10021714, 9799471, 9472498, 9482170, 9438667, 9768112, 10618138]
2921A0618138N66395O25167M95453r5963r5067K33165j14293j065493j464599
2912I702903r92262m51235j86543m31442o11290m59992j61631P5994l43924j79330
2902E961248m52199m35479L8748n3470j89101m29929l01093L34800P3059Q6660
2892D633244r1616N6270n7772j74967J41953K41597k38065r1137j73537O5679
2882D311649k60928J02399J69287l09212J11445q3187j92178k31172K68937J75492
2872D062532k5757l11719J8771k04332P4437J1201J88489J92589l24259n9845
2862C622107r4660R046k57102l85670K31209M78797K19132m79226l13797o3185
2852B966651K83599R233K5549K26922J31663l4306L7983J71806l44489j72026
$$ y = [10618138, 11184533, 11809700, 12305153, 12209190, 12114123, 12347288, 12232995, 11167502, 9702903, 8710641, 8259406, 8072863, 7641421, 7030131, 6570139, 6408508, 6484502, 6140578, 5961248, 5509049, 5073570, 5112318, 5058848, 4869747, 4439818, 4138725, 4473525, 4546584, 4633244, 4541628, 4597898, 4540126, 4365159, 4507112, 4748709, 4510644, 4419507, 4245970, 4311649, 4050721, 4153120, 4322407, 4013195, 4124640, 4041453, 3849275, 3618103, 3887040, 4062532, 4036775, 3725056, 3743827, 3539495, 3613932, 3625133, 3813622, 4006211, 3681952, 3622107, 3527447, 3536493, 3279391, 2893721, 3124930, 3603727, 3822859, 3343633, 3029836, 2966651, 3250250, 3259483, 3285032, 3511954, 3643617, 3609311, 3647294, 3819100, 3474611, 3302585]
2842C302585j93304K62068j70965o1776k7208l3221k69862q3116J8721K7808k2763
2831B748967J29702L05577j23798K27783j7951K28034L64203K99944n9499q4816
2821D018146k6548j74001n1699Q2555K50134k46076j27650q6607M9231j71985
2811C515500M5462q0137l10275m898k52294k8310k70732J09468J58158J33137
2801C015079K95813n0701R069K8430K78727K05403K15246j2958j32959l4963K78378
2790D094564K5787m86862n30000n2785K61632l41845k95990m9117K09185J63568
2780B998137n3604r8399n55934j76985J88092j66429j30201J29203K29848j47453
2770B216275m63242J47003M44930K43325R7649r5373q3339O896L63599M40221
$$ y = [3302585, 3109281, 3371349, 3200384, 3138608, 3111400, 3078179, 2808317, 2725201, 2743922, 2771730, 2748967, 2878669, 3184246, 3060448, 3288231, 3270280, 3498314, 3862517, 4162461, 4102962, 4018146, 3991598, 3817597, 3765898, 3848453, 4098587, 3852511, 3724861, 3638254, 3687485, 3515500, 3560962, 3480825, 3170550, 3165652, 2913358, 2885048, 2614316, 2723784, 2881942, 3015079, 3310892, 3260191, 3269260, 3297690, 3576417, 3781820, 3997066, 3984108, 3851149, 3816186, 4094564, 4120351, 3633489, 3103489, 3050704, 3312336, 2970491, 2674501, 2625384, 2834569, 2998137, 2944533, 2846134, 2290200, 2113215, 2301307, 2134878, 2004677, 2133880, 2363728, 2216275, 1753033, 1900036, 2344966, 2588291, 2685940, 2590567, 2507228, 2514124, 2877723, 3317944]
2760C317944J84190j72107o46563l72256L01439L92868k61457l76462p6040m3888
2750B247668k46000K99706n5639l47453m65407K11989M75336P862N16469J76729
2740B821260k7663k95742N1405p106k19355m00024q8097j2551J92501j6172j43221
2729A855235j68372K94153l307k10383j54264K98702J86796J09044j06820j80682
2719A920102l87664L16327O55174j003l99685k55924m0395J56955j13128J49005
2709A999764k56841j40241j9732K7350Q1889j53356j87636J85124N74945K88866
2699B400132j59672m87512J28889j1488P7499m6792K3690l0872k78999J73787
2689A788662J15468k7472j95479j69471K84317R6902J81578K9206N9838J03809
$$ y = [3317944, 3502134, 3330027, 2683464, 2311208, 2612647, 3005515, 2744058, 2367596, 2291556, 2247668, 2001668, 2301374, 2245735, 1898282, 1432875, 1644864, 2120200, 2128062, 2644531, 2821260, 2793597, 2497855, 2549260, 2542154, 2322799, 1922775, 1834678, 1822127, 2014628, 1998456, 1855235, 1686863, 1981016, 1977709, 1767326, 1613062, 1911764, 2098560, 2207604, 2100784, 1920102, 1532438, 1848765, 2503939, 2502936, 2103251, 1847327, 1806932, 1963887, 1850759, 1999764, 1742923, 1602682, 1582950, 1610300, 1692189, 1538833, 1351197, 1536321, 2111266, 2400132, 2240460, 1752948, 1881837, 1870349, 1947848, 1901056, 1924746, 1893874, 1614875, 1788662, 1904130, 1876658, 1681179, 1511708, 1796025, 1892927, 2074505, 2103711, 2163549, 2267358]
2679B267358J70706j92117j8126l0627n1755k58840m70087k67180K08293M66739
2669A824364K80358o7754j28141j96959k32000q1005m5467k0610l263K49389K10923
2658A789835o4903j52560k67925R8075K48485M31993m85109m7026k91273p9831
2648A179761j43282M55893J81227Q0446J62853J72658l36160l21936J0952N3734
2638A496146k87487P8922J38445M32643K39144J52050k96310k05607j13624k37903
2628A396419r7372J38112K59887k2253M9451M3693L2618j3385J4856j88752O3977
2617A677251J0326p258p03124J31184M00803Q38059l10081n53598n54032L59286
2607A288816J06426j64905R0686O0695J05259J6412K15386k55364l08270K86763
$$ y = [2267358, 2438064, 2245947, 2227821, 2197194, 2145439, 1886599, 1416512, 1149332, 1357625, 1824364, 2104722, 2036968, 1908827, 1711868, 1479868, 1398863, 1353396, 1332786, 1329523, 1578912, 1789835, 1724932, 1572372, 1304447, 1402522, 1651007, 2083000, 1597891, 1550865, 1259592, 1179761, 1036479, 1492372, 1673599, 1754045, 1916898, 2089556, 1753396, 1431460, 1442412, 1496146, 1208659, 1287581, 1426026, 1858669, 2097813, 2249863, 1953553, 1747946, 1634322, 1396419, 1299047, 1437159, 1697046, 1674793, 1724244, 1767937, 1800555, 1787170, 1802026, 1613274, 1677251, 1687577, 1680319, 977195, 1108379, 1509182, 2347241, 2037160, 1483562, 929530, 1288816, 1395242, 1230337, 1321023, 1381718, 1486977, 1503389, 1718775, 1463411, 1155141, 1441904]
2597A441904L98710q8958l68336J77017k02823j67590R6848J79754j71117L464
2587A298873L50081k71829k76926L3617J59371k08103m00074J09209L05255J30005
2577A229479O6255j5609P104J84465j03564j68034k25924K12375K49361K71896
2567A707804j91335m29422k58846L12180J44089M8111j25652K50963K29303m48706
2557A238489r0715r3306M43878J28998M0461n4554l13433m3789j68437J16331
2547A203923k68787N1782K84136O4850l15404j00628K54469J22065J40234n348
2537A431292k97877m25333M43609O65087J7503n12612K2781J78822l59463L4462
2527A198271J80419j32651k14826l43947J3837J56150M47256r239l38791j07501
$$ y = [1441904, 1840614, 1751656, 1383320, 1560337, 1357514, 1189924, 1286772, 1466526, 1295409, 1298873, 1648954, 1377125, 1100199, 1133816, 1293187, 1085084, 685010, 794219, 1099474, 1229479, 1295734, 1280125, 1287229, 1471694, 1368130, 1200096, 974172, 1186547, 1435908, 1707804, 1516469, 1087047, 828201, 1140381, 1284470, 1332581, 1206929, 1457892, 1687195, 1238489, 1147774, 1054468, 1498346, 1627344, 1667805, 1613251, 1299818, 1256029, 1087592, 1203923, 935136, 986918, 1271054, 1335904, 1020500, 919872, 1174341, 1296406, 1436640, 1431292, 1133415, 708082, 1151691, 1816778, 1834281, 1321669, 1344450, 1523272, 1163809, 1198271, 1378690, 1246039, 1031213, 687266, 701103, 857253, 1304509, 1295270, 956479, 848978]
2517H48978R1621o4780K80494M21090m1527o19709J71950K45685L9459k3512R289
2506A359038j74578l19695L86285J978k8501J16964Q1861m65726m33601L97496
2496I21521M68793k95658l5483L18257k92514k95379n4601M72053K5825M3476
2486A276290J01353J38081j38051k39464J5806k2655j23630L67136K62213j13843
2476A523236n58144k01957L31983K98642m9423j41223R9692l4453R305R6205j60203
2465A213660O235J7006j97499k7159j03807M54478J76666o6583k80062j86937
2455A005998R7255o4408o6534L03983J98973j29352n46136J42113K95185k12610
2445A024467j15312J80363K17911j28018R2061j41558p6060j82502K58862J02042
$$ y = [848978, 940599, 875819, 1156313, 1577403, 1535876, 916167, 1088117, 1333802, 1373261, 1349749, 1359038, 1184460, 864765, 1251050, 1253028, 1224527, 1341491, 1423352, 957626, 524025, 921521, 1390314, 1094656, 1059173, 1377430, 1084916, 789537, 734936, 1206989, 1232814, 1276290, 1377643, 1515724, 1377673, 1138209, 1154015, 1131360, 1007730, 1374866, 1637079, 1523236, 965092, 763135, 1095118, 1393760, 1344337, 1203114, 1302806, 1268353, 1277658, 1373863, 1213660, 1219895, 1236901, 1039402, 1012243, 908436, 1362914, 1539580, 1472997, 1192935, 1005998, 1103253, 1038845, 972311, 1276294, 1475267, 1345915, 799779, 941892, 1237077, 1024467, 909155, 1089518, 1307429, 1179411, 1271472, 1129914, 1053854, 871352, 1130214, 1232256]
2435A232256r5497n4140J25669M2743J02682J04139j50812l8864J97196L46521
2425A811893l3321m61679n3733J69216m460k48554K24135K03217J0715n1437l00148
2414A265844j72484J06246L50484L5818j17810o0373J5546N4901q6441p8034j42395
2403A171302Q6097J52610P139k09796K06830L57530J14689L4927j30420L0031
2393A820939n2857R4981K3K27431L94898L73379l5484p5203K42450M66538L25230
2382C782325O72935J267639O49690k97698q7624K55973L76122J20130M45952J067312
2372H252756K135405K887742M660652Q051321J4474768K0468600K7351534J4447392
2364A02730170r215281j5199939j3874148j2863940j0698649p812009n951302
$$ y = [1232256, 1136759, 1082619, 1208288, 1251031, 1353713, 1457852, 1307040, 1268176, 1465372, 1811893, 1778572, 1316893, 1263160, 1432376, 1427916, 1179362, 1403497, 1606714, 1617429, 1565992, 1265844, 1093360, 1199606, 1550090, 1585908, 1468098, 1407725, 1423271, 1478172, 1391731, 1313697, 1171302, 1257399, 1410009, 1417148, 1207352, 1414182, 1771712, 1886401, 1921328, 1790908, 1820939, 1768082, 1863063, 1863086, 2090517, 2485415, 2858794, 2823310, 2748107, 2990557, 3457095, 3782325, 4455260, 5722899, 6372589, 6074891, 5987267, 6243240, 6619362, 6739492, 7185444, 8252756, 10388161, 13275903, 17936555, 25987876, 40462644, 60931244, 88282778, 102730170, 93514889, 78314950, 64440802, 51576862, 40878213, 33066204, 27114902]
2357B7114902m732784l366956k591829k458298j676952l83337J3922k83349j143564
2348A0491755j079615j069143o18271k59168m02505l57516l59181k11038m35545
2339E699773r7451m84781k55049j14941Q4820j44580l88709o4306j01736p1354
2329D061686K28821m27617k50660k46782K26726n66l22406k59065m7922K3815
2319B986030n4663k63084k78920j04071J38889L49614j87904M3228k19274j0750
2309B399095Q357J93494o4234m24097o6314L51640L49194P6910p8255k42917r4035
2298B408838k68947R1103j46503K08148Q4834M1824n9503m46624l85793j21609
2288A405768K21283M43737o4630j27544q0755K81298J01970k00238j63505J35255
$$ y = [27114902, 22382118, 19015162, 16423333, 13965035, 12288083, 11904746, 11918668, 11635319, 10491755, 9412140, 8342997, 7724726, 7465558, 7063053, 6705537, 6346356, 6135318, 5699773, 5602322, 5117541, 4862492, 4747551, 4832371, 4687791, 4299082, 4234776, 4133040, 4061686, 4290507, 3862890, 3612230, 3365448, 3592174, 3591608, 3269202, 3010137, 2962215, 2986030, 2931367, 2668283, 2389363, 2285292, 2424181, 2773795, 2585891, 2629119, 2409845, 2399095, 2407452, 2600946, 2536712, 2112615, 2046301, 2397941, 2747135, 2824045, 2745790, 2502873, 2408838, 2139891, 2230994, 2084491, 2292639, 2377473, 2419297, 2359794, 1913170, 1527377, 1405768, 1627051, 2070788, 2006158, 1878614, 1797859, 2079157, 2181127, 1980889, 1817384, 1952639]
2278A952639j84120k31307K8356L32546J2966k89920o8108J53407L48628r6894
2268A958193o9616n9084k6905l24319l42460J44748N41299L81338K8956j14241
2258B117909k3247j3683j70319k57953l17945M9966m2423K03017J20456k92420
2248A373358J45406q4416r2129k67702n0099L37808k18028O3535Q6611J25712
2238A420056j9956k85842j69229r6318M05790M93627q0098k55771j79130l27920
2228I05209K43376R0981N01902j60952l86580r0234Q1061K13117r8088j01407
2218A198385l05783K37505O61909O2296j46118j13499J73325J93252m47652k00043
2208A313577l29722n2445M91225M37821L1011r61677j15870L22625L22395Q6494
$$ y = [1952639, 1768519, 1537212, 1565568, 1898114, 1911080, 1621160, 1553052, 1706459, 2055087, 1958193, 1888577, 1829493, 1802588, 1478269, 1135809, 1280557, 1821856, 2203194, 2232150, 2117909, 2094662, 2080979, 1910660, 1652707, 1334762, 1384728, 1342305, 1545322, 1665778, 1373358, 1518764, 1434348, 1342219, 1074517, 1024418, 1362226, 1144198, 1207733, 1294344, 1420056, 1400100, 1114258, 945029, 848711, 1254501, 1748128, 1668030, 1412259, 1233129, 905209, 1148585, 1239566, 1741468, 1580516, 1193936, 1103702, 1184763, 1397880, 1299792, 1198385, 892602, 1130107, 1792016, 1854312, 1708194, 1594695, 1768020, 1961272, 1513620, 1313577, 983855, 931410, 1422635, 1860456, 1891467, 929790, 813920, 1136545, 1458940, 1545434]
2198A545434m77074j13018K53136j57745j68618k49526N96140K90496m86803k57293
2188G75129Q7688J99958J53418K21021J33877o79173j83066j89532O9039N80627
2178A168986K22264N29807o15806J59634M7584l07279j3174M2256L6707l75846
2168H95133j86205L59387N072J31116q7060n4885k1938j6157J917N884N9673O9301
2156A161238j20024J87876O5908j16204j21838O9420K8095n08176K10670K16174
2146A073139J05763L85552l86280k08549l2053Q4958J17882m38851l267Q873J25810
2135H32977r888Q412K30053j35453p0586O2820P426M351k23675J39216K19060
2124A064713J28479J41528o539k67815k88588K6095K46454K43195M36219o8025
$$ y = [1545434, 1068360, 955342, 1208478, 1050733, 882115, 632589, 1228729, 1519225, 1032422, 775129, 862817, 1062775, 1216193, 1437214, 1571091, 891918, 708852, 519320, 588359, 1168986, 1391250, 1921057, 1305251, 1464885, 1512469, 1205190, 1192016, 1234272, 1270979, 895133, 708928, 1068315, 1073387, 1204503, 1117443, 1062558, 1040620, 1024463, 1026380, 1032264, 1091937, 1161238, 1041214, 1229090, 1294998, 1178794, 1056956, 1126376, 1154471, 646295, 856965, 1073139, 1178902, 1564454, 1178174, 969625, 937572, 1022530, 1140412, 701561, 698294, 707167, 832977, 823089, 831501, 1061554, 926101, 855515, 918335, 925761, 930112, 706437, 845653, 1064713, 1193192, 1334720, 1328181, 1060366, 771778, 797873, 1044327, 1287522, 1723741, 1655716]
2114A655716l27927N1719n7939q2105j03086k58368N4004r1530J70337J76087
2104A186908R7882m6248l09518j14207K7491R1806J72221M78547N2306m27917
2094A209271K72839P8033j18445l47690L96191l8435l89740k54445K68264n0832
2084A025011P2025J84826r5655j39430k96766K11808m9247J35532J77014l66944
2074H58174k88153J71371K81379L05397l04261q9500o814R3249N4588r792l14598
2063G51040N0626m2132j18304l05881L09784R9190K89378L15382n5537m73451
2053H20095j87984J03259K15488J1049K39663Q3832j31698J39478j207K8162j24458
2042A195679K57519M0969n66186l31882p8381L66946K54712K34258j74539m09551
$$ y = [1655716, 1327789, 1379508, 1321569, 1239464, 1136378, 878010, 932014, 840484, 1010821, 1186908, 1284790, 1238542, 929024, 814817, 842308, 934114, 1106335, 1584882, 1637188, 1209271, 1482110, 1560143, 1441698, 1094008, 1490199, 1451764, 1062024, 807579, 1075843, 1025011, 1097036, 1281862, 1186207, 1046777, 750011, 961819, 912572, 1048104, 1225118, 858174, 570021, 741392, 1022771, 1328168, 1023907, 934407, 927593, 1020842, 1075430, 1065638, 751040, 801666, 759534, 641230, 335349, 645133, 744323, 1033701, 1349083, 1293546, 820095, 632111, 735370, 950858, 961907, 1201570, 1285402, 1153704, 1293182, 1291975, 1320137, 1195679, 1453198, 1494167, 927981, 596099, 517718, 884664, 1139376, 1373634, 1199095, 789544]
2032G89544M0705L94775R7035m91377j7357J33758m142Q4902L82063J8850K75222
2021A703978k38171o17169n00261j21520O93508K26768J21212m65846m58025L77076
2011G21550M24501M1458j82322k64462k10983o356K33531K7597j10746M81882
2001A155650L63279J681l83487j57500J26398K48460J03724l88409j73338K8996
1991I25454l03321K40546K81851O0560k72905j7100L21111k39325k40104J09214
1981H65981k51125L8036J66245p3922j08976L60819J13130l14496k17051J06198
1971F84839J88343q896k31238l3104K18453L28149J50845m04456J2890j05861
1961G99964M1898p7228R2536K09190k79661r8651k8506R1064K56215m6670N4505
$$ y = [789544, 830249, 1225024, 1322059, 830682, 813325, 947083, 942941, 1027843, 1409906, 1428756, 1703978, 1465807, 848638, 348377, 226857, 920365, 1147133, 1268345, 802499, 344474, 721550, 1146051, 1187509, 1005187, 740725, 529742, 523386, 756917, 784514, 673768, 1155650, 1518929, 1520610, 1137123, 979623, 1106021, 1354481, 1458205, 1069796, 896458, 925454, 622133, 862679, 1144530, 1205090, 932185, 915085, 1236196, 996871, 756767, 865981, 614856, 652892, 819137, 745215, 636239, 997058, 1110188, 795692, 578641, 684839, 873182, 864286, 633048, 599944, 818397, 1146546, 1297391, 892935, 905825, 799964, 841862, 764634, 857170, 1066360, 786699, 688048, 659542, 750606, 1006821, 960151, 1014656]
1950A014656j37853r0014J76699j407J219j38364M17L52232J22908K08562k55793
1939A253262k30023j65139j30143o2109j37084K84244L81958q1247o25963l10217
1929A77539L9452O40649j600N825m02575J36578J189j69500J98106M78190J23513
1918A227366j77190N2295J54550l01959l18739k41887K17073K78491M07606k34962
1908A062644m31374J41092M08935r0752k42060j32645Q2784O493q0690J08143
1898H32570m1733L71881m3146k69818j14282J33968r8239L1667r369K02922k4073
1887I72348j56761r4237J73952M314k52678l5106J94939K96224R0777r5842N7307
1876A155237j83389q2201j79264j43458k74601J65251o6415L71220j37069R3589
$$ y = [1014656, 876803, 786789, 963488, 962081, 963300, 824936, 825353, 1177585, 1300493, 1509055, 1253262, 1023239, 858100, 727957, 665848, 528764, 813008, 1194966, 1113719, 487756, 177539, 216991, 857640, 856040, 861865, 459290, 595868, 597057, 427557, 625663, 1103853, 1227366, 1050176, 1102471, 1257021, 955062, 636323, 394436, 611509, 890000, 1297606, 1062644, 631270, 772362, 1181297, 1090545, 848485, 715840, 798624, 805117, 724427, 832570, 790837, 1162718, 1119572, 849754, 735472, 869440, 771201, 802868, 793499, 996421, 972348, 815587, 721350, 895302, 899616, 646938, 611832, 806771, 1102995, 1193772, 1097930, 1155237, 971848, 889647, 710383, 566925, 292324, 457575, 391160, 762380, 625311, 718900]
1866G18900K75475k0406l27353L1167j0694j20381j84300M26217P2145j8757l9173
1855H02840m4796k53180K46091Q579O0170j4257l6222k07477L8728M79625L54116
1844A434217j98983l36976j05188j85547M1549j1526R9297j88470K17118j18131
1834F47360K39448J44704J36692l65618j35744J72083R7050q0688j9074r9845
1824G36368j06385M64429K93727o53760l30336J84371M48415L5276Q294k44917
1814H35482m11966j7992M14139O9762K15189J22179j23573k41649L19534Q7422
1804A268527m36683l11700K03889M8068J13289n8246j71736M29239J44297l10906
1794I18038k77479O6730K64507O281K66952p9433n84682j85678L07317J75130
$$ y = [718900, 994375, 973969, 646616, 677783, 667089, 546708, 362408, 788625, 860770, 842013, 802840, 758044, 504864, 750955, 759534, 819704, 805447, 769225, 561748, 600476, 1080101, 1434217, 1235234, 898258, 793070, 607523, 649072, 637546, 736843, 548373, 765491, 647360, 886808, 1031512, 1168204, 802586, 666842, 838925, 935975, 855287, 836213, 736368, 629983, 1094412, 1388139, 734379, 404043, 588414, 1036829, 1072105, 1080399, 835482, 423516, 405524, 819663, 889425, 1104614, 1226793, 1103220, 861571, 1181105, 1268527, 831844, 520144, 724033, 772101, 885390, 827144, 655408, 1084647, 1228944, 918038, 640559, 707289, 971796, 978077, 1245029, 1165596, 580914, 395236, 702553, 877683]
1784H77683J02552n3680l70529k50652P0069J98308l13627K75285N01398j34534
1774I02273j51103J36637L52185k1948j6078k5172l9972j84863j19978J12389
1764I44370M9815k12623n2112n6058o4249k22008J8901L16700N8586q9557l6920
1753F54845M8312k85729l3754J56105M03984R8047Q4909j94472q0326j85430L46624
1742A013115j41749j95735j10404O5771K16380k88844m4958J05635k0039P8766
1732F77938l59457K3859K81341N1835K32773k28421L36652N5121k71871j29149
1722F70621J72363K78757J83371m92055m8827q0889O2741o10289n4035N28802
1712F10560J48372N9951Q5932K81313j87479k99052k74605m7133N6246L57676
$$ y = [877683, 980235, 926555, 556026, 305374, 375443, 573751, 260124, 535409, 1036807, 902273, 751170, 887807, 1239992, 1218044, 1201966, 1176794, 1136822, 951959, 831981, 944370, 994185, 781562, 729450, 673392, 609143, 387135, 406036, 722736, 781322, 691765, 654845, 703157, 417428, 383674, 539779, 943763, 1041810, 1126719, 932247, 851921, 666491, 1013115, 871366, 675631, 565227, 630998, 847378, 558534, 513576, 619211, 599172, 677938, 318481, 342340, 623681, 675516, 908289, 679868, 1016520, 1071641, 799770, 670621, 842984, 1121741, 1305112, 813057, 764230, 683341, 746082, 135793, 81758, 610560, 758932, 818883, 904815, 1186128, 998649, 699597, 424992, 377859, 434105, 791781]
1702G91781L29932J98964o14230k07241j83097L46233K42989J566r3733k87314
1692E25850n4615N2009j26593j49880j37799J68407j42099L41699N14308J44576
1682A135863k75558m43032k36971K5923R8688M93429O7069J4954l6080k46877
1672E97408J14193n3246L80082j61899j95556K44073n6944j49410J93349J69625
1662A081675k11362o24148O7058K30395K62479p4093j50267J07166k56177j02035
1652C30691k58091P07399R41563n3695l95020m34245k62686j11031q7343L92974
1642G70516J99936K64904J46648o97830j84473j06108J42442J15856j59722j83371
1632C08798m91566M67181L07603J2893L75908J68201p05m55046N8939J6624l86124
$$ y = [791781, 1121713, 1320677, 706447, 499206, 316109, 662342, 905331, 906897, 813164, 525850, 471235, 523244, 396651, 246771, 108972, 277379, 135280, 476979, 991287, 1135863, 860305, 417273, 180302, 206225, 304913, 798342, 865411, 880365, 844285, 597408, 711601, 658355, 1038437, 876538, 680982, 925055, 868111, 718701, 912050, 1081675, 870313, 246165, 313223, 543618, 806097, 732004, 581737, 688903, 432726, 330691, 72600, 779999, 1721562, 1667867, 1272847, 838602, 575916, 464885, 377542, 770516, 970452, 1235356, 1382004, 684174, 499701, 393593, 536035, 651891, 492169, 308798, -182768, 284413, 592016, 604909, 980817, 1149018, 1148313, 693267, 752206, 768830, 382706]
1621C82706K73207Q4971n1653j63964k85325L05441P8681L40924K7664n64421
1611D28231j47083L6166J54626K66144J46611J69095k32994J0084l30283k47241
1601B53356J27955O3621K19515m4599J02207L8945m2536M36643j6894l82021m37389
1590C18803K09032N53174j04246j67207l84597k51212R08293O51847L15302o45191
1580A403998n90217k88304n0806O1692J17680J98173J39434O3519r1140n5690
1570I08339n8563O8175n7999J0776l58001j01943O9758j0521K05765Q4441J64096
1559I24323n9455K69838j2487n79995l18197O1909L65015L30294l5950O9503q0930
1548I33868q0444j55490k40454Q3462N1978o6079J70680P1961l17499q3781M77751
$$ y = [382706, 655913, 740884, 689231, 525267, 239942, 545383, 624064, 964988, 992652, 428231, 281148, 317314, 471940, 738084, 884695, 1053790, 820796, 830880, 500597, 253356, 381311, 444932, 664447, 619848, 722055, 761000, 718464, 1155107, 1138213, 756192, 318803, 527835, 1081009, 976763, 809556, 424959, 173747, 1082040, 1733887, 2049189, 1403998, 813781, 525477, 474671, 536363, 654043, 852216, 991650, 1055169, 964029, 908339, 849776, 917951, 859952, 870728, 512727, 410784, 480542, 470021, 675786, 760227, 924323, 864868, 1134706, 1122219, 542224, 224027, 285936, 650951, 981245, 945295, 1014798, 933868, 853424, 697934, 457480, 540942, 592920, 526841, 697521, 769482, 451983, 368202, 845953]
1537H45953L30739k11039k33387K95K44953k17308J41799j03401M3976n9256K34844
1526A018168J38539K00751k02113j85936l60166P4869P2513k62623j77309j39309
1516A77384M22523N73509k50004m77315l04222M51251J90755j22506k75068J72814
1506E59121J39236O9291L73631l53547m59430J61012M91003M2389j42619q09438
1496G0649J40864L33689N16815l33015l95924L56666M17613j69510l44540k3871
1486E69436M5707K68168K38054J77819k25434K46227l66702n13214j3008K27885
1476F54938P4782Q7994J96623j31348k38013M3414k467J19427l15747K17947M5667
1465G53217k49167N4686L46777K69076K32457j55448n13053l09655J4391M16024
$$ y = [845953, 1176692, 965653, 732266, 732561, 977514, 760206, 902005, 798604, 842580, 783324, 1018168, 1156707, 1357458, 1155345, 969409, 609243, 684112, 756625, 494002, 316693, 177384, 599907, 1173416, 923412, 446097, 141875, 593126, 783881, 661375, 386307, 559121, 698357, 767648, 1141279, 787732, 328302, 489314, 980317, 1022706, 880087, 70649, 211513, 545202, 1062017, 729002, 333078, 689744, 1107357, 937847, 593307, 569436, 615143, 883311, 1121365, 1299184, 1073750, 1319977, 953275, 440061, 427053, 654938, 729720, 817714, 1014337, 882989, 644976, 688390, 685923, 805350, 489603, 707550, 753217, 504050, 558736, 905513, 1174589, 1407046, 1251598, 738545, 428890, 443281, 859305]
1455H59305r8104J10720j398o8465k64245K38746L44306j0848k62515m09000j32277
1444C06225J92248J63457K0111o9714M34708L2691j91760k21862q3604J29169
1434G11669K60884k39682j30351j84281N3154K59702r2413N36493K15962k83444
1424A107693m85111l66163O3317L52824J75876J46755K04749k11579q8436q8212
1414H11713N8749j38366J18j17052j13193J50611J16328J10031j89038q6350r1105
1403E12446L1335M91882M41823j57642o97729l77170r1527K10770K95616K30363
1393H90167m7564K28854L559l60290l6213r6104m6243K5119L67336K29111j04157
1382A053575m27852o0639Q4487k64627J01709j3010j63779K26011J54310l1124
$$ y = [859305, 761201, 871921, 870523, 802058, 537813, 776559, 1120865, 1110017, 847502, 438502, 306225, 498473, 661930, 682041, 612327, 1047035, 1079726, 887966, 666104, 582500, 711669, 972553, 732871, 602520, 418239, 471393, 731095, 638682, 1175175, 1391137, 1107693, 622582, 256419, 319736, 672560, 848436, 995191, 1199940, 988361, 899925, 811713, 870462, 732096, 732214, 615162, 501969, 652580, 768908, 878939, 689901, 603551, 512446, 543781, 1035663, 1477486, 1319844, 622115, 244945, 153418, 364188, 659804, 890167, 842603, 1071457, 1075016, 714726, 678513, 582409, 536166, 561285, 928621, 1157732, 1053575, 625723, 565084, 649571, 384944, 486653, 473643, 309864, 535875, 690185, 659061]
1372F59061k52450r9699L39974J2801J18256O4033j81066O1920j76418K38751
1362G85163J04677j22089L7690p2100M49788P1369k93206l08077p1705L0880K66881
1351H79271J5931L9692k61445Q1980j87601J29141L41815k5343N6939k34884J01722
1340I37218M6155l614j15573j10512J70015J28261k76486M6126p8554P2510k90101
1329E25445O5124l1228k19077j5094R7769j75275R3133R9329L57313k59926J77199
1318G14712l2292k05775P5003l8808k75442J1739J91574L62390j63620l5761R6019
1307F99739j00727J38023k48966j35413M7154J43430J43972J50085L19657k70566
1297H86388l05483p7446M36555K22891O0973k02815m18569o2745J04944k6729
$$ y = [659061, 406611, 306912, 646886, 659687, 777943, 841976, 660910, 722830, 546412, 785163, 889840, 767751, 805441, 733341, 1183129, 1254498, 961292, 653215, 581510, 612390, 879271, 895202, 934894, 673449, 755429, 567828, 696969, 1038784, 1013441, 1070380, 835496, 937218, 983373, 979759, 864186, 753674, 923689, 1051950, 775464, 821590, 743036, 815546, 525445, 590569, 559341, 340264, 325170, 422939, 247664, 340797, 440126, 797439, 537513, 714712, 682420, 476645, 551648, 512840, 237398, 249137, 440711, 803101, 639481, 603720, 699739, 599012, 737035, 488069, 352656, 399810, 543240, 687212, 837297, 1156954, 886388, 580905, 503459, 940014, 1162905, 1223878, 1021063, 602494, 539749, 644693, 617964]
1287F17964j25002j37092J21967L19945Q6555m23876p37965J9328L74838M80779
1277E97441m0227K84106J34324O0006l90276k08616L2759O88294q8216j70749
1267H98846m27834j45873P5411L10997L90441l91057m11397J33254j48222l45775
1257f1209j40516M72519M52693J702L7072L7393L7485m6560l38593q3594k5245
1246C43147K41844L49602j43942J0866Q9153J36521j64215m63011j30296P9009
1236C48678M99422Q4333j86920l3790p749p287m06871R5042J98932M5765L3200
1225F62755J53809r5469k83031L5144M23811k35062K29473L67094l36194n16455
1215D05875k36634L28912M32942l9695Q2236j55662j85529k55833k83222L62790
$$ y = [617964, 492962, 355870, 477837, 797782, 884337, 460461, -277504, -258176, 116662, 597441, 557214, 841320, 975644, 1035650, 645374, 436758, 469517, 1157811, 1069595, 898846, 471012, 325139, 400550, 711547, 1101988, 710931, 299534, 432788, 284566, -61209, -201725, 270794, 723487, 725189, 762261, 799654, 837139, 790579, 451986, 368392, 343147, 584991, 934593, 790651, 801517, 890670, 1027191, 862976, 399965, 269669, 348678, 848100, 932433, 745513, 711723, 703974, 696687, 289816, 384858, 583790, 629555, 662755, 816564, 721095, 438064, 473208, 897019, 661957, 891430, 1258524, 922330, 405875, 169241, 498153, 931095, 891400, 973636, 817974, 632445, 376612, 93390, 456180]
1205D56180K27180j53757l98510J09784K98976n8925M9510J62116j61274j35631
1195C95649K73455K96339j25588J56098j81160n02018j83720M38641N0827j23483
1185D95040m4204K24120J00619k85395J33337j51638P3343o5436p7767r419J74272
1174E66872R0393Q4435n0745N7452K13229K1206n2987k51867j67334J03630R8867
1163G13151J33673L69605o8181j60455k33833l45738m16359L47070J92567O5781
1153E97281j49429J69298J28849k27434K52216j09815K2671J6515j68714k06333
1143C25105P0858o3967K45095l9609J03777j23787m13333o114L15460J30648L02315
1132H46448j97540j87348J8038q2993o8024M08865j3526J02822r2651J87j23291
$$ y = [456180, 683360, 529603, 131093, 240877, 539853, 480928, 530438, 692554, 531280, 395649, 669104, 965443, 839855, 995953, 814793, 312775, 129055, 567696, 618523, 495040, 450836, 674956, 775575, 490180, 623517, 471879, 545222, 479786, 402019, 392600, 566872, 657265, 741700, 690955, 748407, 961636, 982842, 929855, 677988, 510654, 614284, 713151, 846824, 1216429, 1148248, 987793, 753960, 408222, -8137, 338933, 531500, 597281, 447852, 617150, 745999, 518565, 770781, 660966, 683637, 700152, 531438, 325105, 395963, 331996, 577091, 537482, 641259, 517472, 104139, 98025, 413485, 544133, 846448, 648908, 461560, 479598, 396605, 328581, 737446, 723920, 826742, 734091, 734278, 610987]
1121F10987k52768J82520M62977R0455j63711m19585l08768K44864K98873L66751
1111A112595j55780q8914l2420p3317k79400J06231Q0749K85746k8085j55709
1101G71696n6916P6417j38376Q4443k75333j27519p184K58894n072n192j94082
1090C81776O5594j30382Q5399J55439j43079k79631q0743p0678M5658K84546K65653
1079E79552J90627q3929K2381j31732k45637J67759O8314o6934K794k63423k0388
1068B19384N28703M94367l72984m10647R9300L68487l56346L89112Q7363J4193
1058A060932m04983J86172J71672K55498L095j45540l23980m93735k23282L01235
1048C87084L75370J79085k15420j55580K38685l98031m83925K33531J68970N5126
$$ y = [610987, 358219, 540739, 1003716, 1094171, 930460, 510875, 202107, 446971, 745844, 1112595, 956815, 867901, 835481, 762164, 482764, 588995, 669744, 955490, 927405, 771696, 714780, 791197, 652821, 737264, 461931, 334412, 327228, 586122, 581050, 575858, 381776, 447370, 316988, 402387, 557826, 414747, 135116, 54373, -16305, 29353, 313899, 579552, 770179, 686250, 708631, 576899, 331262, 499021, 567335, 500401, 503195, 239772, 219384, 748087, 1242454, 869470, 458823, 558123, 926610, 570264, 959376, 1046739, 1060932, 655949, 842121, 1013793, 1269291, 1272386, 1126846, 802866, 309131, 85849, 387084, 762454, 941539, 726119, 570539, 809224, 411193, -72732, 160799, 329769, 384895]
1038C84895l23832P7017N32968L55328J45549m12146o25448l47556L24538M52343
1028E63656L6669m95703k5885O1630J71281j16330P5783k18243J00354j5483J88448
1017C26177k50836j22262L69841N15339J63623o7250j23501J02427l5877j18917
1007G58764K2110M9472j281M0561k33199N4597P9677J60778j86410l77622j96242
996A71205J8142P80493Q3821m83973l84439j35898M07140J97407J55027j61532
986F47393Q404M142K2308n52209O8689J52477K17189m6164l86844J7852J33651
975B86888K52930J38279j10754j85020k73317J28948N03064k20758R9608M05070
965A024938Q1250m16003M2435j465M1177j60793K54104l92878l33245J28255N02713
$$ y = [384895, 61063, 138080, 671048, 1026376, 1171925, 759779, 134331, -213225, 111313, 563656, 600325, 104622, 78737, 140367, 311648, 195318, 271101, 52858, 153212, 137729, 326177, 75341, -46921, 322920, 838259, 1001882, 934632, 811131, 913558, 877681, 758764, 780874, 830346, 829065, 869626, 636427, 691024, 770701, 931479, 745069, 367447, 171205, 189347, 969840, 1053661, 569688, 185249, 49351, 456491, 653898, 808925, 647393, 655797, 659939, 682247, 130038, 198727, 351204, 568393, 522229, 135385, 153237, 286888, 539818, 678097, 567343, 382323, 109006, 237954, 741018, 520260, 619868, 1024938, 1106188, 690185, 732620, 731155, 772332, 611539, 865643, 472765, 139520, 267775, 770488]
954G70488l06663j00416K17718J61945n14934l02858J72722O74256j54099k92662
944C25497L3954K32750j76744m58604K67024K07743J45353j65150P1153K46537
934G29513l8149j99919Q2736l2148j39035J33598K28930q9810o4634J42419j67672
923E85829m37389M3812M20936M013m38848l3464k3783p7960L99606J29946K24968
912G97666o0200q8777r1890k3001j50638k77569q1983M8425j69418n3088K90737
901A40264J26000J59755j11190Q4437p7185o2324K40957K03870j39945k12452
891C52187k97418L31050L33941O8203o70477l06791L18255K37451k48842J76345
881B93904L71234K03445k34194J96245J81539n37679j81264L03575J10024p0833
$$ y = [770488, 463825, 363409, 581127, 743072, 228138, -74720, 98002, 772258, 618159, 325497, 359451, 592201, 415457, -43147, 223877, 431620, 576973, 411823, 482976, 729513, 691364, 491445, 574181, 542033, 402998, 536596, 765526, 675716, 611082, 753501, 585829, 148440, 192252, 613188, 617201, 178353, 144889, 121106, 43146, 442752, 572698, 797666, 737466, 648689, 556799, 533798, 383160, 105591, 23608, 72033, -97385, -150473, 140264, 266264, 426019, 314829, 399266, 322081, 259757, 500714, 704584, 564639, 352187, 54769, 385819, 719760, 787963, 117486, -189305, 128950, 366401, 117559, 293904, 665138, 868583, 634389, 830634, 1012173, 474494, 293230, 596805, 706829, 635996]
871F35996j19571J07147K62539L9135j27926m78476N29128J44261l24006m61981
861B06246J4015j53492l40964J21654K23962K85296M43212R1993m42338l37165
851A12419j72478l03697j4980M25919L40333M17738L60687k21851k97042l28958
841C18090j19377O5122m3621M79085j24646r4853k80485j36471L401j0610P194
830F2829j10581j91985M188K7423K79017L83367K92520L38968k07724o64660q5674
819A27688K35889J50133r4416j95918R4162L22414L49385M2187l06022j71794
809E53708K29012k99649k58026n2734J51378J74628J0463R6651k7271J31060k7675
798F81545l27193r1383K09364m7371j23660k61423L72184K2538L37727J32182
$$ y = [635996, 516425, 623572, 886111, 925246, 797320, 318844, 847972, 992233, 668227, 206246, 220261, 66769, -274195, -152541, 71421, 356717, 799929, 891922, 449584, 112419, -60059, -363756, -378736, 47183, 387516, 805254, 1165941, 944090, 647048, 318090, 198713, 263835, 220214, 699299, 574653, 479800, 199315, 62844, 66245, 55635, 62829, -47752, -239737, -235549, -208126, 70891, 454258, 746778, 1085746, 878022, 213362, 127688, 363577, 513710, 419294, 223376, 317538, 639952, 989337, 1031524, 725502, 553708, 782720, 483071, 225045, 172311, 323689, 498317, 508780, 605431, 578160, 709220, 681545, 354352, 262969, 472333, 424962, 301302, 39879, 412063, 434601, 772328, 904510]
788I04510J7053l17048j59584K46246R0051J87935j79814l62940K60945J69559
778H56913m55663m88032m9049K82517l8340L59047O8621j48499q9962M6203k68414
767G5342M7985J46430K10331k49811O02866j34784j15272j01850N9742M1348J20515
756G02842j39306k70013J6665Q41469k27997n43210j18731J75267L91487k54911
746E73562K6165j62072N8593J68816j29212n8743J04137J21239Q7310l27933k68849
735A93013l11796L25052J28456r5138L2368J41772Q8241J41307M057N9639M685
724G11656J76282m0480n61471j90187K08042K90829j4840l09294j48913k1186
714A00438J16871J36872p1847j30236k31381j03934L50300J48864j67809P1850
$$ y = [904510, 921563, 604515, 444931, 691177, 781228, 969163, 789349, 426409, 687354, 856913, 401250, -86782, -135831, 146686, 108346, 467393, 536014, 387515, 297553, 343756, 75342, 123327, 269757, 480088, 230277, 833143, 698359, 583087, 481237, 540979, 582327, 702842, 563536, 293523, 310188, 1151657, 923660, 380450, 261719, 436986, 828473, 573562, 599727, 437655, 496248, 665064, 535852, 477109, 581246, 702485, 789795, 461862, 193013, -118783, 206269, 334725, 239587, 271955, 413727, 501968, 643275, 647332, 706971, 711656, 887938, 847458, 285987, 95800, 303842, 594671, 579831, 270537, 121624, 100438, 217309, 354181, 282334, 152098, -79283, -183217, 167083, 315947, 148138, 219988]
704B19988L50499J18348K15812Q606J18881j80688J9796L9535n5891r3608Q9070
693H50348o9849q601o3803n296Q407J20617N2156l23177k86676j3929M9006j75963
681A33240m9938J33812K77664j06166j31911M9825K77599j24294m26047k86237
671b52453M94655L86791J66629j3658k29708l01169o7095J10904J59921j16541
661C38276o4753j88551L56039K93467n0708k19717l73687j13388J08411L73914
651D59303J72170j11844P392J47828k20751j42839J19664j7397q5091J55285K52348
640G36068r0339k46705m5240l9606j15220n645K37454J78761J19352J48784l9650
629H38014l9861J75019j13901k30708j78124M1336k80689P9265K99099r2074k98135
$$ y = [219988, 570487, 688835, 904647, 913253, 1032134, 851446, 871242, 910777, 854886, 761278, 850348, 780499, 771898, 708095, 702799, 711206, 831823, 883979, 560802, 274126, 260197, 309203, 133240, 83302, 217114, 494778, 388612, 256701, 306526, 584125, 459831, 33784, -252453, 242202, 628993, 795622, 781964, 552256, 251087, 183992, 294896, 454817, 338276, 273523, 84972, 441011, 734478, 683770, 464053, 90366, -23022, 85389, 459303, 631473, 519629, 527021, 674849, 454098, 311259, 430923, 413526, 328435, 483720, 736068, 645729, 399024, 353784, 314178, 198958, 193313, 430767, 609528, 728880, 877664, 838014, 798153, 973172, 859271, 628563, 450439, 491775, 211086, 290351, 589450, 497376, 199241]
618A99241o1248J89422N6479j2921K06485j87370k87249L98623N74925r6209k91778
607F88400k55503J80422l2929J01890k26576O129J72013j62485l27080J6432K21924
596C82637J00303k94610K06317N4444k95891j74362q9435J87676J98711K54753
586E30543k04765k03993K20455M04589J24326n7754k19122k1439M5951R8843k3387
575F94247n4625K0017j67880k44290Q0676R182L34130l57011J06526j89663K26380
564D57689K40699j15241N24O2102J99099q2171k97786p9886J04651L94211j31883
553G52008l82541j25196K41850K28114N2987K21572J73786l66071k08608M7876
543F35777J20861j80188m86759J12238K00745J04044k05684k98836J53014l8674
$$ y = [199241, 137993, 327415, 383894, 370973, 577458, 390088, 102839, 501462, 1076387, 980178, 688400, 432897, 613319, 580390, 682280, 455704, 461833, 633846, 471361, 144281, 160713, 382637, 482940, 188330, 394647, 449091, 153200, -21162, -110597, 77079, 275790, 530543, 325778, 121785, 342240, 746829, 871155, 813401, 594279, 572840, 618791, 717634, 694247, 639622, 659639, 491759, 247469, 328145, 337327, 671457, 314446, 420972, 231309, 457689, 698388, 583147, 583671, 645773, 844872, 762701, 464915, 385029, 489680, 883891, 752008, 369467, 244271, 486121, 714235, 767222, 988794, 1162580, 796509, 587901, 635777, 756638, 576450, 89691, 201929, 402674, 506718, 301034, 2198, 155212, 116538]
533A16538j4097J5140j69449K64469L8219J74586J30337P4020K81132k23596J3588
522G00887j2944m6972k52834k16586J84013J01170K56181j98507n1730k18670
512B44008M3494k61389P4755Q6695Q7790k70430R9317L72905J48878J11893n7958
501F79958k24173j79989K60630L45135l18075k19069r2123L17703R2346L872o244
490F59971m53720M19757K1446j94591o3634L67174K28971k72242n05287r5182
480A12663k44195K34519J53739K70610r0704m6446M9126K56678l4414j79561l29859
469A52156k73689p5685m3999L04947N0069L62917L9225Q4780l09341j6627o436
458B68317j14934J16136J0575K9604j39995J76066M36000j59050m41576j05286
$$ y = [116538, 102441, 117581, -51868, 212601, 250820, 425406, 555743, 629763, 910895, 687299, 700887, 687943, 640971, 388137, 171551, 355564, 456734, 712915, 514408, 462678, 244008, 287502, 26113, 100868, 187563, 275353, 4923, 104240, 477145, 626023, 737916, 679958, 455785, 275796, 536426, 881561, 563486, 344417, 252294, 569997, 662343, 666215, 659971, 206251, 626008, 647454, 452863, 389229, 756403, 985374, 713132, 207845, 112663, -131532, 102987, 256726, 527336, 436632, 390186, 439312, 695990, 661576, 482015, 152156, -121533, -197218, -241217, 63730, 113799, 476716, 515941, 600721, 291380, 274753, 268317, 153383, 269519, 280094, 309698, 169703, 345769, 781769, 622719, 181143, 75857]
448G5857L35422P5918k00858k06906j3563L53786J09747j6538m9505o7322Q1201
437D77239l2813j05184r3910N9157J0298O5203O4973O95422j99598l26657m25971
426A88159P3646K02981L12491k28125l98943n45819M76809M53917Q6922k64435
416C57603j23519N14602M90853j91934r27550Q3825J21268J25218l93676J81207
406B37897M72845K82238k30307m57155k17260K27501R0404m4119n331Q1012J15976
395E53701Q4J53653j95517l71207j8255L2765j1386l1614L23601K01095L5820
384F72740p8456r2230j23967o2304K16986l0419k19944J03691L48732K54772j94137
373G95464k01142p8675K52000k90928j91014k25749K25862k60869R8309J76998
$$ y = [75857, 411279, 487197, 286339, 79433, 65870, 419656, 529403, 512865, 463360, 396038, 477239, 444426, 339242, 245332, 304489, 314787, 379990, 444963, 1140385, 940787, 614130, 188159, 261805, 464786, 777277, 549152, 150209, -395610, 81199, 535116, 622038, 357603, 234084, 748686, 1239539, 1047605, 120055, 203880, 325148, 450366, 56690, 237897, 710742, 992980, 762673, 305518, 88258, 315759, 406163, 362044, 356713, 437725, 553701, 553785, 707438, 511921, 140714, 122459, 155224, 143838, 112224, 435825, 636920, 672740, 594284, 502054, 378087, 315783, 532769, 502350, 282406, 386097, 734829, 989601, 795464, 594322, 515647, 767647, 476719, 285705, 59956, 285818, 24949, 123258, 300256]
363C00256J96640n32711k9203J07310p0519j47648L66167L72080J27890k9552
353F60710o9032j43627J46K82155j84852J90344N3047P0447j99223r5982O9466
342F33599K85221J18370k65052l87780n3318J30316M0704k17476J2810o9540j8000
331B09854j36617L36820K78684R6155l08252k06530j10368J23775J42763j5436
321D10848O0316O4992J98290k65139k26687K51524j93082k87865k01706M34762
311B46253J23170n3172M2545n5884q1695j29560p434K43347Q7774n0620j49803
300B14921m7124K902j25184K65852K42430j4422k52347K5872j41898r1645j2585
289F6772J58131P6075K41526M41599m54471l70499J0710P62980j03409l96215
$$ y = [300256, 496896, -35815, -65018, 42292, -28227, -175875, 190292, 562372, 690262, 660710, 591678, 448051, 448197, 730352, 545500, 735844, 788891, 859338, 660115, 564133, 633599, 918820, 1037190, 772138, 384358, 331040, 461356, 502060, 284584, 297394, 227854, 209854, 73237, 410057, 688741, 784896, 476644, 270114, 159746, 283521, 426284, 410848, 471164, 536156, 734446, 469307, 242620, 494144, 301062, 13197, -188509, 246253, 369423, 316251, 358796, 302912, 221217, 91657, 84223, 327570, 415344, 364724, 214921, 167797, 170699, 45515, 311367, 553797, 539375, 287028, 312900, 171002, 79357, 66772, 224903, 300978, 542504, 984103, 529632, 159133, 169843, 932823, 829414, 433199]
279D33199k14689M26036L6059n34590l49621R0L82856k15687p4922K88307M36917
268F13955K14835k83183j72356j18221J05847r13K10649J32918J00702R1265k47751
257F47747l01448k02397L60533J6423l63374l07860P1008J81986L59284K16212
247F78114K02951l41471k07286l57359k48195J10852L05546j79082j49370K64682
237G9382Q9150j32620L30737L77534j87955m05632k77101l82957J01922O97650
227B90110O03338k62506r8511L41266M3131k55389l17602l0370r1560J85386J63497
216E70790L6526n2240j30373J45766m0762l21613m26002K42077M91155J45297
206F60621q1778k99246K674L3922J64190j81148J72528K58637K74024m16380k57416
$$ y = [433199, 218510, 644546, 680605, 146015, -203606, -203516, 179340, -36347, -111269, 177038, 613955, 828790, 545607, 373251, 255030, 360877, 359964, 570613, 703531, 804233, 895498, 647747, 346299, 143902, 504435, 520858, 157484, -150376, -79368, 102618, 461902, 678114, 881065, 539594, 332308, -25051, -273246, -162394, 143152, -35930, -185300, 79382, 168532, 35912, 366649, 744183, 556228, 150596, -126505, -509462, -407540, 290110, 893448, 630942, 532431, 873697, 916828, 661439, 343837, 313467, 221907, 407293, 570790, 607316, 555076, 424703, 570469, 529707, 208094, -217908, 24169, 515324, 660621, 578843, 279597, 282271, 316193, 480383, 299235, 471763, 730400, 1004424, 588044, 330628]
195C30628j52932r9917k20190M2198K61549P3764q905p4085J05305J34719J8698
184D10832k83254k72629j6566K00469J1950L87729L18432J65023m15626k1328
174D85032R6871R0649l0277j08462k69638K05205n702K2380j08963J76533L12817
163H66445p8261j19991j44496j20971j10858p8088J44374J6989K24696O1664l0782
152F30721j76149k86179J48378J42968r9110n21072r4067N72735N36974O8920
142I24119l23499m12000m8347j02254M0037J10217K57763J69580k75860k21478
132A18278L30560K42032q3826m21810j8019J94123J74253j92533k1511L57870
122F79417q2525l72730R8121P2726L55125k7730j81777m39662l10039J46092J96271
$$ y = [330628, 177696, 77779, -142411, -100213, 161336, 235100, 226195, 152110, 257415, 392134, 410832, 127578, -145051, -161617, 38852, 50802, 438531, 756963, 921986, 506360, 485032, 581903, 672552, 642275, 533813, 264175, 469380, 463678, 486058, 377095, 553628, 866445, 788184, 668193, 523697, 402726, 291868, 213780, 358154, 375143, 599839, 661503, 630721, 454572, 168393, 316771, 459739, 360629, -160443, -254510, 318225, 855199, 924119, 600620, 188620, 140273, 38019, 78056, 188273, 446036, 615616, 339756, 118278, 448838, 690870, 607044, 185234, 167215, 361338, 535591, 343058, 321547, 679417, 596892, 224162, 322283, 395009, 750134, 722404, 540627, 100965, -209074, -62982, 133289]
111A33289J50219l9013n3124L4328J52822J01512j48346k42130K06355K37523
101E33435p4786l66427k99129K26950K67503p0371k18969j02359L10385n5189
91A51043J41979R2177P7627l8217k75161m7860j48224J66645M8984l8857j47469
80a7333J21027Q4059j60519o2641M17291P8271k25425j55465L07156K34400k86417
69C34404m44332P686M20275L65286l55168k56343M7442L20984P3341m10197l80785
58b77407J7655L51808K68197j70111k85203j50655r2353K96028k9973K33331j17980
$$ y = [133289, 283508, 244495, 191371, 225699, 378521, 480033, 331687, 89557, 295912, 533435, 458649, 92222, -206907, 20043, 287546, 217175, -1794, -104153, 206232, 151043, 293022, 385199, 462826, 424609, 149448, 101588, -46636, 120009, 168993, 130136, -17333, 103694, 187753, 27234, -35407, 381884, 460155, 234730, 79265, 386421, 620821, 334404, -109928, -102242, 318033, 683319, 328151, 71808, 119250, 440234, 513575, 103378, -277407, -259752, 92056, 360253, 190142, -95061, -245716, -338069, -42041, -72014, 161317, 43337]
$$ [...]
##END NTUPLES=NMR SPECTRUM
##END=
