##TITLE=1H_DE-80H_X3
 200.13MHz, d2o
 8 sc
 
 19ns.26.2.2025
##JCAMPDX= 6.0         $$ Bruker NMR JCAMP-DX V2.0
##DATA TYPE= NMR SPECTRUM
##DATA CLASS= NTUPLES
##ORIGIN= UXNMR, Bruker Analytische Messtechnik GmbH
##OWNER= pz
$$ XWIN-NMR		Version 3.5
$$ Wed Apr 22 10:52:19 2026 Russian Standard Time (UT+4h)  Yarkov@DPX200
##.OBSERVE FREQUENCY= 200.1313
##.OBSERVE NUCLEUS= ^1H
##.ACQUISITION MODE= SIMULTANEOUS
##.ACQUISITION SCHEME= undefined
##.AVERAGES= 8
##.DIGITISER RES= 18
##SPECTROMETER/DATA SYSTEM= spect
##.PULSE SEQUENCE= zg30
##.SOLVENT NAME= DMSO
##.SHIFT REFERENCE= (INTERNAL, DMSO, 0, 15.488)
##AUDIT TRAIL= $$ (NUMBER, WHEN, WHO, WHERE, WHAT)
$$ ##TITLE= Audit trail, XWIN-NMR		Version 3.5
$$ ##JCAMPDX= 5.01
$$ ##ORIGIN= Bruker BioSpin GmbH
$$ ##OWNER= Yarkov
$$ C:/Bruker/XWIN-NMR/data/yarkov2/nmr/H-C/1/pdata/1/auditp.txt
$$ ##AUDIT TRAIL=  $$ (NUMBER, WHEN, WHO, WHERE, WHAT)
(   1,<2026-04-22 10:50:11.03 +0400>,<Yarkov>,<DPX200>,
      <created by zg, POWCHK disabled, PULCHK disabled
       configuration hash MD5:
       00 E9 B6 7A A2 85 ED C7 34 08 36 98 17 FE 4E 26
       data hash MD5: 16K
       98 28 CC 93 80 AA 01 5A 32 B3 10 A5 64 71 69 1D>)
(   2,<2026-04-22 10:51:16.56 +0400>,<Yarkov>,<DPX200>,
      <Start of raw data processing
       efp BC_mod = 2 LB = 0.25 FT_mod = 6 PKNL = 1 PHC0 = -5302.316 PHC1 = 11.42193 SI = 16K 
       data hash MD5: 16K
       0C 52 9D 12 5D A1 10 57 E3 9F DD 72 25 DE 52 19>)
(   3,<2026-04-22 10:51:31.26 +0400>,<Yarkov>,<DPX200>,
      <pk PHC0 = -5.8 PHC1 = 0 
       data hash MD5: 16K
       B0 AC 49 BD 91 E0 52 89 2C A5 15 83 78 EF 0C F5>)
$$ ##END=
$$ 
$$ hash MD5
$$ 85 9E 17 47 BE A0 5C A0 12 8F EA 56 E3 62 CC 98
##$RELAX= 
##$RELAX= 
##$RELAX= 
##$RELAX= 
##$RELAX= 
##$RELAX= 
$$ Bruker specific parameters
$$ --------------------------
##$DU= <C:/Bruker/XWIN-NMR>
##$EXPNO= 1
##$NAME= <H-C>
##$PROCNO= 1
##$TYPE= <nmr>
##$USER= <yarkov2>
##$AMP= (0..31)
100 100 100 100 100 100 100 100 100 100 100 100 100 100 100 100 100 100 
100 100 100 100 100 100 100 100 100 100 100 100 100 100 
##$AQSEQ= 0
##$AQ_mod= 1
##$AUNM= <au_zg>
##$AUTOPOS= <>
##$BF1= 200.13
##$BF2= 200.13
##$BF3= 200.13
##$BF4= 200.13
##$BF5= 200.13
##$BF6= 200.13
##$BF7= 200.13
##$BF8= 200.13
##$BYTORDA= 1
##$CFDGTYP= 0
##$CFRGTYP= 5
##$CHEMSTR= <none>
##$CNST= (0..31)
1 1 145 1 1 1 1 1 1 1 1 1 1 1 1 1 1 1 1 1 1 1 1 1 1 1 1 1 1 1 1 1 
##$CPDPRG= <>
##$CPDPRG1= <>
##$CPDPRG2= <>
##$CPDPRG3= <>
##$CPDPRG4= <mlev>
##$CPDPRG5= <mlev>
##$CPDPRG6= <mlev>
##$CPDPRG7= <mlev>
##$CPDPRG8= <mlev>
##$CPDPRGB= <>
##$CPDPRGT= <>
##$D= (0..31)
0 0.7 0 0 0 0 0 0 0 0 0 0.03 0 0 0 0 0 0 0 0 0 0 0 0 0 0 0 0 0 0 0 0 
##$DATE= 1776840610
##$DBL= (0..7)
120 120 120 120 120 120 120 120 
##$DBP= (0..7)
150 150 150 150 150 150 150 150 
##$DBP07= 0
##$DBPNAM0= <>
##$DBPNAM1= <>
##$DBPNAM2= <>
##$DBPNAM3= <>
##$DBPNAM4= <>
##$DBPNAM5= <>
##$DBPNAM6= <>
##$DBPNAM7= <>
##$DBPOAL= (0..7)
0.5 0.5 0.5 0.5 0.5 0.5 0.5 0.5 
##$DBPOFFS= (0..7)
0 0 0 0 0 0 0 0 
$$ [...]
##$SUBNAM2= <"">
##$SUBNAM3= <"">
##$SUBNAM4= <"">
##$SUBNAM5= <"">
##$SUBNAM6= <"">
##$SUBNAM7= <"">
##$SUBNAM8= <"">
##$SUBNAM9= <"">
##$SW= 18.0517328524113
##$SWIBOX= (0..15)
0 0 2 0 0 0 0 0 0 0 0 0 0 0 0 0 
##$SW_h= 3612.71676300578
##$TD= 16384
##$TD0= 1
##$TE= 0
##$TE2= 300
##$TE3= 300
##$TEG= 300
##$TL= (0..7)
0 120 120 120 120 120 120 120 
##$TP= (0..7)
150 150 150 150 150 150 150 150 
##$TP07= 0
##$TPNAME0= <>
##$TPNAME1= <>
##$TPNAME2= <>
##$TPNAME3= <>
##$TPNAME4= <>
##$TPNAME5= <>
##$TPNAME6= <>
##$TPNAME7= <>
##$TPOAL= (0..7)
0.5 0.5 0.5 0.5 0.5 0.5 0.5 0.5 
##$TPOFFS= (0..7)
0 0 0 0 0 0 0 0 
##$TUNHIN= 0
##$TUNHOUT= 0
##$TUNXOUT= 0
##$USERA1= <user>
##$USERA2= <user>
##$USERA3= <user>
##$USERA4= <user>
##$USERA5= <user>
##$V9= 5
##$VALIST= <valist>
##$VCLIST= <CCCCCCCCCCCCCCC>
##$VD= 0
##$VDLIST= <DDDDDDDDDDDDDDD>
##$VPLIST= <PPPPPPPPPPPPPPP>
##$VTLIST= <TTTTTTTTTTTTTTT>
##$WBST= 1024
##$WBSW= 4
##$XGAIN= (0..3)
0 0 0 0 
##$XL= 0
##$YL= 0
##$YMAX_a= 77384
##$YMIN_a= -70885
##$ZGOPTNS= <>
##$ZL1= 120
##$ZL2= 120
##$ZL3= 120
##$ZL4= 120
##$ABSF1= 0
##$ABSF2= 0
##$ABSG= 0
##$ABSL= 0
##$ALPHA= 0
##$AQORDER= 0
##$ASSFAC= 0
##$ASSFACI= 0
##$ASSFACX= 0
##$ASSWID= 0
##$AUNMP= <proc_1d>
##$AZFE= 0.1
##$AZFW= 0.1
##$BCFW= 0
##$BC_mod= 2
##$BYTORDP= 0
##$COROFFS= 0
##$CY= -3
##$DATMOD= 1
##$DC= 0
##$DFILT= <>
##$DTYPP= 0
##$F1P= 0
##$F2P= 0
##$FCOR= 1
##$FTSIZE= 16384
##$FT_mod= 6
##$GAMMA= 0
##$GB= 0
##$INTBC= 1
##$INTSCL= 3.241238e-09
##$ISEN= 128
##$LB= 0.25
##$LEV0= 0
##$LPBIN= 0
##$MAXI= 10000
##$MC2= 0
##$MEAN= 0
##$ME_mod= 0
##$MI= 1.114404
##$NCOEF= 0
##$NC_proc= -8
##$NLEV= 6
##$NOISF1= 3.799351
##$NOISF2= 2.8
##$NSP= 0
##$NTH_PI= 0
##$NZP= 0
##$OFFSET= 15.48797
##$PC= 1
##$PHC0= -5308.116
##$PHC1= 11.42193
##$PH_mod= 1
##$PKNL= yes
##$PPARMOD= 0
##$PSCAL= 0
##$PSIGN= 0
##$REVERSE= no
##$SF= 200.13000675053
##$SI= 16384
##$SIGF1= 3
##$SIGF2= 2
##$SINO= 0.751879
##$SIOLD= 32768
##$SREGLST= <19F.Aceton>
##$SSB= 0
##$STSI= 16384
##$STSR= 0
##$SW_p= 3612.71676300578
##$SYMM= 0
##$S_DEV= 0
##$TDeff= 16384
##$TDoff= 0
##$TI= <>
##$TILT= no
##$TM1= 0
##$TM2= 0
##$TOPLEV= 0
##$USERP1= <user>
##$USERP2= <user>
##$USERP3= <user>
##$USERP4= <user>
##$USERP5= <user>
##$WDW= 1
##$XDIM= 16384
##$YMAX_p= 436325995
##$YMIN_p= -28585439
$$ End of Bruker specific parameters
$$ ---------------------------------
##NTUPLES= NMR SPECTRUM
##VAR_NAME=  FREQUENCY,     SPECTRUM/REAL,   SPECTRUM/IMAG
##SYMBOL=    X,             R,               I
##VAR_TYPE=  INDEPENDENT,   DEPENDENT,       DEPENDENT
##VAR_FORM=  AFFN,          ASDF,            ASDF
##VAR_DIM=   16384,         16384,           16384
##UNITS=     HZ,            ARBITRARY UNITS, ARBITRARY UNITS
##FACTOR=    0.220516191357247, 1,           1
##FIRST=     3099.60761113236, 0,            0
##LAST=      -513.109151873419, 0,           0
##MIN=       -513.109151873419, -28585439,   0
##MAX=       3099.60761113236, 436325995,    0
$$ Real data points
##PAGE= N=1
##DATA TABLE= (X++(R..R)), XYDATA
$$ [...]
5047A1360810j50477R35226j216477k99535J036734j860458l20079j67797k89079
$$ 11360810 11210333 12145559 10929082 10629547 11666281 9805823 9485744 9317947 9028868
5038I028868k32220L5484K77897k80k69104k3909P70998j216688O71145L93044
$$ 9028868 8796648 8832132 9110029 9109749 8840645 8816736 9587734 8371046 9042191 9435235
5028I435235l05244k22700J04561r53169k46608j94476j64651q654q418J496178
$$ 9435235 9129991 8907291 9011852 8058683 7812075 7617599 7452948 7444294 7435876 8932054
5018H932054l61723m19007n76588q91074J62182j662877L8608J954509l18916
$$ 8932054 8570331 8151324 7574736 6683662 6845844 5182967 5221575 7176084 6857168
5009F857168K10860J00447j008454J01805q40339M70752k26645r43069J715121
$$ 6857168 7068028 7168475 6160021 6261826 5421487 5892239 5665594 4722525 6437646
5000F437646k17096j649531Q03376J64027j024706J930515n47810J278267k50035
$$ 6437646 6220550 4571019 5374395 5538422 4513716 6444231 5896421 7174688 6924653
4991F924653O43109q9734m35841j784916l27212r88331k69356M86389O67182k038521
$$ 6924653 7567762 7478028 7042187 5257271 4930059 3941728 3672372 4158761 4825943 2787422
4981B787422J54518R45645j553829J153338L24808j751402K163308J79098j475236
$$ 2787422 2941940 3887585 2333756 3487094 3811902 2060500 4223808 4402906 2927670
4972B927670j05832j003059P84853k56798l35774J420063n21992m79150k69813
$$ 2927670 2821838 1818779 2603632 2346834 2011060 3431123 2909131 2429981 2160168
4963B160168J324155m23340j203273m057Q82571J066526j037445L65290r30182
$$ 2160168 3484323 3060983 1857710 1853653 2736224 3802750 2765305 3130595 2200413
4954B200413M25416r44167P6987N21817m16919j478862K103763m57267l79991
$$ 2200413 2625829 1681662 1758649 2280466 1863547 384685 2488448 2031181 1651190
4945A651190Q70118j320998L40688P47210R37016j09951j982073J315175r85436
$$ 1651190 2521308 1200310 1540998 2288208 3225224 3115273 1133200 2448375 1462939
4936A462939j176245j232679J633974P20420R22522j771728P57626J491302k298562
$$ 1462939 286694 -945985 687989 1408409 2330931 559203 1316829 2808131 509569
4927E09569Q7623J849752j294076p55477P27130j338925J212131r60652l71228
$$ 509569 597192 2446944 1152868 397391 1124521 -214404 997727 37075 -334153
4918c34153J21327l86924J076032J52779p2315J165176j29601j91229j43341j679939
$$ -334153 -212826 -599750 476282 629061 556746 1721922 1592321 1401092 1257751 -422188
4908d22188L24075O52747M07719J06633L20114L1643j10629o38510M50896l35586
$$ -422188 -98113 554634 962353 1068986 1389100 1420743 1310114 671604 1122500 786914
4898G86914r86552J210820j81798J67793K19733Q25418M62846j074683p33541
$$ 786914 -199638 1011182 829384 997177 1216910 2042328 2505174 1430491 696950
4889F96950J134964p60096N47711j85570P29981o7919L40731p62945M08085Q47115
$$ 696950 1831914 1071818 1619529 1433959 2163940 2096021 2436752 1673807 2081892 2929007
4879B929007n65963j463987J49987J959052K84924q91504J264406k70227m44920
$$ 2929007 2363044 899057 1049044 3008096 3293020 2401516 3665922 3395695 2950775
4870B950775J298675k145114l57687M14578l47690J00925M00278J868421J053002
$$ 2950775 4249450 2104336 1746649 2161227 1813537 1914462 2314740 4183161 5236163
4861E236163j732327J515971J12522o36378J076220J48961R78113J251174n26108
$$ 5236163 3503836 5019807 5132329 4495951 5572171 5721132 6699245 7950419 7424311
4852G424311k044915R50094O78950J096115k109721J896283R5260p86856J377925
$$ 7424311 5379396 6329490 7008440 8104555 5994834 7891117 7986377 7199521 8577446
4843H577446k93904Q32386L56741J410445J285619J647351J394544K625788N133718
$$ 8577446 8283542 9115928 9472669 10883114 12168733 13816084 15210628 17836416 22970134
4834B2970134J0117566J0396261R665102J0175309Q43702o009987j0482367j0824112
$$ 22970134 33087700 43483961 53149063 63324372 64168074 58158087 47675720 36851608
4826C6851608p589895q345899n769339k112067l237911j830236j603522m58915
$$ 36851608 29261713 20915814 15146475 13034408 9796497 7966261 6362739 5903824
4818E903824o94441n45351O2222r88238O3650J3469R6222k573957J023213P95607
$$ 5903824 5209383 4664032 4726254 3738016 3801666 3815135 3911357 1337400 2360613 3156220
4808C156220r17838K25345l08101J85410M11681k423125P26262r51684K94620
$$ 3156220 2238382 2463727 2155626 2341036 2752717 329592 1055854 104170 398790
4799C98790J209225L96079K56488n18108r03256K26031P86950j63694l11412k43340
$$ 398790 1608015 2004094 2260582 1742474 839218 1065249 1852199 1688505 1377093 1133753
4789A133753k40544L25083j288126k30388m17828p53006Q47503j37804K52712
$$ 1133753 893209 1218292 -69834 -300222 -718050 -1471056 -623553 -761357 -508645
4780e08645P44287K34041J69672J172363m95161j133003q95350J644057Q16184
$$ -508645 235642 469683 639355 1811718 1316557 183554 -711796 932261 1748445
4771A748445k274970Q50955M62899j531981J417806k4027P24528k51820J33795
$$ 1748445 -526525 324430 787329 -744652 673154 649127 1373655 1121835 1255630
4762A255630J273244j30530M80024m32005j713797j94897l26968j286801n62517
$$ 1255630 2528874 2398344 2878368 2446363 732566 537669 210701 -1076100 -1638617
4753a638617Q75656K36233K048185J2952P85718l16163l22321N25109j254364
$$ -1638617 -762961 -526728 1521457 1534409 2320127 2003964 1681643 2206752 952388
4744I52388K80041O4900p76142J813012j66413j339232M63543j168905R51106
$$ 952388 1232429 1297329 521187 2334199 2167786 828554 1292097 123192 1074298
4735A074298N88019J503843o73107j055116O48471J002516k369226O79710J110347
$$ 1074298 1662317 3166160 2493053 1437937 2086408 3088924 719698 1399408 2509755
4726B509755o28493j232506J336752N80064j440917J25212R71944n75388j48331
$$ 2509755 1881262 648756 1985508 2565572 1124655 1249867 2221811 1646423 1498092
4717A498092P12334J102535n81850q07510m35851o30478j36266j68894R50953
$$ 1498092 2210426 3312961 2731111 1923601 1487750 857272 721006 552112 1503065
4708A503065K63662N05143P6739m37810R32722m51044k80250L24413j900397J318491
$$ 1503065 1766727 2271870 2348609 1910799 2843521 2392477 2112227 2436640 536243 1854734
4698A854734j285407j740046J956005N59316L59436O21244K5847L48646p67804
$$ 1854734 569327 -1170719 785286 1344602 1704038 2325282 2351129 2699775 1931971
4689A931971j90826m14241l77407J81583j7135O7326K74734K01339Q07519p19737
$$ 1931971 1741145 1326904 949497 1131080 1113945 1181271 1456005 1657344 2464863 1745126
4679A745126O15621q31588M46444M31560j56943J61844N87258j141560j188198
$$ 1745126 2360747 1529159 1975603 2407163 2250220 2412064 2999322 1857762 669564
4670F69564N35376q26484J624995j131046O24870L2400Q7793k71019P37537L30273
$$ 669564 1204940 378456 2003451 872405 1497275 1529675 1617468 1346449 2083986 2414259
4660B414259j656688J407434j07573j081149P1812J734794J25493j213839j118422
$$ 2414259 757571 2165005 2057432 976283 1048095 2782889 2908382 1694543 576121
4651E76121K643129Q7990r17531P92424N80061j115941l0968n2982M49167J127728
$$ 576121 3219250 3307240 2389709 3182133 3762194 2646253 2615285 2562303 3011470 4139198
4641D139198r93604R81064O23880N17948J51710k044596N9198J229452N47000
$$ 4139198 3145594 4126658 4750538 5268486 5420196 3375600 3434798 4664250 5211250
4632E211250K008270J823949J663324M388201K924920K466683R91049L8651k430765
$$ 5211250 7219520 9043469 10706793 15094994 18019914 20486597 21477646 21516297 19085532
4623A9085532j937094k703408j446759r42570q32297L64248k03560p63566j400559
$$ 19085532 17148438 14445030 12998271 12055701 11223404 11587652 11384092 10620526 9219967
4614I219967J271770J450923K600380J671144J810039J537571J334797L147335
$$ 9219967 10491737 11942660 14543040 16214184 18024223 19561794 20896591 24043926
4606B4043926N69232P14150J160063J792064L162825K420119L367975J801065
$$ 24043926 24613158 25327308 26487371 28279435 31442260 33862379 37230354 39031419
4598C9031419n12449o0455J015037J656207J615838J967744J837848j50819m35090
$$ 39031419 38518970 38458515 39473552 41129759 42745597 44713341 46551189 46400370 45965280
4589D5965280k970426k900318k116867Q40942j515519k239239K91224n83938l899907
$$ 45965280 42994854 40094536 37977669 38818611 37303092 35063853 35355077 34771139 30871232
4580C0871232k730452j608758k693171j775644j826106j205947k045163j102551
$$ 30871232 28140780 26532022 23838851 22063207 20237101 19031154 16985991 15883440
4572A5883440j240124l947320q62837q39401j744841k129039P61863m15631j248050
$$ 15883440 14643316 10695996 9833159 8993758 7248917 5119878 5881741 5466110 4218060
4563D218060K4765N62125l96808q29514n33506r83997P2032p69613J805964n09073
$$ 4218060 4242825 4804950 4408142 3578628 3045122 2061125 2133157 1363544 3169508 2660435
4553B660435j185438K209880l00460m72314m45322r59940L49629j18722o66203
$$ 2660435 1474997 3684877 3384417 2912103 2466781 1506841 1856470 1737748 1071545
4544A071545Q50951n41414P12674r81535P60815l74535O34230q31123K64168N16875
$$ 1071545 1922496 1381082 2093756 1112221 1873036 1498501 2132731 1301608 1565776 2082651
4534B082651j65848n40639j219778J437130o32880P95703O6850L57540o44111
$$ 2082651 1916803 1376164 156386 1593516 960636 1756339 1823189 2180729 1536618
4525A536618m4487Q39279p4413R03256k15601J004109j01114m34147P33792j360867
$$ 1536618 1492131 2331410 2256997 3160253 2944652 3948761 3847647 3413500 4147292 2786425
4515B786425j233561J49047O06730j113435j77259K200703L70970k034149M3274
$$ 2786425 1552864 1701911 2308641 1195206 1017947 3218650 3589620 1555471 1598745
4506A598745M25177N62641j192187Q20563j450945M77193l62551j054976O74808
$$ 1598745 2023922 2586563 1394376 2214939 763994 1241187 878636 -176340 498468
4497D98468O75612j5104O04231k65816J227742Q34437m67393j738712K2360k56215
$$ 498468 1174080 1158976 1763207 1497391 2725133 3559570 3092177 1353465 1375825 1119610
4487A119610p07200l83538l22041K645R51830J020767j661005J319588N79467
$$ 1119610 412410 28872 -293169 -290524 661306 1682073 21068 1340656 1920123
4478A920123N19098q08315r50006K186376o91106q76448j043705q45195m92215
$$ 1920123 2439221 1630906 680900 2867276 2176170 1299722 256017 -589178 -1081393
4469a081393J214811L38522J754526L94200K65028p66858j413644M71303k94034
$$ -1081393 133418 471940 2226466 2620666 2885694 2118836 705192 1176495 882461
4460H82461m90545o55755K65094O79174J033302j614542n19786P45077j110874
$$ 882461 391916 -263839 1255 680429 1713731 99189 -420597 324480 -786394
4451g86394k88008J312593J922438j33755K42251J277508k402468j359384q7706
$$ -786394 -1074402 238191 2160629 2026874 2269125 3546633 1144165 -215219 -302925
4442c02925o4636L19422r12390K193636R82983j403511N87899L18050P3532j441030
$$ -302925 -367561 -48139 -960529 1233107 2216090 812579 1400478 1718528 1792060 351030
4432C51030K96582L25091N76376k08023M22999j610340L08099j45962p84611N91487
$$ 351030 647612 972703 1549079 1341056 1764055 153715 461814 315852 -468759 122728
4422A22728J53032j41812k974Q73165n04066k0641K377184k155245M63595N18609
$$ 122728 275760 133948 130974 1004139 500073 479432 2856616 701371 1164966 1683575
4412A683575m59980r23611j782846J439117O2082k06118K296346M66744j56198
$$ 1683575 1223595 299984 -1482862 -43745 18337 -187781 2108565 2575309 2419111
4403B419111R10691L7200j57930j402726p25750J21337k47924K53382J60902o23700
$$ 2419111 3329802 3367002 3209072 1806346 1080596 1201933 954009 1207391 1368293 744593
4393G44593K036520j24462l22534K079096o09273r77219r82479n69110J26164
$$ 744593 2781113 2656651 2334117 4413213 3803940 2826721 1844242 1275132 1401296
4384A401296j249511J158518J740118K87202K64188N93938j553414p49116K73277
$$ 1401296 151785 1310303 3050421 3337623 3601811 4195749 2642335 1893219 2166496
4375B166496r72262m12773p35135O73826Q64719L40209J113678r35824l46070
$$ 2166496 1194234 781461 46326 720152 1584871 1925080 3038758 2102934 1756864
4366A756864L71584o66946R8748m07897J347981o42099j200693J539789p58376
$$ 1756864 2128448 1461502 1560250 1152353 2500334 1858235 657542 2197331 1438955
4357A438955p82048Q69202N4018k6492l9891O94396N69640J92553j61470J88120
$$ 1438955 656907 1526109 1580127 1553635 1513744 2208140 2777780 2970333 2808863 2996983
4347B996983j253668J28127j056229M26520R39626j226686J786732K86342r6201
$$ 2996983 1743315 1871442 815213 1241733 2181359 954673 2741405 3027747 2931546
4338B931546J030933O61671j333561l62903K117735j546536j540675K15538O06229
$$ 2931546 3962479 4624150 3290589 2927686 5045421 3498885 1958210 2173748 2779977
4329B779977L28354j545654J717977J277367l67755N70216m09671l35319M42498
$$ 2779977 3108331 1562677 3280654 4558021 4190266 4760482 4350811 4015492 4457990
4320D457990m14996O53301P17084J71333J806254q58373K9347J653242l107176
$$ 4457990 4042994 4696295 5413379 5584712 7390966 6532593 6561940 8215182 5108006
4311E108006l55094j97633J50157J204491J020951J044738O18004n65099L26503
$$ 5108006 4752912 4555279 4705436 5909927 6930878 7975616 8593620 8028521 8355024
4302H355024O29720n02986j822974R34227p20128M56946p69648L361452j030041
$$ 8355024 8984744 8481758 6658784 7593011 6872883 7329829 6560181 9921633 8891592
4293H891592k46870L231155j551229k52326N92501l5891j659340N23819J275888
$$ 8891592 8644722 11875877 10324648 10072322 10664823 10628932 8969592 9493411 10769299
4284A0769299j827676N46706J424789N2530J110004n87906M00712K85093K13241
$$ 10769299 8941623 9488329 10913118 10965648 12075652 11487746 11888458 12173551 12386792
4275A2386792j45875N88135n71238L59555k366552J176036J41945m51557J059166
$$ 12386792 12240917 12829052 12257814 12617369 10250817 11426853 11568798 11117241 12176407
4266A2176407O55795Q13397Q26786j407590J892166p76093j392734L97245J985580
$$ 12176407 12832202 13645599 14472385 13064795 14956961 14180868 12788134 13185379 15170959
4257A5170959l14371O0694K540670m04895L04014M04440O19563J75224J434564
$$ 15170959 14856588 14917282 17457952 17053057 17357071 17761511 18381074 18556298 19990862
4248A9990862J144413J502454N18067J247016K96613j0868J331075J786675L656820
$$ 19990862 21135275 22637729 23155796 24402812 24699425 24688557 26019632 27806307 31463127
4239C1463127J874299L134457O877392O809252J2491212J8334857K2085842J9664591
$$ 31463127 33337426 36471883 43349275 50158527 62649739 80984596 103070438 122735029
4231A22735029J4720128r03417j5247761j9009844j9811310j7983607j2775811
$$ 122735029 137455157 136551740 121303979 102294135 82482825 64499218 51723407
4224E1723407q881857p099536n602158l841295p94425k044192j590301j370322
$$ 51723407 42841550 35742014 30139856 26298561 25504136 23459944 21869643 20499321
4216B0499321j545359l64117r44241m95017J421332j858807n22935L45404j253130
$$ 20499321 18953962 18589845 17645604 17150587 18571919 16713112 16190177 16535581 15282451
4207A5282451q79947J296774q85183j984694J428391J550445k677796R81344k9373
$$ 15282451 14402504 15699278 14814095 12829401 14257792 15808237 13130441 14111785 14082412
4198A4082412p86949j133959j90634l32553M57229J531173n30320l50182j33599
$$ 14082412 13295463 12161504 11970870 11638317 12095546 13626719 13096399 12746217 12612618
4189A2612618J70208j238208J732542k203326J14295l86121k103771N92025J618963
$$ 12612618 12782826 11544618 13277160 11073834 11188129 10802008 8698237 9290262 10909225
4180A0909225N35675J1758P76570K32265o70025L2945j131506j257936q41862
$$ 10909225 11444900 11456658 12233228 12465493 11795468 11828413 10696907 9438971 8597109
4171H597109p00682M50324q6911J686911M6727J134219j075352M29905N65273
$$ 8597109 7896427 8346751 8259840 9946751 9993478 11127697 10052345 10482250 11047523
4162A1047523j822169m44304n42191j741386M0282J232879k466778P81027J880960
$$ 11047523 9225354 8781050 8238859 6497473 6537755 7770634 5303856 6084883 7965843
4153G965843n06375r90197R78508K11777k026765J052723m99437k116813J617214
$$ 7965843 7459468 6469271 7447779 7659556 5632791 6685514 6186077 4069264 5686478
4144E686478m08062j212785Q79121N7291j615122j14447j827516R48643J101908
$$ 5686478 5278416 4065631 4944752 5002043 3386921 3272474 1444958 2393601 3495509
4135C495509J1871K13710J359830m29505q49401L8516n8086k126883O9946J056118
$$ 3495509 3507380 3721090 5080920 4651415 3802014 3840530 3782444 1655561 1725507 2781625
4125B781625K77532k47403J006233M93733p27067k25380p42428k46117N15643
$$ 2781625 3059157 2811754 3817987 4311720 3584653 3359273 2616845 2370728 2886371
4116B886371M45727O8048K9641M08049r45667j052507J215743N9919J894885k197370
$$ 2886371 3332098 3400146 3429787 3837836 2892169 1839662 3055405 3115324 5010209 2812839
4106B812839k34248J517654j419352j197877O47272k97374N89765N38440J11735
$$ 2812839 2578591 4096245 2676893 1479016 2126288 1828914 2418679 2957119 3068854
4097C068854J001941J248723q57855r36187o38619p90300K15549m13399M85524
$$ 3068854 4070795 5319518 4461663 3525476 2886857 2096557 2312106 1898707 2384231
4088B384231M58336N69687Q00939K80141l09783N62997j383939j685021K486980
$$ 2384231 2842567 3412254 4213193 4493334 4183551 4746548 3362609 1677588 4164568
4079D164568l27285P55468j27129m35984p30153J249490K93500j306788R30285
$$ 4164568 3837283 4592751 4465622 4029638 3299485 4548975 4842475 3535687 4465972
4070D465972j8318K62607J765382P04833K40944J050575J494419K427020n3010
$$ 4465972 4447654 4710261 6475643 7180476 7421420 8471995 9966414 12393434 12340424
4061A2340424L135923J978627j461448k043459l53471j588630k002255q93127
$$ 12340424 15476347 17454974 15993526 13950067 13596596 12007966 10005711 9112584
4053I112584N10211N73013k229757M33670n58057j194467J187650R5215j925678
$$ 9112584 9622795 10195808 7966051 8399721 7841664 6647197 7834847 7930062 6004384
4044F004384j02161K289563j910914M79040L61193N872m08113K83865J471171
$$ 6004384 5902223 8191786 6280872 6759912 7121105 7126977 6718864 7002729 8473900
4035H473900l43271j087580K54710j512998n30907K114538q0157M6074q93623
$$ 8473900 8130629 7043049 7297759 5784761 5253854 7368392 7288235 7334309 6440686
4026F440686Q7680o62625Q90388p32728J298096J23980J409701l79225j65077
$$ 6440686 6528366 5865741 6756129 6023401 7321497 7445477 8855178 8475953 8310876
4017H310876J337572r31660j211872P735L8169O77034L67677j734680J941706
$$ 8310876 9648448 8716788 7504916 7512651 7550820 8227854 8595531 6860851 8802557
4008H802557J91596j666338J219688n82484J334568k55906N45948J013024j121633
$$ 8802557 8994153 7327815 8547503 7965019 9299587 9043681 9589629 10602653 9481020
3999I481020j98403k50351j052078P44221J713884j600866J584896J483832j818998
$$ 9481020 9282617 9032266 7980188 8724409 10438293 8837427 10422323 11906155 10087157
3990A0087157K179J188260k96421q31902J882940q03664m96947N83517p04538
$$ 10087157 10089336 11277596 10981175 10149273 12032213 11228549 10731602 11315119 10610581
3981A0610581K31873m62133J826372j531225j448211K462072J788803j956481
$$ 10610581 10842454 10380321 12206693 10675468 9227257 11689329 13478132 11521651
3973A1521651M34108K332257m96570k683888J756142J152158l88913j243639J108449
$$ 11521651 11955759 14288016 13791446 11107558 12863700 14015858 13626945 12383306 13491755
3964A3491755R76412J36102M79335J882911j087769N31385K306557J010880K103593
$$ 13491755 14468167 14604269 15083604 16966515 15878746 16410131 18716688 19727568 21831161
3955B1831161K184930R22760m05974j365258m6037k798437j106218r09751K17940
$$ 21831161 24016091 24938851 24532877 23167619 23121582 20323145 19216927 18307176 18525116
3946A8525116M36854J337924Q86622r02787L05583Q24942K09919j623328p70266
$$ 18525116 18961970 20299894 21186516 20283729 20589312 21414254 21624173 20000845 19230579
3937A9230579m88264P35910q26033J892467l17411r55479J019778N54153k48461
$$ 19230579 18742315 19478225 18652192 20544659 20227248 19271769 20291547 20845700 20597239
3928B0597239J268709J542365L56676J121904K476737R12272k196639r46532q80293
$$ 20597239 21865948 23408313 23764989 24886893 27363630 28275902 26079263 25132731 24252438
3919B4252438j306888j623482m03169j468714l2394N33024r84581l921p79613
$$ 24252438 22945550 21322068 20918899 19450185 19417791 19950815 18966234 18962313 18182700
3910A8182700k18123j666099L34606N75268k93880j049017J482854q79196Q40612
$$ 18182700 17964577 16298478 16633084 17208352 16914472 15865455 17348309 16469113 17309725
3901A7309725K27135J100424r01716o98001O92419p60770N83008J521502m57539
$$ 17309725 17536860 18637284 17735568 17037567 17729986 16969216 17552224 19073726 18616187
3892A8616187O4869p30715n13779n06615J169647J15555o12814K64900l53267
$$ 18616187 18681056 17950341 17436562 16929947 18099594 18215149 17602335 17867235 17513968
3883A7513968j35641J022792J00426J172657O65456J22416k05117m71768M33139
$$ 17513968 17378327 18401119 18501545 19674202 20339658 20462074 20256957 19785189 20218328
3874B0218328o90421L33881J915898K30036O88347K097154N69370Q89431j958518
$$ 20218328 19527907 19861788 21777686 22007722 22696069 24793223 25362593 26252024 24293506
3865B4293506Q22964M09913R12440J075256J390128J709804P48538Q20045L168545
$$ 24293506 25116470 25526383 26438823 27514079 28904207 30614011 31362549 32182594 35351139
3856C5351139P82158Q09921J146071J619406Q01769K121239P41546J494415J52108
$$ 35351139 36133297 36943218 38089289 39708695 40510464 42631703 43373249 44867664 45019772
3847D5019772Q94390J11573K73706N37778m61508j423783K08982J66543J223666
$$ 45019772 45914162 46025735 46299441 46837219 46375711 44951928 45160910 45327453 46551119
3838D6551119O80487k76614P28710j068906L53324m54364l88633j056977J46805
$$ 46551119 47231606 46954992 47683702 46614796 46968120 46513756 46125123 45068146 45214951
3829D5214951j329786j370699n57700m93199k340604j587167L07104m71038l315492
$$ 45214951 43885165 42514466 41956766 41463567 39122963 37535796 37842900 37371862 34056370
3820C4056370k0139r59244j161440j683207k50276J20054j318151O1714J94420
$$ 34056370 34036231 33076987 31915547 30232340 29982064 30102118 28783967 28845681 29040101
3811B9040101j235542j468106K34982j059437r29974m36325p82003j733297j018422
$$ 29040101 27804559 26336453 26571435 25511998 24582024 24145699 23363696 21630399 20611977
3802B0611977j1673R89820m75999q53013o21329J15682L03272k154134r9370N59337
$$ 20611977 20600304 21590124 21114125 20261112 19639783 19755465 20058737 17904603 17805233 18364570
3792A8364570k610749J034000P28529n61874j95513j090012K27724l98679r3674
$$ 18364570 15753821 16787821 17516350 16954476 16758963 15668951 15896675 15497996 15404322
3783A5404322Q2782K7112k50833k67051j052150J5517r89982O51848J58440o34261
$$ 15404322 15487104 15514216 15263383 14996332 13944182 13959699 12969717 13621565 13780005 13145744
3773A3145744J586483N03464r30321k2823J783700o3519k307208J140684R60704
$$ 13145744 14732227 15235691 14305370 14282547 16066247 16002728 13695520 14836204 15796908
3764A5796908o67673n574K02748j18144m74902N32406O73417j786281K399934
$$ 15796908 15129235 15123661 15326409 15208265 14733363 15265769 15939186 14152905 16552839
3755A6552839P23356l140468m6936J776245j564107k146975K612062L02762j519301
$$ 16552839 17276195 14135727 14088791 15865036 14300929 12153954 14766016 15068778 13549477
3746A3549477o86474L423790r46898M47001n99780j924554n24100K39718J032916
$$ 13549477 12863003 16286793 15339895 15786896 15187116 13262562 12738462 12978180 14011096
3737A4011096N89062j030186J337205p38028j065587L10534p26987J0226n08338
$$ 14011096 14600158 13569972 14907177 14169149 13103562 13414096 12687109 12697335 12188997
3728A2188997J253698J30420J363831M59196m8475r40839J203617j869893O2219
$$ 12188997 13442695 13573115 14936946 15396142 15347667 14406828 15610445 13740552 13802771
3719A3802771K883224l25534k79416Q87470O31945l120098J768331J605206k08846
$$ 13802771 16685995 16360461 16081045 16968515 17600460 14480362 16248693 17853899 17645053
3710A7645053M20997o93545j006040M53959n21707j219443L6788M23794k37850
$$ 17645053 18066050 17372505 16366465 16820424 16298717 15079274 15116062 15539856 15302006
3701A5302006P36593R66210j416948q37958J32446p92472n99195P28024J164906
$$ 15302006 16038599 17004809 15587861 14749903 14882349 14089877 13490682 14218706 15383612
3692A5383612l49341k29165r3942m06999k11828k228822J627099J323790J040732
$$ 15383612 15034271 14805106 14711164 14304165 14092337 11863515 13490614 14814404 15855136
3683A5855136l59194j01281k35423m88494j322779p81470Q03411Q8808n2153M24811
$$ 15855136 15495942 15394661 15159238 14670744 13347965 12566495 13369906 13458714 13406561 13831372
3673A3831372N03617J11567p95681n59916r13999P15879N58200o43212q7823m72681
$$ 13831372 14334989 14446556 13650875 13090959 12176960 12892839 13451039 12807827 12720004 12247323
3663A2247323R19441K6355j182632O76056O59221L61350j594443Q1881L11142
$$ 12247323 13166764 13193119 12010487 12686543 13345764 13707114 12112671 12194552 12505694
3654A2505694j405586r7373Q58165R02446j092757N98914J180481j509014k360547
$$ 12505694 11100108 11002735 11860900 12763346 11670589 12269503 13449984 11940970 9580423
3645I580423J471948r32749r27845J350745J118992j92272M30079k51729q3749
$$ 9580423 11052371 10119622 9191777 10542522 11661514 11469242 11899321 11647592 11563843
3636A1563843o82500K57699O85340j131934K286556J220777j296500j316727J506413
$$ 11563843 10881343 11139042 11824382 10692448 12979004 14199781 12903281 11586554 13092967
3627A3092967R66155l96835M29548N96525k69504p32886R22836j475110p92548
$$ 13092967 14059122 13662287 14091835 14688360 14418856 13685970 14608806 13133696 12341148
3618A2341148J932112r79362L44328L56616O08634k172517q24673Q74548k178093
$$ 12341148 14273260 13293898 13638226 13994842 14603476 12430959 11606286 12480834 10302741
3609A0302741Q15622O6885q50927J677659J157786k138144N47955q62639o03181
$$ 10302741 11118363 11185248 10334321 12011980 13169766 11031622 11579577 10716938 10113757
3600A0113757Q54080R37812o06963m36233M99633J092938m97482K14571j21249
$$ 10113757 10967837 11905649 11298686 10862453 11362086 12455024 11957542 12172113 12050864
3591A2050864M78902N5630K16629L59729m51211K69689o48617n0122J07308N88494
$$ 12050864 12529766 12585396 12802025 13161754 12710543 12980232 12331615 12281493 12388801 12977295
3581A2977295Q55782M04343N88283K480840k157002o91484M28074n51029l8041
$$ 12977295 13833077 14237420 14825703 17306543 15149541 14458057 14886131 14335102 14297061
3572A4297061K024754O07324J693560J598797p50343L84026j9922K77440N83149
$$ 14297061 16321815 16929139 18622699 20221496 19471153 19855179 19835257 20112697 20695846
3563B0695846j466472K481931K479908m18724J164648l74837o2287L54555Q96166
$$ 20695846 19229374 21711305 24191213 23772489 24937137 24562300 24500013 24854568 25750734
3554B5750734J110163J313142j076474J055186m20543j491023J18591k50748q68134
$$ 25750734 26860897 28174039 27097565 28152751 27732208 26241185 26359776 26109028 25240894
3545B5240894J173261J474660o68513m56177q47434Q822p25544l40901o75290
$$ 25240894 26414155 27888815 27220302 26764125 25916691 25925513 25199969 24859068 24183778
3536B4183778q39947N10767K208438j717473l44908j173803j262534J20295n83563
$$ 24183778 23343831 23854598 26063036 24345563 24000655 22826852 21564318 21684613 21101050
3527B1101050k87543j122429M02952r81158j533254O8164M03787k554076m34631
$$ 21101050 20813507 19691078 20094030 19112872 17579618 17647782 18051569 15497493 15062862
3518A5062862J246918j629675n22569j421849O88688O71121N4454r38606K9037
$$ 15062862 16309780 14680105 14157536 12735687 13424375 14095496 14149950 13211344 13240381
3509A3240381j65975J599155j52407q20979L23070j044380N35080Q95957J057551
$$ 13240381 13074406 14673561 14521154 13700175 14023245 12978865 13513945 14409902 15467453
3500A5467453J443497M06558L68358L89660k10510k65815r52010m14694N93775
$$ 15467453 16910950 17317508 17685866 18075526 17865016 17599201 16647191 16232497 16826272
3491A6826272J896128n20790N24989l6937Q68526j296226O4664J000543q93845
$$ 16826272 18722400 18201610 18726599 18689662 19558188 18261962 18326626 19327169 18433324
3482A8433324k9730L7353o68642J94056l31655L40807Q94859o67565j694214O66842
$$ 18433324 18403594 18440947 17772305 17966361 17634706 17975513 18870372 18202807 16508593 17175435
3472A7175435j363003j36340o5662n45105L1022q54310K028704j00208q85339
$$ 17175435 15812432 15676092 15610430 15065325 15096347 14242037 16270741 16170533 15285194
3463A5285194j652471n07477j467559j228640k22231o56814J170305m18765j06990
$$ 15285194 13632723 13125246 11657687 10429047 10206816 9550002 10720307 10301542 10194552
3454A0194552J21497p19147r32547J037977j137574M38945k88279r56088K2371
$$ 10194552 10316049 9596902 8664355 9702332 8564758 9003703 8715424 7759336 7781707
3445G781707o41920j872211J2212m60048j15801K103854j015329J82354L41845
$$ 7781707 7139787 5267576 5279788 4819740 4703939 6807793 5792464 5974818 6316663
3436F316663M6107j11613r32093q45056M15504K49046J08153M93860j98968q9080
$$ 6316663 6362770 6251157 5319064 4474008 4889512 5138558 5246711 5740571 5541603 5452523
3426E452523j404255o17158K417203q78876o3028O90170K99821r98262J08161
$$ 5452523 4048268 3431110 5848313 4969437 4906409 5596579 5896400 4898138 5006299
3417E006299N87217j70979J383783j251790J62437l50248j059653M07341M23574
$$ 5006299 5593516 5422537 6806320 5554530 5716967 5366719 4307066 4714407 5137981
3408E137981n81141O13498n43570Q53536P60342l8369n19746r46226o57784J784426
$$ 5137981 4556840 5170338 4626768 5480304 6240646 6202277 5682531 4736305 4078521 5862947
3398E862947j189568K8955J729680O2320L82604M35349k79668j14237p24718O33213
$$ 5862947 4673379 4702334 6432014 6494334 6876938 7312287 7032619 6918382 6193664 6826877
3388F826877J366485j076722M00432L08373J72703P00388O88479k903794J324315
$$ 6826877 8193362 7116640 7517072 7825445 7998148 8698536 9387015 6483221 7807536
3379G807536r161M6251m58196N97223P4227J52101j314425J070778k47758k82632
$$ 7807536 7798375 7844626 7386430 7983653 8057880 8209981 6895556 7966334 7718576 7435944
3369G435944p68974J907058N52745P77027j143086O23907R00313p37260K97397
$$ 7435944 6666970 8574028 9126773 9903800 8760714 9384621 10284934 9547674 9845071
3360I845071j80576j322706J394742M82316q01047k98882J0026L99806j85435
$$ 9845071 9664495 8341789 9736531 10218847 9417800 9118918 9128944 9528750 9343315
3351I343315N86609J227446n16404j145083N35626l92703o36184n58627M03504
$$ 9343315 9929924 11157370 10640966 9495883 10031509 9638806 9002622 8443995 8847499
3342H847499q93622R05372L50557r48663J349152R365l45230J358918j938448
$$ 8847499 7953877 8859249 9209806 8261143 9610295 9619660 9274430 10633348 8694900
3333H694900k83261K54346J555262n57131j670889M10328p9763q44241r38064
$$ 8694900 8411639 8665985 10221247 9664116 7993227 8403555 8323792 7479551 6541487
3324F541487N98020O27680r26092O84573M17440O68684O04124J023752m06581
$$ 6541487 7139507 7767187 6841095 7525668 7943108 8611792 9215916 10239668 9833087
3315I833087Q85449k80367j13482k221591N78240K36590l41551j98026O76341
$$ 9833087 10718536 10438169 10324687 8103096 8681336 8917926 8576375 8378349 9054690
3306I054690j43278J897428K52109k47809R22039K63234j166765L35145P43992
$$ 9054690 8911412 10808840 11060949 10813140 11735179 11998413 10831648 11166793 11910785
3297A1910785j567578M54579O35801k60059J258156J86635J67372P13104M5744
$$ 11910785 10343207 10797786 11433587 11173528 12431684 12618319 12785691 13498795 13544539
3288A3544539M32979K94940N46562J146980J265511J400534K539598Q73088J005399
$$ 13544539 13977518 14272458 14819020 15966000 17231511 18632045 21171643 22044731 23050130
3279B3050130J933804K155770J078240K462362K597540R23927J97810O98445O07653
$$ 23050130 24983934 27139704 28217944 30680306 33277846 34201773 34399583 35098028 35705681
3270C5705681Q69348L3060R82407P66455O48290n61341k197075J274958k687758
$$ 35705681 36575029 36608089 37590496 38356951 39005241 38443900 36246825 37521783 34834025
3261C4834025k059544R83072j562421k22988O78527j375410m18882J288534Q65932
$$ 34834025 32774481 33757553 32195132 31972144 32650671 31275261 30856379 32144913 33010845
3252C3010845J875798J216146M672750L787298L172583P665199N503521P432533
$$ 33010845 34886643 36102789 40775539 44562837 47735420 55400619 60904140 68336673
3244F8336673Q446523Q212238O930262O640886J167741o00701m429460q475003
$$ 68336673 76783196 84995434 91925696 98566582 99734323 99133622 94704162 86229159
3236H6229159o729880r437632p803431o690248p788951o265205m289914m610328
$$ 86229159 79499279 70061647 62258216 55567968 47779017 41513812 37223898 32613570
3228C2613570k438637k584292n63983j613083k149359M1319K1815k192678r76195
$$ 32613570 30174933 27590641 27026658 25413575 23264216 23305535 23327350 21134672 20158477
3219B0158477n57070K14509j27297J377545Q2138k78245m9775R64703J23044R25667
$$ 20158477 19601407 19815916 19688619 21066164 21148302 20870057 20820282 21784985 21908029 22833696
3209B2833696K846917J82198J523028L082621K059662J772685L377811J795639
$$ 22833696 25680613 25862811 27385839 30468460 32528122 34300807 37678618 39474257
3201C9474257J949346K309891J298149J94599J394519l85910J245677K012353
$$ 39474257 41423603 43733494 45031643 45226242 46620761 46234851 47480528 49492881
3193D9492881K65700K585950L393792M449348K499568K576356L411756O424754
$$ 49492881 49758581 52344531 55738323 60187671 62687239 65263595 68675351 75100105
3185G5100105N086136P480706P585363Q989532O903216N847798J984228l294299
$$ 75100105 80186241 87666947 95252310 104241842 111145058 116992856 118977084 115682785
3177A15682785o413867j0641886j0030557j0956997q998395q910907q533898n363628
$$ 115682785 109268918 98627032 88596475 77639478 68641083 59730176 51196278 45832650
3169D5832650n425353m263867l339927m353148j051207j91468k530541j233384
$$ 45832650 40407297 36143430 32803503 28450355 27399148 27207680 24677139 23443755
3161B3443755j937538j571905J54924j099986r87774p35150q31458J418474k62349
$$ 23443755 21506217 19934312 20089236 18989250 18001476 17266326 16434868 17853342 17590993
3152A7590993J338322j98151k053006J259057n29519j007153J201345K72859K00567
$$ 17590993 18929315 18731164 16678158 17937215 17407696 16400543 17601888 17874747 18075314
3143A8075314Q82904q84431J691392j536951k103914K646747J961599l24393L39086
$$ 18075314 18958218 18073787 19765179 18228228 16124314 18771061 20732660 20408267 20747353
3134B0747353J624370K91721K7000K291458j516805N85650J954193J805946Q30114
$$ 20747353 22371723 22663444 22690444 24981902 23465097 24050747 26004940 27810886 28641000
3125B8641000K618784J915506R61406J406419J923224K442974J419490L316617
$$ 28641000 31259784 33175290 34136696 35543115 37466339 39909313 41328803 44645420
3117D4645420L673702L044718M783661N964164M240767O378264P907130R815273
$$ 44645420 48319122 51363840 56147501 62111665 66352432 72730696 80637826 90453099
3109I0453099R026946J0646035J2702750R382624J0191992J1249281N837359L834960
$$ 90453099 99480045 110126080 122828830 132211454 142403446 153652727 159490086 163325046
3101A63325046N067432K671304K060674L844831L594057J027659j295346k093354
$$ 163325046 168392478 171063782 173124456 176969287 180563344 181591003 180295657 178202303
3093A78202303m472044l149917k309116j912201k676074n80549r62867o006712
$$ 178202303 173730259 170580342 168271226 166359025 163682951 163102402 162139535 156132823
3085A56132823o185499o871658q165227j0256584r192365r671558q335650q272650
$$ 156132823 149947324 143075666 134910439 124653855 115461490 105789932 97454282 89181632
3077H9181632n187614n680674n609331n075687l678716m076342k577571j305031
$$ 89181632 83994018 78313344 72704013 67628326 63949610 59873268 57295697 55990666
3069E5990666k853165l343013k113623j994767j81268p21285N71458P89694J525826
$$ 55990666 53137501 49794488 47680865 45686098 45504830 44783545 45355003 46144697 47670523
3060D7670523M632503K332015M859514P011382N319686O798799Q845346P171736
$$ 47670523 52303026 54635041 59494555 66505937 71825623 78624422 87469768 94641504
3052I4641504O195928N777752J925496k544113m986069q037448j0915984r467832
$$ 94641504 100837432 106615184 108540680 105996567 101010498 92973050 82057066 72589234
3044G2589234r571908p345610p381148p090192n787719m072942l955988l445607
$$ 72589234 63017326 55671716 48290568 41200376 35412657 31339715 27383727 23938120
3036B3938120k562899l117553j600604p15169m90910k027064N66807j854885j553159
$$ 23938120 21375221 18257668 16657064 15941895 15450985 13423921 13990728 12135843 10582684
3027A0582684o21509r8753j068393L21384N42606q73914O31153j798988J64504
$$ 10582684 9961175 9862422 8794029 9115413 9658019 8784105 9415258 7616270 7780774
3018G780774k9225j645985R90913n65912p51459Q92064N41566q68169J45137J81935
$$ 7780774 7751549 6105564 7096477 6530565 5779106 6671170 7212736 6344567 6489704 6671639
3008F671639r79384j628750J162612l53246j187724n15256O94449j72749J23876
$$ 6671639 5692255 4063505 5226117 4872871 3685147 3169891 3864340 3691591 3815467
2999C815467J561352j293845k0855k00582j322454J542567j417678j66885J163266
$$ 3815467 5376819 4082974 4062119 3861537 2539083 4081650 2663972 2497087 3660353
2990C660353k053628o68727J194813J47479m58117J96665k69227l84893r33591
$$ 3660353 1606725 937998 2132811 2280290 1822173 2018838 1749611 1364718 431127
2981D31127R40853N68756j310488k5375o16181J890362o38140M36933J97107r36433
$$ 431127 1371980 1940736 630248 604873 -11308 1879054 1240914 1677847 1874954 938521
2971I38521k456360j229065K196571K97765K55716J063896m12946j32128j562621
$$ 938521 -1517839 -2746904 -550333 -252568 3148 1067044 654098 521970 -1040651
2962a040651l05378J190559J16179r54827K73104k3065J129340J472196j413191
$$ -1040651 -1346029 -155470 -39291 -994118 -721014 -744079 385261 1857457 444266
2953D44266j99422J59675j530135J049615r00633K072182n80653K32267k44964
$$ 444266 244844 404519 -1125616 -76001 -976634 1095548 514895 747162 502198
2944E02198j292869J531617J9907o74572j328637Q71679L97687p90901j514723
$$ 502198 -790671 740946 760853 86281 -1242356 -370677 27010 -763891 -2278614
2935b278614K677269Q24500j293563o89564K187356j546182n30059L61366K83778
$$ -2278614 398655 1223155 -70408 -759972 1427384 -118798 -648857 -287491 -3713
2926c713m1398j52356O69337P49554j026927j49881j278428M66953L42930p7193
$$ -3713 -45111 -197467 471870 1221424 194497 44616 -1233812 -766859 -423929 -501122
2916e01122m96657J003242j242855o82868J984115q76820M4459Q48788M41757
$$ -501122 -997779 5463 -1237392 -1920260 63855 -812965 -768506 80282 522039
2907E22039n46891O11722Q66450j984674m57881O5467J189865j244705J728851
$$ 522039 -24852 586870 1453320 -531354 -989235 -923768 266097 -978608 750243
2898G50243P20510p57479M75333j282741M45799l30290J548620n24024O38066
$$ 750243 1470753 713274 1188607 -94134 351665 21375 1569995 1045971 1684037
2889A684037L90569j027386k160166N7603J085043p99776j967943K291610J617641
$$ 1684037 2074606 1047220 -1112946 -1055343 29700 -770076 -2738019 -446409 1171232
2880A171232j450740P53934m62992j161020l25662J578163o78548M01421n95191
$$ 1171232 -279508 474426 11434 -1149586 -1475248 102915 -575633 -174212 -769403
2871g69403P82760q73752J47785R61561p85489j17195O55857M68942M79821m06323
$$ -769403 13357 -860395 -712610 248951 -536538 -653733 2124 471066 950887 544564
2861E44564l55212m13713n31899L48811L71008J33243K49241k58010M89530j294423
$$ 544564 189352 -224361 -756260 -407449 -36441 96802 346043 88033 577563 -716860
2851g16860O62071j053444J508467J634406k030516j34074K18173q12744l984
$$ -716860 -54789 -1108233 400234 2034640 4124 -129950 88223 -724521 -728505
2842g28505K384777j865830O31291l13314m25354j078931J554241J383149q26088
$$ -728505 1656272 -209558 421733 108419 -316935 -1395866 158375 1541524 715436
2833G15436p44896K46257j326762o92979O19722k29232m65679j36379J102874
$$ 715436 -29460 216797 -1109965 -1802944 -1183222 -1412454 -1878133 -2014512 -911638
2824i11638N60887J610084R64885j765200m44608k51698j085171r02135J442426
$$ -911638 -350751 1259333 2224218 459018 14410 -237288 -1322459 -2224594 -782168
2815g82168j60143J145080l82366J661416j647185n53272J536753j23459k6924
$$ -782168 -942311 202769 -179597 1481819 -165366 -718638 818115 694656 667732
2806F67732l42740o3187p20686N99628r7428J460097k142215o62597J588012j637129
$$ 667732 324992 261805 -458881 140747 43319 1503416 -638799 -1301396 286616 -1350513
2796a350513R99199M9191Q87110M38408p54910J588941p32731j837445Q33714
$$ -1350513 -351314 -302123 584987 1023395 268485 1857426 1124695 -712750 120964
2787A20964O3602k53346k08244j502394Q98182P05169p32489J518308N02650r54019
$$ 120964 184566 -68780 -277024 -1779418 -881236 -176067 -908556 609752 1112402 158383
2777A58383O54346L70418K74238j464755k94972p97061j102823j62828R93103
$$ 158383 812729 1183147 1457385 -7370 -302342 -1099403 -2202226 -2365054 -1371951
2768a371951j81483J301579K138514j538134m12132q96747L9647R28683r09002
$$ -1371951 -1553434 -251855 1886659 348525 -63607 -960354 -920707 7976 -901026
2759i01026O36122m04962j219349Q65569J174224p79882P04738M20189k24155
$$ -901026 -264904 -669866 -1889215 -1023646 150578 -629304 75434 495623 271468
2750B71468J42891Q03027j568075j070124k05516l5592l60414O88687J081376
$$ 271468 414359 1217386 -350689 -1420813 -1626329 -1661921 -2022335 -1333648 -252272
2741b52272j25980R40473J017947k769934l95833O61625k99159J217473k29817
$$ -252272 -378252 562221 1580168 -1189766 -1585599 -923974 -1223133 -5660 -235477
2732b35477J27706j76295K98633n64615L44504p83879r8017j93899J422822O24684
$$ -235477 -107771 -284066 14567 -550048 -205544 -989423 -1087440 -1281339 141483 766167
2722G66167j178577L02777j143801M76148n1598j60016m55246k9780l89298j27158
$$ 766167 -412410 -109633 -1253434 -777286 -828884 -988900 -1444146 -1473926 -1863224 -1990382
2712a990382J504866j508265J399854O28193m39786M96214J180152o40910j090158
$$ -1990382 -485516 -1993781 -593927 34266 -405520 90694 1270846 629936 -460222
2703d60222N05064K76537j532244m74349R19787P08274Q498r59259K409930l75223
$$ -460222 44842 321379 -1210865 -1685214 -765427 -57153 -48655 -1007914 1402016 1026793
2693A026793q45350N59902L14844n54891m44499J80833n83545o86247j87728J261918
$$ 1026793 181443 741345 1056189 501298 56799 237632 -345913 -1032160 -1219888 42030
2683D2030j071997N06086P99281j36567l92373m25988Q34792o79226j108688n35465
$$ 42030 -1029967 -523881 275400 138833 -253540 -679528 155264 -523962 -1632650 -2168115
2673b168115K817588j430499r11752J986431L13490k465527P4180J440115j491849
$$ -2168115 649473 -781026 -1692778 293653 607143 -1858384 -1784204 -344089 -1835938
2664a835938R9626J562664j29268p27512M43479Q12191k81200K37137P4558o51349
$$ -1835938 -1736312 -173648 -302916 -1030428 -586949 225242 -55958 181179 255737 -395612
2654c95612j507141N83806J714387p2991l58606O17855m34229q10286O09541N65603
$$ -395612 -1902753 -1318947 395440 322449 -36157 581698 147469 -662817 -53276 512327
2644E12327m76449q90983O1371L11525L89739P81929J51485O94245j67361k294609
$$ 512327 35878 -855105 -793734 -482209 -92470 689459 840944 1535189 1367828 -926781
2634i26781r89939k78132J533248l83511j090O70669L46070m72933O17047J463725
$$ -926781 -1916720 -2194852 -661604 -1045115 -1046205 -375536 -29466 -502399 114648 1578373
2624A578373j0277k092518l26919r94746R49653N40388q07801J46017P13707M69206
$$ 1578373 1568096 -524422 -851341 -1846087 -896434 -356046 -1163847 -1017830 -304123 165083
2614A65083j08170m77617N42191M68241j344093o84115M47592O9125Q7127K9622
$$ 165083 56913 -420704 121487 589728 -754365 -1438480 -990888 -921763 -834636 -805014
2604h05014J406713L66311j209504n55743L62812O04505l39532N03454J99326
$$ -805014 601699 968010 -241494 -797237 -434425 170080 -169452 334002 533328
2595E33328K290010k66075k11318j24619p03299o11775r65678P92580j911407
$$ 533328 2823338 2557263 2345945 2221326 1518027 906252 -59426 733154 -1178253
2586a178253J3118m28385Q53701K237428j625920K83157k93758n18291j62627
$$ -1178253 -1165135 -1593520 -739819 1497609 -128311 154846 -138912 -657203 -819830
2577h19830J540345n24535J71312o62039Q03427o79120J26471J227277j913867
$$ -819830 720515 195980 367292 -294747 508680 -170440 -43969 1183308 -730559
2568g30559J076663j01511M24089j150523n60075K391161o86085j555793M11163
$$ -730559 346104 244593 668682 -481841 -1041916 1349245 663160 -892633 -481470
2559d81470O78665k43505J96126j04060K46694j245161p74692Q39315M29413O29550
$$ -481470 197195 -46310 149816 45756 292450 -952711 -1727403 -888088 -458675 170875
2549A70875j73470m08772o37990Q05262J380515j304818r203J067635o7456j261711
$$ 170875 -2595 -411367 -1049357 -244095 1136420 -168398 -177601 890034 822578 -439133
2539d39133K417015n02999j117734p06134j87012N29432l47907Q72611J220829
$$ -439133 1977882 1474883 357149 -348985 -535997 -6565 -354472 518139 1738968
2530A738968l66042N09842o49208j888814P7812R7901R16710j019974N34897R11993
$$ 1738968 1372926 1882768 1233560 -655254 -577442 -479541 437169 -582805 -47908 864085
2520H64085k7063R18682L58623j640589p05085j72912K30524L87115J513206O22328
$$ 864085 837022 1755704 2114327 473738 -231347 -404259 -173735 213380 1726586 2348914
2510B348914j598281n19533N06023m69296m7683m89979J324108j433062N50036
$$ 2348914 750633 231100 737123 267827 220144 -269835 1054273 -378789 171247
2501A71247J83839K51419O5272Q84292N79426r62772p53743J061223n38281o49463
$$ 171247 355086 606505 671777 1556069 2135495 1172723 418980 1480203 941922 292459
2491B92459k6327O86286m22966P55617k97307R74344L19550k041215p75503L42616
$$ 292459 266132 952418 529452 1285069 987762 1962106 2281656 240441 -535062 -192446
2481a92446q4365K03351Q29041N76328r35004l46372M17627n28543N25194L37225
$$ -192446 -276811 -73460 755581 1331909 396905 50533 468160 -60383 464811 802036
2471H02036K62425k86515K19214l14086P65832p88256q75981J237740M98322l77602
$$ 802036 1064461 777946 997160 683074 1448906 660650 -215331 1022409 1520731 1143129
2461A143129l91844q78508N20523O28344j794275J559762J42625j020148K152319
$$ 1143129 751285 -127223 393300 1021644 -772631 787131 929756 -90392 2061927
2452B061927q39441K04014m53969N20288k45573j516068P13063O19642j125665
$$ 2061927 1222486 1426500 972531 1492819 1247246 -268822 444241 1063883 -61782
2443f1782J607912m30996K53920n66621K60120m37518J557341J342939j134970
$$ -61782 1546130 1115134 1369054 802433 1062553 625035 2182376 3525315 2390345
2434B390345j697859L89011N12528k71740R82575j663866J073582O38253K58133
$$ 2390345 692486 1081497 1594025 1322285 2304860 640994 1714576 2352829 2610962
2425B610962L97166R48643l36752q01491p36746r92450J436109q59975J096060
$$ 2610962 3008128 3956771 3620019 2818528 2081782 1089332 2525441 1665466 2761526
2416B761526k35475M98351m63509o21829p00884m44523J090487n1172l86952M85620
$$ 2761526 2526051 3024402 2560893 1939064 1238180 793657 1884144 1832972 1446020 1931640
2406A931640J13242R73892k91575m86840r41078j2708O75531P84792n1007J48348
$$ 1931640 2044882 3018774 2727199 2240359 1299281 1286573 1962104 2746896 2695889 2844237
2396B844237J131933l22442m09811J29841N01034k82308n8309l76574K367285
$$ 2844237 3976170 3653728 3243917 3373758 3874792 3592484 3534175 3157601 5524886
2387E524886k35488M64415K32339j578717J185059J464482p61380j08182J955506
$$ 5524886 5289398 5753813 5986152 4407435 5592494 7056976 6295596 6187414 8142920
2378H142920o27709q35031l41855J004358J019832j162061J006899L80376p96939
$$ 8142920 7515211 6680180 6338325 7342683 8362515 7200454 8207353 8587729 7790790
2369G790790N32774N57417r89642M76456M95723O58615J155898j31589K881654
$$ 7790790 8323564 8880981 7891339 8367795 8863518 9522133 10678031 10546442 13428096
2360A3428096q20674j91383J442660n4112p02353J65316K766910m7045J604768
$$ 13428096 12607422 12416039 13858699 13804587 13102234 13267550 16034460 15987415 17592183
2351A7592183K931135K138454J376684L390357K760975L251850K055459L402726
$$ 17592183 20523318 22661772 24038456 27428813 30189788 33441638 35497097 38899823
2343C8899823M352524J295932K877787K270356L542798L657353P815061P757295
$$ 38899823 43252347 44548279 47426066 49696422 53239220 56896573 64711634 72468929
2335G2468929R651924J6548584K6264626M6482674O3244346P2297767P5803984
$$ 72468929 82120853 98669437 124934063 171416737 234661083 306958850 382762834
2328C82762834N3563161n151429m7445803o5087940o9081974o4040350m4967093
$$ 382762834 436325995 431174566 383728763 318640823 249558849 185518499 140551406
2321A40551406l2149882k4781671j8591835j3652302r497420m774544k732134
$$ 140551406 108401524 83619853 65028018 51375716 41878296 37103752 34371618
2314C4371618m091674j574235l250792l896207k532938k470541k577136j209520
$$ 34371618 30279944 28705709 25454917 21558710 19025772 16555231 13978095 12768575
2306A2768575q9033m9943j175454k65296l219k275955m56055j168132o41034P80334
$$ 12768575 12679542 12629599 11454145 11188849 11185630 8909675 8453620 7285488 6644454 7424788
2296G424788l49224j135740J457717j276237N68076l1637K11152p0756j009873
$$ 7424788 7075564 5939824 7397541 6121304 6689380 6657743 6868895 6798139 5788266
2287E788266J020001j692164j916095J170942R07185j651872K7023J646456j213355
$$ 5788266 6808267 5116103 3200008 4370950 5278135 3626263 3653286 5299742 4086387
2278D086387j076409j23058N28908N81774j422130n22605q01111J532766j389008
$$ 4086387 3009978 2886920 3415828 3997602 2575472 2052867 1251756 2784522 1395514
2269A395514R16497n34157L50152p69629K04916O5477n18752J077086O4205j021016
$$ 1395514 2312011 1777854 2128006 1358377 1563293 1628770 1110018 2187104 2251309 1230293
2259A230293k08510J046131r84790L17613L5536L36008n70647j874110N93566
$$ 1230293 1021783 2067914 1083124 1400737 1436273 1772281 1201634 -672476 -78910
2250g8910P84172o21924N7558J311835r24586j71119M62013o43916k0052R87098
$$ -78910 705262 83338 140896 1452731 528145 357026 819039 175123 155071 1142169
2240A142169p13416l36150N31537m62866o52815L37460J76339p22909j192231
$$ 1142169 428753 92603 624140 161274 -491541 -154081 22258 -700651 -1892882
2231a892882R36488r09770J640106J297424p32327k59430J091853j813196q37120
$$ -1892882 -956394 -1866164 -226058 1071366 339039 79609 1171462 -641734 -1478854
2222a478854M52345m17386J556458q2537k54949m5085r8175J196329m03287p62224
$$ -1478854 -1026509 -1443895 112563 30026 -224923 -270008 -368183 828146 424859 -337365
2212c37365M72520o82547n28744J098245R83594q93375m84066r16510O43210n06884
$$ -337365 135155 -547392 -1076136 22109 1005703 112328 -371738 -1288248 -645038 -1151922
2202a151922O22771P47773k863701K351491r194o86152J403412M14856p42174
$$ -1151922 -529151 218622 -2645079 -293588 -302782 -988934 414478 829334 87160
2193H7160J589832j476796n7328q90116j285667J758801j580176J561455P29744
$$ 87160 1676992 200196 142868 -747248 -2032915 -274114 -1854290 -292835 436909
2184D36909r47866J456501k69116j639271J522141j934516Q02125M13442l74771
$$ 436909 -510957 945544 676428 -962843 559298 -1375218 -573093 -159651 -534422
2175e34422l19056L09931n09766L19452R19543q61589r8155k91627Q73090n99420
$$ -534422 -853478 -543547 -1053313 -733861 185682 -675907 -774062 -1065689 -192599 -792019
2165g92019l40862J396628j452612l67296J29522J119376p57054J157750q93049
$$ -792019 -1132881 263747 -1188865 -1556161 -1426639 -307263 -1064317 93433 -799616
2156g99616R7057N42099j981827O46788O82768P23708j442520P45407P69673k32530
$$ -799616 -702559 -160460 -2142287 -1495499 -812731 -89023 -1531543 -786136 -16463 -248993
2146b48993J342228r94322r33283K5569j05844j384180J739619O57242j675791
$$ -248993 1093235 98913 -834370 -808801 -914645 -2298825 -559206 98036 -1577755
2137a577755K65651M84967M21304J00355R6573L13248J17110R14802j348663k57237
$$ -1577755 -1312104 -827137 -405833 -305478 -208905 104343 221453 1136255 -212408 -469645
2127d69645Q28684l09090j536465J335507j442405O82172J287161k442651K979848
$$ -469645 359039 49949 -1486516 -151009 -1593414 -911242 375919 -2066732 913116
2118I13116j397315j458282J840966J278273l61898j106841n69681J326527k454683
$$ 913116 -484199 -1942481 -101515 1176758 814860 -291981 -861662 464865 -1989818
2109a989818l86924J096601o06733L38258J893954J42738P83434j649637m12004
$$ -1989818 -2376742 -1280141 -1886874 -1548616 345338 488076 1271510 -378127 -790131
2100g90131p70664J28056J872686j435857N17178K87626J506758k054776Q55448
$$ -790131 -1560795 -1432739 439947 -995910 -478732 -191106 1315652 -739124 116324
2091A16324l32599n43232K80319M1417j5836l39313J246278q70915R33108m15799
$$ 116324 -216275 -759507 -479188 -437771 -453607 -792920 453358 -417557 515551 99752
2081I9752l68939P37085K17044K04608o55628k001013o19114J427901J17606Q6104
$$ 99752 -269187 467898 684942 889550 233922 -1767091 -2386205 -958304 -840698 -754594
2071g54594K28407M90558k04861m5062Q47928O9093k298793L41179J798116P58513
$$ -754594 -526187 -35629 -240490 -285552 562376 631469 -1667324 -1326145 471971 1230484
2061A230484p51504M63612K128036j588154k86024n09712j141727o82088K588971
$$ 1230484 478980 942592 3070628 1482474 1196450 686738 -454989 -1137077 1451894
2052A451894j89730j10380J310236j586725l12343L9932R39041k136124j39922
$$ 1451894 1262164 1151784 2462020 875295 562952 602884 1541925 -594199 -734121
2043g34121J037371j116295M35685P33497j033709J89270J026294N09783o98150
$$ -734121 303250 -813045 -377360 356137 -677572 -488302 537992 1047775 349625
2034C49625k68095L60091j068089M06723K68501k00482j438902J543840J191219
$$ 349625 81530 441621 -626468 -219745 48756 -151726 -1590628 -46788 1144431
2025A144431j094406m64418J133946n38094o27729R96445q42903L30926K39183
$$ 1144431 50025 -414393 719553 181459 -446270 550175 -292728 38198 277381
2016B77381M03365m26682J8578p36817j25561L51542j570597N37143J28719M75469
$$ 277381 680746 254064 272642 -464175 -589736 -238194 -1808791 -1271648 -1142929 -667460
2006f67460l54588K189711N10524j572675L21715J018718k073596k43791R94850
$$ -667460 -1022048 1167663 1678187 105512 427227 1445945 -627651 -871442 123408
1997A23408L94517m2604J0130L86919j075930o13969R0560j74891J102945n10129
$$ 123408 517925 475321 485451 872370 -203560 -817529 -726969 -901860 201085 -309044
1987c09044l99043J373794q68076m06054j150861k50405J724161l72978l01873
$$ -309044 -708087 665707 -202369 -608423 -1759284 -2009689 -285528 -658506 -960379
1978i60379J361327j261564J61277P84804J77110j517425J250249K58271r69718
$$ -960379 400948 -860616 -699339 85465 262575 -1254850 -4601 253670 -716048
1969g16048L16137J835078l89576j437171Q21925J192330j423761j779432J362930
$$ -716048 -399911 1435167 1045591 -391580 430345 1622675 198914 -1580518 -217588
1960b17588r91252j57407J209698q49855P88768J815562j135455n90646J027464
$$ -217588 -1208840 -1366247 -156549 -1006404 -217636 1597926 462471 -128175 899289
1951H99289q51562j519266R41492J256454q0456j064778J205889P70432k293795
$$ 899289 47727 -1471539 -530047 726407 645951 -418827 787062 1557494 -736301
1942g36301Q61227J08950o49495J502021m16589n05150o87915k90249P00776M84222
$$ -736301 124926 233876 -415619 1086402 669813 164663 -523252 -813501 -112725 371497
1932C71497r9077l21300q13363j228958Q58056P13085j369491J69591Q13075K35842
$$ 371497 272420 -48880 -862243 -2091201 -1233145 -520060 -1889551 -1719960 -906885 -671043
1922f71043P1892R02719K52099j693345R19151n73782n91420k62850p80870P47135
$$ -671043 -599151 303568 555667 -1137678 -218527 -792309 -1383729 -1646579 -2427449 -1680314
1912a680314J180727L68319m54629M75510r925L98653j446628K07826J072546
$$ -1680314 -499587 -131268 -585897 -110387 -120312 278341 -1168287 -960461 112085
1903A12085j175646l08190K67284J246586N50912j406403j59902J259006L76588
$$ 112085 -1063561 -1371751 -1104467 142119 693031 -713372 -873274 385732 762320
1894G62320k40015r256J54583K49870M9574j650636J301560j280231J002449P40420
$$ 762320 522305 513049 667632 917502 967076 -683560 618000 -662231 340218 1080638
1884A080638j827666K589221O37187j640121j561182J919943j332475j246327
$$ 1080638 -747028 1842193 2479380 839259 -721923 1198020 -134455 -1380782
1876a380782L13822P74938l38575O40006J11560m47403l09752n58519L88173J212606
$$ -1380782 -1066960 -292022 -630597 9409 120969 -326434 -636186 -1194705 -806532 406074
1866D06074j821816r3049Q77037k78173Q17393j053002J148201j671224J46166
$$ 406074 -1415742 -1508791 -631754 -909927 -92534 -1145536 2665 -1668559 -1522393
1857a522393P63492R26253K22583l60098j354527M31552j05110m90827J358362
$$ -1522393 -758901 167352 389935 29837 -1324690 -893138 -998248 -1489075 -130713
1848a30713m73557q95239R55468O37108p39262R41313N13650j583761L86305J63536
$$ -130713 -604270 -1499509 -544041 93067 -646195 295118 808768 -774993 -388688 -225152
1838b25152j409627J811330N02684j070510p3740N71449m84952n45506R98086
$$ -225152 -1634779 176551 679235 -391275 -465015 106434 -378518 -924024 74062
1829G4062j5020O67969p81976M09907o13440k55781P47120m4307j426009m74508
$$ 74062 59042 727011 -54965 354942 -258498 -514279 232841 188534 -1237475 -1711983
1819a711983R26620L80216l62273L4359J66120Q9044m99972N79839P34902L00617
$$ -1711983 -785363 -405147 -767420 -733061 -566941 -477897 -977869 -398030 336872 637489
1809F37489j563388j377270L40584J090408j01909o28076J813662k003487O28262
$$ 637489 -925899 -2303169 -1962585 -872177 -974086 -1602162 211500 -1791987 -1163725
1800a163725Q03317r79387k97363K74438O56376m41070l68135J884159j352738
$$ -1163725 -360408 -1339795 -1637158 -1362720 -706344 -1147414 -1515549 368610 -984128
1791i84128m63689m16715O69507Q05823K30949r43206K548214r96572p50898J694295
$$ -984128 -1447817 -1864532 -1195025 -389202 -158253 -1101459 1446755 450183 -300715 1393580
1781A393580j649913P04510J02698O97057q54279n99053J199286o75462j839672
$$ 1393580 -256333 448177 550875 1247932 393653 -205400 993886 318424 -1521248
1772a521248J218774N10760p57510J793172j39903m82153k75002K23152r07911
$$ -1521248 -302474 208286 -549224 1243948 1104045 621892 346890 570042 -337869
1763c37869O06935K02072q96506k17321J60555K44856k37228J456693M38185j020235
$$ -337869 269066 471138 -425368 -642689 -482134 -237278 -474506 982187 1420372 400137
1753D00137r28404J059556n97449K8023j06933q55250j173415M34846K334014
$$ 400137 -528267 531289 -66160 -38137 -145070 -1000320 -2173735 -1738889 595125
1744E95125N53727o94549n7693L79848j732323L23378R32306p03500r73590M08648
$$ 595125 1148852 454303 396610 776458 -955865 -632487 299819 -403681 -1377271 -968623
1734i68623O1601J518713n84371j021577Q36553j85045J16404j645703Q65982
$$ -968623 -907022 611691 27320 -994257 -157704 -342749 -226345 -1872048 -1006066
1725a006066o64272K55728J087279j663956j360817O10820O44135N27446q57734
$$ -1006066 -1670338 -1414610 -327331 -1991287 -3352104 -2741284 -2097149 -1569703 -2427437
1716b427437Q94435J198711j264484J157631O45381j303570o44026j429724P30973
$$ -2427437 -1533002 -334291 -1598775 -441144 204237 -1099333 -1743359 -3173083 -2442110
1707b442110R80394J117737j136758p81375R61175N48025j376823l84134Q13787
$$ -2442110 -1461716 -343979 -1480737 -2262112 -1300937 -752912 -2129735 -2513869 -1700082
1698a700082R74190L2123O53826j019658j380839K066718m1187j813365J233737
$$ -1700082 -725892 -693769 -39943 -1059601 -2440440 -373722 -414909 -2228274 -994537
1689i94537N98228q32993M00962L74224O80725o20662p98355J339879J605703
$$ -994537 -396309 -1229302 -828340 -454116 226609 -394053 -1192408 147471 1753174
1680A753174j394906P9878l24116o49887j276371k39043L56799M9203R24559K216737
$$ 1753174 358268 438146 114030 -535857 -1812228 -2051271 -1694472 -1645269 -720710 1496027
1670A496027j199155m67316L76901j093806p2395O6991N7880q66524L15952L031566
$$ 1496027 296872 -170444 206457 -887349 -959744 -892753 -834873 -1701397 -1385445 1646121
1660A646121n19740r48703K49948j307696K1407m40850L47590l33245O06649J152133
$$ 1646121 1126381 177678 427626 -880070 -858663 -1299513 -951923 -1285168 -678519 473614
1650D73614j183811J145190Q9653J34500j095584O01260j93116m30659j460909
$$ 473614 -710197 434993 524646 659146 -436438 164822 -28294 -458953 -1919862
1641a919862R58973o00788q95510K872272k914112M81239J762083N38765n46200
$$ -1919862 -960889 -1561677 -2457187 415085 -2499027 -2017788 -255705 283060 -263140
1632b63140k42615N00841O90819p03429r86806L02060o8477r71513N97768j026314
$$ -263140 -505755 -4914 685905 -17524 -1004330 -702270 -770747 -1742260 -1144492 -2170806
1622b170806J387611N38620J6720m6974L95155R90574q85212l04531K76850R16916
$$ -2170806 -783195 -244575 -227855 -274829 120326 1110900 225688 -78843 198007 1114923
1612A114923k445474L34739p51411K35710J237772o17331M35942J234556N52661
$$ 1114923 -1330551 -995812 -1747223 -1511513 -273741 -891072 -455130 779426 1332087
1603A332087m86768o23174p31030J033882j238140l91681m05981l278R06908m52196
$$ 1332087 845319 222145 -508885 524997 -713143 -1104824 -1510805 -1514083 -607175 -1059371
1593a059371M97389J739429j575142m2761O53094J06907j697187J50027J714446
$$ -1059371 -561982 1177447 -397695 -440456 212638 319545 -1377642 -1227615 486831
1584D86831o04359p50489J777994R18430j962869k83516j16377J82077j873058
$$ 486831 -117528 -868017 909977 1828407 -134462 -417978 -534355 -352278 -2225336
1575b225336J96682K832421j373199R74113q24896o81363J150613q36024R49362
$$ -2225336 -2028654 803767 -569432 404681 -420215 -1101578 49035 -786989 162373
1566A62373n97696k21873R01101j67545o46458n41031J387325J44209K17990j70160
$$ 162373 -435323 -657196 243905 76360 -570098 -1111129 276196 420405 638395 468235
1556D68235n9106r5588k127990J141458K09961n04527r75244L061339P69547r56035
$$ 468235 409129 313541 -1814449 -672991 -463030 -967557 -1942801 1118538 1888085 932050
1546I32050M69899j250895l53889l42309O86615j204891n80460J990314n53768
$$ 932050 1401949 151054 -202835 -545144 141471 -1063420 -1643880 346434 -207334
1537b07334J156355q0908j577549j52687P36018Q90075J453039j054206k735951
$$ -207334 949021 868113 -709436 -862123 -126105 763970 2217009 1162803 -1573148
1528a573148Q19640o9071K96229j178376M87539l77242k61035K120682Q28775
$$ -1573148 -753508 -822579 -526350 -1704726 -1217187 -1594429 -1855464 265218 1093993
1519A093993L26990n35722M59526k73952J24078j311547j50358k8945o69917J30576
$$ 1093993 1420983 885261 1344787 1070835 1194913 -116634 -266992 -295937 -965854 -835278
1509h35278q63159M54569M20191K507337N12309o62405j157411m93395K7849M04067
$$ -835278 -1698437 -1243868 -823677 1683660 2195969 1533564 376153 -117242 -89393 314674
1499C14674L78842j074031J629604k412562P88986J090843O2597j553995R40872
$$ 314674 693516 -380515 1249089 -1163473 -374487 716356 778953 -775042 165830
1490A65830n76804P10261K07745P62098j628336R13757j04750j043440l53467
$$ 165830 -410974 299287 507032 1269130 -359206 554551 449801 -593639 -947106
1481i47106N83769J277496j833071P44783n28484k54595P46846k03496k26515
$$ -947106 -363337 914159 -918912 -174129 -702613 -957208 -210362 -413858 -640373
1472f40373J46344N0613o79796m3100K64222Q89519j129206k82025P04290n24777
$$ -640373 -494029 -443416 -1123212 -1166312 -902090 -12571 -1141777 -1423802 -719512 -1244289
1462a244289J097634j610079j2382J385697j692912l78734K070825p12127k70075
$$ -1244289 -146655 -1756734 -1769116 -383419 -2076331 -2455065 -384240 -1096367 -1366442
1453a366442k2597k00962r3878J275958J10742M81079k56375m8028j224557J041073
$$ -1366442 -1389039 -1590001 -1683879 -407921 -297179 183900 -72475 -120503 -1345060 -303987
1443c03987n04615n39169O73243j084463J72613O64260k43908L73756j90499O32165
$$ -303987 -808602 -1347771 -674528 -1758991 -1586378 -922118 -1166026 -792270 -982769 -350604
1433c50604q66545J066424o35863O37376j96685P86555j672858j244870p36390
$$ -350604 -1217149 -150725 -786588 -149212 -345897 440658 -1232200 -2477070 -3213460
1424c213460P42214M98028O714k9498Q06748M67762j21661J140893n22704r66920
$$ -3213460 -2471246 -1973218 -1966504 -1996002 -1189254 -721492 -843153 297740 -224964 -1191884
1414a191884J1233l43649p43947Q22702r3924j694433J582368J17561j110633
$$ -1191884 -1180651 -1524300 -2268247 -1445545 -1539469 -3233902 -1651534 -1533973 -2644606
1405b644606J109201J516945l4308J028004l99056k425582k91096N73937N90538
$$ -2644606 -1535405 -18460 -52768 975236 576180 -1849402 -2140498 -1566561 -976023
1396i76023M75088J698323j538409L2549J90381m23501j282225j113736Q72617
$$ -976023 -500935 1197388 -341021 -308472 -118091 -541592 -1823817 -2937553 -2064936
1387b064936N15639j19050J609404P81093N62731N87538q39339j274979j73898
$$ -2064936 -1549297 -1668347 -58943 722150 1284881 1872419 1033080 -241899 -415797
1378d15797j010360p97602n13118J406310n79614p92667J856759J382111N15327
$$ -415797 -1426157 -2223759 -2736877 -1330567 -1910181 -2702848 -846089 536022 1051349
1369A051349m750p47987m55804l71623L79172j501425o6366R58887j277176K00900
$$ 1051349 1046599 298612 -157192 -528815 -149643 -1651068 -1717434 -758547 -2035723 -1834823
1359a834823N28351l076K96434M20188K052261j272548j029805l2820L71144r31691
$$ -1834823 -1306472 -1309548 -1013114 -592926 1459335 186787 -843018 -875838 -504694 -1436385
1349a436385J633333L14617o58993k2587j096869K14807J172929j328578j186219
$$ -1436385 196948 511565 -147428 -170015 -1266884 -1052077 120852 -1207726 -2393945
1340b393945J709741p05738J602243j302118J248686J371545k026923J512978
$$ -2393945 -684204 -1389942 212301 -1089817 158869 1530414 -496509 1016469
1332A016469K07128j379442J9769Q08177n96290j647424N65969R86924j927734
$$ 1016469 1223597 -155845 -136076 672101 75811 -1571613 -1005644 -18720 -1946454
1323a946454J463823J816228j141949j584970N24285J501646q15532o54040J512637
$$ -1946454 -482631 1333597 191648 -1393322 -869037 632609 -182923 -836963 675674
1314F75674o11839j932358P35248J95376J11435m30591J409324k29943l17662
$$ 675674 63835 -1868523 -1133275 -937899 -826464 -1257055 152269 -77674 -395336
1305c95336m21158o01883J606873o77859J017093j601721L87609k99987J090057
$$ -395336 -816494 -1418377 188496 -489363 527730 -1073991 -686382 -986369 103688
1296A03688o22704Q82941j374910r79096J215672j246171J178524L50161j9382
$$ 103688 -519016 363925 -1010985 -1990081 -774409 -2020580 -842056 -491895 -511277
1287e11277m47011m36646o59916J267188m26745M10903o9495j1121J009645j290131
$$ -511277 -958288 -1394934 -2054850 -787662 -1214407 -803504 -872999 -884120 125525 -1164606
1277a164606R52423K9893j308546o5388j131100M90227J122989j86341J213747
$$ -1164606 -212183 -182290 -1490836 -1556224 -2687324 -2197097 -1074108 -1260449 -46702
1268d6702k80380q37170L086135j649033k273092K387185l3948j842206M95165
$$ -46702 -327082 -1164252 1921883 272850 -2000242 386943 352995 -1489211 -994046
1259i94046o65502m30732J157927L14068o11513O96954p43496K155325j042142
$$ -994046 -1659548 -2090280 -932353 -618285 -1229798 -532844 -1276340 878985 -163157
1250a63157J142988J253495l738637j8127J400541n38016l93538Q54274j395969
$$ -163157 979831 2233326 -1505311 -1523438 -122897 -660913 -1054451 -200177 -1596146
1241a596146P51382J54156R73622j193034p51754J535573J017805j495853j65956
$$ -1596146 -844764 -690608 283014 -910020 -1661774 -126201 891604 -604249 -770205
1232g70205L47523O7803m01415Q131j255622j070415J489871l64960K093302q79877
$$ -770205 -422682 -354879 -756294 -748163 -2003785 -3074200 -1584329 -1949289 144013 -735864
1222g35864K57123l46150k07211P23567J914259j930785j520122j37860J386790
$$ -735864 -478741 -824891 -1032102 -308535 1605724 -325061 -1845183 -1983043 -596253
1213e96253J89214o97194N00695r28397n7136R87626l07307l33464Q45853j34365
$$ -596253 -407039 -1104233 -603538 -1531935 -1589071 -601445 -908752 -1242216 -396363 -530728
1203e30728m32145l23656P86147p66878p51237K216775J55368m14745j997110
$$ -530728 -962873 -1286529 -500382 -1267260 -2018497 198278 353646 -61099 -2058209
1194b058209J909087J47129j136309L63844l83559l92648N66104Q47103j345488
$$ -2058209 -149122 -1993 -1138302 -774458 -1158017 -1550665 -984561 -137458 -1482946
1185a482946N49013j16304l26359J098760o14062J179589j261066Q10J130438
$$ -1482946 -933933 -1050237 -1376596 -277836 -891898 287691 -973375 -972565 157873
1176A57873o57079l64370L06252j60538N58091j095717n06654J819596l34902
$$ 157873 -499206 -863576 -557324 -717862 -159771 -1255488 -1762142 57454 -277448
1167b77448M32134O23575O7494j113313M01721n89950J332517j252687m77528
$$ -277448 154686 778261 845755 -267558 134163 -455787 876730 -375957 -853485
1158h53485m89324J346361q21544O17146O12425n38826O37569j756430J961293
$$ -853485 -1342809 3552 -817992 -200846 411579 -127247 510322 -1246108 715185
1149G15185q82437J65932J243303k170111n39730K22555n74383M87829J076415
$$ 715185 -167252 -1320 1241983 -928128 -1467858 -1245303 -1819686 -1331857 -255442
1140b55442j404921N74344o96767J572110Q01109M98715o61819L2227j488323
$$ -255442 -1660363 -1086019 -1782786 -210676 590433 1089148 427329 459556 -1028767
1131a028767O11734m98247q61923J5655M70545J365601p1658l90145Q25660j96703
$$ -1028767 -417033 -915280 -1777203 -1761548 -1291003 74598 2940 -387205 438455 241752
1121B41752j501669J377596l95662n69222L20977J406960n23698j302669P95914
$$ 241752 -1259917 117679 -277983 -847205 -526228 880732 357034 -945635 -149721
1112a49721L51081l04915J195257N8459n30864j201875k43515J454822J80910
$$ -149721 201360 -103555 1091702 1150161 619297 -582578 -826093 628729 809639
1103H09639o87741n92249K567173O4507j079900J353669k336947p91201m21411
$$ 809639 121898 -470351 2096822 2161329 1081429 2435098 98151 -693050 -1114461
1094a114461Q38404P12535r99844J406416r43126N7948j249213K29829j044728
$$ -1114461 -276057 436478 -563366 843050 -100076 -42128 -1291341 -1061512 -2106240
1085b106240O09969J596638r85912j47825L02943l18521j607468P80592m39659
$$ -2106240 -1496271 100367 -885545 -1033370 -730427 -1048948 -2656416 -1875824 -2315483
1076b315483j116387J092620J534981k42711N957J482882m37143m60843n31263
$$ -2315483 -3431870 -2339250 -804269 -1046980 -1041023 441859 4716 -456127 -987390
1067i87390m19884P05511j737706M21838r96901M63138M12898m27787K655726
$$ -987390 -1407274 -701763 -2439469 -2017631 -3014532 -2551394 -2138496 -2566283 89443
1058H9443k22374J66096K56304j043884L81965m6700q54242p48222J484829o40147
$$ 89443 -132931 33165 289469 -754415 -372450 -419150 -1273392 -2021614 -536785 -1176932
1048a176932O85764M39452k094970Q65666J096038j743889J938154j06089j056420
$$ -1176932 -491168 -51716 -2146686 -1281020 -184982 -1928871 9283 -96806 -1153226
1039a153226L2940R30661N6587l28175j70104j193401l34821L76335j017506m90447
$$ -1153226 -1120286 -189625 -133038 -461213 -631317 -1824718 -2159539 -1783204 -2800710 -3291157
1029c291157J581369q3807L22508Q20397L69290o49744R3544J193642j337882
$$ -3291157 -1709788 -1793595 -1471087 -650690 -281400 -931144 -837600 356042 -981840
1020i81840m59721L91719j435036P85352N81459j27410o99236O17255R90321L04314
$$ -981840 -1441561 -1049842 -2484878 -1699526 -1118067 -1245477 -1944713 -1327458 -337137 -32823
1010c2823p73913R34725K10210j885960P43707P56179j551010K12964R19300l13597
$$ -32823 -806736 127989 338199 -1547761 -804054 -47875 -1598885 -1385921 -466621 -780218
1000g80218N51868O24645j707821j547628J461313M37185K19930P55167N09284
$$ -780218 -228350 396295 -1311526 -2859154 -1397841 -960656 -740726 14441 523725
991E23725j077773R88969l96173R28105m21744o52016o32114k49119J4729J1925
$$ 523725 -554048 434921 38748 966853 545109 -106907 -739021 -988140 -973411 -961486
981i61486J238936J156015r26887K29550J630141k594857J049660R88560p44900
$$ -961486 277450 1433465 506578 736128 2366269 -228588 821072 1809632 1064732
972A064732k037109o40749Q84385P04699L75527J194423j273339j466404P98557
$$ 1064732 -972377 -1613126 -728741 -24042 351485 1545908 272569 -1193835 -395278
963c95278j37940P35616j244002J495330o02721J99267O63430N53589N41537p00715
$$ -395278 -533218 202398 -1041604 453726 -148995 50272 713702 1267291 1808828 1108113
953A108113n49354j400664K50395K52363j191547P81936K041280j396328q89528
$$ 1108113 558759 -841905 -591510 -339147 -1530694 -748758 1292522 -103806 -993334
944i93334J449510J623196K22884j541217N00062j647493j165697K008099j134889
$$ -993334 456176 2079372 2302256 761039 1261101 -386392 -1552089 456010 -678879
935f78879p06885j51678J568819J60842Q69469p33834M1205J80014o86570M62257
$$ -678879 -1385764 -1537442 31377 192219 1061688 327854 369059 549073 -137497 324760
925C24760M24417k55705m29243n00555R90582q59954j455680N04446J87864k53690
$$ 324760 749177 493472 64229 -436326 554256 -305698 -1761378 -1256932 -1069068 -1322758
915a322758J335868j79879L23252j26187K084318J252814l213013j25824R4787
$$ -1322758 13110 -166769 156483 30296 2114614 3367428 154415 28591 123378
906A23378j7417j042805k80932o51655N93517J445261j224764J721725J085964
$$ 123378 105961 -936844 -1217776 -1869431 -1275914 169347 -1055417 666308 1752272
897A752272r64142p71307J270130j67092j554410p42259J587267J7688o55398
$$ 1752272 788130 16823 1286953 1119861 -434549 -1176808 410459 428147 -227251
888b27251J030022j649121J032197l82272p7053L00249j164770L19331N8267K47119
$$ -227251 802771 -846350 185847 -196425 -273478 26771 -1137999 -818668 -760401 -513282
878e13282K245278p73938p45324l95813j98705o97819o57025N03958O85032J752232
$$ -513282 1731996 958058 212734 -183079 -381784 -1079603 -1736628 -1232670 -547638 1204594
868A204594j366004n53217O15979K173799j289030j271236J785471j415207m44451
$$ 1204594 -161410 -714627 -98648 2075151 786121 -485115 1300356 -114851 -559302
859e59302L43585R27375j4422j273432m96159j83199J163368Q97512j008088p38165
$$ -559302 -215717 711658 697236 -576196 -1072355 -1255554 -92186 805326 -202762 -940927
849i40927J259162o89017j16474j90624R87992M16470k081109J082674N47236
$$ -940927 318235 -370782 -487256 -677880 310112 726582 -1354527 -271853 275383
840B75383r31333J087408K87808m54387q82823n22671L14625J85686J470213j846251
$$ 275383 -655950 431458 719266 264879 -617944 -1140615 -825990 -640304 829909 -1016342
830a016342L27635J021218m55617J001103n78000j44161M33566J52073j649554
$$ -1016342 -688707 332511 -123106 877997 299997 155836 589402 741475 -908079
821i08079J403749p2807j393940n41235J461245Q86250j066779K211K00654p97840
$$ -908079 495670 422863 -971077 -1512312 -51067 835183 -231596 -229385 -28731 -826571
811h26571L60842l20044l21261J863860k86909l16071o4033K62090n09627l6097
$$ -826571 -465729 -785773 -1107034 756826 469917 153846 89813 351903 -157724 -193821
801a93821j091501k16483J388492o15315J397892q53072R27947L79667k553108
$$ -193821 -1285322 -1501805 -113313 -728628 669264 -183808 744139 1123806 -1429302
792a429302O69436J893982j484482j296187K292080j722155J27424r36485J254119
$$ -1429302 -759866 1134116 -350366 -1646553 645527 -1076628 -949204 -1885689 -631570
783f31570j06173k24205N86451K40530j258763J884097j098613k56314J607474
$$ -631570 -737743 -961948 -375497 -134967 -1393730 490367 -608246 -864560 742914
774G42914j110981j276409l12463l66448M53710J467852l077675K352663M54550
$$ 742914 -368067 -1644476 -1956939 -2323387 -1869677 -401825 -3479500 -1126837 -672287
765f72287l20067O25819M31680O54340j512734N8247r90334N26201q44890J569134
$$ -672287 -992354 -366535 65145 719485 -793249 -735002 -1725336 -1199135 -2044025 -474891
755d74891r64835J449572P25072j721362J349558k82597N64830j282557p63723
$$ -474891 -1439726 9846 734918 -986444 363114 80517 645347 -637210 -1400933
746a400933N38110L8319n94565J780038Q16457j930809O47773m69276K14431M91267
$$ -1400933 -862823 -824504 -1419069 360969 1177426 -753383 -105610 -574886 -360455 130812
736A30812j033893K82250P95297k12297n14210L79077j302630J116939k52847
$$ 130812 -903081 -620831 174466 -37831 -552041 -172964 -1475594 -358655 -611502
727f11502k13431J300001r53291r2279j711425J19630J950772k19968q3366J250925
$$ -611502 -824933 475068 -478223 -570502 -2281927 -2162297 -211525 -431493 -514859 736066
717G36066K21238N5897n766j196796k03300R86536j370806q1351Q91156R18704
$$ 736066 957304 1013201 1007435 -189361 -392661 593875 -776931 -858282 32874 951578
707I51578k72667J69684R00198j661279n85363M23350J74297j158821Q81160j62220
$$ 951578 678911 848595 1748793 87514 -497849 -74499 99798 -1059023 -177863 -340083
697c40083n19797P5182K54965J709263m96548j89055Q95625j718979k06707l16328
$$ -340083 -859880 -784698 -529733 1179530 682982 493927 1389552 -329427 -536134 -852462
687h52462J91638O84593r11449n86476J216738P3102N27699j52224P07778j216813
$$ -852462 -660824 23769 -887680 -1474156 -257418 -184316 343383 191159 898937 -317876
677c17876N1994J95274L18311j396745J01724Q34323L218p01285P85828l31876
$$ -317876 -265882 -70608 247703 -1149042 -1047318 -212995 -209777 -911062 -125234 -457110
667d57110o3702J166373p18445j23855p64588J170290J356422j826063j66913
$$ -457110 -520812 645561 -72884 -196739 -961327 208963 1565385 -260678 -427591
658d27591n65592p80435l36692J057386K66029M99642m87329N53333l17799N02427
$$ -427591 -993183 -1773618 -2110310 -1052924 -786895 -287253 -774582 -221249 -539048 -36621
648c6621J69407k185209J377470J401776j459845k44713O48475m40889j47162
$$ -36621 132786 -2052423 -674953 726823 -733022 -977735 -329260 -770149 -917311
639i17311m44384M62671j422937Q94078J557219O94181L88279j016119K27389
$$ -917311 -1361695 -899024 -2321961 -1427883 129336 823517 1211796 195677 423066
630D23066K72833Q8164M74549m63311j170467M76150M24226k84346o95958R93261
$$ 423066 695899 784063 1258612 795301 -375166 100984 525210 240864 -455094 538167
620E38167J159720k422097L052481p06117k413691O91125r22569J204468p19016
$$ 538167 1697887 -724210 2328271 1622154 -791537 -100412 -1022981 181487 -537529
611e37529n63894P14596l11012Q95601R61191k008198L75153o3088N6304J412151
$$ -537529 -1101423 -386827 -697839 197762 1158953 -849245 -474092 -537180 -480876 931275
601I31275j523416J271505j017538M15005R67047o42920j554669K86688J62833
$$ 931275 -592141 679364 -338174 76831 1043878 400958 -1153711 -867023 -704190
592g04190K08421L48761m25717N59537m10336j32715K019231p86341J62827j654357
$$ -704190 -495769 -147008 -572725 -13188 -423524 -556239 1462992 676651 839478 -814879
582h14879J96241J008475j274195q63873J498780n35920O50135P2199l87489J94790
$$ -814879 -618638 389837 -884358 -1748231 -249451 -785371 -135236 -63037 -450526 -255736
572b55736N46999r10997L84845j620022Q27602N17045o5783J000664J136032j139564
$$ -255736 291263 -619734 -234889 -1854911 -1027309 -510264 -576047 424617 1560649 421085
562D21085k143959J591787l20465J41867M54306N35126k95805l20676l07963J24810
$$ 421085 -1722874 -131087 -451552 -309685 144621 679747 383942 63266 -244697 -119887
552a19887N21149r25514p87161J00771O75624j401921j015488K561743J1717j642483
$$ -119887 401262 -524252 -1311413 -1210642 -535018 -1936939 -2952427 -390684 -378967 -2021450
542b021450L10316J334777P87958j327555q9660O66744M4694j90522o05629J409072
$$ -2021450 -1711134 -376357 411601 -915954 -1005614 -338870 -294176 -484698 -1090327 318745
532C18745k09899m27661J98500m73337R13966K05292j21014j84596j96105m37712
$$ 318745 108846 -318815 -120315 -593652 320314 525606 404592 219996 23891 -413821
522d13821j22267j10148j49930J251842r59293Q48335m79870J765419J2172p6231
$$ -413821 -536088 -646236 -796166 455676 -503617 344718 -135152 1630267 1642439 1566208
512A566208j098475J502636m38446j100027j67170J09657q98194O90660J911775
$$ 1566208 467733 1970369 1531923 431896 264726 374383 -523811 166849 2078624
503B078624O96947k086549K58088J180643l04560k245087L26733J217186q42117
$$ 2078624 2775571 689022 947110 2127753 1823193 -421894 -95161 1122025 279908
494B79908L79099J060289p25140Q00159j601768j023302O15648O6288J030726
$$ 279908 659007 1719296 994156 1794315 192547 -830755 -215107 -148819 881907
485H81907n27171j2925J285417j171251o28320J577897k94858p46792j33262L62330
$$ 881907 354736 341811 1627228 455977 -172343 1405554 1110696 363904 230642 592972
475E92972j132038J058924K67632m45891p01753P61126J189121j036672l75912
$$ 592972 -539066 519858 787490 341599 -360154 400972 1590093 553421 177509
466A77509p1347j779331r89730Q96604L35827k07922K900267j592263J36012n8471
$$ 177509 106162 -1673169 -2662899 -1766295 -1430468 -1638390 1261877 -330386 -194374 -252845
456b52845j140484O37814L30684l78836o49725r1613p53410Q29407M29574J776547
$$ -252845 -1393329 -755515 -424831 -803667 -1453392 -1545005 -2298415 -1469008 -1039434 737113
446G37113n12124l54889j18533n43065N62087j057289j542930j48561N60592K51781
$$ 737113 224989 -129900 -248433 -791498 -229411 -1286700 -2829630 -2978191 -2417599 -2165818
436b165818J587314L04160q5459o49525L28495J11786n41158M10P75381j104801
$$ -2165818 -578504 -274344 -359803 -1009328 -680833 -569047 -1110205 -1109795 -334414 -1439215
426a439215L39466M59865q4102m11791J44286O0866M57773j197407J129472M07448
$$ -1439215 -1099749 -639884 -723986 -1135777 -991491 -930625 -472852 -1670259 -540787 -133339
416a33339j279718J808788N79214j244301k00599J363359j674153L81361j2621
$$ -133339 -1413057 395731 974945 -269356 -469955 893404 -780749 -399388 -412009
407d12009j131651l26354J462099J300761j472230J600894K67845r13494O26285
$$ -412009 -1543660 -1870014 -407915 892846 -579384 1021510 1289355 375861 1002146
398A002146J267643L29761j531557j369493j80490k13451K433702q67013m44500
$$ 1002146 2269789 2599550 1067993 -301500 -481990 -695441 1738261 871248 426748
389D26748J401110q68057J021900j069931M80507p05911q96256L18217K10704
$$ 426748 1827858 959801 1981701 911770 1392277 686366 -209890 108327 319031
380C19031M48847P00322q61024n78706R25653r73620n04218K68917M96505P76315
$$ 319031 767878 1468200 607176 28470 954123 -19497 -523715 -254798 241707 1018022
370A018022m34370k25481m87282q25598P53688K090427m26625n86812Q19557j1644
$$ 1018022 583652 358171 -129111 -954709 -201021 1889406 1462781 875969 1695526 1683882
360A683882p55002p3059q54122p80186L74680O16456m56629N06336J140915R02540
$$ 1683882 928880 855821 1699 -778487 -403807 212649 -243980 262356 1403271 2305811
350B305811j018610j58446O36064o34337l24016n36446J726020j665360p58692
$$ 2305811 1287201 1128755 1764819 1130482 806466 270020 1996040 330680 -428012
341d28012o59391L8929P91556N24692K25492J72446Q91506L33464k175747K21585
$$ -428012 -1087403 -1048474 -256918 267774 493266 665712 1557218 1890682 -285065 -63480
331f3480J255216k718898r50288J819841k78334Q34208K90401M16504o55518j42242
$$ -63480 1191736 -1527162 -2477450 -657609 -935943 -101735 188666 605170 -50348 -192590
321a92590K04884p72704O00872M64717j553250J49343J940610O72807k11567j969342
$$ -192590 12294 -760410 -159538 305179 -1248071 -1098728 841882 1514689 1303122 -666220
311f66220O8809j26855q60452r47005J981314j045208R10238J332973j02322N45856
$$ -666220 -597411 -724266 -1584718 -2531723 -550409 -1595617 -685379 647594 545272 1091128
301A091128K7238j109494q05967J84648j54249j219587Q46828Q94099M95480j031856
$$ 1091128 1118366 8872 -797095 -612447 -766696 -1986283 -1139455 -245356 250124 -781732
291g81732J132243m63346o4265J823505n86889N47590j877429J22912J42902j089977
$$ -781732 350511 -112835 -177100 1646405 1059516 1607106 -270323 -147411 -4509 -1094486
281a094486Q3666l98362R52390J558837p55529m96698M39597j430746N91080n01383
$$ -1094486 -1010820 -1409182 -456792 1102045 346516 -150182 289415 -1141331 -550251 -1051634
271a051634J96506J723007j107627p46068P10352j50162J25380j338028m4001
$$ -1051634 -855128 867879 -239748 -985816 -275464 -425626 -300246 -1638274 -1682275
262a682275J782171m82227L61853J71334L60456P0010r24646j763722J096546
$$ -1682275 99896 -382331 -20478 150856 511312 581322 -343324 -2107046 -1010500
253a010500p26910J24065J241593k32838P75480j18971l42066m71750k88926o43863
$$ -1010500 -1737410 -1613345 -371752 -604590 170890 51919 -290147 -761897 -1050823 -1694686
243a694686J59654J16469M36469J884555j138676L01225r59542L39238M75517
$$ -1694686 -1535032 -1418563 -982094 902461 -236215 65010 -894532 -555294 -79777
234g9777J152268j662902J58518L61353r23200R2822q21831Q80943k00382P80766
$$ -79777 1072491 -590411 -431893 -70540 -993740 -900918 -1722749 -841806 -1042188 -261422
224b61422N59409K58982L41799J249334j021515j875867m99848K38543j405198
$$ -261422 297987 556969 898768 2148102 1126587 -749280 -1249128 -1010585 -2415783
215b415783Q26774J000423K40871J177196p32590Q39765J783012l324799Q6525
$$ -2415783 -1589009 -588586 -347715 829481 96891 936656 2719668 -605131 -518606
206e18606J001778j419308m21300J217713L97015k11397j352753L53484O73259
$$ -518606 483172 -936136 -1357436 -139723 257292 45895 -1306858 -953374 -280115
197b80115j814312J8283J829634O70002Q40921j284000m87673Q25079m14946q61022
$$ -280115 -2094427 -2076144 -246510 423492 1264413 -19587 -507260 317819 -97127 -958149
187i58149K68110j01319o6691J69407o97599J575321l14465N2451o41122L86213
$$ -958149 -690039 -791358 -858049 -688642 -1386241 189080 -125385 -72934 -714056 -327843
177c27843M63298m41517L58721o33175P50232J157834k325882r42149L29301K324655
$$ -327843 135455 -306062 52659 -580516 169716 1327550 -998332 -1940481 -1611180 713475
167G13475o07091r05872J48547N94119M17407l51957J295185J66257j890315P94956
$$ 713475 106384 -799488 -650941 -56822 360585 8628 1303813 1470070 -420245 374711
157C74711J66717r08235L25138j6148j115662J40421N53833J259776n7938q87700
$$ 374711 541428 -366807 -41669 -57817 -1173479 -1033058 -479225 780551 722613 -165087
147a65087J320990j12404k0770p28078j868173N94596R56721m61344O07387n19999
$$ -165087 1155903 1043499 1022729 294651 -1573522 -978926 -22205 -483549 123838 -396161
137c96161J021418N04283l16778q31556M86762O598q53317m84433M32485l99264
$$ -396161 625257 1129540 812762 -18794 467968 474566 -378751 -863184 -430699 -829963
127h29963j85393J284994j359882Q44828N15705j228489j85714J455512N72069
$$ -829963 -1015356 269638 -1090244 -245416 270289 -958200 -1143914 311598 883667
118H83667j347734p29844n46141j04304r08246J226786r67418P01507Q48206J462897
$$ 883667 -464067 -1193911 -1740052 -1844356 -2752602 -1525816 -2493234 -1791727 -943521 519376
108E19376l32039k89133p699m63977j861069l3133J445105j035936J587269k70159
$$ 519376 187337 -101796 -109495 -573472 -2434541 -2467674 -1022569 -2058505 -471236 -741395
98g41395M75453n013j38465O59618o47289o6192M35894r22461J606401p38390
$$ -741395 -265942 -270955 -409420 250198 -397091 -463283 -27389 -949850 656551 -81839
88h1839j233345J590876j207549o87312J750499j242906L83458N54348n21125
$$ -81839 -1315184 275692 -931857 -1619169 131330 -1111576 -728118 -173770 -694895
79f94895J74627K70921L30135l72497r88223N14927j42952r0394M72709j017181
$$ -694895 -520268 -249347 80788 -291709 -1279932 -765005 -907957 -998351 -525642 -1542823
69a542823J331403P30604j855095o02286J675261Q5722M7832J09881l22287K45055
$$ -1542823 -211420 519184 -1335911 -1938197 -262936 -177214 -129382 -19501 -341788 -96733
59i6733j88583q06235L93602Q3188L52637k5376m89886N35945l8079l33771m90108
$$ -96733 -285316 -1091551 -697949 -614761 -262124 -287500 -777386 -241441 -279520 -613291 -1103399
48a103399Q04982R81122m91986m07884M4920P74392r93296Q7893j230579L1462
$$ -1103399 -298417 682705 190719 -217165 -172245 602147 -391149 -303256 -1533835 -1502373
38a502373J255617J03109k43565j49934R15729n38082k9890k36170N68668j257608
$$ -1502373 -246756 -143647 -387212 -537146 378583 -159499 -189389 -425559 143109 -1114499
28a114499N77009Q3307j86091o5924J07654k18690R2945o2772R45713k99065k74263
$$ -1114499 -537490 -454183 -640274 -706198 -598544 -817234 -724289 -787061 158652 -140413 -414676
17d14676K78371N92387l92468n41963j83053j73335O20817n8929m84524J47285
$$ -414676 -136305 456082 63614 -478349 -661402 -834737 -213920 -272849 -757373 -610088
7f10088P26435N28860R6575l85051K04194l90500m56512
$$ -610088 116347 645207 741782 356731 560925 170425 -286087
0b86087
$$ -286087
$$ Imaginary data points
##PAGE= N=2
##DATA TABLE= (X++(I..I)), XYDATA
16383a202102n9520J12582L55089n85311n76133O80396k72389o55437J50643R16877
$$ -1202102 -1261622 -1149040 -793951 -1379262 -1955395 -1274999 -1547388 -2202825 -2052182 -1135305
16373a135305k37615L28234j43926J61683n21738m04213k7838m87136m12255J227373
$$ -1135305 -1372920 -1044686 -1188612 -1026929 -1548667 -1952880 -1980718 -2467854 -2880109 -1652736
16363a652736j000650N90463O57365N04277L01486n05108k79448O64040K05137
$$ -1652736 -2653386 -2062923 -1405558 -901281 -599795 -1104903 -1384351 -720311 -515174
16354e15174k156052K65541K03746P69109n27578Q59721L18541M27792j16424
$$ -515174 -2671226 -2405685 -2201939 -1432830 -1960408 -1100687 -782146 -354354 -470778
16345d70778l30715L75405k58292K07950o71970o90572O30715R25894j598023
$$ -470778 -801493 -426088 -684380 -476430 -1148400 -1838972 -1208257 -282363 -1880386
16336a880386K74483M86939K87891P4817j93854P77735Q87719l77295j55912J14716
$$ -1880386 -1605903 -1118964 -831073 -756256 -950110 -172375 715344 338049 182137 296853
16326B96853o73444L88794l79335l06492n6909o26781R39146L58528K42359Q34127
$$ 296853 -376591 12203 -367132 -673624 -730533 -1357314 -418168 -59640 182719 1016846
16316A016846m84827L80669o44428j74849J04793m42144k55074Q68479j47726
$$ 1016846 532019 912688 268260 93411 198204 -243940 -499014 369465 221739
16307B21739M03973P52399j44336j34637l57635R49490o46473j250777J233027
$$ 221739 625712 1378111 1233775 1099138 741503 1690993 1044520 -206257 1026770
16298A026770k40761k58817M93914L09219M93991J61301J083277j261749p43125
$$ 1026770 786009 527192 1021106 1330325 1824316 1985617 3068894 1807145 1064020
16289A064020R14784r84122p80250P44928L93425j13411j45963l22973J573359
$$ 1064020 1978804 994682 214432 959360 1352785 1239374 1093411 770438 2343797
16280B343797k314154P44859P75593n81855J73697J134538j277437p03114O71397
$$ 2343797 29643 774502 1550095 968240 1141937 2276475 999038 295924 967321
16271I67321J03220q41402J47267J882272r46776J6465Q94574q09926K41376q24844
$$ 967321 1070541 229139 376406 2258678 1311902 1328367 2222941 1413015 1654391 829547
16261H29547R81189j019451Q25090J96841l44347J445547q86727m98399J65111
$$ 829547 1810736 791285 1616375 1813216 1468869 2914416 2027689 1529290 1694401
16252A694401r18541J95458j38891k28507J328076n29611j168498R79757J310560
$$ 1694401 775860 971318 832427 603920 1931996 1402385 233887 1213644 2524204
16243B524204l57545J91176L93919k22388j825108M685J68821j28206J36679j221822
$$ 2524204 2166659 2357835 2751754 2529366 704258 708943 877764 749558 886237 -335585
16233c35585R31298k39695J581937N05499j282443J333623J488n59466n35370
$$ -335585 595713 356018 1937955 2443454 1161011 2494634 2496122 1936656 1401286
16224A401286k43873L7990p671j218030J546266j063316L26927J186061k53222
$$ 1401286 1157413 1195403 1187732 -30298 1515968 452652 779579 1965640 1712418
16215A712418k67993K085474k800971O89554R32537o47592N39624r27719k41606
$$ 1712418 1444425 3529899 728928 1418482 2351019 1703427 2243051 1315332 1073726
16206A073726l57090j00290J169697j82851J35491P33581k78586J8021M4589j269929
$$ 1073726 716636 616346 1786043 1603192 1738683 2472264 2193678 2211699 2256288 986359
16196I86359N36946N3659Q01536O1686N63532K73887n66496j007458K6185j5075
$$ 986359 1523305 1576964 2378500 2440186 3003718 3277605 2711109 1703651 1729836 1714761
16186A714761q16144o55853J797310P67655k35098L41681L76939L85674k73649
$$ 1714761 898617 242764 2040074 2807729 2572631 2914312 3291251 3676925 3403276
16177C403276j135037o8636M32218j132063m57452P59119L79368q47008J674408
$$ 3403276 2268239 2199603 2631821 1499758 1042306 1801425 2180793 1333785 3008193
16168C008193k95352Q86896M6926R68312k162441q24867O14580n07714j3187J2495
$$ 3008193 2712841 3599737 3646663 4614975 2452534 1627667 2242247 1734533 1721346 1733841
16158A733841J298321J51126k23531j69950J032361p73849r56235p03744L83586
$$ 1733841 3032162 3183288 2959757 2789807 3822168 3048319 2092084 1388340 1771926
16149A771926p22480R16057O16871M52062J654600j298600Q47014l74128n12230
$$ 1771926 1049446 1965503 2582374 3034436 4689036 3390436 4237450 3863322 3351092
16140C351092q62458L0797j196430j54365M95068N93489o34590J235091J017389
$$ 3351092 2488634 2519431 1323001 1168636 1663704 2257193 1622603 2857694 3875083
16131C875083j831675M44937j63110n21840q60265R59008o52115q34476P97710
$$ 3875083 2043408 2488345 2325235 1803395 943130 1902138 1250023 415547 1213257
16122A213257k23571r02953J876189q45752p93843O53593K93484J793126j492151
$$ 1213257 989686 86733 1962922 1117170 323327 976920 1270404 3063530 1571379
16113A571379J063021P48332l57848N50043j053189k90922j070365M2786J41397
$$ 1571379 2634400 3382732 3024884 3574927 2521738 2230816 1160451 1203237 1344634
16104A344634M84965N64095J69701J507074J72283R38386o53776N17889j719717
$$ 1344634 1829599 2393694 2563395 4070469 4242752 5181138 4527362 5045251 3325534
16095C325534j85971J305977j052419j395296L51322J72443j02145L71057K175303
$$ 3325534 3139563 4445540 3393121 1997825 2349147 2521590 2419445 2790502 4965805
16086D965805j111182L3885N25475m69392o5465p1722n96772m07603j44534k036946
$$ 4965805 3854623 3888508 4413983 3944591 3879126 3807404 3210632 2803029 2658495 621549
16076F21549J284270R99681o62346K79774P64779L13972j224752J366058M85061
$$ 621549 1905819 2905500 2243154 2522928 3287707 3601679 2376927 3742985 4228046
16067D228046j140653r43084J083795p53232r86868J272296J122336j938436M42876
$$ 4228046 3087393 2144309 3228104 2474872 1488004 2760300 3882636 1944200 2387076
16058B387076J071697Q87792j545478J191350J481229j342852K56351r40528K18541
$$ 2387076 3458773 4346565 2801087 3992437 5473666 4130814 4387165 3446637 3665178
16049C665178K71051j2912l73782p66969K28965J302787j575098K001326O14033
$$ 3665178 3936229 3923317 3549535 2782566 3011531 4314318 2739220 4740546 5354579
16040E354579j161653p34640R23010l53155N7487j445775K87279l06760j434606
$$ 5354579 4192926 3458286 4381296 4028141 4085628 2639853 2927132 2620372 1185766
16031A185766K269866n19234j679191J378775J95035p27745R72201j36592R2084
$$ 1185766 3455632 2936398 1257207 2635982 2831017 2103272 3075473 2938881 3030965
16022C030965j41977j118755O48717j349706K40018Q0139J099169j289865J48069
$$ 3030965 2888988 1770233 2418950 1069244 1309262 1389401 2488570 1198705 1346774
16013A346774o85900J921639J47781N5717N54639M90112j304038o50930O35937
$$ 1346774 660874 2582513 2730294 2786011 3340650 3830762 2526724 1875794 2511731
16004B511731k17675q30002l18887l34967J262545k57353K16359J188812N94209
$$ 2511731 2294056 1464054 1145167 810200 2072745 1815392 2031751 3220563 3814772
15995C814772L89294j753860J079361k1954q05292J67410R06159j011149p2834
$$ 3814772 4204066 2450206 3529567 3507613 2702321 2869731 3775890 2764741 2691907
15986B691907M46276K13629j181666O45028n14801l78377N54386O35406L56235
$$ 2691907 3138183 3351812 2170146 2815174 2300373 1921996 2476382 3111788 3468023
15977C468023k08354j06750k17221j409949q26570O65276J465603L4018q83115
$$ 3468023 3259669 3152919 2935698 1525749 699179 1364455 2830058 2864076 1980961
15968A980961O6477q9554o94521Q72912L60658M10794K74715j246606o23773J613988
$$ 1980961 2047438 1957884 1263363 2136275 2496933 2907727 3182442 1935836 1312063 2926051
15958B926051m46939m01287l70147O09940P38240k10576j36516L24231n61579
$$ 2926051 2479112 2077825 1707678 2317618 3055858 2845282 2708766 3032997 2471418
15949B471418M00478j257324n05905J424892J93394O19929o57383j95725K252690
$$ 2471418 2871896 1614572 1108667 2533559 2726953 3346882 2689499 2493774 4746464
15940D746464j453832l90033J653434p07656j529265j151719J378845N2201r35900
$$ 4746464 3292632 2902599 4556033 3848377 2319112 1167393 2546238 2598439 1662539
15931A662539K793374l40116k348920J860736N51507k618138M89624R96190L08537
$$ 1662539 4455913 4115797 1766877 3627613 4179120 1560982 2050606 3046796 3355333
$$ [...]
##END NTUPLES=NMR SPECTRUM
##END=
