##TITLE=1H_DE-80H_X3
 200.13MHz, d2o
 8 sc
 
 19ns.26.2.2025
##JCAMPDX= 6.0         $$ Bruker NMR JCAMP-DX V2.0
##DATA TYPE= NMR SPECTRUM
##DATA CLASS= NTUPLES
##ORIGIN= UXNMR, Bruker Analytische Messtechnik GmbH
##OWNER= pz
$$ XWIN-NMR		Version 3.5
$$ Mon Apr 20 10:21:21 2026 Russian Standard Time (UT+4h)  Yarkov@DPX200
##.OBSERVE FREQUENCY= 200.1313
##.OBSERVE NUCLEUS= ^1H
##.ACQUISITION MODE= SIMULTANEOUS
##.ACQUISITION SCHEME= undefined
##.AVERAGES= 8
##.DIGITISER RES= 18
##SPECTROMETER/DATA SYSTEM= spect
##.PULSE SEQUENCE= zg30
##.SOLVENT NAME= CDCl3
##.SHIFT REFERENCE= (INTERNAL, CDCl3, 0, 15.4263)
##AUDIT TRAIL= $$ (NUMBER, WHEN, WHO, WHERE, WHAT)
$$ ##TITLE= Audit trail, XWIN-NMR		Version 3.5
$$ ##JCAMPDX= 5.01
$$ ##ORIGIN= Bruker BioSpin GmbH
$$ ##OWNER= Yarkov
$$ C:/Bruker/XWIN-NMR/data/yarkov2/nmr/H-C/1/pdata/1/auditp.txt
$$ ##AUDIT TRAIL=  $$ (NUMBER, WHEN, WHO, WHERE, WHAT)
(   1,<2026-04-20 10:20:26.76 +0400>,<Yarkov>,<DPX200>,
      <created by zg, POWCHK disabled, PULCHK disabled
       configuration hash MD5:
       00 E9 B6 7A A2 85 ED C7 34 08 36 98 17 FE 4E 26
       data hash MD5: 16K
       EA 4B AE 62 63 00 B7 68 BF C0 F1 54 B7 4D E6 A9>)
(   2,<2026-04-20 10:20:30.79 +0400>,<Yarkov>,<DPX200>,
      <Start of raw data processing
       efp BC_mod = 2 LB = 0.25 FT_mod = 6 PKNL = 1 PHC0 = -5301.948 PHC1 = 6.821927 SI = 16K 
       data hash MD5: 16K
       79 8C 5F 5C 00 3C E5 3E C8 C5 03 BB FC 33 B7 1F>)
(   3,<2026-04-20 10:20:43.01 +0400>,<Yarkov>,<DPX200>,
      <pk PHC0 = 7 PHC1 = 0 
       data hash MD5: 16K
       6D 1B 93 FC BA E9 3C 45 50 09 60 40 4C 01 52 85>)
$$ ##END=
$$ 
$$ hash MD5
$$ A6 50 92 B9 68 8F 1F 30 EF BB 53 B9 34 8C 80 4E
##$RELAX= 
##$RELAX= 
##$RELAX= 
##$RELAX= 
##$RELAX= 
##$RELAX= 
$$ Bruker specific parameters
$$ --------------------------
##$DU= <C:/Bruker/XWIN-NMR>
##$EXPNO= 1
##$NAME= <H-C>
##$PROCNO= 1
##$TYPE= <nmr>
##$USER= <yarkov2>
##$AMP= (0..31)
100 100 100 100 100 100 100 100 100 100 100 100 100 100 100 100 100 100 
100 100 100 100 100 100 100 100 100 100 100 100 100 100 
##$AQSEQ= 0
##$AQ_mod= 1
##$AUNM= <au_zg>
##$AUTOPOS= <>
##$BF1= 200.13
##$BF2= 200.13
##$BF3= 200.13
##$BF4= 200.13
##$BF5= 200.13
##$BF6= 200.13
##$BF7= 200.13
##$BF8= 200.13
##$BYTORDA= 1
##$CFDGTYP= 0
##$CFRGTYP= 5
##$CHEMSTR= <none>
##$CNST= (0..31)
1 1 145 1 1 1 1 1 1 1 1 1 1 1 1 1 1 1 1 1 1 1 1 1 1 1 1 1 1 1 1 1 
##$CPDPRG= <>
##$CPDPRG1= <>
##$CPDPRG2= <>
##$CPDPRG3= <>
##$CPDPRG4= <mlev>
##$CPDPRG5= <mlev>
##$CPDPRG6= <mlev>
##$CPDPRG7= <mlev>
##$CPDPRG8= <mlev>
##$CPDPRGB= <>
##$CPDPRGT= <>
##$D= (0..31)
0 0.7 0 0 0 0 0 0 0 0 0 0.03 0 0 0 0 0 0 0 0 0 0 0 0 0 0 0 0 0 0 0 0 
##$DATE= 1776666026
##$DBL= (0..7)
120 120 120 120 120 120 120 120 
##$DBP= (0..7)
150 150 150 150 150 150 150 150 
##$DBP07= 0
##$DBPNAM0= <>
##$DBPNAM1= <>
##$DBPNAM2= <>
##$DBPNAM3= <>
##$DBPNAM4= <>
##$DBPNAM5= <>
##$DBPNAM6= <>
##$DBPNAM7= <>
##$DBPOAL= (0..7)
0.5 0.5 0.5 0.5 0.5 0.5 0.5 0.5 
##$DBPOFFS= (0..7)
0 0 0 0 0 0 0 0 
$$ [...]
##$SUBNAM2= <"">
##$SUBNAM3= <"">
##$SUBNAM4= <"">
##$SUBNAM5= <"">
##$SUBNAM6= <"">
##$SUBNAM7= <"">
##$SUBNAM8= <"">
##$SUBNAM9= <"">
##$SW= 18.0517328524113
##$SWIBOX= (0..15)
0 0 2 0 0 0 0 0 0 0 0 0 0 0 0 0 
##$SW_h= 3612.71676300578
##$TD= 16384
##$TD0= 1
##$TE= 0
##$TE2= 300
##$TE3= 300
##$TEG= 300
##$TL= (0..7)
0 120 120 120 120 120 120 120 
##$TP= (0..7)
150 150 150 150 150 150 150 150 
##$TP07= 0
##$TPNAME0= <>
##$TPNAME1= <>
##$TPNAME2= <>
##$TPNAME3= <>
##$TPNAME4= <>
##$TPNAME5= <>
##$TPNAME6= <>
##$TPNAME7= <>
##$TPOAL= (0..7)
0.5 0.5 0.5 0.5 0.5 0.5 0.5 0.5 
##$TPOFFS= (0..7)
0 0 0 0 0 0 0 0 
##$TUNHIN= 0
##$TUNHOUT= 0
##$TUNXOUT= 0
##$USERA1= <user>
##$USERA2= <user>
##$USERA3= <user>
##$USERA4= <user>
##$USERA5= <user>
##$V9= 5
##$VALIST= <valist>
##$VCLIST= <CCCCCCCCCCCCCCC>
##$VD= 0
##$VDLIST= <DDDDDDDDDDDDDDD>
##$VPLIST= <PPPPPPPPPPPPPPP>
##$VTLIST= <TTTTTTTTTTTTTTT>
##$WBST= 1024
##$WBSW= 4
##$XGAIN= (0..3)
0 0 0 0 
##$XL= 0
##$YL= 0
##$YMAX_a= 268140
##$YMIN_a= -334712
##$ZGOPTNS= <>
##$ZL1= 120
##$ZL2= 120
##$ZL3= 120
##$ZL4= 120
##$ABSF1= 0
##$ABSF2= 0
##$ABSG= 0
##$ABSL= 0
##$ALPHA= 0
##$AQORDER= 0
##$ASSFAC= 0
##$ASSFACI= 0
##$ASSFACX= 0
##$ASSWID= 0
##$AUNMP= <proc_1d>
##$AZFE= 0.1
##$AZFW= 0.1
##$BCFW= 0
##$BC_mod= 2
##$BYTORDP= 0
##$COROFFS= 0
##$CY= -3
##$DATMOD= 1
##$DC= 0
##$DFILT= <>
##$DTYPP= 0
##$F1P= 0
##$F2P= 0
##$FCOR= 1
##$FTSIZE= 16384
##$FT_mod= 6
##$GAMMA= 0
##$GB= 0
##$INTBC= 1
##$INTSCL= 3.241238e-09
##$ISEN= 128
##$LB= 0.25
##$LEV0= 0
##$LPBIN= 0
##$MAXI= 10000
##$MC2= 0
##$MEAN= 0
##$ME_mod= 0
##$MI= 1.114404
##$NCOEF= 0
##$NC_proc= -6
##$NLEV= 6
##$NOISF1= 3.799351
##$NOISF2= 2.8
##$NSP= 0
##$NTH_PI= 0
##$NZP= 0
##$OFFSET= 15.42626
##$PC= 1
##$PHC0= -5294.948
##$PHC1= 6.821927
##$PH_mod= 1
##$PKNL= yes
##$PPARMOD= 0
##$PSCAL= 0
##$PSIGN= 0
##$REVERSE= no
##$SF= 200.130019100575
##$SI= 16384
##$SIGF1= 3
##$SIGF2= 2
##$SINO= 0.751879
##$SIOLD= 32768
##$SREGLST= <19F.Aceton>
##$SSB= 0
##$STSI= 16384
##$STSR= 0
##$SW_p= 3612.71676300578
##$SYMM= 0
##$S_DEV= 0
##$TDeff= 16384
##$TDoff= 0
##$TI= <>
##$TILT= no
##$TM1= 0
##$TM2= 0
##$TOPLEV= 0
##$USERP1= <user>
##$USERP2= <user>
##$USERP3= <user>
##$USERP4= <user>
##$USERP5= <user>
##$WDW= 1
##$XDIM= 16384
##$YMAX_p= 381661257
##$YMIN_p= -1194604
$$ End of Bruker specific parameters
$$ ---------------------------------
##NTUPLES= NMR SPECTRUM
##VAR_NAME=  FREQUENCY,     SPECTRUM/REAL,   SPECTRUM/IMAG
##SYMBOL=    X,             R,               I
##VAR_TYPE=  INDEPENDENT,   DEPENDENT,       DEPENDENT
##VAR_FORM=  AFFN,          ASDF,            ASDF
##VAR_DIM=   16384,         16384,           16384
##UNITS=     HZ,            ARBITRARY UNITS, ARBITRARY UNITS
##FACTOR=    0.220516191357247, 1,           1
##FIRST=     3087.25770735109, 0,            0
##LAST=      -525.459055654691, 0,           0
##MIN=       -525.459055654691, -1194604,    0
##MAX=       3087.25770735109, 381661257,    0
$$ Real data points
##PAGE= N=1
##DATA TABLE= (X++(R..R)), XYDATA
$$ [...]
$$ plain form
6023 10162602 9663158 9480064 9170174 8903446 8654804 8240438 8137157 8001627 7884935
6014 7884935 7767833 8024050 7872208 7647588 7316769 6766427 6129961 5521183 5116488 4876241
6004 4876241 4490019 4173753 3854927 3753031 3514908 3281246 3172935 3040662 3180693 2974323
5994 2974323 3047049 2990361 2746682 2631543 2592966 2530948 2470985 2316702 2225605 2186800 2112609
5983 2112609 2250097 2070693 2090116 2053649 1922063 2021499 1873761 1708021 1748194 1770756
5973 1770756 1611730 1584300 1726618 1564144 1667310 1575387 1491859 1539338 1476672 1448916 1472732
5962 1472732 1525546 1330426 1620940 1678012 1493540 1225254 1293344 1310406 1270135 1239494 1133124
5951 1133124 1159181 1198535 1330177 1253413 1223046 997407 1171081 1287279 1352238 1094838
$$ packed form
6023A0162602m99444j83094l09890k66728k48642m14366j03281j35530j16692
6014G884935j17102K56217j51842k24620l30819n50342o36466o08778m04695k40247
6004D876241l86222l16266l18826j01896k38123k33662j08311j32273J40031k06370
5994B974323P2726n6688k43679j15139l8577o2018n9963j54283r1097l8805p4191
5983B112609J37488j79404J9423l6467j31586R9436j47738j65740M0173K2562
5973A770756j59026k7430J42318j62474J03166r1923q3528M7479o2666k7756K3816
5962A472732N2814j95120K90514N7072j84472k68286O8090J7062m0271l0641j06370
5951A133124K6057L9354J31642p6764l0367k25639J73674J16198O4959k57400
$$ plain form
5941 1094838 1013353 1105887 1051873 1168515 1056654 1096143 1158245 1063107 1092970 1010054 839105
5930 839105 866442 1025622 898367 819452 738762 1000263 1078068 765465 847012 849402 963840
5919 963840 825280 968083 832806 732542 877163 929000 1028332 781833 760460 647523
5909 647523 913065 815912 695297 720117 716861 838095 779804 874976 726993 767487 667736
5898 667736 828641 836017 791475 679438 599360 777709 794071 738996 848951 692762 648399
5887 648399 734040 794967 837905 762433 817573 840011 788099 755979 714743 671496 766049 751123
5875 751123 803049 767058 721543 683642 681175 748591 682883 739332 893501 740888 635364
5864 635364 611634 521608 607236 613296 570304 670096 643024 569973 537201 556698 447884 507704
$$ packed form
5941A094838q1485R2534n4014J16642j11861L9489O2102r5138K9863q2916j70949
5930H39105K7337J59180j27255p8915q0690K61501P7805l12603Q1547K390J14438
5919I63840j38560J42803j35277j00264J44621N1837R9332k46499k1373j12937
5909F47523K65542r7153j20615K4820l256J21234n8291R5172j47983M0494r9751
5898F67736J60905P376m4542j12037q0078J78349J6362n5075J09955j56189m4363
5887F48399Q5641O0927M2938p5472N5140K2438n1912l2120m1236m3247R4553j4926
5875G51123N1926l5991m5515l7901k467O7416o5708N6449J54169j52613j05524
5864F35364k3730r0026Q5628O060m2992R9792k7072p3051l2772J9497j08814N9820
$$ plain form
5852 507704 571265 622812 596428 489811 539951 517696 546645 521964 617187 657748 637264
5841 637264 648476 559865 575075 560425 605745 543915 523308 568318 619221 796390 675584
5830 675584 636657 540829 710948 783866 662809 740220 596106 724389 776005 807946 734528
5819 734528 742669 654073 746337 781595 642093 727206 582926 689978 674127 743702 758982
5808 758982 594026 661376 689657 698750 606554 567392 613330 676839 635740 604864 754969
5797 754969 691836 620995 577433 583688 700682 648079 574686 666529 782875 679667 770476
5786 770476 697424 673495 590071 603182 621909 639171 650143 443986 580234 677770 721526
5775 721526 746971 779397 528561 591213 647535 682514 685829 578767 668613 625952 755773
$$ packed form
5852E07704O3561N1547k6384j06617N0140k2255K8949k4681R5223M0561k0484
5841F37264J1212q8611J5210j4650M5320o1830k0607M5010N0903J77169j20806
5830F75584l8927r5828J70119P2918j21057P7411j44114J28283N1616L1941p3418
5819G34528Q141q8596R2264L5258j39502Q5113j44280J07052j5851O9575J5280
5808G58982j64956O7350K8281R093r2196l9162M5938O3509m1099l0876J50105
5797G54969o3133p0841m3562O255J16994n2603p3393R1843J16346j03208R0809
5786G70476p3052k3929q3424J3111J8727J7262J0972k06157J36248R7536M3756
5775G21526K5445L2426k50836O2652N6322L4979L315j07062Q9846m2661J29821
$$ plain form
5764 755773 613329 547344 634041 417942 544355 721035 591336 501009 643389 705829
5754 705829 757958 708864 541137 751809 667728 699484 790772 824668 808498 902620 953942
5743 953942 860549 977862 898922 1041044 837454 748758 654339 857850 923907 804146 918987
5732 918987 810985 880981 860856 890715 751834 646229 626338 740879 877965 653908
5722 653908 733172 861000 849058 810541 709539 886001 786164 853815 905735 950231 1243433
5711 1243433 1332562 1404083 1445706 1231097 960581 1122939 925244 822894 686916 775914
5701 775914 760446 834109 833506 765416 774440 730737 844822 661888 754932 728200 813588 815440
5689 815440 834066 711055 774323 934829 940315 936908 945330 1039393 957698 1185176 1299544
$$ packed form
5764G55773j42444o5985Q6697k16099J26413J76680j29699r0327J42380O2440
5754G05829N2129m9094j67727K10672q4081L1756R1288L3896j6170R4122N1322
5743I53942r3393J17313p8940J42122k03590q8696r4419K03511O6057j19761J14841
5732I18987j08002O9996k0125K9859j38881j05605j9891J14541J37086k24057
5722F53908P9264J27828j1942l8517j01002J76462r9837O7651N1920M4496K93202
5711A243433Q9129P1521M1623k14609k70516J62358j97695j02350j35978Q8998
5701G75914j5468P3663o03o8090R024m3703J14085j82934R3044k6732Q5388J852
5689H15440J8626j23011O3268J60506N486l407Q422R4063q1695K27478J14368
$$ plain form
5678 1299544 1223795 1253145 1121435 956323 873340 792100 655982 715827 765962 627645 780710
5667 780710 804221 782420 662789 688602 660376 601916 696525 491250 637309 425948 566897
5656 566897 634135 701367 657383 716365 826897 797929 818238 776512 837726 886930 811425
5645 811425 894922 974359 975680 866211 651404 697176 576324 635021 690462 706642 515202
5634 515202 694424 672053 824685 779174 696657 799163 867709 936096 705422 740852 631578
5623 631578 721561 785202 870883 791038 819813 841388 803017 654549 577381 630257 737494
5612 737494 865720 824531 753900 777528 785863 630579 867510 772860 724423 662090 778197
5601 778197 727580 662533 647667 730143 717824 658810 590538 630295 593768 642993 660486 656381
$$ packed form
5678A299544p5749K9350j31710j65112q2983q1240j36118N9845N0135j38317J53065
5667G80710K3511k1801j19631K5813k8226n8460R4609k05275J46059k11361J40949
5656E66897O7238O7232m3984N8982J10532k8968K0309m1726O1214M9204p5505
5645H11425Q3497P9437J321j09469k14807M5772j20852N8697N5441J6180j91440
5634E15202J79222k2371J52632m5511q2517J02506O8546O8387k30674L5430j09274
5623F31578Q9983O3641Q5681p9845K8775K1575l8371j48468p7168N2876J07237
5612G37494J28226m1189p0631K3628Q335j55284K36931r4650m8437o2333J16107
5601G78197n0617o5047j4866Q2476j2319n9014o8272L9757l6527M9225J7493m105
$$ plain form
5589 656381 790677 618492 731293 702436 690590 566578 706374 698943 619520 653521 579503
5578 579503 665391 660082 576007 483964 760249 640156 566656 607973 551091 580118 689635
5567 689635 811812 752918 673197 709957 707589 683198 618561 648419 742640 819665 868229 648628
5555 648628 777375 525171 734218 771520 894632 684546 662393 707171 786089 742372 600264
5544 600264 784885 753722 880679 844404 772610 640862 569328 543490 748308 650096 639436
5533 639436 654492 761322 563686 465731 703445 625466 563890 623933 610119 647584 611325
5522 611325 616028 635994 656271 605366 583387 664799 503352 396953 402289 664808 602476
5511 602476 609527 535628 630786 586489 544136 668778 568405 667355 603114 874013 691878
$$ packed form
5589F56381J34296j72185J12801k8857j1846j24012J39796p431p9423L4001p4018
5578E79503Q5888n309q4075r2043K76285j20093p3500M1317n6882K9027J09517
5567F89635J22177n8894p9721L6760k368k4391o4637K9858R4221P7025M8564k19601
5555F48628J28747k52204K09047L7302J23112k10086k2153M4778P8918m3717j42108
5544F00264J84621l1163J26957l6275p1794j31748p1534k5838K04818r8212j0660
5533F39436J5056J06830j97636r7955K37714p7979o1576O0043j3814L7465l6259
5522F11325M703J9966K0277n0905k1979Q1412j61447j06399N336K62519o2332
5511F02476P051p3899R5158m4297m2353J24642j00373R8950o4241K70899j82135
$$ plain form
5500 691878 695067 670756 797534 929046 797044 777555 758104 763033 545564 721153 820882
5489 820882 737341 673590 881315 900969 689347 652605 721700 687811 769389 701078 921665
5478 921665 980819 794280 755450 761711 808438 706344 818911 781937 820111 720587 919367
5467 919367 753420 768303 738650 750144 806356 688814 665193 668653 771253 783356 750052
5456 750052 766041 824419 739458 736287 780095 735039 604559 671992 677194 643488 561263 615129
5444 615129 810519 718426 746435 748520 735612 688812 514423 596129 649373 706322 755804
5433 755804 811348 682933 476913 453788 652494 730850 682940 771007 746079 725321 742613
5422 742613 613457 703397 665095 836211 1050806 886721 665148 665057 820470 778465 767820
$$ packed form
5500F91878L189k4311J26778J31512j32002j9489j9451M929k17469J75589R9729
5489H20882q3541o3751K07725J9654k11622l6742O9095l3889Q1578o8311K20587
5478I21665N9154j86539l8830O261M6727j02094J12567l6974L8174r9524J98780
5467I19367j65947J4883k9653J1494N6212j17542k3621L460J02600J2103l3304
5456G50052J5989N8378q4961l171M3808m5056j30480O7433N202l3706q2225N3866
5444F15129J95390r2093K8009K085j2908m6800j74389Q1706N3244N6949M9482
5433G55804N5544j28415k06020k3125J98706P8356m7910Q8067k4928k0758J7292
5422G42613j29156Q9940l8302J71116K14595j64085k21573r1J55413m2005j0645
$$ plain form
5411 767820 804798 981025 937472 878518 806006 645849 714986 756462 845619 905364 834418
5400 834418 886432 887835 1015234 792195 700070 770092 865477 833659 794683 818416 746899
5389 746899 831150 888284 957350 775182 631087 779834 838620 709497 682877 694349 835929
5378 835929 774012 729977 789335 915112 742665 901794 749757 777244 750602 827770 1021498
5367 1021498 891578 810018 919985 894179 804841 672324 632955 666337 896717 934117 866275
5356 866275 849997 800909 894170 990039 877302 676086 828500 955438 911017 877907 719530
5345 719530 805277 895969 791947 931867 896948 868616 673203 732473 779181 816817 787913
5334 787913 965706 823021 704771 860616 799548 812503 824898 577939 815408 767727
$$ packed form
5411G67820L6978J76227m3553n8954p2512j60157O9137M1476Q9157N9745p0946
5400H34418N2014J403J27399k23039r2125P0022R5385l1818l8976K3733p1517
5389G46899Q4251N7134O9066j82168j44095J48747N8786j29123k6620J1472J41580
5378H35929o1917m4035N9358J25777j72447J59129j52037K7487k6642P7168J93728
5367A021498j29920q1560J09967k5806q9338j32517l9369L3382K30380L7400o7842
5356H66275j6278m9088R3261R5869j12737k01216J52414J26938m4421l3110j58377
5345G19530Q5747R0692j04022J39920l4919k8332j95413N9270M6708L7636k8904
5334G87913J77793j42685j18250J55845o1068J2955J2395k46959K37469m7681
$$ plain form
5324 767727 793113 858618 863287 710798 934851 834406 924067 855679 575010 803576 831857
5313 831857 896276 847576 950055 927191 889891 922624 769743 664404 747712 848092 929671
5302 929671 863094 746632 762114 913105 692326 694125 833128 951366 803319 764696 802896
5291 802896 830399 844887 898188 825612 828774 906499 843886 967747 736565 683349 861912
5280 861912 941370 1005246 891721 900013 953793 1071834 873907 968935 892723 882726 877323 914752
5268 914752 918901 887408 1010956 1042193 1013747 724289 952968 899784 1014253 935896 911745
5257 911745 1008599 986593 990452 954369 932227 820551 784554 964218 866505 818306 824119 842227
5245 842227 899110 905948 989996 985757 924910 857524 839595 820311 812678 811330 850393 839736
$$ packed form
5324G67727K5386O5505M669j52489K24053j00445Q9661o8388k80669K28566K8281
5313H31857O4419m8700J02479k2864l7300L2733j52881j05339Q3308J00380Q1579
5302I29671o6577j16462J5482J50991k20779J799J39003J18238j48047l8623L8200
5291H02896K7503J4488N3301p2576L162P7725o2613J23861k31182n3216J78563
5280H61912P9458O3876j13525Q292N3780J18041j97927R5028p6212r997n403L7429
5268I14752M149l1493J23548L1237k8446k89458K28679n3184J14469p8357k4151
5257I11745R6854k2006L859l6083k2142j11676l5997J79664r7713m8199N813J8108
5245H42227N6883O838Q4048m239o0847o7386j7929j9284p633j348L9063j0657
$$ plain form
5233 839736 871624 889831 890676 790857 755860 828510 834779 923155 848171 785056 885987 776312
5221 776312 968930 1025478 929477 949141 874196 944872 1110847 1053500 931740 924196 975098
5210 975098 962930 1125422 1133063 1061731 929007 978657 1010962 1044754 1120757 997284 930624
5199 930624 1100586 1090674 1219205 1184926 966047 980219 1033743 1133191 1052203 1117430 1026213
5188 1026213 1041050 1135917 1130397 1131634 1094480 936513 1045475 1201235 1164827 1083656 1088103
5177 1088103 992503 1113248 1140771 1027650 1170509 921192 848654 1039192 983899 951278
5167 951278 959389 960248 1092094 939760 1035805 1131361 1118215 1082248 929076 953373 801427
5156 801427 868077 828223 856348 923537 1022439 1056796 919011 1024133 837403 947689 1094491
$$ packed form
5233H39736L1888J8207Q45r9819l4997P2650O269Q8376p4984o3115J00931j09675
5221G76312J92618N6548r6001J9664p4945P0676J65975n7347j21760p544N0902
5210I75098j2168J62492P641p1332j32724M9650L2305L3792P6003j23473o6660
5199I30624J69962r912J28531l4279k18879J4172N3524R9448q0988O5227r1217
5188A026213J4837R4867n520J237l7154j57967J08962J55760l6408q1171M447
5177A088103r5600J20745K7523j13121J42859k49317p2538J90538n5293l2621
5167I51278Q111Q59J31846j52334R6045R5556j3146l5967j53172K4297j51946
5156H01427O6650l9854K8125O7189R8902L4357j37785J05122j86730J10286J46802
$$ plain form
5145 1094491 1017894 1038300 1179138 1080022 989882 1089378 1042408 942875 1002902 1016336 1043720
5134 1043720 1062758 943313 919593 1133069 1141398 1103248 1157486 1249767 1095747 964386 973343
5123 973343 982001 1065209 1079127 1309468 1136265 1144607 1219107 1096173 1078567 1006654 1183030
5112 1183030 1354463 1303490 1293056 1199291 1278312 1212362 1108077 1241535 1202677 1089126 1112818
5101 1112818 1177337 1230527 1229543 1300279 1249617 1304402 1298564 1213732 1258638 1168386 1077659 1084125
5089 1084125 1137228 1345727 1260374 1306930 1110977 1102975 1152913 1311290 1255129 1159279 1039554
5078 1039554 1100450 1255715 1155207 1141637 1055020 1248257 1105100 1122831 1063577 945166
5068 945166 958090 1081707 1178584 1169768 1109414 973920 1133523 990341 982335 966110 916392
$$ packed form
5145A094491p6597K0406J40838r9116r0140R9496m6970r9533O0027J3434K7384
5134A043720J9038j19445k3720K13476Q329l8150N4238R2281j54020j31361Q957
5123I73343Q658Q3208J3918K30341j73203Q342P4500j22934j7606p1913J76376
5112A183030J71433n0973j0434r3765P9021o5950j04285J33458l8858j13551K3692
5101A112818O4519N3190r84P0736n0662N4785n838q4832M4906r0252r0727O466
5089A084125N3103K08499q5353M6556j95953q002M9938J58377n6161r5850j19725
5078A039554O0896J55265j00508j3570q6617J93237j43157J7731n9254j18411
5068I45166J2924J23617R6877q816o0354j35494J59603j43182q006j6225m9718
$$ plain form
5057 916392 1093221 918370 1008573 983402 975741 1097484 1020183 1142714 1079651 959977 917584
5046 917584 993433 1003384 848458 1076944 1083759 1045621 1053023 1054326 954998 1039283 1115698 1238432
5034 1238432 1097904 1171137 1204161 1175559 1190416 1160050 1232701 1289769 1256356 1012518 1073780
5023 1073780 1136146 1097165 1120810 1252455 1184610 1138237 1159571 1170207 1249195 1070665 1155435
5012 1155435 1294864 1270647 1216029 1243156 1280332 1273713 1135157 1100991 1334769 1292281 1385256
5001 1385256 1407315 1396540 1417212 1387280 1654481 1631000 1603295 1664797 1618940 1760770 1585585
4990 1585585 1759678 1769049 1853340 1898568 1910168 2094019 1964639 1797544 1929299 2038934
4980 2038934 2047965 2016645 2076919 2132078 1958941 2012415 2022775 2133783 2126722 2147646 2054392
$$ packed form
5057I16392J76829j74851R0203k5171p661J21743p7301J22531o3063j19674m2393
5046I17584P5849R951j54926K28486O815l8138P402J303r9328Q4285P6415J22734
5034A238432j40528P3233L3024k8602J4857l0366P2651N7068l3413k43838O1262
5023A073780O2366l8981K3645J31645o7845m6373K1334J0636P8988j78530Q4770
5012A155435J39429k4217n4618K7127L7176o619j38556l4166K33778m2488R2975
5001A385256K2059j0775K0672k9932K67201k3481k7705O1502m5857J41830j75185
4990A585585J74093R371Q4291M5228J1600J83851j29380j67095J31755J09635
4980B038934R031l1320O0274N5159j73137N3474J0360J11008p061K0924r3254
$$ plain form
4969 2054392 2075992 2032901 2216057 2320927 2478158 2451947 2548125 2834074 2792688 3011237
4959 3011237 3119371 3461499 3712524 4043019 4571021 4966774 5273722 5900766 6852914 7827048
4949 7827048 9345360 10862307 12410477 13465692 13541324 12976641 12021237 10871599 9707870
4940 9707870 8772392 8177213 7563556 7346701 7233030 7204884 7578463 8138379 9390714 10490122
4930 10490122 11908282 13241823 13842424 13708428 12799702 11501104 10435527 9318706 8362185
4921 8362185 7511163 6881761 6247938 5862052 5627893 5413728 5120182 4945694 4970180 4923688
4911 4923688 4735785 4651855 4877417 4825830 5128666 5103350 5220956 5488315 5686152 6102700
4901 6102700 6359043 6803890 7329697 8183476 9163196 10360918 12131542 14445446 17011049
$$ packed form
4969B054392K1600m3091J83156J04870J57231k6211R6178K85949m1386K18549
4959C011237J08134L42128K51025L30495N28002L95753L06948O27044R52148R74134
4949G827048J518312J516947J548170J055215P5632n64683r55404j149638j163729
4940I707870r35478n95179o13657k16855j13671k8146L73579N59916J252335J099408
4930A0490122J418160J333541O00601j33996r08726j298598j065577j116821r56521
4921H362185q51022o29402o33823l85886k34159k14165k93546j74488K4486m6492
4911D923688j87903q3930K25562n1587L02836k5316J17606K67359J97837M16548
4901F102700K56343M44847N25807Q53779R79720J197722J770624K313904K565603
$$ plain form
4892 17011049 19007800 20069628 20018364 19049630 17612012 16017799 14552426 13371384 12671848
4883 12671848 12038631 11935946 11943805 12131139 13071818 14159158 15673480 17455188 19277942
4874 19277942 20784259 21235319 20616061 19457195 18026001 16698799 15689445 15010266 14857330
4865 14857330 15228625 16201307 17131078 17515307 17202616 16291634 15253269 14049434 13119434
4856 13119434 12490226 11954122 11801186 11879439 12131890 12512865 13255327 14585459 16477794
4847 16477794 18941842 21295946 23356711 24761610 25167384 25088542 24797466 24568400 24675665
4838 24675665 24610440 24760580 24549380 24519487 24343510 24122036 23887298 23789111 23719888 23837981
4828 23837981 23951681 24119422 24543298 24795088 25165146 25472382 25885686 26304937 26695178
$$ packed form
4892A7011049J996751J061828n1264r68734j437618j594213j465373j181042o99536
4883A2671848o33217j02685P859J87334R40679J087340J514322J781708J822754
4874A9277942J506317M51060o19258j158866j431194j327202j009354o79179j52936
4865A4857330L71295R72682R29771L84229l12691r10982j038365j203835r30000
4856A3119434o29208n36104j52936P8253K52451L80975P42462J330132J892335
4847A6477794K464048K354104K060765J404899M05774p8842k91076k29066J07265
4838B4675665o5225J50140k11200k9893j75977k21474k34738r8187o9223J18093
4828B3837981J13700J67741M23876K51790L70058L07236M13304M19251L90241
$$ plain form
4819 26695178 27154051 27451096 27729020 28202450 28628356 29240192 29863276 30981278 32580031
4810 32580031 34682210 36739821 38294826 38582847 37596746 35645048 33286656 31147245
4802 31147245 29324701 28477796 28375760 29077897 29958801 31099848 32665440 34517033 37074431
4793 37074431 39856711 42976244 45641349 47288659 47399573 45983588 43596787 40746274
4785 40746274 37893667 35767678 33583618 31817214 30590582 29809911 29389217 29055505 28859692
4776 28859692 28680633 28611535 28469971 28202605 27760062 27417347 26791291 26207951 25259113 23953144
4766 23953144 22577090 21120428 19371957 17600203 15980943 14664096 13515596 12648217
4758 12648217 11858529 11268830 10801316 10454929 10422433 10315890 10183066 9929680 9887846 9668861
$$ packed form
4819B6695178M58873K97045K77924M73430M25906O11836O23084J118002J598753
4810C2580031K102179K057611J555005K88021r86101j951698k358392k139411
4802C1147245j822544q46905j02036P02137Q80904J141047J565592J851593K557398
4793C7074431K782280L119533K665105J647310J10914j415985k386801k850513
4785D0746274k852607k125989k184060j766404j226632p80671m20694l33712j95813
4776B8859692j79059o9098j41564k67366m42543l42715o26056n83340r48838j305969
4766B3953144j376054j456662j748471j771754j619260j316847j148500q67379
4758A2648217p89688n89699m67514l46387l2496j06543j32824k53386m1834k18985
$$ plain form
4748 9668861 9557475 9461986 9499863 9526232 9534973 9673224 10022380 10422395 10969740 11813410
4738 11813410 12853075 14541137 16607230 19107585 21715281 24116557 25529317 25743067
4730 25743067 24545043 22581853 20300434 18052013 16099865 14064997 12809069 11565997
4722 11565997 10588924 9921468 9490885 8928117 8670585 8275305 7965278 7905805 7844364 8003197
4712 8003197 8159961 8442657 8338586 8626791 8874349 9171104 9559038 10215146 10868568 11841693
4702 11841693 12776945 13980133 15453272 17405156 19655638 22769579 26155107 29795897
4694 29795897 33101563 35468817 36449017 35823859 34086398 31321470 28171418 25006948
4686 25006948 22409980 20200213 18647724 17518239 16978078 16777065 17001235 17671442 18199526
$$ packed form
4748I668861j11386r5489L7877K6369Q741J38251L49156M00015N47345Q43670
4738A1813410J039665J688062K066093K500355K607696K401276J412760K13750
4730B5743067j198024j963190k281419k248421j952148k034868j255928j243072
4722A1565997r77073o67456m30583n62768k57532l95280l10027n9473o1441J58833
4712H003197J56764K82696j04071K88205K47558K96755L87934O56108O53422R73125
4702A1841693R35252J203188J473139J951884K250482L113941L385528L640790
4694B9795897L305666K367254R80200o25158j737461k764928l150052l164470
4686B5006948k596968k209767j552489j129485n40161k01013K24170O70207N28084
$$ plain form
4677 18199526 18258613 17772717 16862717 15611387 14425217 13226504 12299968 11698722 11133250
4668 11133250 10858325 10597068 10590052 10730609 11080337 11491336 12019179 12567382 13636242 14901097
4658 14901097 16576512 18375450 20178549 21414743 21602430 20841606 19494962 17977039
4650 17977039 16862205 15898583 15395750 14860900 14590830 14632406 14978003 15731189 16762184
4641 16762184 18522016 20501740 22312364 23446278 23819424 23072585 21574374 19625957
4633 19625957 17627355 15540791 13753777 12294227 11154715 10237179 9563502 9067988 8544875
4624 8544875 8084859 7475582 7060418 6978755 6591935 6380613 6266497 6160018 6114745 6212098
4614 6212098 6241805 6222968 6293651 6561439 6943204 7241136 7530419 8065708 8746931 9639857
$$ packed form
4677A8199526N9087m85896r10000j251330j186170j198713r26536o01246n65472
4668A1133250k74925k61257p016J40557L49728M10999N27843N48203J068860J264855
4658A4901097J675415J798938J803099J236194J87687p60824j346644j517923
4650A7977039j114834r63622n02833n34850k70070M1576L45597P53186J030995
4641A6762184J759832J979724J810624J133914L73146p46839j498211j948417
4633A9625957j998602k086564j787014j459550j139512r17536o73677m95514n23113
4624H544875m60016o09277m15164q1663l86820k11322j14116j06479m5273R7353
4614F212098K9707j8837P0683K67788L81765K97932K89283N35289O81223Q92926
$$ plain form
4604 9639857 10534953 11774708 13269353 14166285 14725668 14522456 13632525 12427097 11217797
4595 11217797 10292177 9582549 8830193 8430309 8148516 7724707 7074689 6580001 6174397
4586 6174397 5897317 5661252 5374208 5362116 5212140 5131569 5408517 5479682 5361708 5345407
4576 5345407 5234858 5267801 5187736 5202292 5291566 5417353 5386916 5471255 5546313 5345445 5516028
4565 5516028 5706780 5938307 6140542 6145881 6211287 6137514 5780499 5316411 4977438 4666168
4555 4666168 4475872 4179589 4188058 4111837 3959661 4018985 4247318 4120516 4221828 4394319
4545 4394319 4443502 4621786 4469927 4481310 4588887 4537705 4450160 4399452 4312526 4188745 4286934
4534 4286934 4507063 4655009 4541726 4431706 4573237 4407474 4127026 4023819 3756972 3531869
$$ packed form
4604I639857Q95096J239755J494645Q96932N59383k03212q89931j205428j209300
4595A1217797r25620p09628p52356l99884k81793m23809o50018m94688m05604
4586F174397k77080k36065k87044j2092j49976q0571K76948P1165j17974j6301
4576E345407j10549L2943q0065J4556Q9274J25787l0437Q4339P5058k00868J70583
4565E516028J90752K31527K02235N339O5406p3773l57015m64088l38973l11270
4555D666168j90296k96283Q469p6221j52176N9324K28333j26802J01312J72491
4545D394319M9183J78284j51859J1383J07577n1182q7545n0708q6926j23781R8189
4534D286934K20129J47946j13283j10020J41531j65763k80448j03207k66847k25103
$$ plain form
4524 3531869 3375816 3109963 3153448 2825828 2826598 2821663 2920219 2890030 2721097 2854731 2765491
4513 2765491 2626862 2582435 2883909 3057193 2929568 3162677 3195544 3162664 3180171 3242355
4503 3242355 3204489 3184640 2937123 2977013 2972978 2744894 2635050 2560498 2596280 2411491 2364984
4492 2364984 2347393 2391402 2064871 2145647 2406434 2200059 2212079 2245754 2269709 2422366 2223918
4481 2223918 2180287 2325440 2328280 2187666 2214269 2132070 2126831 2059937 2132336 2268091 2147385
4470 2147385 2027164 2037151 1916045 1894520 2083387 2150530 2212648 2064123 2095274 1962759 1794696
4459 1794696 1750619 1817242 1961678 1962613 2034249 1925003 1829743 1848001 1805796 1938187 1946750
4448 1946750 1837545 1863919 1908641 1793591 1655819 1600513 1713608 1732249 1802724 1767312 1687335
$$ packed form
4524C531869j56053k65853M3485l27620P70m935R8556l0189j68933J33634q9240
4513B765491j38629m4427L01474J73284j27625K33109L2867l2880J7507O2184
4503C242355l7866j9849k47517L9890m035k28084j09844p4552L5782j84789m6507
4492B364984j7591M4009l26531Q0776K60787k06375J2020L3675K3955J52657j98448
4481B223918m3631J45153K840j40614K6603q2199n239o6894P2399J35755j20706
4470B147385j20221R987j21106k1525J88867O7143O2118j48525L1151j32515j68063
4459A794696m4077O6623J44436R35P1636j09246r5260J8258m2205J32391Q563
4448A946750j09205K6374M4722j15050j37772n5306J13095J8641P0475l5412p9977
$$ plain form
4437 1687335 1623663 1651535 1741917 1818987 1824889 1886380 1989807 1991677 1783135 1804093 1935534
4426 1935534 1871454 2113886 2084664 2269879 2278990 2312414 2148276 1967486 1990599 1919426 1926039
4415 1926039 1877899 1808059 1648700 1790853 1923068 1839922 1755994 1523329 1585618 1517052 1523834
4404 1523834 1547505 1552305 1610718 1803059 1788722 1688535 1576785 1618403 1831281 1901957 1948981
4393 1948981 1663528 1618596 1622630 1741599 1784316 1642308 1730998 1871961 1820979 1844365 1709754
4382 1709754 1733194 1771960 1901418 1980821 1873015 1763103 1739195 1697935 1747180 1715177 1834419
4371 1834419 1881089 1919931 1862339 1891733 1936282 1784808 1950609 2103911 1871263 1885883 1987555
4360 1987555 1908703 1918141 1709438 1805956 2019980 2052447 1956593 1928073 1893755 1939662 1953789
$$ packed form
4437A687335o3672K7872R0382P7070N902O1491J03427J870k08542K0958J31441
4426A935534o4080K42432k9222J85215R111L3424j64138j80790K3113p1173O613
4415A926039m8140o9840j59359J42153J32215q3146q3928k32665O2289o8566O782
4404A523834K3671M800N8413J92341j4337j00187j11750M1618K12878P0676M7024
4393A948981k85453m4932M034J18969M2717j42008Q8690J40963n0982K3386j34611
4382A709754K3440L8766J29458P9403j07806j09912k3908m1260M9245l2003J19242
4371A834419M6670L8842n7592K9394M4549j51474J65801J53302k32648J4620J01672
4360A987555p8852R438k08703R6518K14024L2467r5854k8520l4318M5907J4127
$$ plain form
4349 1953789 2153082 2189504 2102651 2212628 2111981 2074111 2025967 2000852 2119787 2190131 2328848
4338 2328848 2277491 2300150 2256818 2286087 2537767 2693463 2748309 2759262 2737991 2836932 2863208
4327 2863208 2901560 3225004 3370201 3573094 3900324 4144370 4117284 4342528 5036797 5628954
4317 5628954 6457105 7000187 7708332 8407503 8658696 8873479 8882542 8913058 8842627 8756199
4307 8756199 8785045 8625440 8426307 8913550 9436218 9988234 10442402 10743590 11305762 11606958
4297 11606958 11813041 12061679 12401154 12545703 12781169 12922499 12643631 12189050 11780167
4288 11780167 11521822 11122750 10598085 10117345 10026027 10006150 10123520 10432889 10840669 11277056
4278 11277056 11696410 11956493 11977890 11693512 11619218 11739869 11648407 11567150 11461771 11501197
$$ packed form
4349A953789J99293L6422q6853J09977j00647l7870m8144k5115J18935P0344J38717
4338B328848n1357K2659m3332K9269K51680J55696N4846J0953k1271R8941K6276
4327B863208L8352L23444J45197K02893L27230K44046k7086K25244O94269N92157
4317E628954Q28151N43082P08145O99171K51193K14783R063L0516p0431q6428
4307H756199K8846j59605j99133M87243N22668N52016M54168L01188N62172L01196
4297A1606958K06083K48638L39475J44549K35466J41330k78868m54581m08883
4288A1780167k58345l99072n24665m80740r1318j9877J17370L09369M07780M36387
4278A1277056M19354K60083K1397k84378p4294J20651r1462q1257j05379L9426
$$ plain form
4268 11501197 11609210 11519832 11392606 11449387 11531173 11700222 12112817 12449824 12804741 13610861
4258 13610861 14451737 15662962 16561744 16996243 17676946 18053955 18024141 18171939 18124128 18238367
4248 18238367 18366576 18426309 18780077 18839596 18999189 19260287 19384401 19260844 19201203 19298561
4238 19298561 19678544 19747284 19849230 20132945 20262269 20080449 19805475 19390128 18716895 17838825
4228 17838825 16763064 15917452 15104937 14468005 14311835 14215438 14032474 13983149 14047567 13969175
4218 13969175 13922030 13566524 13407917 13254855 12988036 12771406 12615323 12418903 12149007 12063361
4208 12063361 11795965 11581164 11077293 10608982 10574425 10286261 10179960 10419782 10468585 10706002
4198 10706002 10989852 11240712 11717760 11883979 11960009 12561965 12608935 12731638 12637303 12595349
$$ packed form
4268A1501197J08013q9378j27226N6781Q1786J69049M12595L37007L54917Q06120
4258A3610861Q40876J211225Q98782M34499O80703L77009k9814J47798m7811J14239
4248A8238367J28209N9733L53768N9519J59593K61098J24114j23557n9641R7358
4238A9298561L79983O8740J01946K83715J29324j81820k74974m15347o73233q78070
4228A7838825j075761q45612q12515o36932j56170r6397j82964m9325O4418p8392
4218A3969175m7145l55506j58607j53062k66819k16630j56083j96420k69896q5646
4208A2063361k67396k14801n03871m68311l4557k88164j06301K39822M8803K37417
4198A0706002K83850K50860M77048J66219P6030O01956M6970J22703r4335m1954
$$ plain form
4188 12595349 12361058 11898006 11504870 11263979 10705590 10165112 9749824 9324671 9131387
4179 9131387 9057391 9224123 9541088 9754414 9648684 9726008 9557012 9194590 8768118 8397236
4169 8397236 7799049 7228431 6652002 6015492 5517952 4932781 4669181 4435410 4183496 3990741
4159 3990741 3895825 3847004 3667754 3568538 3392120 3528170 3284413 3148709 3169737 2991779
4149 2991779 2844142 2901059 2892553 2972973 2857866 2817230 2905153 2752959 2782702 2664116 2527573
4138 2527573 2557265 2500556 2427681 2583470 2512549 2563302 2531710 2473157 2533473 2619071 2755227
4127 2755227 3025667 2928416 2946920 2804419 2685423 2565534 2517060 2400450 2350523 2152935
4117 2152935 2077774 2256520 2218667 2260207 2224692 2373873 2290361 2426069 2350968 2280737 2175319
$$ packed form
4188A2595349k34291m63052l93136k40891n58389n40478m15288m25153j93284
4179I131387p3996J66732L16965K13326j05730P7324j68996l62422m26472l70882
4169H397236n98187n70618n76429o36510m97540n85171k63600k33771k51914j92755
4159C990741r4916m8821j79250r9216j76418J36050k43757j35704K1028j77958
4149B991779j47637N6917q506Q0420j15107m0636Q7923j52194K9743j18586j36543
4138B527573K9692n6709p2875J55789p0921N0753l1592n8553O0316Q5598J36156
4127B755227K70440r7251J8504j42501j18996j19889m8474j16610m9927j97588
4117B152935p5161J78746l7853M1540l5515J49181q3512J35708p5101p0231j05418
$$ plain form
4106 2175319 2168138 2347737 2207809 2087669 2014580 2094110 2114047 2172587 2132987 1990167 2055035
4095 2055035 2018650 2032880 2105113 2037290 1975062 2097102 2044140 2056659 1848270 1932587 1978731
4084 1978731 1705152 1789840 1824730 1719232 2041516 1960968 1945338 1956765 1914026 1937703 2039793
4073 2039793 1943313 1891804 1810167 1935004 2017402 1895917 1918436 1913057 1957339 1891898 1896801
4062 1896801 1838469 2082947 1984198 2103679 1993469 2021114 1980508 2053249 2089414 1828630 1925366
4051 1925366 1857164 1939114 1889820 1878644 1809776 1840964 1769520 1798808 1836529 1718489 1818872
4040 1818872 1881583 1913664 1791778 1736387 1850346 2035762 1873608 1872210 1778874 1749577 1803306
4029 1803306 1674071 1637074 1684485 1608827 1830938 1861297 1715933 1819324 1823802 1906479 1937851
$$ packed form
4106B175319p181J79599j39928j20140p3089P9530J9937N8540l9600j42820O4868
4095B055035l6385J4230P2233o7823o2228J22040n2962J2519k08389Q4317M6144
4084A978731k73579Q4688L4890j05498L22284q0548j5630J1427m2739K3677J02090
4073B039793r6480n1509q1637J24837Q2398j21485K2519n379M4282o5441M903
4062A896801n8332K44478r8749J19481j10210K7645m0606P2741L6165k60784R6736
4051A925366o8202Q1950m9294j1176o8868L1188p1444K9288L7721j18040J00383
4040A818872O2711L2081j21886n5391J13959J85416j62154j398r3336k9297N3729
4029A803306j29235l6997M7411p5658K22111L0359j45364J03391M478Q2677L1372
$$ plain form
4018 1937851 1899049 1772293 1815344 1760883 1801273 1788603 1727247 1700366 1715181 1693423 1743455
4007 1743455 1762845 1859674 1924289 1847028 1832571 1760003 2019564 1886675 1958338 1863948 1869562
3996 1869562 1876714 1899933 1853382 1782951 1823422 1924226 2081400 2075558 2098784 2060433 2193991
3985 2193991 2280804 2256762 2296765 2417102 2401113 2521083 2564528 2564279 2645719 2597360 2692606
3974 2692606 2738999 2627171 2896020 3122740 3333470 3463316 3531975 3758872 3946690 4135917
3964 4135917 4262918 4521846 4640933 4740811 4703873 4733741 4634410 4761284 4936841 5041820
3954 5041820 5116577 5242300 5599854 5766545 6176994 6389542 7083422 7415563 7960699 8283513
3944 8283513 8609182 8868359 8800562 8893659 8809121 8588543 8346672 8384409 8056389 8116005
$$ packed form
4018A937851l8802j26756M3051n4461M0390j2670o1356k6881J4815k1758N0032
4007A743455J9390R6829O4615p7261j4457p2568K59561j32889P1663r4390N614
3996A869562P152K3219m6551p0431M0471J00804J57174n842K3226l8351J33558
3985B193991Q6813k4042M0003J20337j5989J19970M3445k49Q1440m8359R5246
3974B692606M6393j11828K68849K26720K10730J29846O8659K26897J87818J89227
3964D135917J27001K58928J19087R9878l6938K9868r9331J26874J75557J04979
3954E041820P4757J25723L57554J66691M10449K12548O93880L32141N45136L22814
3944H283513L25669K59177o7797R3097q4538k20578k41871L7737l28020N9616
$$ plain form
3934 8116005 8145772 8373695 8731318 9089607 9504410 9910433 10329684 10701258 10975572 11034774
3924 11034774 11049532 10859850 10742587 10513238 10180401 9918859 9898901 9906120 9958458 10282221
3914 10282221 10878564 11377985 12030574 12649966 13168469 13401683 13438521 13401807 13176679 12798544
3904 12798544 12572962 12461193 12466027 12609764 12782094 13473001 14179165 14989531 16077086 17370405
3894 17370405 18260852 19377512 20403385 21027013 21499184 21494314 21435619 21030818 20433492 19761453
3884 19761453 19486705 19033807 19103618 19413045 20063782 20925088 21813563 23010683 24028712
3875 24028712 25108647 25705175 26264182 26528036 26274172 25703355 25054856 24123624 22978601
3866 22978601 21904453 21029569 20303521 19751392 19586343 19820843 20190996 20722360 21156454
$$ packed form
3934H116005K9767K27923L57623L58289M14803M06023M19251L71574K74314N9202
3924A1034774J4758j89682j17263k29349l32837k61542j9958P219N2338L23763
3914A0282221N96343M99421O52589O19392N18503K33214L6838l6714k25128l78135
3904A2798544k25582j11769M834J43737J72330O90907P06164Q10366J087555J293319
3894A7370405Q90447J116660J025873O23628M72171m870n8695m04801n97326o72039
3884A9761453k74748m52898O9811L09427O50737Q61306Q88475J197120J018029
3875B4028712J079935N96528N59007K63854k53864n70817o48499r31232j145023
3866B2978601j074148q74884p26048n52129j65049K34500L70153N31364M34094
$$ plain form
3857 21156454 21869738 22218973 22195345 22015801 21571353 20949242 20546248 20334281 20062040 19884527
3847 19884527 19665442 19766083 19883205 20154160 20599716 21499694 22395670 23351850 24365329
3838 24365329 24901308 25136534 24865625 24657321 24223164 23918697 23750125 24073008 24791049
3829 24791049 25698176 26811759 28516292 30308454 31953338 34128686 36017506 38001465
3821 38001465 39876754 42045150 44530068 47352994 50381591 53520976 56569429 58583813
3813 58583813 59375200 59165079 57755910 55078943 51786863 48539924 45392688 42679589
3805 42679589 40688388 39624368 39228036 39587859 40733203 42693780 45583862 49117823
3797 49117823 53603841 58343691 62664898 66063479 68420682 69225379 68374840 66135685
$$ packed form
3857B1156454P13284L49235k3628j79544m44448o22111m02994k11967k72241j77513
3847A9884527k19085J00641J17122K70955M45556Q99978Q95976R56180J013479
3838B4365329N35979K35226k70909k08304m34157l04467j68572L22883P18041
3829B4791049R07127J113583J704533J792162J644884K175348J888820J983959
3821C8001465J875289K168396K484918K822926L028597L139385L048453K014384
3813E8583813P91387k10121j409169k676967l292080l246939l147236k713099
3805D2679589j991201j064020l96332L59823J145344J960577K890082L533961
3797D9117823M486018M739850M321207L398581K357203Q04697q50539k239155
$$ plain form
3789 66135685 63057460 59426049 55255208 50962230 46909573 43316221 39984440 37766442
3781 37766442 36078193 35116540 35029183 35714198 36824951 38034646 39291951 40641334 42184185
3772 42184185 43260299 43946620 44065428 43670036 42149568 40123658 37684013 34636815 31753611
3763 31753611 29194004 27125356 25301270 23920248 23184002 23071386 23240366 23650555 24498139
3754 24498139 25400531 26291215 26896390 27117693 26656631 25707812 24471709 23432547 22243689
3745 22243689 21029893 20237979 19764025 19553064 19353326 19572572 19935031 20336796 20887119
3736 20887119 21469750 21755989 22075535 22095870 22165697 22507520 22492742 22624711 22687915 22542436
3726 22542436 21921875 21055161 20068879 18778883 17547469 16477446 15686043 14960441 14543035
$$ packed form
3789F6135685l078225l631411m170841m292978m052657l593352l331781k217998
3781C7766442j688249r61653q7357O85015J110753J209695J257305J349383J542851
3772D2184185J076114O86321J18808l95392j520468k025910k439645l047198k883204
3763C1753611k559607k068648j824086j381022p36246j12616J68980M10189Q47584
3754B4498139R02392Q90684O05175K21303m61062r48819j236103j039162j188858
3745B2243689j213796p91914m73954k10961j99738K19246L62459M01765N50323
3736B0887119N82631K86239L19546K0335O9827L41823j4778J31969O3204j45479
3726B2542436o20561q66714r86282j289996j231414j070023p91403p25602m17406
$$ plain form
3717 14543035 14284407 14068347 13922437 14037161 14282370 14520455 14826513 14966586 15097078
3708 15097078 14982589 14373117 13640206 12913510 12010052 10981113 10203036 9671290 8996110
3699 8996110 8369321 8003656 7591238 7356339 7034217 6786653 6522778 6342407 6145578 5943981
3689 5943981 5900079 5599446 5458562 5443807 5403857 5394915 5262308 5124287 5214510 5106502 5238814
3678 5238814 5222593 4959760 4996143 4850097 4812362 4768788 4663752 4654449 4522082 4538947 4397775
3667 4397775 4421653 4466690 4533588 4495823 4519614 4495010 4510294 4504340 4416860 4327850 4222529
3656 4222529 4161247 4015764 4039431 4102727 3871669 3785783 3819979 3784069 3759489 3623051 3505826
3645 3505826 3397516 3251079 3141653 3211479 3093930 3046796 2956211 2974452 2839711 2941066
$$ packed form
3717A4543035k58628k16060j45910J14724K45209K38085L06058J40073J30492
3708A5097078j14489o09472p32911p26696r03458j028939p78077n31746o75180
3699H996110o26789l65665m12418k34899l22122k47564k63875j80371j96829k01597
3689E943981m3902l00633j40884j4755l9950q942j32607j38021R0223j08008J32312
3678E238814j6221k62833L6383j46046l7735m3574j05036r303j32367J6865j41172
3667D397775K3878M5037O6898l7765K3791k4604J5284n954q7480q9010j05321
3656D222529o1282j45483K3667O3296k31058q5886L4196l5910k4580j36438j17225
3645C505826j08310j46437j09426O9826j17549m7134r0585J8241j34741J01355
$$ plain form
3635 2941066 2770529 2789321 2782155 2748043 2741526 2703234 2636874 2647675 2634233 2628774 2749313 2658433
3623 2658433 2783576 2454453 2390717 2405523 2333742 2449138 2414589 2495054 2547867 2603293 2564157
3612 2564157 2524874 2515119 2454997 2474208 2607668 2661234 2557561 2454191 2399954 2594076 2548811
3601 2548811 2701672 2736081 2701530 2752450 2831085 2696443 2574288 2638849 2673602 2789815 2907267
3590 2907267 2792708 2788183 2761344 2763764 2737909 2776799 2847591 3009381 3144302 3320325 3209825
3579 3209825 3142511 3318713 3340132 3224961 3204775 3338264 3375786 3590792 3526704 3669073
3569 3669073 3749967 4055208 4146491 4477329 4747307 4804649 5135785 5522936 5711435 5985582
3559 5985582 6239981 6630486 6878435 7049446 7301550 7376689 7483938 7684926 7738597 7921434
$$ packed form
3635B941066j70537J8792p166l4112o517l8292o6360J0801j3442n459J20539r0880
3623B658433J25143l29123o3736J4806p1781J15396l4549Q0465N2813N5426l9136
3612B564157l9283r755o0122J9211J33460N3566j03673j03370n4237J94122m5265
3601B548811J52861L4409l4551N0920P8635j34642j22155O4561L4753J16213J17452
3590B907267j14559m525k6839K420k5855L8890P0792J61790J34921J76023j10500
3579C209825o7314J76202K1419j15171k0186J33489L7522K15006o4088J42369
3569C669073Q0894L05241R1283L30838K69978N7342L31136L87151J88499K74147
3559E985582K54399L90505K47949J71011K52104P5139J07249K00988N3671J82837
$$ plain form
3549 7921434 8079045 8352861 8704302 8921170 9034169 9260506 9699778 10057634 10406602 10811591
3539 10811591 11576259 12026449 12687649 13393905 13986447 14399632 14870181 15021940 15145162
3530 15145162 15212318 15132372 15190607 15294641 15303225 15468520 15606229 15680151 15568272 15567857 15456583
3519 15456583 15200621 14752416 14459911 14034146 13692429 13524365 13374413 13326758 13063535 13081408
3509 13081408 12675891 12269572 11909838 11459219 11388812 11287207 11142565 11233829 11266497 11570650
3499 11570650 11917731 12408360 12861798 13107157 13696304 14283139 14413472 14719411 14868044
3490 14868044 15019908 15116727 15427316 15655409 16119674 16570461 17054671 17847625 18485975 19005231
3480 19005231 19484442 19740177 19867760 20156139 20431177 20869264 21094058 21019379 20858018 20679918
$$ packed form
3549G921434J57611K73816L51441K16868J12999K26337M39272L57856L48968M04989
3539A0811591P64668M50190O61200P06256N92542M13185M70549J51759J23222
3530A5145162O7156p9946N8235J04034Q584J65295J37709P3922j11879m15j11274
3519A5456583k55962m48205k92505m25765l41717j68064j49952m7655k63223J7873
3509A3081408m05517m06319l59734m50619p0407j01605j44642R1264L2668L04153
3499A1570650L47081M90629M53438K45359N89147N86835J30333L05939J48633
3490A4868044J51864R6819L10589K28093M64265M50787M84210P92954O38350N19256
3480A9005231M79211K55735J27583K88379K75038M38087K24794p4679j61361j78100
$$ plain form
3470 20679918 20407275 20143226 19962272 19917451 19802133 19806475 19738291 19603904 19215102 18818532
3460 18818532 18411898 17952333 17450705 16976291 16250570 15484279 14845262 14284257 13897893
3451 13897893 13227614 12517378 11870368 11049105 10386154 9517955 9015675 8677254 7992661
3442 7992661 7851648 7838807 7632144 7498468 7493196 7511608 7691871 7705402 7712316 7849693 8122655
3431 8122655 8384308 8636104 8788782 8796872 9036918 9382728 9627964 9874623 10045835 10397721
3421 10397721 10435149 10652139 10740479 10824173 10943189 11043787 11325684 11436236 11462404 11440659
3411 11440659 11515963 11615522 11703560 11732185 11988141 12207101 12342388 12586139 13008181 13360066
3401 13360066 13735567 14200541 14885164 15392131 15980015 16518323 16600129 16597714 16217477 15569324
$$ packed form
3470B0679918k72643k64049j80954m4821j15318M342o8184j34387l88802l96570
3460A8818532m06634m59565n01628m74414p25721p66291o39017n61005l86364
3451A3897893o70279p10236o47010q21263o62951q68199n02280l38421o84593
3442G992661j41013j2841k06663j33676n272J8412J80263J3531O914J37377K72962
3431H122655K61653K51796J52678Q090K40046L45810K45236K46659J71212L51886
3421A0397721L7428K16990Q8340Q3694J19016J00598K81897J10552K6168k1745
3411A1440659P5304R9559Q8038K8625K55956K18960J35287K43751M22042L51885
3401A3360066L75501M64974O84623N06967N87884N38308Q1806k415l80237o48153
$$ plain form
3391 15569324 14881280 13926490 13332062 12691090 12170009 11630820 11211693 11191158 10991694 10966428
3381 10966428 11086242 11225306 11468952 11824590 12344594 12964267 13665490 14399119 15538206
3372 15538206 16437890 17105455 17594091 17693421 17441862 16872727 16178150 15349414 14799827 14027367
3362 14027367 13587713 13215714 13160656 13292810 13710282 14311353 14813182 15722894 16515373 16896391
3352 16896391 17161547 17215479 17023856 16947404 16987007 16828447 16885945 16987258 17118890 17369696
3342 17369696 17287594 17064336 16689958 16548384 16452635 16633925 17069339 17559870 18516824 19341803
3332 19341803 20189407 20963500 21210545 21155134 21044155 20732472 20395547 20176454 20037662 19968121
3322 19968121 20071189 20144083 20053640 19912388 19263489 18556302 17762244 17014696 16298661 15916862
$$ packed form
3391A5569324o88044r54790n94428o40972n21081n39189m19127k0535j99464k5266
3381A0966428J19814J39064K43646L55638N20004O19673P01223P33629J139087
3372A5538206Q99684O67565M88636R9330k51559n69135o94577q28736n49587p72460
3362A4027367m39654l71999n5058J32154M17472O01071N01829R09712P92479L81018
3352A6896391K65156N3932j91623p6452L9603j58560N7498J01313J31632K50806
3342A7369696q2102k23258l74378j41574r5749J81290M35414M90531R56954Q24979
3332A9341803Q47604P74093K47045n5411j10979l11683l36925k19093j38792o9541
3322A9968121J03068P2894r0443j41252o48899p07187p94058p47548p16035l81799
$$ plain form
3312 15916862 15420082 15259662 15463748 15882389 16261695 16832877 17321111 17770561 18721903
3303 18721903 19412913 20229372 21002004 21623343 22027694 22148643 21738574 20821482 19725533
3294 19725533 18570510 17247791 16078109 14892702 14122857 13326723 12633793 12160699 11767140
3285 11767140 11561857 11308752 11443790 11541865 11989994 12477073 13068805 13785300 14089699 14394142
3275 14394142 14392004 14272101 13553659 12871541 12343729 11854416 11588021 11405565 11307830 11236253
3265 11236253 11437532 11827981 12049805 12238717 12312652 12495897 12412280 12107541 11633018 11240492
3255 11240492 10764858 10229245 9793508 9212739 8910236 8330989 8124827 7616511 7069489
3246 7069489 6613349 6444408 6296922 5964414 5655218 5615122 5584358 5455636 5322245 5240290
$$ packed form
3312A5916862m96780j60420K04086M18641L79306N71182M88234M49450R51342
3303A8721903O91010Q16459P72632O21339M04351J20949m10069r17092j095949
3294A9725533j155023j322719j169682j185407p69845p96134o92930m73094l93559
3285A1767140k05283k53105J35038R8075M48129M87079N91732P16495L04399L04443
3275A4394142k138j19903p18442o82118n27812m89313k66395j82456r7735p1577
3265A1236253K01279L90449K21824J88912P3935J83245q3617l04739m74523l92526
3255A1240492m75634n35613m35737n80769l02503n79247k06162n08316n47022
3246G069489m56140j68941j47486l32508l09196m0096l0764j28722j33391q1955
$$ plain form
3236 5240290 5218351 5269838 5407650 5363115 5406143 5356785 5442300 5643808 5781180 5834890 5910509
3225 5910509 6179947 6091626 6159165 6372841 6788347 7126856 7608814 8309985 8981103 10062267
3215 10062267 11530803 13436548 15505997 17314077 18811348 19514489 19294018 18070299
3207 18070299 16506429 14976592 13684595 12803323 12086103 11818144 11700685 12033572 12934677
3198 12934677 14366489 15698710 17414477 18781242 19336531 19227649 18194981 16810807
3190 16810807 15316386 13782843 12396192 11441139 10597632 9837657 9648764 9545203 9233485
3181 9233485 9153370 9096955 9187721 9066036 9140016 9375098 9588780 9818880 9800094 10072345
3171 10072345 10107409 10110403 9943225 10125539 10224969 10409687 10626829 10904393 11258078 11456798
$$ packed form
3236E240290k1939N1487J37812m4535M3028m9358Q5515K01508J37372N3710P5619
3225E910509K69438q8321O7539K13676M15506L38509M81958P01171O71118J081164
3215A0062267J468536J905745K069449J808080J497271P03141k20471j223719
3207A8070299j563870j529837j291997q81272p17220k67959j17459L32887R01105
3198A2934677J431812J332221J715767J366765N55289j08882j032668j384174
3190A6810807j494421j533543j386651r55053q43507p59975j88893j03561l11718
3181I233485q0115n6415R0766j21685P3980K35082K13682K30100j8786K72251
3171A0072345L5064K994j67178J82314R9430J84718K17142K77564L53685J98720
$$ plain form
3161 11456798 11820079 12238447 12579943 12896588 13454886 14014892 14353689 14973202 15701886
3152 15701886 16506539 17648027 19261754 21888544 25443974 28390392 30171549 30506509
3144 30506509 29377095 27935560 27175136 26937991 27066210 27721747 28776058 30309538 32035469
3135 32035469 34033291 36526350 39599049 43314813 47573050 52728371 59105273 67265197
3127 67265197 78077366 92961295 112490739 136736078 164097854 191121030 213988587
3120 213988587 229367988 237632502 240581267 242651820 247481128 256176349 266198526 273279820
3112 273279820 274001127 267013109 254880021 242070820 233553103 232328312 237712001 245767697
3104 245767697 251547013 251306387 242521833 227171440 208448545 189964584 174988526 165088031
$$ packed form
3161A1456798L63281M18368L41496L16645N58298N60006L38797O19513P28684
3152A5701886Q04653J141488J613727K626790L555430K946418J781157L34960
3144C0506509j129414j441535p60424k37145J28219O55537J054311J533480J725931
3135C2035469J997822K493059L072699L715764M258237N155321O376902Q159924
3127F7265197J0812169J4883929J9529444K4245339K7361776K7023176K2867557
3120B13988587J5379401Q264514K948765K070553M829308Q695221J0022177P081294
3112B73279820P21307o988018j2133088j2809201q517717j224791N383689Q055696
3104B45767697N779316k40626q784554j5350393j8722895j8483961j4976058r900495
$$ plain form
3096 165088031 161636553 165310351 176663912 195879461 222260865 253465521 286174884
3089 286174884 317691070 346164373 369119191 381661257 378277442 356520814 319343471
3082 319343471 274771488 231723952 195302585 166570974 144545631 127851128 115172314
3075 115172314 104812325 96212145 88932199 82565868 77105389 72705607 69255748 67071452
3067 67071452 65651126 65184676 65754276 67249996 69209794 72073711 76423114 82787719
3059 82787719 93515900 110980337 137320910 170506666 203196184 225163915 228988146
3052 228988146 213873747 187111042 157865380 131748908 110600724 94261152 81633681
3045 81633681 72233373 65110321 60099791 56595470 54050134 52282415 50798253 49494376
$$ packed form
3096A65088031l451478L673798J1353561J9215549K6381404L1204656L2709363
3089B86174884L1516186K8473303K2954818J2542066l383815k1756628l7177343
3082C19343471m4571983m3047536l6421367k8731611k2025343j6694503j2678814
3075A15172314j0359989q600180p279946o366331n460479m399782l449859k184296
3067F7071452j420326m66450N69600J495720J959798K863917M349403O364605
3059H2787719J0728181J7464437K6340573L3185756L2689518K1967731L824231
3052B28988146j5114399k6762705k9245662k6116472k1148184j6339572j2627471
3045H1633681r400308p123052n010530l504321k545336j767719j484162j303877
$$ plain form
3037 49494376 47896751 45674778 43312154 41011945 38716167 36664359 34806049 33182085
3029 33182085 31934798 30922436 30271462 30240350 30345929 30661958 31411119 32493992 33435144
3020 33435144 34082849 34204628 33628560 32544244 30967428 29253098 27395063 25830273 24357208
3011 24357208 23451481 22730576 22136563 21944547 21749866 22136859 22769442 23794879 25136173
3002 25136173 26695323 28188050 29423158 29999260 29893758 29128932 28136552 26745427 25252395
2993 25252395 24004495 23135891 22406271 22221394 22160652 22581790 23635249 25048784 27100145
2984 27100145 29579280 32333259 34973843 36894710 37653740 37160494 35280181 32775574
2976 32775574 30028913 27103462 24629265 22703251 21132081 19854790 19274350 18610672
$$ packed form
3037D9494376j597625k221973k362624k300209k295778k051808j858310j623964
3029C3182085j247287j012362o50974l1112J05579L16029P49161J082873R41152
3020C3435144O47705J21779n76068j084316j576816j714330j858035j564790j473065
3011B4357208r05727p20905n94013j92016j94681L86993O32583J025437J341294
3002B5136173J559150J492727J235108N76102j05502p64826r92380j391125j493032
2993B5252395j247900q68604p29620j84877o0742M21138J053459J413535K051361
2984B7100145K479135K753979K640584J920867P59030m93246j880313k504607
2976C2775574k746661k925451k474197j926014j571170j277291n80440o63678
$$ plain form
2968 18610672 18383105 18605948 19282376 20205533 21387901 22429699 23173929 23479687 22979204
2959 22979204 21827479 20503027 19190647 17729675 16513925 15383896 14587935 14111724
2951 14111724 13838521 13686538 13847473 14327007 15091300 16013257 17464407 18791355 20168504
2942 20168504 21082707 21602703 21448091 20635492 19510525 18102109 16791891 15781175 14840155
2933 14840155 13918731 13762475 13554005 13739330 14183618 14929734 15858130 17243168 18628470
2924 18628470 19576499 20161090 20066054 19358586 17977654 16534218 14743357 13268018 12014627
2915 12014627 10885304 9927126 9217327 8591532 8082437 7828860 7514421 7188299 6989888
2906 6989888 6875531 6719151 6553581 6297618 6263335 6076675 6118114 6039114 5716140 5692958
$$ packed form
2968A8610672k27567K22843O76428R23157J182368J041798P44230L05758n00483
2959B2979204j151725j324452j312380j460972j215750j130029p95961m76211
2951A4111724k73203j51983J60935M79534P64293R21957J451150J326948J377149
2942B0168504R14203N19996j54612q12599j124967j408416j310218j010716r41020
2933A4840155r21424j56256k08470J85325M44288P46116R28396J385038J385302
2924A8628470R48029N84591r5036p07468j380932j443436j790861j475339j253391
2915A2014627j129323r58178p09799o25795n09095k53577l14439l26122j98411
2906F989888j14357j56380j65570k55963l4283j86660M1439p9000l22974k3182
$$ plain form
2896 5692958 5530554 5494767 5525653 5382801 5208335 5117249 5064583 4942866 4759960 4891110
2886 4891110 4672778 4653491 4584146 4475160 4365244 4203815 4135980 4260157 4106923 4034315
2876 4034315 3979289 4091804 3964868 3770129 3796259 3857398 3903517 3970377 3861179 3733195
2866 3733195 3789530 3760540 3918499 3899974 3729812 3667395 3821373 3700870 3636448 3667794 3686240
2855 3686240 3763141 3715670 3664165 3642522 3571781 3382601 3587099 3620151 3463196 3575971 3673999
2844 3673999 3782759 3605716 3803713 3827117 3987493 4221367 4221753 4419806 4570048 4353807
2834 4353807 4429253 4421799 4444264 4460532 4587340 4538965 4466695 4441970 4174236 4170771 4194551
2823 4194551 4150947 4300634 4378081 4258916 4332443 4138663 3966150 3834832 3820720 3727095
$$ packed form
2896E692958j62404l5787L0886j42852j74466r1086n2666j21717j82906J31150
2886D891110k18332j9287o9345j08986j09916j61429o7835J24177j53234p2608
2876D034315n5026J12515j26936j94739K6130O1139M6119O6860j09198j27984
2866C733195N6335k8990J57959j8525j70162o2417J53978j20503o4422L1346J8446
2855C686240P6901m7471n1505k1643p0741j89180K04498L3052j56955J12775R8028
2844C673999J08760j77043J97997K3404J60376K33874L86J98053J50242k16241
2834D353807P5446p454K2465J6268J26808m8375p2270k4725k67734l465K3780
2823D194551m3604J49687P7447j19165P3527j93780j72513j31318j4112r3625
$$ plain form
2813 3727095 3636183 3614823 3587993 3678844 3828932 3935535 4130552 4302535 4303248 4473566 4533937
2802 4533937 4462717 4289370 4128693 3964842 3737986 3531365 3197247 3284576 3204531 2957578
2792 2957578 2952998 2894143 2784833 2807753 2808216 2634982 2865331 2675541 2650382 2538868 2424173
2781 2424173 2467112 2445811 2638110 2585696 2682790 2906535 2724317 2900864 3047427 3190315
2771 3190315 3258224 3190311 3092287 2928748 2821054 2679156 2495332 2514969 2385359 2284336
2761 2284336 2341066 2251888 2254396 2192860 2276865 2302344 2265656 2179952 2247619 2193932 2322550
2750 2322550 2216249 2142682 2028615 2142904 2146150 2089212 2308359 2304987 2408595 2430494 2263132
2739 2263132 2241287 2179115 2204865 2182268 2129275 2035847 2035822 2122398 1990162 1905383 1831188 1874773
$$ packed form
2813C727095r0912k1360k6830R0851J50088J06603J95017J71983P13J70318O0371
2802D533937p1220j73347j60677j63851k26856k06621l34118Q7329q0045k46953
2792B957578m580n8855j09310K2920M63j73234K30349j89790k5159j11514j14695
2781B424173M2939k1301J92299n2414R7094K23745j82218J76547J46563J42888
2771C190315O7909o7913r8024j63539j07694j41898j83824J9637j29610j01023
2761B284336N6730q9178K508o1536Q4005K5479l6688q5704O7667n3687J28618
2750B322550j06301p3567j14067J14289L246n6938K19147l372J03608K1899j67362
2739B263132k1845o2172K5750k2597n2993r3428k5Q6576j32236q4779p4195M3585
$$ plain form
2727 1874773 1950551 1975637 1935584 1905863 2001095 1837896 2088204 1973266 1771927 1885086
2717 1885086 1854073 1959992 1777904 1928626 1773046 1883543 1860998 1809149 1802020 1798917 1734068
2706 1734068 1916233 1890032 1842533 1837203 1871138 1875010 1724929 1681896 1737337 1828007 1901689
2695 1901689 1845821 1714628 1710826 1649100 1962916 1862363 1722669 1802072 1934895 2070692
2685 2070692 1956909 1941635 1863745 1874223 1885125 1749102 1956689 1685759 1642642 1767694
2675 1767694 1758316 1655998 1689556 1708312 1666212 1745268 1722018 1793586 1839806 1717585 1739425
2664 1739425 1820840 1841770 1625759 1743092 1770941 1669409 1643378 1622197 1609648 1630775 1649762
2653 1649762 1681212 1856752 2058489 1859224 2094101 2064833 1728129 1838156 1721352 1692322
$$ packed form
2727A874773P5778K5086m0053k9721R5232j63199K50308j14938k01339J13159
2717A885086l1013J05919j82088J50722j55580J10497k2545n1849p129l103o4849
2706A734068J82165k6201m7499n330L3935L872j50081m3033N5441R0670P3682
2695A901689n5868j31193l802o1726L13816j00553j39694P9403J32823J35797
2685B070692j13783j5274p7890J0478J0902j36023K07587k70930m3117J25052
2675A767694r378j02318L3558J8756m2100P9056k3250P1568M6220j22221K1840
2664A739425Q1415K0930k16011J17333K7849j01532k6031k1181j2549K1127J8987
2653A649762L1450J75540K01737j99265K34877k9268l36704J10027j16804k9030
$$ plain form
2643 1692322 1621604 1556147 1516032 1624626 1389979 1445594 1444308 1423779 1479872 1526971 1605374
2632 1605374 1411038 1450082 1290066 1421658 1484169 1393543 1506109 1374251 1409881 1449423
2622 1449423 1391929 1417908 1331955 1489844 1514820 1561992 1509091 1370772 1274233 1240141 1290713
2611 1290713 1374957 1439957 1287414 1416348 1597959 1549707 1310547 1434237 1394368 1391829 1440365
2600 1440365 1502774 1491968 1504310 1349895 1387796 1359276 1304397 1532157 1358785 1345065 1206484
2589 1206484 1247371 1411836 1435794 1368079 1398058 1478328 1393715 1405295 1255680 1399255 1240650
2578 1240650 1272960 1245420 1251853 1314473 1233234 1324359 1217076 1228528 1137520 1219781 1261483
2567 1261483 1173959 1337103 1256666 1386307 1357317 1197166 1305881 1207529 1286246 1345594 1335344
$$ packed form
2643A692322p0718o5457m0115J08594k34647N5615j286k0529N6093M7099P8403
2632A605374j94336L9044j60016J31592O2511r0626J12566j31858L5630L9542
2622A449423n7494K5979q5953J57889K4976M7172n2901j38319r6539l4092N0572
2611A290713Q4244O5000j52543J28934J81611m8252k39160J23690l9869k539M8536
2600A440365O2409j0806J2342j54415L7901k8520n4879K27760j73372j3720j38581
2589A206484M0887J64465K3958o7715K9979Q0270q4613J1580j49615J43575j58605
2578A240650L2310k7540O433O2620q1239R1125j07283J1452r1008Q2261M1702
2567A261483q7524J63144q0437J29641k8990j60151J08715r8352P8717N9348j0250
$$ plain form
2556 1335344 1256314 1229892 1269382 1203232 1195579 1294232 1348845 1406252 1311657 1272557 1231885 1129168
2544 1129168 1086144 1070796 1110301 1253544 1211564 1098908 1274075 1070967 1156702 1309130
2534 1309130 1205975 1181947 1203113 1211755 1205496 1131296 1026686 1110132 1107361 1268130 1227674
2523 1227674 1103247 1087767 996296 1272487 1397131 1301490 1220720 1252563 1260326 1244512 1281242
2512 1281242 1123986 1116837 1065694 1066982 1249693 1105025 1098029 1218647 1179318 1206252 1200757
2501 1200757 1330282 1261854 1258904 1139777 1122782 1156360 964554 1045601 1129010 1014731 1045874
2490 1045874 1229657 1185710 1221814 1187276 1089786 1219165 1212184 1311062 1223602 1186078 1226490
2479 1226490 1189448 1273456 1306365 1262105 1294158 1497664 1365196 1323574 1271079 1209528 1360816
$$ packed form
2556A335344p9030k6422L9490o6150p653R8653N4613N7407r4595l9100m0672j02717
2544A129168m3024j5348L9505J43243m1980j12656J75167k03108Q5735J52428
2534A309130j03155k4028K1166Q642o259p4200j04610Q3446k771J60769m0456
2523A227674j24427j5480r1471K76191J24644r5641q0770L1843P763j5814L6730
2512A281242j57256p149n1143J288J82711j44668o996J20618l9329K6934n495
2501A200757J29525o8428k950j19127j6995L3578j91806Q1047Q3409j14279L1143
2490A045874J83783m3947L6104l4538r7490J29379o981R8878q7460l7524M0412
2479A226490l7042Q4008L2909m4260L2053K03506j32468m1622n2495o1551J51288
$$ plain form
2468 1360816 1294924 1290985 1342672 1325269 1377983 1299992 1266371 1242950 1330262 1330659 1473491 1390710
2456 1390710 1357497 1446533 1511934 1574188 1459066 1414689 1367936 1434101 1501124 1382701 1292218
2445 1292218 1371495 1432246 1582651 1446233 1417624 1422718 1559193 1699785 1563274 1457807
2435 1457807 1467799 1424595 1706881 1681535 1580241 1612874 1616373 1623963 1718783 1672653 1692132 1731797
2423 1731797 1986296 2020586 1880838 2030990 1994740 1981207 2160322 2174542 2178996 2355020 2372036
2412 2372036 2257699 2475567 2463788 2760552 2863640 3007331 3017314 3247499 3417785 3726205
2402 3726205 4143912 4677288 5699412 6715774 7537057 7874852 7838378 7777778 8196924 9030725
2392 9030725 10127768 11568589 13494089 15811672 19468640 26918088 41725451 65019519
$$ packed form
2468A360816o5892l939N1687j7403N2714p7991l3621k3421Q7312L97J42832q2781
2456A390710l3213Q9036O5401O2254j15122m4377m6753O6165O7023j18423r0483
2445A292218P9277O0751J50405j36418k8609N094J36475J40592j36511j05467
2435A457807R992m3204K82286k5346j01294L2633L499P590R4820m6130J9479L9665
2423A731797K54499L4290j39748J50152l6250j3533J79115J4220M454J76024J7016
2412B372036j14337K17868j1779K96764J03088J43691R983K30185J70286L08420
2402C726205M17707N33376J022124J016362Q21283L37795l6474o0600M19146Q33801
2392I030725J097043J440821J925500K317583L656968P449448J4807363K3294068
$$ plain form
2384 65019519 88461420 100148701 97097936 78207024 58305382 44228918 33980105
2377 33980105 26611625 20943463 16903514 13650249 11302116 9903009 9163978 8918344
2369 8918344 8997678 8685398 8358628 7661287 6976135 6402698 5877689 5332434 4943575 4704081
2359 4704081 4610888 4458137 4301793 4154573 3944516 3803176 3739758 3549641 3477886 3331418
2349 3331418 3272731 3149636 3127716 3047438 3071911 2819549 2779355 2652884 2554952 2608182 2528266
2338 2528266 2296403 2413289 2429929 2409906 2370296 2347234 2152370 2161688 2313402 2172913 2175205
2327 2175205 2149079 2013478 2117233 2112214 2011623 2009383 1978221 1934340 1853573 1752825 1681929
2316 1681929 1690095 1703942 1788880 1724172 1672257 1832258 1783398 1634914 1521701 1403059 1552059
$$ packed form
2384F5019519K3441901J1687281l050765j8890912j9901642j4076464j0248813
2377C3980105p368480n668162m039949l253265k348133j399107p39031k45634
2369H918344P9334l12280l26770o97341o85152n73437n25009n45255l88859k39494
2359D704081r3193j52751j56344j47220k10057j41340o3418j90117p1755j46468
2349C331418n8687j23095k1920q0278K4473k52362m0194j26471r7932N3230p9916
2338B528266k31863J16886J6640k0023l9610k3062j94864R318J51714j40489K292
2327B175205k6126j35601J03755n019j00591k240l1162m3881q0767j00748p0896
2316A681929Q166J3847Q4938o4708n1915J60001m8860j48484j13213j18642J49000
$$ plain form
2305 1552059 1634577 1475142 1486517 1361020 1318961 1411496 1437933 1457905 1307551 1326856 1455264
2294 1455264 1521922 1372144 1445702 1430582 1426784 1524291 1423972 1307893 1254407 1177951 1097519
2283 1097519 1308640 1288081 1258836 1436210 1362739 1226483 1371510 1269234 1213009 1242585
2273 1242585 1136573 1402862 1322328 1234322 1240952 1184614 1140270 1198617 1169274 1131812 1087551
2262 1087551 973499 1094818 1125852 1133687 1149281 1192404 1065419 1178271 1142957 1108023 1098523
2251 1098523 977337 1207503 1171982 1243829 1206538 1275459 1264980 1215314 1114449 1079519 1087686
2240 1087686 908288 1002033 1087961 1068153 930432 932222 997873 1075081 1039581 948425 975347
2229 975347 985837 1040981 1135690 1013302 1038327 1024558 904579 1000078 923832 708101 885592
$$ packed form
2305A552059Q2518j59435J1375j25497m2059R2535K6437J9972j50354J9305J28408
2294A455264O6658j49778P3558j5120l798R7507j00319j16079n3486p6456q0432
2283A097519K11121k0559k9245J77374p3471j36256J45027j02276n6225K9576
2273A242585j06012K66289q0534q8006O630n6338m4344N8347k9343l7462m4261
2262A087551j14052J21319L1034P835J5594M3123j26985J12852l5314l4934r500
2251A098523j21186K30166l5521P1847l7291O8921j0479m9666j00865l4930Q167
2240A087686j79398R3745Q5928j9808j37721J790O5651P7208l5500r1156K6922
2229I75347J0490N5144R4709j22388K5025j3769j19979R5499p6246k15731J77491
$$ plain form
2218 885592 789901 715982 823408 876560 953427 960792 1093169 986120 902606 867499 851187
2207 851187 883982 880245 799713 884200 981642 902401 690602 773966 811362 797776 1048347
2196 1048347 1029633 1058492 1033194 925954 1011229 904231 953567 1010273 975447 971308 941934
2185 941934 870398 839985 926804 874666 868832 1010742 854566 864290 855315 797430 787651 948810
2173 948810 951464 919458 882561 871788 889395 783961 915219 879408 859843 901774 823342
2162 823342 857222 895113 736051 918790 953683 839231 749261 754206 769023 800501 797949
2151 797949 783248 765921 815751 706753 700586 674886 744207 947173 778909 813078 782580
2140 782580 723354 800747 738426 704437 656888 734040 790556 771969 744072 692603 626518 829801
$$ packed form
2218H85592r5691p3919J07426N3152P6867P365J32377j07049q3514l5107j6312
2207H51187L2795l737q0532Q4487R7442p9241k11799Q3364L7396j3586K50571
2196A048347j8714K8859k5298j07240Q5275j06998M9336N6706l4826m139k9374
2185I41934p1536l0413Q6819n2138n834J41910j56176R724q975n7885r779J61159
2173I48810K654l2006l6897j0773J7607j05434J31258l5811j9565M1931p8432
2162H23342L3880L7891j59062J82739L4893j14452q9970M945J4817L1478k552
2151G97949j4701j7327M9830j08998o167k5700O9321K02966j68264L4169l0498
2140G82580n9226P7393o2321l3989m7549P7152N6516j8587k7897n1469o6085K03283
$$ plain form
2128 829801 780484 787691 755841 767911 622931 573477 739956 810219 890261 955126 937868
2117 937868 961089 1138775 1138596 1114480 1087336 1180151 1229953 1125797 1019963 732078 639973
2106 639973 948338 903861 843260 830993 890981 760147 791954 868524 817977 894529 943678
2095 943678 996145 848557 627879 550272 619923 729096 606827 656390 844158 885813 647000
2084 647000 795806 689568 822759 962875 853530 870196 713089 730428 754211 786036
2074 786036 780154 710004 716145 752368 666571 587366 593267 780439 777466 709046 756356 593519
2062 593519 616917 773715 744653 748222 687485 722961 579063 579300 611484 682199 805055 845027
2050 845027 696309 762887 718467 523600 577157 644016 679498 585059 750294 712752 574652
$$ packed form
2128H29801m9317P207l1850J2070j44980m9454J66479P0263Q0042O4865j7258
2117I37868K3221J77686j79k4116k7144R2815M9802j04156j05834k87885r2105
2106F39973L08365m4477o0601j2267N9988j30834L1807P6570n0547P6552M9149
2095I43678N2467j47588k20678p7607O9651J09173j22269M9563J87768M1655k38813
2084F47000J48806j06238J33191J40116j09345J6666j57107J7339K3783L1825
2074G86036n882p0150O141L6223q5797p9205N901J87172k973o8420M7310j62837
2062E93519K3398J56798k9062L569o0737L5476j43898K37L2184P0715J22856L9972
2050H45027j48718O6578m4420j94867N3557O6859L5482r4439J65235l7542j38100
$$ plain form
2039 574652 532336 466992 552820 786704 724496 758121 756698 644546 617450 555820 532538
2028 532538 595326 528128 711542 734185 568295 513427 622446 687359 564471 891940 820312
2017 820312 679091 782379 632545 564512 506072 486990 545839 633454 651172 500866 611849
2006 611849 646463 584347 548432 619270 652894 636536 636569 731389 636933 635733 716413 639480
1994 639480 695567 697882 547476 727756 652239 712325 670363 663921 778992 604151 607039
1983 607039 596240 545689 653840 780209 571012 547559 547306 654495 585334 691149 620493
1972 620493 623217 801679 673594 576483 639078 565549 639970 787639 696479 622061 476612
1961 476612 543743 515918 437949 608183 567957 721792 723388 779284 695941 660159 633298
$$ packed form
2039E74652m2316o5344Q5828K33884o2208L3625j423j12152k7096o1630k3282
2028E32538O2788o7198J83414K2643j65890n4868J09019O4913j22888L27469p1628
2017H20312j41221J03288j49834o8033n8440j9082N8849Q7615J7718j50306J10983
2006F11849L4614o2116l5915P0838L3624j6358L3R4820r4456j200Q0680p6933
1994F39480N6087K315j50406J80280p5517O0086m1962o442J15071j74841K888
1983F07039j0799n0551J08151J26369k09197k3453k53J07189o9161J05815p0656
1972F20493K724J78462j28085r7111O2595p3529P4421J47669r1160p4418j45449
1961D76612O7131k7825p7969J70234m0226J53835J596N5896q3343l5782k6861
$$ plain form
1950 633298 568750 764903 688830 568619 491170 513986 557374 506106 531726 643375 634664
1939 634664 699449 587498 538215 574593 634720 652794 863808 532151 545321 583919 638009
1928 638009 488337 479537 522232 579110 616337 661450 640445 642593 617503 624850 832945 732634
1916 732634 635631 623669 687669 491722 448737 560097 687943 552022 711404 703251 634729
1905 634729 542646 415599 540596 551639 506120 461050 549064 544796 339027 404394 482862
1894 482862 530217 521293 607281 597635 491079 536668 653399 535696 603188 490256 694879
1883 694879 635130 519592 340957 421514 398440 494482 413318 552609 568673 275645 538225
1872 538225 538689 476973 388541 605532 605522 654837 544854 631693 559374 682226 519785 571128
$$ packed form
1950F33298o4548J96153p6073j20211p7449K2816M3388n1268K5620J11649q711
1939F34664O4785j11951m9283L6378O0127J8074K11014l31657J3170L8598N4090
1928F38009j49672q800M2695N6878L7227M5113k1005K148k5090P347K08095j00311
1916G32634r7003j1962O4000j95947m2985J11360J27846j35921J59382q153o8522
1905F34729r2083j27047J24997J1043m5519m5070Q8014m268k05769O5367P8468
1894D82862M7355q924Q5988r646j06556M5589J16731j17703O7492j12932K04623
1883F94879n9749j15538j78635Q0557k3074R6042q1164J39291J6064k93028K62580
1872E38225M64o1716q8432K16991j0M9315j09983Q6839p2319J22852j62441N1343
$$ plain form
1860 571128 603853 517300 533024 640169 632042 556319 690734 690755 741449 653617 810692 715740
1848 715740 751264 654405 678072 691130 533236 561289 567347 672690 650533 668556 645844
1837 645844 677908 526343 423979 446881 584894 398235 741021 771419 403866 454264
1827 454264 498916 483981 421104 443924 465654 686404 518007 538632 251970 317988 236475
1816 236475 388259 609643 562217 381840 445978 416594 318790 298575 386704 613231 540868
1805 540868 606721 402078 491748 305462 394856 348684 498631 512898 667006 592088 479590
1794 479590 399669 307756 586719 463522 363914 426334 464682 470942 623644 472420 487313
1783 487313 551157 601610 606057 644475 470645 563114 825519 772791 765113 516637 591090
$$ packed form
1860E71128L2725q6553J5724J07145q127p5723J34415K1N0694q7832J57075r4952
1848G15740L5524r6859K3667J3058j57894K8053O058J05343k2157J8023k2712
1837F45844L2064j51565j02364K2902J38013j86659L42786L0398l67553N0398
1827D54264M4652j4935o2877K2820K1730K20750j68397K0625k86662O6018q1513
1816B36475J51784K21384m7426j80377O4138k9384r7804k0215Q8129K26527p2363
1805E40868O5853k04643Q9670j86286Q9394m6172J49947J4267J54108p4918j12498
1794D79590p9921r1913K78963j23197r9608O2420L8348O260J52702j51224J4893
1783D87313O3844N0453M447L8418j73830R2469K62405n2728p678k48476P4453
$$ plain form
1772 591090 528979 496603 441827 334397 291610 510721 472845 488237 345603 432633 738981
1761 738981 734473 733750 516516 498002 464796 594387 506044 543609 391077 661697 574737
1750 574737 602588 395790 215037 398346 485425 458516 476793 546731 471227 599509 490538
1739 490538 462153 418246 537795 515786 460443 333951 387763 383626 424503 378775 392672
1728 392672 484294 494023 340035 337252 396227 384875 477144 467801 510586 395129 436805 547129
1716 547129 500385 379606 418192 550678 673992 437522 392378 494060 389147 488056
1706 488056 477892 549713 462060 347243 455042 506022 338074 589020 700354 643224 641814
1695 641814 483938 634748 536355 524473 347196 443348 532941 546082 529777 573239 340588
$$ packed form
1772E91090o2111l2376n4776j07430m2787K19111l7876J5392j42634Q7030L06348
1761G38981m508p23k17234j8514l3206J29591q8343L7565j52532K70620q6960
1750E74737K7851k06798j80753J83309Q7079k6909J8277O9938p5504J28282j08971
1739D90538k8385m3907J19549k2009n5343j26492N3812m137M0877m5728J3897
1728C92672R1622R729j53988k783N8975j1352R2269r343M2785j15457M1676J10324
1716E47129m6744j20779L8586J32486J23314k36470m5144J01682j04913R8909
1706D88056j0164P1821q7653j14817J07799N0980j67948K50946J11334n7130j410
1695F41814j57876J50810r8393j1882j77277R6152Q9593J3141j6305M3462k32651
$$ plain form
1684 340588 409735 618235 498000 562469 569226 611536 527146 538577 367359 520168 581578
1673 581578 540737 394686 351313 317532 192232 423581 358211 217128 385749 575897
1663 575897 571127 490525 405728 399630 567419 353254 388470 500348 480551 505583 488049
1652 488049 390895 372664 392885 480412 449070 351779 342486 254643 412486 353247 235355
1641 235355 470835 353043 477688 449819 499624 526842 411615 509803 533988 468747 371281
1630 371281 492202 449131 465843 350655 455975 358771 384668 443490 460251 487951 408561
1619 408561 453346 501518 549921 279446 436932 547055 448686 447143 471137 404267 433610
1608 433610 456088 334697 429721 292735 479646 439976 392738 341443 374606 473103 605781
$$ packed form
1684C40588O9147K08500j20235O4469O757M2310q4390J1431j71218J52809O1410
1673E81578m0841j46051m3373l3781j25300K31349o5370j41083J68621J90148
1663E75897m770q0602q4797o098J67789k14165L5216J11878j9797K5032j7534
1652D88049r7154j8231K0221Q7527l1342r7291r293q7843J57843n9239j17892
1641B35355K35480j17792J24645k7869M9805K7218j15227R8188K4185o5241r7466
1630C71281J20921m3071J6712j15188J05320r7204K5897N8822J6761K7700p9390
1619D08561M4785M8172M8403k70475J57486J10123r8369j543K3994o6870K9343
1608D33610K2478j21391R5024j36986J86911l9670m7238n1295L3163R8497J32678
$$ plain form
1597 605781 300556 381315 418325 393575 452383 289039 427941 342000 371532 481360 367871
1586 367871 360351 411710 539417 643125 438678 397976 365266 349955 350348 290618 390633
1575 390633 477347 441287 556062 507510 421895 410989 467156 605006 596956 619861 458729
1564 458729 385471 256167 421638 403569 445575 464543 374779 435341 310494 257906 240794
1553 240794 500756 347331 463210 298162 409405 402152 300942 426898 451748 463242
1543 463242 457075 384165 271672 396210 236171 340016 365063 315377 441423 313669 437914
1532 437914 362787 361136 492041 526047 514224 435891 424054 330223 304350 378059 421090 468206
1520 468206 512049 413955 433795 464048 234753 284505 392457 529804 381175 434634 314716
$$ packed form
1597F05781l05225Q0759L7010k4750N8808j63344J38902q5941K9532J09828j13489
1586C67871p520N1359J27707J03708k04447m0702l2710j5311L93n9730J00015
1575C90633Q6714l6060J14775m8552q5615j0906N6167J37850q050K2905j61132
1564D58729p3258j29304J65471j8069M2006J8968q9764O0562j24847n2588j7112
1553B40794K59962j53425J15879j65048J11243p253j01210J25956K4850J1494
1543D63242o167p2910j12493J24538j60039J03845K5047m9686J26046j27754J24245
1532D37914p5127j651J30905L4006j1823p8333j1837r3831k5873P3709M3031M7116
1520D68206M3843r8094J9840L0253k29295M9752J07952J37347j48629N3459j19918
$$ plain form
1509 314716 341404 413973 395347 351229 267737 483022 452480 453168 364758 311355 314231 522157
1497 522157 290820 272886 240339 263100 329772 216748 264949 313123 335663 549356 458639
1486 458639 281105 382326 499962 528283 461850 328338 408531 466248 497728 276071 159751
1475 159751 385327 370157 447699 387992 174983 213636 368518 480890 459643 392981 435475
1464 435475 394934 401480 373895 288070 463286 509645 423425 454763 437077 305087 389791
1453 389791 355424 325132 334026 388932 487516 361923 211313 267233 470989 307418 542755
1442 542755 439779 459859 445062 283866 321207 369273 297631 471422 498376 370759 295101
1431 295101 183753 285073 270628 240236 337849 393831 399250 443987 382658 451830 357602
$$ packed form
1509C14716K6688P2569j8626m4118q3492K15285l0542O88q8410n3403K876K07926
1497E22157k31337j7934l2547K2761O6672j13024M8201M8174K2540K13693r0717
1486D58639j77534J01221J17636K8321o6433j33512Q0193N7717L1480k21657j16320
1475A59751K25576j5170P7542n9707k13009L8653J54882J12372k1247o6662M2494
1464D35475m0541O546k7585q5825J75216M6359q6220L1338j7686j31990Q4704
1453C89791l4367l0292Q894N4906R8584j25593j50610N5920K03756j63571K35337
1442E42755j02976K0080j4797j61196L7341M8066p1642J73791K6954j27617p5658
1431B95101j11348J01320j4445l0392R7613N5982N419M4737o1329O9172r4228
$$ plain form
1420 357602 462191 438445 335637 377567 336457 426401 286052 138613 193838 218680 201267
1409 201267 254491 115020 427764 414324 454061 492815 354661 283399 320103 345855 270243
1398 270243 432101 234451 381146 447863 296971 208995 332004 301173 539841 430364
1388 430364 422782 464080 356731 443173 426476 313477 388632 427594 535988 392740 360264
1377 360264 425539 409042 579781 406759 398750 347974 480660 438462 527654 377533 297257
1366 297257 361372 264510 468687 271092 405121 354532 466429 369570 362896 422481 416420
1355 416420 407374 386698 333857 358403 502188 376522 280441 214854 241189 323570 462800
1344 462800 233227 226665 308899 289901 387016 432925 262940 458374 362072 445784 353326
$$ packed form
1420C57602J04589k3746j02808M1930m1110Q9944j40349j47439N5225K4842j7413
1409B01267N3224j39471L12744j3440L9737L8754j38154p1262L6704K5752p5612
1398B70243J61858j97650J46695O6717j50892q7976J23009l0831K38668j09477
1388D30364p582M1298j07349Q6442j6697j12999P5155L8962J08394j43248l2476
1377C60264O5275j6497J70739j73022q009n0776J32686m2198Q9192j50121q0276
1366B97257O4115r6862K04177j97595J34029n0589J11897r6859o674N9585o061
1355D16420r046k0676n2841K4546J43785j25666r6081o5587K6335Q2381J39230
1344D62800k29573o562Q2234j8998R7115M5909j69985J95434r6302Q3712r2458
$$ plain form
1333 353326 196424 190519 142246 425482 381929 247331 341308 263110 252680 289567 138251
1322 138251 246797 224592 253054 311016 191147 231840 345329 340287 229388 293434 287038
1311 287038 302936 302663 410057 254236 313458 419375 234865 343135 292701 127702 280243
1300 280243 436855 314046 346967 404872 356958 477986 495606 372630 488773 473392 443912
1289 443912 410790 454516 274344 157226 240435 382684 332034 335401 278213 355803 400740
1278 400740 249420 427267 446726 527698 655255 481198 387607 349548 241168 263009 210120
1267 210120 268362 267068 295221 393869 242061 195986 397799 381037 457573 439919 141665
1256 141665 289201 385004 333009 389704 218445 165017 281275 396100 219223 201842 264331
$$ packed form
1333C53326j56902n905m8273K83236m3553j34598R3977p8198j0430L6887j51316
1322A38251J08546k2205K8462N7962j19869M0693J13489n042j10899O4046o396
1311B87038J5898k73J07394j55821N9222J05917j84510J08270n0434j64999J52541
1300B80243J56612j22809L2921N7905m7914J21028J7620j22976J16143j5381k9480
1289D43912l3122M3726j80172j17118Q3209J42249n0650L367n7188P7590M4937
1278D00740j51320J77847J9459Q0972J27557j74057r3591l8059j08380K1841n2889
1267B10120N8242j294K8153R8648j51808m6075K01813j6762P6536j7654k98254
1256A41665J47536R5803n1995N6695j71259n3428J16258J14825j76877j7381O2489
$$ plain form
1245 264331 346384 397778 295862 258909 162940 334422 304760 300717 277125 197186 292616
1234 292616 287042 97696 139432 378296 410962 518366 259032 292488 256857 290184 211173
1223 211173 155410 238612 247590 327907 398975 172229 99875 290665 260824 438113 314968
1212 314968 247661 387055 302325 254383 269548 243405 263126 335924 249506 266659 181141
1201 181141 276322 305843 262130 258192 175931 306349 367264 215528 258907 260201 277463 319094
1189 319094 310910 205675 160095 170986 215948 418311 221765 328856 269083 340420 280756
1178 280756 273732 326768 408583 225218 217396 232453 150156 122353 113865 338632 406262 398881
1166 398881 461197 130265 265835 461080 456805 520232 389348 420630 333759 351476 259229
$$ packed form
1245B64331Q2053N1394j01916l6953r5969J71482k9662m043k3592p9939R5430
1234B92616n574j89346M1736K38864L2666J07404k59334L3456l5631L3327p9011
1223B11173n5763Q3202Q978Q0317P1068k26746p2354J90790k9841J77289j23145
1212C14968o7307J39394q4730m7942J5165k6143J9721P2798q6418J7153q5518
1201A81141R5181K9521m3713l938q2261J30418O0915j51736M3379J294J7262M1631
1189C19094q184j05235m5580J0891M4962K02363j96546J07091n9773P1337n9664
1178B80756p024N3036Q1815j83365p822J5057q2297k7803q488K24767O7630p381
1166C98881O2316l30932J35570J95245m275O3427j30884L1282q6871J7717r2247
$$ plain form
1155 259229 180992 246938 285545 356164 483409 524421 316775 360340 397277 465930 568840
1144 568840 499239 456969 485767 354410 358078 255004 242530 301572 199577 215498 275817
1133 275817 174915 189263 319592 235843 362992 390300 457577 394327 226329 226692 263968
1122 263968 424152 371222 128200 79400 148967 236383 335622 289802 296137 404367 473319
1111 473319 534803 253649 143360 259418 253441 417699 453518 262351 185267 95794 150056
1100 150056 -9995 116886 284798 342551 270029 120764 17000 90444 340452 187067
1090 187067 247848 338625 221418 232157 164864 192035 259073 436146 400104 285093 114472
1079 114472 161567 41615 223135 331237 183869 311164 376214 343789 221798 215871 264295
$$ packed form
1155B59229p8237O5946L8607P0619J27245M1012k07646M3565L6937O8653J02910
1144E68840o9601m2270K8798j31357L668j03074j2474N9042j01995J5921O0319
1133B75817j00902J4348J30329q3749J27149K7308O7277o3250j67998L63L7276
1122B63968J60184n2930k43022m8800O9567Q7416R9239m5820O335J08230O8952
1111D73319O1484k81154j10289J16058n977J64258L5819j91167p7084q9473N4262
1100A50056j60051J26881J67912N7753p2522j49265j03764P3444K50008j53385
1090A87067O0781R0777j17207J0739o7293K7171O7038J77073l6042j15011j70621
1079A14472M7095j19952J81520J08102j47368J27295O5050l2425j21991n927M8424
$$ plain form
1068 264295 329895 402418 434673 224340 264040 311774 254905 249980 233836 180822 373615
1057 373615 368527 249139 138892 162471 476972 382273 515763 483460 251309 392787 368633
1046 368633 289077 284470 304770 311282 352053 303714 281057 248501 284376 477238 464333 434635
1034 434635 420410 328516 331591 371466 369455 384962 324742 304968 292112 160374 238440 91918
1022 91918 95376 283083 290333 481258 452405 336553 232881 262708 271197 308050 246279 304025
1010 304025 128977 109089 160273 64858 148136 255382 162103 175384 339180 211779 291330
999 291330 238420 293534 292704 366449 531545 157206 22705 20789 7961 152860 181513 130454
987 130454 58535 165369 109589 155615 198426 197973 100399 232171 299115 135782 166574 195089
$$ packed form
1068B64295O5600P2523L2255k10333L9700M7734n6869m925j6144n3014J92793
1057C73615n088j19388j10247K3579L14501r4699J33490l2303k32151J41478k4154
1046C68633p9556m607K0300O512M0771m8339k2657l2556L5875J92862j2905k9698
1034D34635j4225r1894L075L9875k011J5507o0220j9774j2856j31738P8066j46522
1022I1918L458J87707P250J90925k8853j15852j03672K9827Q489L6853o1771N7746
1010C04025j75048j9888N1184r5415Q3278J07246r3279J3281J63796j27401P9551
999B91330n2910N5114q30P3745J65096l74339j34501j916j2828J44899K8653n1059
987A30454p1919J06834n5780M6026M2811m53r7574J31772O6944j63333L0792K8515
$$ plain form
975 195089 256056 346893 438763 383891 322025 250116 194510 204455 163587 393110 209440 338100
963 338100 353653 187657 206137 260248 122791 207349 372489 386820 348560 304608 430718
952 430718 334939 279500 333269 389731 300654 372877 226209 230383 233117 212960 340722 238750
940 238750 260489 262402 266324 252356 180281 220408 305781 368016 327897 369416 293920 290300
928 290300 169231 214305 276168 146371 253254 231520 256720 309821 295605 377374 393392
917 393392 276465 227429 260753 257533 226122 92913 254845 241279 175338 275262 144667
906 144667 126224 226427 248391 368729 331623 202402 354004 222644 167046 112792 173293
895 173293 193901 114390 114926 106085 113415 103553 199242 179380 300453 324081 345739 384214 100784
$$ packed form
975A95089O0967R0837R1870n4872o1866p1909n5606R945m0868K29523j83670J28660
963C38100J5553j65996J8480N4111j37457Q4558J65140J4331l8260m3952J26110
952D30718r5779n5439N3769N6462q9077P2223j46668M174K734k0157J27762j01972
940B38750K1739J913L922j3968p2075M0127Q5373O2235m0119M1519p5496l620
928B90300j21069M5074O1863j29797J06883k1734K5200N3101j4216Q1769J6018
917C93392j16927m9036L3324l220l1411j33209J61932j3566o5941R9924j30595
906A44667j8443J00203K1964J20338l7106j29221J51602j31360n5598n4254O0501
895A73293K0608p9511N36q841P330r862R5689j9862J21073K3628K1658L8475k83430
$$ plain form
882 100784 48337 97123 164855 60170 74626 74583 121378 166660 180755 348470 190965 235656
870 235656 176426 487388 387941 321104 338025 155035 199116 167699 70667 -16491 -22538 142566
858 142566 375287 206120 43623 119453 274510 373780 305434 141065 278721 301737 278702
847 278702 289857 314586 320947 177501 324110 307371 63253 141680 271462 267403 335379
836 335379 307480 266554 371827 345346 230956 259092 291841 357534 360199 398719 235371
825 235371 148505 447349 475165 372273 321340 320353 241540 311018 63175 135528 138129 161363
813 161363 408610 341734 338467 220005 270785 332936 294154 219378 340946 346705 261043 122302
801 122302 221818 200795 57931 132342 190587 163234 248798 139551 100790 211752 159707
$$ packed form
882A00784n2447M8786O7732j04685J4456m3M6795M5282J4095J67715j57505M4691
870B35656n9230L10962r9447o6837J6921j82990M4081l1417r7032q7158o047J65104
858A42566K32721j69167j62497P5830J55057R9270o8346j64369J37656K3016k3035
847B78702J1155K4729O361j43446J46609j6739k44118P8427J29782m059O7976
836C35379k7899m0926J05273k6481j14390K8136L2749O5693K665L8520j63348
825B35371q6866K98844K7816j02892n0933r87p8813O9478k47843P2353K601K3234
813A61363K47247o6876l267j18462N0780O2151l8782p4776J21568N759q5662j38741
801A22302R9516k1023j42864P4411N8245k7353Q5564j09247l8761J10962n2045
$$ plain form
790 159707 183699 314600 310474 166839 248038 328754 258193 137929 293305 306391 260810
779 260810 293318 171953 236787 226725 74428 219284 214636 156772 297426 275353 167347
768 167347 102505 118888 173920 284089 109423 78690 145458 158228 320527 349973 277997
757 277997 157201 233702 239781 55704 17605 114593 163323 238618 234785 161701 219198 237457
745 237457 287930 351963 332591 374037 299127 272133 209093 125337 251492 243065 406599 233386
733 233386 160584 98540 56999 87437 151360 132597 311042 469629 285858 321493 199484
722 199484 103393 313687 287462 243589 338294 165967 327260 227165 163351 156807 159932
711 159932 186877 196484 90187 154419 94087 58772 149929 196718 217915 287651 267291 296966
$$ packed form
790A59707K3992J30901m126j43635Q1199Q0716p0561j20264J55376J3086m5581
779B60810L2508j21365O4834j0062j52297J44856m648n7864J40654k2073j08006
768A67347o4842J6383N5032J10169j74666l0733O6768J2770J62299K9446p1976
757B77997j20796P6501O079j84077l8099R6988M8730P5295l833p3084N7497J8259
745B37457N0473O4033j9372M1446p4910k6994o3040q3756J26155q427J63534j73213
733B33386p2802o2044m1541L0438O3923j8763J78445J58587j83771L5635j22009
722A99484r6091K10294k6225m3873R4705j72327J61293j00095o3814o544L125
711A59932K6945R607j06297O4232o0332l5315R1157M6789K1197O9736k0360K9675
$$ plain form
699 296966 208257 121354 217578 235169 31550 45995 81506 77505 159152 132154 91943 212119
687 212119 221831 30523 152521 165670 127515 416781 383135 382382 379549 329990 446239 347546
675 347546 194578 215890 214440 104398 186785 218556 136412 273899 134730 209674 338029
664 338029 215507 359558 357171 452904 262976 260887 361415 373247 223622 438235 317431
653 317431 151282 212862 112312 168646 175169 304236 253442 390725 285118 280159 261309
642 261309 297330 203759 295071 305548 314965 189218 116318 284449 241136 244235 198779 239231
630 239231 -1939 266938 69468 211442 190744 75349 249424 116982 -10785 -79105
620 -79105 97624 174594 175993 112312 164294 187849 122336 320016 221107 174805 317541 151003
$$ packed form
699B96966q8709q6903R6224J7591k03619J4445L5511m001Q1647k6998m0211J20176
687B12119R712j91308J21998J3149l8155K89266l3646p53k833m9559J16249r8693
675C47546j52968K1312j450j10042Q2387L1771q2144J37487j39169P4944J28355
664C38029j22522J44051k387R5733j89928k089J00528J1832j49625K14613j20804
653C17431j66149O1580j00550N6334O523J29067n0794J37283j05607m959j8850
642B61309L6021r3571R1312J0477R417j25747p2900J68131m3313L099m5456M0452
630B39231k41170K68877j97470J41974k0698j15395J74075j32442j27767o8320
620g9105J76729P6970J399o3681N1982K3555o5513J97680r8909m6302J42736j66538
$$ plain form
608 151003 244094 147930 -31613 111872 208250 156104 111707 159483 165019 180607 144690 371519
596 371519 224117 400250 375849 457251 370801 309799 237278 124219 127641 122242 149858 149371
584 149371 166067 70760 359771 233495 247332 196776 398049 367211 398240 285273 238593
573 238593 216917 82165 222323 40325 272812 227508 206004 301848 218772 67951 139933
562 139933 170080 209107 234542 159001 67959 136090 64053 215907 133461 101626 218652
551 218652 143856 233277 26438 223575 260194 269950 176426 157145 51816 80707 -19205
540 -19205 71555 156505 75960 207624 221805 269850 176038 129926 216613 287692 272385 341525
528 341525 202819 206188 147111 89008 145278 23350 179251 157578 276110 109591 279469
$$ packed form
608A51003R3091r6164j79543J43485R6378n2146m4397M7776N536J5588l5917K26829
596C71519j47402J76133k4401Q1402q6450o1002p2521j13059L422n399K7616m87
584A49371J6696r5307K89011j26276J3837n0556K01273l0838L1029j12967m6680
573B38593k1676j34752J40158j81998K32487m5304k1504R5844q3076j50821P1982
562A39933L0147L9027K5435p5541r1042O8131p2037J51854q2446l1835J17026
551B18652p4796Q9421k06839J97137L6619R756r3524j9281j05329K8891r9912
540a9205R0760Q4950q0545J31664J4181M8045r3812m6112Q6687P1079j5307O9140
528C41525j38706L369n9077n8103N6270j21928J55901k1673J18532j66519J69878
$$ plain form
517 279469 95624 260865 232350 240364 324885 352950 363984 305282 281671 122921 162088
506 162088 134614 327957 323247 214094 169901 146581 293433 351748 208510 302642 233144
495 233144 360310 355921 176721 88138 74428 66653 273180 327725 248396 155733 204822 357671
483 357671 111077 164704 64706 56244 186734 58192 59005 176287 37615 112443 135174
472 135174 26506 100678 83077 342060 196454 155451 67771 144188 167156 166984 165076 98725
460 98725 151395 41869 254919 99901 -86795 -60072 166199 208728 325520 180518 123818
449 123818 227122 91613 225375 183752 143269 201297 327171 353243 86942 -31402 195099
438 195099 183182 239852 120577 175200 130968 153833 154544 213738 192753 241513 290050 324673
$$ packed form
517B79469j83845J65241k8515Q014Q4521K8065J1034n8702k3611j58750L9167
506A62088k7474J93343m710j09153m4193k3320J46852N8315j43238R4132o9498
495B33144J27166m389j79200q8583j3710p775K06527N4545p9329r2663M9089J52849
483C57671k46594N3627r9998q462J30490j28542Q13J17282j38672P4828K2731
472A35174j08668P4172j7601K58983j45606m1003q7680P6417K2968j72j908o6351
460I8725N2670j09526K13050j55018j86696K6723K26271M2529J16792j45002n6700
449A23818J03304j35509J33762m1623m0483N8028J25874K6072k66301j18344K26501
438A95099j1917N6670j19275N4623m4232K2865P11N9194k0985M8760M8537L4623
$$ plain form
426 324673 158314 -25648 173051 274228 203272 212336 198539 349616 358315 185839 184018
415 184018 145780 121154 140543 314992 231783 123197 148866 296733 353150 307275 351437
404 351437 421312 383398 217556 193767 154977 83717 107665 346053 272335 105000 117438
393 117438 -121158 129007 116255 155279 359833 382527 220147 379738 242029 158775 -3608
382 -3608 80465 219448 72574 157454 -76582 36997 28561 90003 312094 346153 233539
371 233539 281465 136896 36384 -41453 -6244 160039 247378 60203 -19589 102637 227806
360 227806 187988 199994 37140 79459 198930 337917 191950 89731 194355 263573 392772
349 392772 188725 -130367 -49343 13596 43969 276185 149686 -3382 182915 125827 156955
$$ packed form
426C24673j66359j83962J98699J01177p0956R064j3797J51077Q699j72476j821
415A84018l8238k4626J9389J74449q3209j08586K5669J47867N6417m5875M4162
404C51437O9875l7914j65842k3789l8790p1260K3948K38388p3718j67335J2438
393A17438k38596K50165j2752L9024K04554K2694j62380J59591j37709q3254j62383
382c608Q4073J38983j46874Q4880k34036J13579q436O1442K22091L4059j12614
371B33539M7926j44569j00512p7837L5209J66283Q7339j87175p9792J22226J25169
360B27806l9818J2006j62854M2319J19471J38987j45967j02219J04624O9218J29199
349C92772k04047l19092Q1024O2939L0373K32216j26499j53068J86297n7088L1128
$$ plain form
338 156955 153227 112115 213890 118087 216416 37710 22866 34122 -114766 66783 248087
327 248087 139919 304179 102306 57893 18414 93512 249381 333061 342443 308325 228996
316 228996 212745 124133 134367 -9908 42911 343452 264795 338014 285160 34781 199167
305 199167 367905 387543 357419 404567 178008 71360 189934 96739 245385 230150 124378
294 124378 141892 222131 114598 59051 52789 186771 180370 281805 315264 13387 56060
283 56060 125201 162823 238393 136320 134979 110410 95022 189915 142455 122422 174718 177197
271 177197 251825 221389 70728 66538 42202 159798 54622 220849 259222 69237 82359
260 82359 62446 33602 172704 182859 190653 190439 137318 103104 25592 166015 102093 107701
$$ packed form
338A56955l728m1112J01775r5803R8329j78706j4844J1256j48888J81549J81304
327B48087j08168J64260k01873m4413l9479P5098J55869Q3680R382l4118p9329
316B28996j6251q8612J0234j44275N2819L00541p8657P3219n2854k50379J64386
305A99167J68738J9638l0124M7148k26559j06648J18574r3195J48646j5235j05772
294A24378J7514Q0239j07533n5547o262J33982o401J01435L3459l01877M2673
283E6060O9141L7622P5570j02073j341k4569j5388R4893m7460k0033N2296K479
271A77197P4628l0436j50661m190k4336J17596j05176J66227L8373j89985J3122
260H2359j9913k8844J39102J0155P794k14n3121l4214p7512J40423o3922N608
$$ plain form
248 107701 129170 63245 141417 7953 21585 -71145 145150 269813 191683 285701 64798
237 64798 96197 142724 206596 156804 132909 71624 92874 11890 95413 126079 67841 192545
225 192545 64594 89412 175974 59662 249435 93842 94408 78172 107327 89995 115983
214 115983 64996 205140 177146 107356 48165 30887 171000 45905 188048 255053 210408
203 210408 175814 107998 10955 147459 110729 27991 -56718 33009 92755 156070 155953 -78214
191 -78214 -43386 100723 194053 262102 60719 -8191 -13449 30949 144504 169817 248444 112579
179 112579 109433 172615 43931 100326 -22064 73541 196108 98642 162411 193754 68807
168 68807 94638 97808 188907 163463 67947 81627 -32569 122415 121602 186223 201491 3641
$$ packed form
248A07701K1469o5925P8172j33464J3632r2730K16295J24663p8130R4018k20903
237F4798L1399M6527O3872m9792k3895o1285K1250q0984Q3523L0666n8238J24704
225A92545j27951K4818Q6562j16312J89773j55593N66j6236K9155j7332K5988
214A15983n0987J40144k7994o9790n9191j7278J40113j25095J42143O7005m4645
203B10408l4594o7816r7043J36504l6730q2738q4709Q9727N9746O3315j17k34167
191g8214L4828J44109R3330O8049k01383o8910n258M4398J13555K5313P8627j35865
179A12579l146O3182j28684N6395j22390R5605J22567r7466O3769L1343j24947
168F8807K5831L170R1099k5444r5516J3680j14196J54984q13O4621J5268j97850
$$ plain form
156 3641 -44652 131913 151211 53885 -28273 -22163 17019 185317 144861 39723 28800 22001
144 22001 5960 56423 -15210 -174287 -98458 -70133 -5122 -32902 65099 14913 -48842 -34260
132 -34260 -35654 -39303 -43975 -62901 -36534 -27035 29198 52456 19636 35052 -119594 -104285 12647
119 12647 -155450 -117120 -108522 -85613 30978 -18242 146379 32423 -53751 -118957 -214376
108 -214376 -100331 -197826 -166308 -83246 -68333 -111587 -57995 -21845 -165777 -190704 -88747
97 -88747 10137 -15386 -35403 -135616 -37365 -76708 -111514 -102789 9857 -47609 -212205 -65865
85 -65865 -70110 -134897 -81955 33840 74464 68125 13827 31832 -109324 -185716 -234706 -118428
73 -118428 -61321 -95053 -135420 -126250 -270026 -232978 -86919 -65816 -122273 -158509 -93410 -72571
$$ packed form
156C641m8293J76565J9298r7326q2158O110L9182J68298m0456j05138j0923o799
144B2001j6041N0463p1633j59077P5829K8325O5011k7780R8001n0186o3755J4582
132c4260j394l649m672j8926K6367R499N6233K3258l2820J5416j54646J5309J16932
119A2647j68097L8330Q598K2909J16591m9220J64621j13956q6174o5206r5419
108b14376J14045r7495L1518Q3062J4913m3254N3592L6150j43932k4927J01957
97h8747R8884k5523k0017j00213R8251l9343l4806Q725J12646n7466j64596J46340
85f5865m245o4787N2942J15795M0624o339n4298J8005j41156p6392m8990J16278
73a18428N7107l3732m0367R170j43776L7048J46059K1103n6457l6236O5099K0839
$$ plain form
61 -72571 -228397 -251335 -374018 -305621 -219462 -225158 -109260 -293706 -327934 -326766 -268856 -212896
49 -212896 -319166 -198918 -74862 -190242 -173008 -195729 -187189 -268658 -288576 -250293 -216222
38 -216222 -246967 -166309 -155264 -202780 -303829 -234228 -102818 -177810 -265181 -256504 -82554 -168368
26 -168368 -235135 -204413 -299343 -237883 -279256 -150990 -162267 -324504 -248871 -134860 -194297
15 -194297 -330836 -281349 -268982 -214623 -139988 -201497 -275684 -335304 -464549 -403980 -273668
4 -273668 -361868 -428298 -263266 -381170
0 -381170
$$ packed form
61g2571j55826k2938j22683O8397Q6159n696J15898j84446l4228J168N7910N5960
49b12896j06270J20248J24056j15380J7234k2721Q540q1469j9918L8283L4071
38b16222l0745Q0658J1045m7516j01049O9601J31410p4992q7371Q677J73950q5814
26a68368o6767L0722r4930O1460m1373J28266j1277j62237P5633J14011n9437
15a94297j36539M9487J2367N4359P4635o1509p4187n9620j29245O0569J30312
4b73668q8200o6430J65032j17904
0c81170
$$ Imaginary data points
##PAGE= N=2
##DATA TABLE= (X++(I..I)), XYDATA
$$ plain form
16383 -1429396 -1387758 -1401908 -1462785 -1448160 -1340000 -1296406 -1348881 -1332675 -1293038 -1105559 -1123238
16372 -1123238 -997622 -1015571 -1080020 -1092145 -1028908 -1021996 -1028618 -1075686 -991073 -955943 -978671
16361 -978671 -1033150 -950636 -942891 -963505 -805297 -788781 -655726 -578761 -613024 -572466 -616875
16350 -616875 -668082 -598676 -613674 -589955 -606680 -441981 -464838 -466409 -356782 -389519 -337058
$$ packed form
16383a429396M1638j4150o0877J4625J08160M3594n2475J6206L9637J87479j7679
16372a123238J25616j7949o4449j2125O3237O912o622m7068Q4613L5130k2728
16361i78671n4479Q2514P745k0614J58208J6516J33055P6965l4263M0558m4409
16350f16875n1207O9406j4998K3719j6725J64699k2857j571J09627l2737N2461
$$ [...]
##END NTUPLES=NMR SPECTRUM
##END=
