##TITLE=1H_DE-80H_X3
 200.13MHz, d2o
 8 sc
 
 19ns.26.2.2025
##JCAMPDX= 6.0         $$ Bruker NMR JCAMP-DX V2.0
##DATA TYPE= NMR SPECTRUM
##DATA CLASS= NTUPLES
##ORIGIN= UXNMR, Bruker Analytische Messtechnik GmbH
##OWNER= pz
$$ XWIN-NMR		Version 3.5
$$ Tue Apr 21 13:32:41 2026 Russian Standard Time (UT+4h)  Yarkov@DPX200
##.OBSERVE FREQUENCY= 200.1313
##.OBSERVE NUCLEUS= ^1H
##.ACQUISITION MODE= SIMULTANEOUS
##.ACQUISITION SCHEME= undefined
##.AVERAGES= 8
##.DIGITISER RES= 18
##SPECTROMETER/DATA SYSTEM= spect
##.PULSE SEQUENCE= zg30
##.SOLVENT NAME= DMSO
##.SHIFT REFERENCE= (INTERNAL, DMSO, 0, 15.4351)
##AUDIT TRAIL= $$ (NUMBER, WHEN, WHO, WHERE, WHAT)
$$ ##TITLE= Audit trail, XWIN-NMR		Version 3.5
$$ ##JCAMPDX= 5.01
$$ ##ORIGIN= Bruker BioSpin GmbH
$$ ##OWNER= Yarkov
$$ C:/Bruker/XWIN-NMR/data/yarkov2/nmr/H-C/1/pdata/1/auditp.txt
$$ ##AUDIT TRAIL=  $$ (NUMBER, WHEN, WHO, WHERE, WHAT)
(   1,<2026-04-21 13:31:57.59 +0400>,<Yarkov>,<DPX200>,
      <created by zg, POWCHK disabled, PULCHK disabled
       configuration hash MD5:
       00 E9 B6 7A A2 85 ED C7 34 08 36 98 17 FE 4E 26
       data hash MD5: 16K
       69 65 F7 63 69 AF 50 28 FA A1 72 A1 0E 24 6B 5D>)
(   2,<2026-04-21 13:32:01.48 +0400>,<Yarkov>,<DPX200>,
      <Start of raw data processing
       efp BC_mod = 2 LB = 0.25 FT_mod = 6 PKNL = 1 PHC0 = -5302.316 PHC1 = 11.42193 SI = 16K 
       data hash MD5: 16K
       B1 2A 55 CF 78 9C 06 94 C5 E7 02 7D 47 03 C5 D7>)
$$ ##END=
$$ 
$$ hash MD5
$$ 00 9C D7 BA 49 F4 9B E2 5B 7C E5 8A BF 98 46 49
##$RELAX= 
##$RELAX= 
##$RELAX= 
##$RELAX= 
##$RELAX= 
##$RELAX= 
$$ Bruker specific parameters
$$ --------------------------
##$DU= <C:/Bruker/XWIN-NMR>
##$EXPNO= 1
##$NAME= <H-C>
##$PROCNO= 1
##$TYPE= <nmr>
##$USER= <yarkov2>
##$AMP= (0..31)
100 100 100 100 100 100 100 100 100 100 100 100 100 100 100 100 100 100 
100 100 100 100 100 100 100 100 100 100 100 100 100 100 
##$AQSEQ= 0
##$AQ_mod= 1
##$AUNM= <au_zg>
##$AUTOPOS= <>
##$BF1= 200.13
##$BF2= 200.13
##$BF3= 200.13
##$BF4= 200.13
##$BF5= 200.13
##$BF6= 200.13
##$BF7= 200.13
##$BF8= 200.13
##$BYTORDA= 1
##$CFDGTYP= 0
##$CFRGTYP= 5
##$CHEMSTR= <none>
##$CNST= (0..31)
1 1 145 1 1 1 1 1 1 1 1 1 1 1 1 1 1 1 1 1 1 1 1 1 1 1 1 1 1 1 1 1 
##$CPDPRG= <>
##$CPDPRG1= <>
##$CPDPRG2= <>
##$CPDPRG3= <>
##$CPDPRG4= <mlev>
##$CPDPRG5= <mlev>
##$CPDPRG6= <mlev>
##$CPDPRG7= <mlev>
##$CPDPRG8= <mlev>
##$CPDPRGB= <>
##$CPDPRGT= <>
##$D= (0..31)
0 0.7 0 0 0 0 0 0 0 0 0 0.03 0 0 0 0 0 0 0 0 0 0 0 0 0 0 0 0 0 0 0 0 
##$DATE= 1776763917
##$DBL= (0..7)
120 120 120 120 120 120 120 120 
##$DBP= (0..7)
150 150 150 150 150 150 150 150 
##$DBP07= 0
##$DBPNAM0= <>
##$DBPNAM1= <>
##$DBPNAM2= <>
##$DBPNAM3= <>
##$DBPNAM4= <>
##$DBPNAM5= <>
##$DBPNAM6= <>
##$DBPNAM7= <>
##$DBPOAL= (0..7)
0.5 0.5 0.5 0.5 0.5 0.5 0.5 0.5 
##$DBPOFFS= (0..7)
0 0 0 0 0 0 0 0 
##$DE= 6
##$DECBNUC= <off>
##$DECIM= 32
##$DECNUC= <off>
##$DECSTAT= 4
##$DIGMOD= 1
##$DIGTYP= 9
##$DL= (0..7)
0 120 120 120 120 120 120 120 
##$DP= (0..7)
$$ [...]
##$SUBNAM2= <"">
##$SUBNAM3= <"">
##$SUBNAM4= <"">
##$SUBNAM5= <"">
##$SUBNAM6= <"">
##$SUBNAM7= <"">
##$SUBNAM8= <"">
##$SUBNAM9= <"">
##$SW= 18.0517328524113
##$SWIBOX= (0..15)
0 0 2 0 0 0 0 0 0 0 0 0 0 0 0 0 
##$SW_h= 3612.71676300578
##$TD= 16384
##$TD0= 1
##$TE= 0
##$TE2= 300
##$TE3= 300
##$TEG= 300
##$TL= (0..7)
0 120 120 120 120 120 120 120 
##$TP= (0..7)
150 150 150 150 150 150 150 150 
##$TP07= 0
##$TPNAME0= <>
##$TPNAME1= <>
##$TPNAME2= <>
##$TPNAME3= <>
##$TPNAME4= <>
##$TPNAME5= <>
##$TPNAME6= <>
##$TPNAME7= <>
##$TPOAL= (0..7)
0.5 0.5 0.5 0.5 0.5 0.5 0.5 0.5 
##$TPOFFS= (0..7)
0 0 0 0 0 0 0 0 
##$TUNHIN= 0
##$TUNHOUT= 0
##$TUNXOUT= 0
##$USERA1= <user>
##$USERA2= <user>
##$USERA3= <user>
##$USERA4= <user>
##$USERA5= <user>
##$V9= 5
##$VALIST= <valist>
##$VCLIST= <CCCCCCCCCCCCCCC>
##$VD= 0
##$VDLIST= <DDDDDDDDDDDDDDD>
##$VPLIST= <PPPPPPPPPPPPPPP>
##$VTLIST= <TTTTTTTTTTTTTTT>
##$WBST= 1024
##$WBSW= 4
##$XGAIN= (0..3)
0 0 0 0 
##$XL= 0
##$YL= 0
##$YMAX_a= 141428
##$YMIN_a= -178220
##$ZGOPTNS= <>
##$ZL1= 120
##$ZL2= 120
##$ZL3= 120
##$ZL4= 120
##$ABSF1= 0
##$ABSF2= 0
##$ABSG= 0
##$ABSL= 0
##$ALPHA= 0
##$AQORDER= 0
##$ASSFAC= 0
##$ASSFACI= 0
##$ASSFACX= 0
##$ASSWID= 0
##$AUNMP= <proc_1d>
##$AZFE= 0.1
##$AZFW= 0.1
##$BCFW= 0
##$BC_mod= 2
##$BYTORDP= 0
##$COROFFS= 0
##$CY= -3
##$DATMOD= 1
##$DC= 0
##$DFILT= <>
##$DTYPP= 0
##$F1P= 0
##$F2P= 0
##$FCOR= 1
##$FTSIZE= 16384
##$FT_mod= 6
##$GAMMA= 0
##$GB= 0
##$INTBC= 1
##$INTSCL= 3.241238e-09
##$ISEN= 128
##$LB= 0.25
##$LEV0= 0
##$LPBIN= 0
##$MAXI= 10000
##$MC2= 0
##$MEAN= 0
##$ME_mod= 0
##$MI= 1.114404
##$NCOEF= 0
##$NC_proc= -7
##$NLEV= 6
##$NOISF1= 3.799351
##$NOISF2= 2.8
##$NSP= 0
##$NTH_PI= 0
##$NZP= 0
##$OFFSET= 15.43508
##$PC= 1
##$PHC0= -5302.316
##$PHC1= 11.42193
##$PH_mod= 1
##$PKNL= yes
##$PPARMOD= 0
##$PSCAL= 0
##$PSIGN= 0
##$REVERSE= no
##$SF= 200.130017335077
##$SI= 16384
##$SIGF1= 3
##$SIGF2= 2
##$SINO= 0.751879
##$SIOLD= 32768
##$SREGLST= <19F.Aceton>
##$SSB= 0
##$STSI= 16384
##$STSR= 0
##$SW_p= 3612.71676300578
##$SYMM= 0
##$S_DEV= 0
##$TDeff= 16384
##$TDoff= 0
##$TI= <>
##$TILT= no
##$TM1= 0
##$TM2= 0
##$TOPLEV= 0
##$USERP1= <user>
##$USERP2= <user>
##$USERP3= <user>
##$USERP4= <user>
##$USERP5= <user>
##$WDW= 1
##$XDIM= 16384
##$YMAX_p= 394713647
##$YMIN_p= -5659390
$$ End of Bruker specific parameters
$$ ---------------------------------
##NTUPLES= NMR SPECTRUM
##VAR_NAME=  FREQUENCY,     SPECTRUM/REAL,   SPECTRUM/IMAG
##SYMBOL=    X,             R,               I
##VAR_TYPE=  INDEPENDENT,   DEPENDENT,       DEPENDENT
##VAR_FORM=  AFFN,          ASDF,            ASDF
##VAR_DIM=   16384,         16384,           16384
##UNITS=     HZ,            ARBITRARY UNITS, ARBITRARY UNITS
##FACTOR=    0.220516191357247, 1,           1
##FIRST=     3089.02274282998, 0,            0
##LAST=      -523.694020175799, 0,           0
##MIN=       -523.694020175799, -5659390,    0
##MAX=       3089.02274282998, 394713647,    0
$$ Real data points
##PAGE= N=1
##DATA TABLE= (X++(R..R)), XYDATA
$$ [...]
5874e8413M12669L22666J06867m39348p56477Q29937N8556o50181K33203k14637
$$ -58413 354256 676922 783789 344441 -412036 417901 476457 -173724 59479 -155158
5864a55158O5468O34290m58028M81333N89777o36152K97327n73611M6081K84748
$$ -155158 -89690 544600 86572 567905 1157682 521530 818857 245246 291327 576075
5854E76075k24480k60696L2120m2279L60912K09286k64017N92502p45261k85641
$$ 576075 351595 90899 123019 80740 441652 650938 386921 979423 234162 -51479
5844e1479K82435k76518J32275m1820M49082O7124q11660L20129o5591r29108
$$ -51479 230956 -45562 86713 44893 493975 561099 -250561 69568 3977 -925131
5834i25131M23919k00472L64880P07298q89456Q34043P08046m26955M31520j081008
$$ -925131 -501212 -701684 -336804 370494 -518962 315081 1023127 596172 1027692 -53316
5824e3316J15304P48931n49492m21011n95395J000364R18957j346362l72208P60642
$$ -53316 61988 810919 261427 -159584 -754979 245385 1164342 -182020 -554228 206414
5814B06414M73118P60570j008449l38103N9835J310317K49157o06506k62872r43841
$$ 206414 679532 1440102 431653 93550 153385 1463702 1712859 1106353 843481 -100360
5804a00360N25894L05263l26443N3881k29205j61336P49231l92498J01692P55990
$$ -100360 425534 730797 404354 458235 229030 67694 816925 424427 526119 1282109
5794A282109l76168o27658l35935N3764J586274L43284j232193l89684o6564N40300
$$ 1282109 905941 278283 -57652 -3888 1582386 1925670 693477 303793 237229 777529
5784G77529K08588K58653o18654r71752M29902l47755P07260L91025k66095o78881
$$ 777529 986117 1244770 626116 -345636 84266 -263489 443771 834796 568701 -110180
5774a10180r45302R05546J758641j299827K07597j9163k38886O49750l73967m14701
$$ -110180 -1055482 -149936 1608705 308878 516475 497312 258426 908176 534209 119508
5764A19508p4068j09856j18806J22616L0665O95023O08354L8413m06274q8031
$$ 119508 45440 -64416 -183222 -60606 -29941 665082 1273436 1311849 905575 817544
5754H17544M89362K68293J40407j212895Q9503k94493M53653n56290r61046J118227
$$ 817544 1306906 1575199 1715606 502711 592214 297721 751374 195084 -765962 352265
5744C52265N77744j4648n70684K30363k7386L80932j63913j105530L75239O76007
$$ 352265 930009 915361 344677 575040 547654 928586 764673 -340857 34382 710389
5734G10389k24055n22424P72466J75822j51967n7912l4832L02110J68674N08032
$$ 710389 486334 -36090 736376 912198 760231 702319 667487 969597 1138271 1646303
5724A646303r53066j247349J064785J67042m09732J174720j688563J50160J024250
$$ 1646303 693237 -554112 510673 677715 267983 1442703 -245860 -95700 928550
5715I28550M64697L96128o17601k98390P21284K84284K88924l02941n27443K55291
$$ 928550 1393247 1789375 1171774 873384 1594668 1878952 2167876 1864935 1337492 1592783
5705A592783r71690J40143r9623j16646k5658n52987L14169K28163M28322M47425
$$ 1592783 621093 761236 661613 544967 519309 -33678 280491 508654 936976 1384401
5695A384401j20991k62306j85500n50542J156037q89669q03076j30109L93617
$$ 1384401 1263410 1001104 815604 265062 1421099 531430 -271646 -401755 -8138
5686h138J281999J79112k59381k74620k09200N41198o21173M83832m10012l90825
$$ -8138 1273861 1452973 1193592 918972 709772 1250970 629797 1113629 703617 312792
5676C12792l80409J66379Q87467L38723J54528R96757k30152j50016m7958l79440
$$ 312792 -67617 98762 986229 1324952 1479480 2476237 2246085 2096069 2048111 1668671
5666A668671j28071j61398q43899J5099m99876M59397P80675j079152m75293j24633
$$ 1668671 1540600 1379202 535303 550402 50526 509923 1290598 211446 -263847 -388480
5656c88480M42871K25927j81810k90453Q06067j42928n0Q8323j169693M34631
$$ -388480 54391 280318 98508 -191945 614122 471194 471144 559467 -610226 -175595
5646a75595Q79127Q5425n68585K31943R78179K97667j318263l49850L9268P9094
$$ -175595 703532 788957 220372 452315 1430494 1728161 409898 60048 99316 178410
5636A78410P36084n43449L14755m86749K44465R14404n53440l69864P05700m92732
$$ 178410 914494 371045 685800 199051 443516 1357920 804480 434616 1140316 647584
5626F47584j43615j78120P65609k12224K53097J6262P5000q54424K47412L18146
$$ 647584 503969 325849 1091458 879234 1132331 1148593 1223593 369169 616581 934727
5616I34727j337129o05106J182009M04114j70210p348M36099k44998K29424m0669
$$ 934727 -402402 -1007508 174501 578615 408405 401057 837156 592158 821582 780913
5606G80913r6863j76891L14468O4763j140250P61811P56257o07184j9441j86967
$$ 780913 684050 507159 821627 886390 -253860 507951 1264208 657024 637583 450616
5596D50616K05601K41203J07469P52513r85702l15127P44311r40892O91479L29390
$$ 450616 656217 897420 1004889 1757402 771700 456573 1200884 259992 951471 1280861
5586A280861K0832m54705n35689O61739J26720k78995K2537o56399m83045M89257
$$ 1280861 1301693 846988 311299 973038 1099758 820763 843300 186901 -296144 193113
5576A93113J7020l36993Q313J89519P33346O1593l85934J044700n86071K07408
$$ 193113 210133 -126860 -118547 70972 804318 865911 479977 1524677 938606 1146014
5566A146014M3111l52879j05361j34807l71570J43107n06943n01193J032877K39791
$$ 1146014 1189125 836246 730885 596078 224508 367615 -139328 -640521 392356 632147
5556F32147j53512N39411K09436J11802k76440M5813K27260k03907k3063j33129
$$ 632147 478635 1018046 1227482 1339284 1062844 1108657 1335917 1132010 1108947 975818
5546I75818r79379J96961M36536K71030O4889p98839J2761P67467o5433m31712
$$ 975818 -3561 193400 629936 900966 965855 167016 179777 947244 881811 450099
5536D50099J152891p34017n95927L39477j87606J343901l15764k76365j77480
$$ 450099 1602990 868973 273046 612523 424917 1768818 1453054 1176689 999209
5527I99209k11050L08122K79089n48334j543612K77528P89974M44523j56879q05207
$$ 999209 788159 1096281 1375370 827036 -716576 -439048 350926 795449 638570 -166637
5517a66637n39921M62492K09966K56267M55750k04169J65041j078j95788N93057
$$ -166637 -706558 -244066 -34100 222167 677917 473748 638789 637711 441923 1034980
5507A034980M99660p26814l53624O2290l53951N92849j74137o05473Q06584o3632
$$ 1034980 1534640 807826 454202 516492 162541 755390 581253 -24220 782364 718732
5497G18732l30100O6429p52464J84165J541765j103495k78712N09613n928M87093
$$ 718732 388632 455061 -297403 -113238 1428527 325032 46320 555933 550005 1037098
5487A037098k22478J53348N11080p30696M53790n23396j34813O48026K70385o13288
$$ 1037098 814620 967968 1479048 748352 1202142 678746 543933 1191959 1462344 849056
5477H49056p71836m11116J38213j97410N69418J34674m45000J245272q1498J87335
$$ 849056 77220 -333896 -195683 -393093 176325 310999 -134001 1111271 1029773 1217108
5467A217108j025153N3141N82541k04124J69186N04454n03633k73183K54502j358214
$$ 1217108 191955 245096 827637 623513 792699 1297153 793520 520337 774839 -583375
5457e83375P03960R8905J48534q32816M77511j55865K21816K74500j37520K97774
$$ -583375 120585 219490 368024 -464792 12719 -143146 78670 353170 215650 513424
5447E13424n88985J38079m7582N34600Q64071M94655j665641j99649J75166J408033
$$ 513424 -75561 62518 14936 549536 1413607 1908262 242621 42972 218138 1626171
5437A626171M06642p49286l33519j09021j63004j77860o073n84943K11318N22699
$$ 1626171 2032813 1283527 950008 840987 677983 500123 494050 -90893 120425 643124
5427F43124j82201m34803K10797J176633n04268r62894M99269J104298l07153
$$ 643124 460923 26120 236917 1413550 909282 -53612 445657 1549955 1242802
5418A242802J12444j889725J02598J492128P0448k69114n88876K66811j62990
$$ 1242802 1355246 -534479 -431881 1060247 1130695 861581 272705 539516 376526
5409C76526Q97173L24038l75256j8203J66312j56617l60394J52772N23625l67751
$$ 376526 1273699 1597737 1222481 1204278 1370590 1213973 853579 1006351 1529976 1162225
5399A162225r33713N26976N79637j09771o16143k83112l30773Q27348J70781N7944
$$ 1162225 228512 755488 1335125 1225354 609211 326099 -4674 822674 993455 1051399
5389A051399m31817k30112Q91117r9798r53827k99686Q70823j003722p51372J051521
$$ 1051399 619582 389470 1280587 1180789 226962 -72724 798099 -205623 -956995 94526
5379I4526K52251O30086m75023j46118L4754J09060J311958j11703m33111l30093
$$ 94526 346777 976863 501840 355722 390476 499536 1811494 1699791 1266680 936587
5369I36587o42530Q67619K08368q71054Q25195L33638o3509K91375m33093l29023
$$ 936587 294057 1161676 1370044 498990 1324185 1657823 1594314 1885689 1452596 1123573
5359A123573Q318j08350J04860n04837K17918l67571p5913n26948o86589J126217
$$ 1123573 1131891 1023541 1128401 623564 841482 473911 397998 -128950 -815539 310678
5349C10678K7061m90778K46743M2244j12823R03141K86842L98318q82515m88746
$$ 310678 337739 -153039 93704 135948 23125 926266 1213108 1611426 728911 240165
5339B40165J301524J38210L93645m66193l28136o31314K72515P90845n8756j336638
$$ 240165 1541689 1679899 2073544 1607351 1279215 647901 920416 1711261 1652505 315867
5329C15867k83874L07615R91774k20404L3561l14869Q4466P20180o62654m62037
$$ 315867 31993 339608 1331382 1110978 1144539 829670 914136 1634316 971662 509625
5319E09625l63443o5027R2675L61346N79296N25653K9031K3697n92043q42500
$$ 509625 146182 81155 173830 535176 1114472 1640125 1669156 1692853 1100810 258310
5309B58310P90427k25075M7389N2835o7629m89381M82280N62440k99508k57323
$$ 258310 1048737 823662 871051 923886 856257 366876 849156 1411596 1112088 854765
5299H54765L20225K59938M84580J01003j393026N13147m17519L31012M77957l02812
$$ 854765 1174990 1434928 1919508 2020511 627485 1140632 723113 1054125 1532082 1229270
5289A229270N21750n51024l37305J371846k61671o95933n88800R58686K22697
$$ 1229270 1751020 1199996 862691 2234537 1972866 1276933 688133 1646819 1869516
5280A869516k41076L2184p47070J2125q92408O08859K06455r0697O43421p36800
$$ 1869516 1628440 1660624 913554 925679 33271 642130 848585 757888 1401309 664509
5270F64509M87723k0071n86656n59436N10341k06153J2615P13466n14334j41980
$$ 664509 1152232 1132161 545505 -13931 496410 290257 302872 1016338 502004 360024
5260C60024L89757K20764m55461j61724O25841L69622p44418m16215O77425n99715
$$ 360024 749781 970545 515084 353360 979201 1348823 604405 188190 865615 265900
5250B65900M9038L33677J31411n45591R6593N13806O10370r1562r90896J040991
$$ 265900 314938 648615 780026 234435 331028 844834 1455204 1363642 372746 1413737
5240A413737P71841p75525j61266L20907l62364O18598l27199p85678q85813N46823
$$ 1413737 2185578 1410053 1248787 1569694 1207330 1825928 1498729 713051 -172762 374061
5230C74061O39109J078102j026414q11286J081745k39624M38354O7118k53064
$$ 374061 1013170 2091272 1064858 253572 1335317 1095693 1534047 1601165 1348101
5221A348101j207513N58265J083632k95702j080653M25300Q43043l18988k63282
$$ 1348101 140588 698853 1782485 1486783 406130 831430 1674473 1355485 1092203
5212A092203N75540K49128r63452K32400L82818k42074o66983L72750K67432q06922
$$ 1092203 1667743 1916871 953419 1185819 1568637 1326563 659580 1032330 1299762 492840
5202D92840j77832M97106l8374M5172R24122l05469J92552p17636R2067R58519
$$ 492840 315008 812114 773740 818912 1743034 1437565 1630117 912481 1004548 1963067
5192A963067p15093m34722n18237k3415l7280Q93520n61745L17318O77261q33782
$$ 1963067 1247974 813252 295015 271600 234320 1127840 566095 883413 1560674 726892
5182G26892N55131J79161n61978M06320R23878l58409j039097j65551M70195k37559
$$ 726892 1282023 1461184 899206 1305526 2229404 1870995 831898 666347 1136542 898983
5172H98983n10529l7655J121880m0192k56588R3479n67689P01650j28944J50407
$$ 898983 388454 350799 1472679 1432487 1175899 1269378 701689 1403339 1274395 1424802
5162A424802j112333m23688M85554M56052j23443j89260m35995R23091R26120
$$ 1424802 312469 -111219 374335 830387 706944 517684 81689 1004780 1930900
5153A930900q35790J038522M99548j188828l63591n10767K3782P68404p90924
$$ 1930900 1095110 2133632 2633180 1444352 1080761 569994 593776 1362180 571256
5144E71256K96609m86651J48420J128170n54808m73718q7007m7001K12132M50198
$$ 571256 867865 381214 529634 1657804 1102996 629278 542271 495270 707402 1157600
5134A157600R85013p56715r77723M91634L5739o6330O88233m63196R0033L23327
$$ 1157600 2142613 1385898 408175 899809 935548 869218 1557451 1094255 1184288 1507615
5124A507615k4643j09044l27057J78671P04778o70634j328930J208419O38035
$$ 1507615 1482972 1373928 1046871 1225542 1930320 1259686 -69244 1139175 1777210
5115A777210n42555K21996M67445j94061j236128q8954O63250K5621P2819k34719
$$ 1777210 1234655 1456651 1924096 1730035 493907 404953 1068203 1093824 1166643 931924
5105I31924m44062O84198P76609m34596l19835m1214R3445O52320r49307r1133
$$ 931924 487862 1172060 1948669 1514073 1194238 1153024 1246469 1898789 949482 858349
5095H58349M35482m70387K27993n27123J93451m58637O78723M66206q55586L50170
$$ 858349 1293831 823444 1051437 524314 717765 259128 937851 1404057 548471 898641
5085H98641L00635l2557P28192q45177J108367K36440r34483Q49778l25464k61962
$$ 898641 1199276 1166719 1894911 1049734 2158101 2394541 1460058 2309836 1984372 1722410
5075A722410m29122o99851J57593O54857J07848M01648p52409k84946m31647L86750
$$ 1722410 1293288 593437 751030 1405887 1513735 1915383 1162974 878028 446381 833131
5065H33131l43470k55889N77061K00348l59782J92901O47919p56242O56083r7123
$$ 833131 489661 233772 810833 1011181 651399 844300 1492219 735977 1392060 1294937
5055A294937N98966l23397j46817P87450K29203p3985j207886L92649k15854j83591
$$ 1294937 1893903 1570506 1423689 2211139 2440342 2366357 1158471 1551120 1335266 1151675
5045A151675k12196Q0714N04378j64427o45681L34755L68294j5477O52479M3009
$$ 1151675 939479 1020193 1524571 1360144 714463 1049218 1417512 1402035 2054514 2097523
5035B097523m06496k07647Q07830K4326k02763L58249j486908K95691N55524P14579
$$ 2097523 1691027 1483380 2291210 2315536 2112773 2471022 984114 1279805 1835329 2549908
5025B549908l50820j318062P04301j50460l55793J203945o38335K3771N2239p49810
$$ 2549908 2199088 881026 1585327 1434867 1079074 2283019 1644684 1668455 1720694 970884
5015I70884R93024J36672K23385j72418m27724n99412J268778l50229j65859P40244
$$ 970884 1963908 2100580 2323965 2151547 1723823 1124411 2393189 2042960 1877101 2617345
5005B617345o84162k52223m51168L80120l17711n66604J73433N12849j3641o41643
$$ 2617345 1933183 1680960 1229792 1609912 1292201 725597 899030 1411879 1398238 756595
4995G56595L41045L56704k279N44581p0265j337468K79749J144795k5947j33636
$$ 756595 1097640 1454344 1452065 1996646 1926381 588913 868662 2013457 1987510 1853874
4985A853874p36774P5738K05577M10453M65965r64958N33786J088857l94336l18855
$$ 1853874 1117100 1192838 1398415 1808868 2274833 1309875 1843661 2932518 2538182 2219327
4975B219327K26091m22041R86297m91868j74036N52123J79411l2240m92987j017254
$$ 2219327 2445418 2023377 3009674 2517806 2343770 2895893 3075304 3043064 2550077 1532823
4965A532823N7269R5840K62552P80709O4307O60083J04181R89025Q21332Q51945
$$ 1532823 1590092 1685932 1948484 2729193 2793500 3453583 3557764 4546789 5368121 6220066
4955F220066n19526j025910M54107M84741j432340q71358N20350r62468J36066
$$ 6220066 5700540 4674630 5128737 5613478 4181138 3309780 3830130 2867662 3003728
4946C003728n1518l4752P51450j67674m96905K78486l28592P6144J97857O95893
$$ 3003728 2952210 2917458 3668908 3501234 3004329 3282815 2954223 3030367 3228224 3924117
4936C924117Q98288J613493P59804k47944J476026M65405P46675J741370R94932
$$ 3924117 4822405 6435898 7195702 6947758 8423784 8889189 9635864 11377234 12372166
4927A2372166J192592P1234n28054k45564q08915k281856j995034o20989l48590
$$ 12372166 13564758 13635992 13107938 12862374 12053459 9771603 7776569 7155580 6806990
4918F806990j22809o34744j16635K69029M23735K9116l74072k1827L63771n83296
$$ 6806990 6684181 6049437 5932802 6201831 6625566 6654682 6280610 6258783 6622554 6039258
4908F039258l86307q06336N30315R77446j147856m45261K31775N3506J338324
$$ 6039258 5652951 4846615 5376930 6354376 5206520 4761259 4993034 5046540 6384864
4899F384864Q75816O46321N18691J295239J407813J32856q22824j330825j273119
$$ 6384864 7260680 7907001 8425692 9720931 11128744 11261600 10438776 9107951 7834832
4890G834832L77940o71111j536040M89279M85122m48659j21884K59199P74580
$$ 7834832 8212772 7541661 6005621 6494900 6980022 6531363 6409479 6668678 7443258
4881G443258l22344L66412J9508L44064K388443O46074L17361N34304K93847N86191
$$ 7443258 7120914 7487326 7506834 7850898 10239341 10885415 11202776 11737080 12030927 12617118
4871A2617118O63242P17174J128124m81793j259700n89552r08719l58702p27086
$$ 12617118 13280360 13997534 15125658 14643865 13384165 12794613 11885894 11527192 10800106
4862A0800106j692314M76178J10042L50330J275040L6741J58594N10487M34658
$$ 10800106 9107792 9583970 9694012 10044342 11319382 11356123 11514717 12025204 12459862
4853A2459862k46341J304918K197434J691863R08225k67120j633439j729940j196524
$$ 12459862 12213521 13518439 15715873 17407736 18315961 18048841 16415402 14685462 13488938
4844A3488938j175329n42975j529486M89319p46381j076040R1680O70481L84197
$$ 13488938 12313609 11770634 10241148 10730467 9984086 8908046 8999726 9670207 10054404
4835A0054404p7684P86195P26391Q76399O39883J644205o95102o5049j78686k14212
$$ 10054404 9976720 10762915 11489306 12365705 13005588 14649793 13954691 13889642 13710956 13496744
4825A3496744L73335L95N58355j14197j8302R23592P87757J120788J988010J117071
$$ 13496744 13870079 13870474 14428829 14314632 14296330 15219922 16007679 17128467 19116477 20233548
4815B0233548Q91139N92239K48550J168717k300630k226407p70213k47415J72668
$$ 20233548 21124687 21716926 21965476 23134193 20833563 18607156 17836943 17589528 17762196
4806A7762196j15945j108602n66068o2713Q63869J602454J126021J431124K227102
$$ 17762196 17646251 16537649 15971581 15908868 16772737 18375191 19501212 20932336 23159438
4797B3159438K326774K363047K671427Q30593K11653j893702k652808l792975
$$ 23159438 25486212 27849259 30520686 31351279 31562932 29669230 27016422 23223447
4789B3223447l197255j495791j160214j222839M1059K18127j28649J228905J059225
$$ 23223447 20026192 18530401 17370187 16147348 16188407 16406534 16277885 17506790 18566015
4780A8566015J512510K216372J090192R15007O38351o70098j072066j665247j960603
$$ 18566015 20078525 22294897 23385089 24300096 24938447 24268349 23196283 21531036 19570433
4771A9570433m20791k577438k617395J33304o21255j7627K47381j671291K49539
$$ 19570433 19149642 16572204 13954809 14088113 13466858 13449231 13696612 12025321 12274860
4762A2274860Q41728k45361j120761O8545j40547K64098m81951M43397Q22771
$$ 12274860 13116588 12871227 11750466 11819011 11678464 11942562 11460611 11904008 12726779
4753A2726779o08634J12477J00600p03451o45783K07190O92894q37919J81584
$$ 12726779 12118145 12230622 12331222 11627771 10981988 11189178 11882072 11044153 11225737
4744A1225737R96559J208308K154711J537067J405603J887671M5561j119569k027019
$$ 11225737 12222296 13430604 15585315 17122382 18527985 20415656 20461217 19341648 17314629
4735A7314629k246141o60071q88302j732328L07002O40729l78202P67575k77551
$$ 17314629 15068488 14408417 13520115 11787787 12094789 12735518 12357316 13124891 12847340
4726A2847340J412058J444452J321385K418766J073632J736997q82244k208027
$$ 12847340 14259398 15703850 17025235 19444001 20517633 22254630 21372386 19164359
4718A9164359m15439j055210M79792l92175j193295j123104j180366o39394j639858
$$ 19164359 18748920 17693710 18173502 17781327 16588032 15464928 14284562 13645168 12005310
4709A2005310l51690j305973j012032Q40194l41151n30651j036195o08384O34220
$$ 12005310 11653620 10347647 9335615 10175809 9834658 9304007 8267812 7659428 8293648
4700H293648M34600j421840P91192K06249L98402L91100O1012J61364N85608M74826
$$ 8293648 8728248 7306408 8097600 8303849 8702251 9093351 9154363 9315727 9901335 10376161
4690A0376161J484432J308426N86056K899245K543568M31520Q36141n10630j043993
$$ 10376161 11860593 13169019 13755075 16654320 19197888 19629408 20465549 19954919 18910926
4681A8910926l66684j55211m12669L31950J060646N03694j12659j78811R16764
$$ 18910926 18544242 18389031 17976362 18308312 19368958 19872652 19759993 19581182 20497946
4672B0497946P34597Q06217R55453m01062M27752n23902j623274k137172k318340
$$ 20497946 21232543 22038760 22994213 22593151 23020903 22497001 20873727 18736555 16418215
4663A6418215p62334k58803m72802j16220j174103k70431K95671r03556K6151
$$ 16418215 15655881 15397078 14924276 14808056 13633953 13363522 13659193 12755637 12781788
4654A2781788r54299O42436J159627M32747J428336J085054J672467J902675p11560
$$ 12781788 11827489 12469925 13629552 14062299 15490635 16575689 18248156 20150831 19439271
4645A9439271p87197q16466j24899j43816j280606j084700O34811L32341K475904
$$ 19439271 18652074 17835608 17710709 17566893 16286287 15201587 15836398 16168739 18644643
4636A8644643J859387r5051K091631J644412K99557p90685j749591j550761j669287
$$ 18644643 20504030 20408979 22500610 24145022 24444579 23653894 21904303 20353542 18684255
4627A8684255j167715r51891q97682p07459P2570l336j174165J179241Q44384
$$ 18684255 17516540 16564649 15666967 14959508 15032078 15028742 13854577 15033818 15878202
4618A5878202q64962o850N21204N25390L95488j92209j159522k085527j434142
$$ 15878202 15013240 15006390 15527594 16052984 16448472 16256263 15096741 13011214 11577072
4609A1577072o28686l32741j56140m33928m30961R4278j53648Q68581N29257l93549
$$ 11577072 10948386 10615645 10459505 10025577 9594616 9688894 9535246 10403827 10933084 10539535
4599A0539535J086635P1074L69911J724941J51313K417214J711075K15824Q95913
$$ 10539535 11626170 11697244 12067155 13792096 13943409 16360623 18071698 18287522 19183435
4590A9183435m41953q19334q02748j456769o68239n32760r05233R18138M76524
$$ 19183435 18741482 17922148 17119400 15662631 14994392 14461632 13556399 14474537 14951061
4581A4951061J479812J549514J509914R17383j217898K73493P30969k62606l60625
$$ 14951061 16430873 17980387 19490301 20407684 19189786 19463279 20194248 19931642 19571017
4572A9571017m62572r32002m90355l37611O90819M28638K00134J356006l09916
$$ 19571017 19108445 18176443 17686088 17348477 18039296 18467934 18668068 20024074 19714158
4563A9714158p23268N36814K62924r18738k08086R39916P25385l31384K57525
$$ 19714158 18990890 19527704 19790628 18871890 18663804 19603720 20329105 19997721 20255246
4554B0255246j100602L93818l77521l50388m24126j418595K70891j31301Q49912
$$ 20255246 19154644 19548462 19170941 18820553 18396427 16977832 17248723 17117422 17967334
4545A7967334J612651O32863P33799n27004r21211n22371j865202j077655J241952
$$ 17967334 19579985 20212848 20946647 20419643 19498432 18976061 17110859 16033204 17275156
4536A7275156O2895P21076J26927N9832J233510N85898P73478l33978p04711p3958
$$ 17275156 17338051 18059127 18186054 18245886 19479396 20065294 20838772 20504794 19800083 19726125
4526A9726125R96775j512243r31667o63922o05305J7719q36856l94578J519282
$$ 19726125 20722900 19210657 18278990 17615068 17009763 17027482 16190626 15796048 17315330
4517A7315330J427517k00388Q3957q54247q76155p40773p36364j608920j402930
$$ 17315330 18742847 18542459 18626416 17772169 16896014 16155241 15418877 13809957 12407027
4508A2407027j014295j5847m38916j306005o90599j035391K83475J67518N67308
$$ 12407027 11392732 11376885 10937969 9631964 8941365 7905974 8189449 8356967 8924275
4499H924275K86856k96904Q40174Q87761P72892R83157j00462R63602J93975K9500
$$ 8924275 9211131 8914227 9754401 10642162 11415054 12398211 12297749 13261351 13455326 13484826
4489A3484826j025910j754115l35636j327697j070199q01182p33881j04013N34498
$$ 13484826 12458916 10704801 10369165 9041468 7971269 7170087 6436206 6332193 6866691
4480F866691R7346j80302p95653l89676j02831q9826Q21160n75847K5864K9748
$$ 6866691 6964037 6783735 5988082 5598406 5495575 5405749 6226909 5651062 5676926 5706674
4470E706674m00588N2106n62951k4542m29685P41603J19340n88894m57025K95911
$$ 5706674 5306086 5358192 4795241 4770699 4341014 5082617 5201957 4613063 4156038 4451949
4460D451949l99447n45034l1335q11821N60671J73380J20161J000525r1863n29436
$$ 4451949 4052502 3507468 3476133 2664312 3224983 3398363 3518524 4519049 4427186 3897750
4450C897750J5932p5462p681j80769R5335J302558n14680q60923O88588k20392
$$ 3897750 3913682 3838220 3830539 3649770 3745105 5047663 4532983 3672060 4360648 4140256
4440D140256L41882j54058p38683K3461P04084L93371m95573m38555j11041r8813
$$ 4140256 4482138 4328080 3589397 3612858 4316942 4710313 4214740 3776185 3665144 3566331
4430C566331M82047L97866j034210q23455P91848k63127Q74733p96657l73991
$$ 3566331 4048378 4446244 3412034 2588579 3380427 3117300 3992033 3195376 2821385
4421B821385J032529N27534J074903M99398j12439J024164R98719p53726j883851
$$ 2821385 3853914 4381448 5456351 5955749 5843310 6867474 7866193 7112467 5228616
4412E228616r43979M25911O54476p08550k89240l27545J11838K35364K98896M75310
$$ 5228616 4284637 4710548 5365024 4656474 4367234 4039689 4151527 4386891 4685787 5161097
4402E161097p60033l93079J89485k58569N7456K48243m26118l21971j87105r10954
$$ 5161097 4401064 4007985 4197470 3938901 3996357 4244600 3818482 3496511 3309406 2398452
4392B398452L85839L03134R1335j61733o87570j95102R15463J83780j85952k84190
$$ 2398452 2784291 3087425 3178760 3017027 2329457 2134355 3049818 3233598 3047646 2763456
4382B763456k28361P02464j74892P07128N03437J58366k04656N28785j62406J7710
$$ 2763456 2535095 3237559 3062667 3769795 4273232 4431598 4226942 4755727 4593321 4611031
4372D611031j86767J92847m07609k0524o53326J60749j92970N01618N1657m17595
$$ 4611031 4424264 4617111 4209502 4188978 3535652 3696401 3503431 4005049 4056706 3639111
4362C639111L65122j06195K02608j27136L47381p89729L38925K17069M477P47575
$$ 3639111 4004233 3898038 4100646 3973510 4320891 3531162 3870087 4087156 4091633 4839208
4352D839208p69001N42773L79534j68905m34973K22327m36178L4569J00856j299392
$$ 4839208 4070207 4612980 4992514 4823609 4388636 4610963 4174785 4209354 4310210 3010818
4342C010818k70306L50774P40596N00726o12633P05864j05609n62446L83092M34639
$$ 3010818 2740512 3091286 3831882 4332608 3719975 4425839 4320230 3757784 4140876 4575515
4332D575515j56559n83293l49186Q10777m80487P91960K16663n69816N844j003256
$$ 4575515 4418956 3835663 3486477 4297254 3816767 4608727 4825390 4255574 4261418 3258162
4322C258162R18892P86811r6112m73981m99919m46961J110766l47796L843l27812
$$ 3258162 4177054 4963865 4867753 4393772 3893853 3446892 4557658 4209862 4213705 3885893
4312C885893K39614O31731j88393J341422K12274O64948N70845j0744K79229m44529
$$ 3885893 4125507 4757238 4568845 5910267 6122541 6787489 7358334 7347590 7626819 7182290
4302G182290j112932J16924J24104j84597L48833K49880q8636o57273J50335J074451
$$ 7182290 6069358 6186282 6310386 6125789 6474622 6724502 6635866 5978593 6128928 7203379
4292G203379n53178M50441j10904k06287J324700o80053Q32173p27904k98791
$$ 7203379 6650201 7100642 6989738 6783451 8108151 7428098 8260271 7532367 7233576
4283G233576j41848K13530Q13345o9342o61288n87350J34155L17679M07657j97122
$$ 7233576 7091728 7305258 8118603 8049261 7387973 6800623 6934778 7252457 7660114 7462992
4273G462992J58845p61965n14714n5278j59051J178578R0603j003281J50274O29070
$$ 7462992 7621837 6859872 6345158 6289880 6130829 7309407 7400010 6396729 6547003 7176073
4263G176073J667339L75506l139248j26264P94251P70763Q81999n14289n29672
$$ 7176073 8843412 9218918 6079670 5953406 6747657 7518420 8400419 7886130 7356458
4254G356458o41721o72786O06909q47342L76548J461704K5348k34670K55219O90098
$$ 7356458 6714737 6041951 6648860 5801518 6178066 7639770 7665118 7430448 7685667 8375765
4244H375765J214195p5577j343949m58518m11305R44826J75231r67351M7155P67758
$$ 8375765 9589960 9514383 8170434 7711916 7300611 8245437 8420668 7453317 7500472 8268230
4234H268230J177744l44652j63515R42546p44514l81672L88234o41489j84962
$$ 8268230 9445974 9101322 8937807 9880353 9135839 8754167 9142401 8500912 8315950
4225H315950l93230J045619N18886j55169K77950j025893o06243k40821O7718
$$ 8315950 7922720 8968339 9487225 9332056 9610006 8584113 7977870 7737049 7804767
4216G804767n4508l23270J33990j49907k24449P31860q61847M10617j08141J24780
$$ 7804767 7750259 7426989 7560979 7411072 7186623 7918483 7056636 7467253 7359112 7483892
4206G483892K22002l01910P032q60141j22606R3054j3800K59993M19619P2670
$$ 7483892 7705894 7403984 7411016 6550875 6428269 6521323 6507523 6767516 7187135 7259805
4196G259805j606456l34140J05876R74546N1358r84403M6678n71946Q20470m16944
$$ 7259805 5653349 5319209 5425085 6399631 6450989 5466586 5513264 4941318 5761788 5344844
4186E344844K5451O69913j018453N47688N34035L90384J10477n83604J06509K25308
$$ 5344844 5370295 6040208 5021755 5569443 6103478 6493862 6604339 6020735 6127244 6352552
4176F352552k72947l7157q05380j88017K93878n48044k62182j03242k03564j3834
$$ 6352552 6079605 6042448 5237068 5049051 5342929 4794885 4532703 4429461 4225897 4212063
4166D212063J164824N05053j10224l46445j44215L83554L09288k20184p41620
$$ 4212063 5376887 5881940 5771716 5425271 5281056 5664610 5973898 5753714 5012094
4157E012094L1894L42168M77381j376100p63400Q81673n50936j6784n23488o3849
$$ 5012094 5043988 5386156 5863537 4487437 3724037 4605710 4054774 4037990 3514502 3450653
4147C450653K34145q71771o60123N70510k65659R25644J042369j266134j7987
$$ 3450653 3684798 2813027 2152904 2723414 2457755 3383399 4425768 3159634 3141647
4138C141647o23061P61444L01153l17813o74019R5881L52571P01407r605j110255
$$ 3141647 2518586 3280030 3581183 3263370 2589351 2685232 3037803 3739210 3729605 2619350
4128B619350N39760o6551k81394j733055O72299N74182K76678N73506l30014k8937
$$ 2619350 3159110 3092559 2811165 1078110 1750409 2324591 2601269 3174775 2844761 2815824
4118B815824O8842K44537L85703k86981k42106M1603p1414J077719k78466l71659
$$ 2815824 2884666 3129203 3514906 3227925 2985819 3027422 2956008 4033727 3755261 3383602
4108C383602l09690J31134O01203j071027P74413o3981o29362O03577n68710r6230
$$ 3383602 3073912 3205046 3806249 2735222 3509635 3445654 2816292 3419869 2851159 2754929
4098B754929j1620m37687O02387p17782K30836J197437p87110l5212l59534k85946
$$ 2754929 2743309 2305622 2908009 2190227 2421063 3618500 2831390 2796178 2436644 2150698
4088B150698O74835N5261K82762N91754r94861Q36597M63301j090718K10882l09946
$$ 2150698 2825533 2880794 3163556 3755310 2760449 3597046 4060347 2969629 3180511 2870565
4078B870565J172083o01061K83027k77190j524644M35991L76970k54527N79520
$$ 2870565 4042648 3441587 3724614 3447424 1922780 2358771 2735741 2481214 3060734
4069C060734J18916r07719J195032j43230J340342q68401p62879L64119p28702
$$ 3060734 3179650 2271931 3466963 3323733 4664075 3795674 3032795 3396914 2668212
4060B668212P19734J194200p80474J14974l47805j63313P4254o22859N11515J87267
$$ 2668212 3387946 4582146 3801672 3916646 3568841 3405528 3479782 2856923 3368438 3555705
4050C555705m4982m54307K25623J11669N50182n78337o37042L73500q85108N85083
$$ 3555705 3510723 3056416 3282039 3393708 3943890 3365553 2728511 3102011 2216903 2801986
4040B801986O86668q08319M83533Q7522n53220N82354N4723J57838j49369m42005
$$ 2801986 3488654 2680335 3163868 3251390 2698170 3280524 3335247 3493085 3343716 2901711
4030B901711L38597P12817k5732k02409j43343j011094j6114K68646Q15075J24299
$$ 2901711 3240308 3953125 3927393 3724984 3581641 2570547 2554433 2823079 3638154 3762453
4020C762453o10056L27177r18537M17616L82190L25052K7520j110216R97796N73859
$$ 3762453 3152397 3479574 2561037 2978653 3360843 3685895 3713415 2603199 3600995 4174854
4010D174854j64040K40938n72301q45503J010444n88461M89755j18329k35502
$$ 4174854 4010814 4251752 3679451 2833948 3844392 3255931 3745686 3627357 3391855
4001C391855M85837N91679n31869r2976m51245j48464R91191k00084L51092J19503
$$ 3391855 3877692 4469371 3937502 3844526 3393281 3244817 4236008 4035924 4387016 4506519
3991D506519j158544J66003R75571k5882M55730j135372k64591N97302j72468
$$ 4506519 3347975 3513978 4489549 4463667 4919397 3784025 3519434 4116736 3944268
3982C944268K3672q2703m2995q90662N09761j0929K14719J47722m36632J81334
$$ 3944268 3967940 3885237 3842242 2951580 3461341 3450412 3665131 3812853 3376221 3557555
3972C557555j81049K38331J478500j232526r72316J080569K39409M98281n82111
$$ 3557555 3376506 3614837 5093337 3860811 2888495 3969064 4208473 4706754 4124643
3963D124643n26893J462575N26061j71923P2305l02055J97057J61784p4776J44303
$$ 4124643 3597750 5060325 5586386 5414463 5486768 5184713 5381770 5543554 5468778 5613081
3953E613081m63427K82763R39141j258497J1750J252558n41960m9501P76751p9104
$$ 5613081 5149654 5432417 6371558 5113061 5124811 6377369 5835409 5785908 6562659 6483555
3943F483555K4919m63114J637068k67417k41458Q08266M6717K07768P18798o20517
$$ 6483555 6508474 6045360 7682428 7415011 7173553 7981819 8028536 8236304 8955102 8334585
3933H334585K9458J0542K83866Q17530p81610L10945L28344n1198R7099m10442
$$ 8334585 8364043 8374585 8658451 9475981 8694371 9005316 9333660 9282462 9379561 8969119
3923H969119M49536J299794k41932o89995k3709k09436K447530O31597k01418
$$ 8969119 9418655 10718449 10476517 9786522 9762813 9553377 12000907 12632504 12431086
3914A2431086k66240j59584J315723J432510m17933q63655l93549k15211J215550
$$ 12431086 12164846 12005262 13320985 14753495 14335562 13471907 13078358 12863147 14078697
3905A4078697L93215j84140P28883R76485j72681O50143J346293R35391J159752
$$ 14078697 14471912 14287772 15016655 15993140 15820459 16470602 17816895 18752286 19912038
3896A9912038l78369N89375J085407J98502J339533K21020J13416J35497P71198
$$ 19912038 19533669 20123044 21208451 21406953 22746486 22967506 23080922 23216419 23987617
3887B3987617k9940P82265J101732J117981Q66962J498417J583112L72087O71198
$$ 23987617 23957677 24739942 25841674 26959655 27826617 29325034 30908146 31280233 31951431
3878C1951431O64207M67519J132169M6101J29747L2274J060497M60347l80708
$$ 31951431 32615638 33083157 34215326 34261427 34391174 34423448 35483945 35944292 35563584
3869C5563584O5859n50443N66805J285485Q88670L98882O5517N44645J023146
$$ 35563584 35629443 35079000 35645805 36931290 37819960 38218842 38284359 38829004 39852150
3860C9852150m17396R6416R0428n65120j179374k04642r636r35045l55663k312253
$$ 39852150 39434754 39531170 39621598 39056478 37877104 37672462 37662826 36727781 36372118 34059865
3850C4059865j360480j96474R57985J692685p9127k46032J169445k90j521966
$$ 34059865 32699385 32502911 33460896 35153581 35074454 34828422 35997867 35997577 34475611
3841C4475611j51941q47826p33857q63758j166534j355020p32273m69179m40229
$$ 34475611 34323670 33475844 32741987 31878229 30711695 29356675 28624402 28155223 27714994
3832B7714994j190378j43805p16805r2584Q47084m90316l31834m827l04274L74269
$$ 27714994 26524616 26380811 25664006 25571422 26418506 25928190 25596356 25591529 25287255 25661524
3822B5661524p3351L33790P96669k57928l70373j341n51711M79593O84994j81004
$$ 25661524 25588173 25921963 26718632 26460704 26090331 26088990 25537279 26016872 26701866 26520862
3812B6520862k24645M09144L24412J155150l6797J65580L97249j327381J445335
$$ 26520862 26296217 26705361 27029773 28184923 28148126 28313706 28710955 27383574 28828909
3803B8828909L15518M92680n65732q91311j072403j086171j655246j071126j666724
$$ 28828909 29144427 29637107 29071375 28180064 27107661 26021490 24366244 23295118 21628394
3794B1628394j18382L72026n96893R03579J337059J505462Q08070L48649P28557
$$ 21628394 21510012 21882038 21285145 22188724 23525783 25031245 25839315 26187964 26916521
3785B6916521J243743J588789O11927j06088n18061k58531p57778J13948n95156
$$ 26916521 28160264 29749053 30360980 30254892 29736831 29478300 28720522 28834470 28239314
3776B8239314j295729j027313k29675Q02383K23728k92610L72248Q84877J257636
$$ 28239314 26943585 25916272 25686597 26488980 26712708 26420098 26792346 27677223 28934859
3767B8934859J690791J129320K299962J829992J854107K072054R73123J307687
$$ 28934859 30625650 31754970 34054932 35884924 37739031 39811085 40784208 42091895
3759D2091895R73003J388986K29448r25671k82134q45938j178072k002221j088506
$$ 42091895 43064898 44453884 44683332 43757661 43475527 42629589 41451517 39449296 38360790
3750C8360790j718544j021398Q29804K12780n36998J062262l491P1l35328p69566
$$ 38360790 36642246 35620848 36450652 36663432 36126434 37188696 37185205 37185276 36849948 36080382
3740C6080382N66058J43983j341366K59559N31688J200955J772358J054800K381917
$$ 36080382 36646440 36790423 35449057 35708616 36240304 37441259 39213617 40268417 42650334
3731D2650334K077789J240033L045211Q71524M54143K51877r68860o81821l34814
$$ 42650334 44728123 45968156 49013367 49884891 50339034 50590911 49622051 48940230 48605416
3722D8605416m91656l2071J08017j776474j499276p67142n14804p51136r61463
$$ 48605416 48113760 48081689 48189706 46413232 44913956 44146814 43632010 42880874 41919411
3713D1919411j729559l30101R77023k6031n69169j951345q04749j723524k451815
$$ 41919411 40189852 39859751 40836774 40810743 40241574 38290229 37485480 35761956 33310141
3704C3310141j359095j439734j059924j995911m33979j500777o62714o08422j096459
$$ 33310141 31951046 30511312 29451388 27455477 27021498 25520721 24858007 24249585 23153126
3695B3153126o19010j24338l58604j20791p14317j061076o04871m09268j138984
$$ 23153126 22534116 22409778 22051174 21930383 21216066 20154990 19550119 19140851 18001867
3686A8001867r40919l65669q34398o52785j753382j71236n07729j095534O34885
$$ 18001867 17060948 16695279 15860881 15208096 13454714 13283478 12775749 11680215 12315100
3677A2315100n58667l95504N17472J06640m66106R75730K48367N96810j2704r13940
$$ 12315100 11756433 11360929 11878401 11985041 11518935 12494665 12743032 13339842 13327138 12413198
3667A2413198k06384N30437j88718r87249j248005m39628J775715K18103l13794
$$ 12413198 12206814 12737251 12548533 11561284 10313279 9873651 11649366 11867469 11553675
3658A1553675K4474M1443P59697K81500n38785l5463k25442J154265O39204j706025
$$ 11553675 11578149 11619592 12379289 12660789 12122004 12086541 11861099 13015364 13654568 11948543
3648A1948543n71116N91355L71355N38269j569800p36637j48335o4404m35248
$$ 11948543 11377427 11968782 12340137 12878406 11308606 10571969 10423634 10359230 9923982
3639I923982N51844j427861j204483N20682o8698l5002j212546o32581l42167
$$ 9923982 10475826 9047965 7843482 8364164 8295466 8260464 7047918 6415337 6073170
3630F073170n13568o29263J547902M71463n65460k2662p84815k50912j62627L2875
$$ 6073170 5559602 4930339 6478241 6949704 6384244 6361582 5576767 5325855 5163228 5196103
3620E196103k62175o49146o74210Q80376M41042m36429Q157K35321J20999K45489
$$ 5196103 4933928 4284782 3610572 4490948 4931990 4495561 4503718 4739039 4860038 5105527
3610E105527J17712k12876m6199M08314O76128p01554l30493l58487R17496M58736
$$ 5105527 5223239 5010363 4964164 5372478 6048606 5347052 5016559 4658072 5575568 6034304
3600F034304m31456l72485k25053j27640N66489J122097q29152j83258K79766
$$ 6034304 5602848 5230363 5005310 4877670 5444159 6566256 5737104 5553846 5833612
3591E833612k86006Q6412P9920M07147l20985J71717J69087M9568J95798M28273
$$ 5833612 5547606 5634018 5713938 6121085 5800100 5971817 6140904 6190472 6386270 6814543
3581F814543m91257o26083l40268N93172J197019n55070M45543j00241q75230
$$ 6814543 6323286 5697203 5356935 5950107 7147126 6592056 7037599 6937358 6062128
3572F062128L46626J104587Q56754J34433k91194L41821P18852P59058k56437
$$ 6062128 6408754 7513341 8370095 8504528 8213334 8555155 9274007 10033065 9776628
3563I776628l77208J53703Q45338l03357j206581O63207J396985k95350r59828
$$ 9776628 9399420 9553123 10398461 10095104 8888523 9551730 10948715 10653365 9693537
3554I693537N14918K0499J112252P65575n12047N14509M1049Q94705R86632q7001
$$ 9693537 10208455 10228954 11341206 12106781 11594734 12109243 12150292 13044997 14031629 13944628
3544A3944628N22466Q89389L26446K15867M17452P71131J304328m10558J33547
$$ 13944628 14467094 15356483 15682929 15898796 16316248 17087379 18391707 17981149 18114696
3535A8114696J358109L02446J036589J083753Q79510J781894K666681K593485
$$ 18114696 19472805 19775251 20811840 21895593 22775103 24556997 27223678 29817163
3527B9817163K632122K987737K709579K859799J618489J250631J179997N39839
$$ 29817163 32449285 35437022 38146601 41006400 42624889 43875520 45055517 45595356
3519D5595356p51970l128769j563690j451453j839972j895062j522709M51468
$$ 45595356 44843386 41714617 40150927 38699474 36859502 34964440 33441731 33893199
3511C3893199r97884j370668j483009m49628j489938j645729j300282j798917
$$ 33893199 32895315 31524647 30041638 29592010 28102072 26456343 25156061 23357144
3503B3357144o69744j096090j244378j298821j032240k75879m51920r65633j086232
$$ 23357144 22687400 21591310 20346932 19048111 18015871 17739992 17288072 16322439 15236207
3494A5236207q37695j063816j21810l92664n96598j17274J22359M78926J18144
$$ 15236207 14398512 13334696 13212886 12820222 12223624 12106350 12228709 12707635 12825779
3485A2825779R22614p75316m83411j96496j409200o81797P03270K96483r23743
$$ 12825779 13748393 12973077 12489666 12293170 10883970 10202173 10905443 11201926 10278183
3476A0278183J5995J32974j20645k52631J29097K0446j31143O17030j98959q10664
$$ 10278183 10294178 10427152 10306507 10053876 10182973 10203419 10072276 10689306 10490347 9679683
3466I679683k30595K41116J24423r62980N09766N16413m29573J153175m40914
$$ 9679683 9449088 9690204 9814627 8851647 9361413 9877826 9448253 10601428 10160514
3457A0160514p90907L14642J02050P10752K85095q39316j9458N01665k15383l22536
$$ 10160514 9369607 9684249 9786299 10497051 10782146 9942830 9923372 10425037 10209654 9887118
3447I887118n46427n90285O84122r02968l55042j18986J18845P80369p96129q32836
$$ 9887118 9340691 8750406 9434528 8531560 8176518 8057532 8176377 8956746 8160617 7327781
3437G327781L55075P4377o8830Q1556l83124Q2484N0858J07990m40695L7459j5391
$$ 7327781 7682856 7757233 7688403 7769959 7386835 7469319 7520177 7628167 7187472 7224931 7209540
3426G209540J93855o10709K39410l09090k68377M22163K47731l39894o27715m75053
$$ 7209540 7403395 6792686 7032096 6723006 6454629 6876792 7124523 6784629 6156914 5681861
3416E681861o67923M70231j875j83017q80758J441771j45015k99905K43241J29047
$$ 5681861 5013938 5484169 5482294 5299277 4418519 5860290 5715275 5415370 5658611 5787658
3406E787658O44211q80429M41988n39559L45596J90897M6435J18051m08907J465447
$$ 5787658 6431869 5551440 5993428 5453869 5799465 5990362 6036797 6154848 5745941 7211388
3396G211388J172288m31640m38571k19987l60072Q01866j06892p04099j92797
$$ 7211388 8383676 7952036 7513465 7293478 6933406 7735272 7628380 6924281 6731484
3387F731484j91018R32116J274779O17768l33623n67979L65050n00523o91786
$$ 6731484 6540466 7472582 8747361 9365129 9031506 8463527 8828577 8328054 7636268
3378G636268k9889k39549l46659j91637j95898J009375q60827O61069N96272j732667
$$ 7636268 7606379 7366830 7020171 6828534 6632636 7642011 6781184 7442253 8038525 6305858
3368F305858J239765k4566L9479N21310M87236L96322j99633J007651J017441
$$ 6305858 7545623 7521057 7560536 8081846 8569082 8965404 8765771 9773422 10790863
3359A0790863o49614k78086N36389L65039Q83796j170113o40973n48368l80101
$$ 10790863 10141249 9863163 10399552 10764591 11648387 10478274 9837301 9288933 8908832
3350H908832O79948p28000J8931l0835J03996Q43932K29393K87267O55486J25443
$$ 8908832 9588780 8860780 8879711 8848876 8952872 9796804 10026197 10313464 10968950 11094393
3340A1094393J482617L13524N971O66120K7613P05917j50443r61102K81996m6939
$$ 11094393 12577010 12890534 12896505 13562625 13590238 14296155 14145712 13184610 13466606 13419667
3330A3419667l1433q54356n95495Q87813P44522r133r5832j89715J355780N94063
$$ 13419667 13388234 12533878 11938383 12826196 13570718 13561585 13465753 13276038 14631818 15225881
3320A5225881k8018q7826q16812j59184l86626L68013m7037J043773o4893k60081
$$ 15225881 15197863 15110037 14293225 14134041 13747415 14115428 14068391 15112164 15047271 14787190
3310A4787190J23743K11010J409260O22292l07523p5007L75167O15486R62491
$$ 14787190 14910933 15121943 16531203 17153495 16845972 16770965 17146132 17761618 18724109
3301A8724109m77720M55244K209793J443586J298360K248718K006312L077595
$$ 18724109 18246389 18701633 20911426 22355012 23653372 25902090 27908402 30985997
3293C0985997L121647L219846M476579L188217L984781J526012J07500N31045
$$ 30985997 34107644 37327490 41804069 44992286 48977067 50503079 50610579 51141624
3285E1141624o02792k545937k288026k461437l363718l055311j655051l172415
$$ 51141624 50538832 47992895 45704869 43243432 39879714 36824403 35169352 31996937
3277C1996937l092566l339449k364655j022167j394889K82086j175376o7431Q39118
$$ 31996937 28904371 25564922 23200267 22178100 20783211 21065297 19889921 19822490 20661608
3268B0661608k05313K1242P68821R09494J60741P57893K028033J494971K00005
$$ 20661608 20456295 20477537 21246358 22155852 22316593 23074486 25102519 26597490 26797495
3259B6797495J012282K191182J391176L143454K561502J916077J509853J472230
$$ 26797495 27809777 30000959 31392135 34535589 37097091 39013168 40523021 41995251
3251D1995251N93538L28171p76802k380405k452351j559839o51163j457308j194822
$$ 41995251 42588789 42916960 42140158 39759753 37307402 35747563 35096400 33639092 32444270
3242C2444270l081902j797204j239788j632177j490231j946109j209666m44473
$$ 32444270 29362368 27565164 26325376 24693199 23202968 21256859 20047193 19602720
3234A9602720j802989o21663P06066j564793R14456m42029m65646m64640N50046
$$ 19602720 17799731 17178068 17884134 16319341 17233797 16791768 16326122 15861482 16411528
3225A6411528K36026M7902K772j87156J676778N83172P8460K10504J233752J345141
$$ 16411528 16647554 16695456 16698228 16511072 18187850 18771022 18849482 19059986 20293738 21638879
3215B1638879M21808L28755J074858J988964J946002J655748J567966L084966
$$ 21638879 22060687 22389442 23464300 25453264 27399266 29055014 30622980 33707946
3207C3707946N076949M076983N364280P162743R856921J3608392J6546709J6455684
$$ 33707946 38784895 42861878 48226158 55388901 65245822 78854214 95400923 111856607
3199A11856607J4483636R975701K759360o100561j2084265j4483387j3640613
$$ 111856607 126340243 136315944 139075304 132974743 120890478 106407091 92766478
3192I2766478j2187316r332442o611613m057363K35829J703714L915008P187971
$$ 92766478 80579162 71246720 64635107 60577744 60813573 62517287 66432295 73620266
3184G3620266J1376944J4730083J5764931J2730243P593046Q30474o174003r374032
$$ 73620266 84997210 99727293 115492224 128222467 135815513 136645987 130471984 121097952
3176A21097952j0746325r181717q807644j0387808j0697679j0202547q761966
$$ 121097952 110351627 101169910 92362266 81974458 71276779 61074232 52312266
3169E2312266o426296l881827l511598l300443k282093j430201j360279j563605
$$ 52312266 45885970 42004143 38492545 35192102 32910009 31479808 30119529 28555924
3161B8555924j072047r18623j114341p84j1474o20276L81952J98098k09948k47807
$$ 28555924 27483877 26565254 25450913 25450129 25438655 24818379 25200331 25398429 25188481 24940674
3151B4940674J309001P02418J259897K328665P49625M00847O25904K194990Q70078
$$ 24940674 26249675 26952093 28211990 30540655 31290280 31691127 32317031 34512021 35382099
3142C5382099q7360R35110N12340J801200L675973O053405J0127784J3792491
$$ 35382099 35294739 36229849 36742189 38543389 42219362 48272767 58400551 72193042
3134G2193042J1818019K684668o442569j0907319j1394100r224377o589926n106776
$$ 72193042 84011061 86695729 80253160 69345841 57951741 48727364 42137438 37030662
3126C7030662l829287k189088j129183P44227p7315L07399O71996M42892J983785
$$ 37030662 33201375 31012287 29883104 30627331 30550016 30857415 31529411 31972303 33956088
3117C3956088L211289K839122M698127N282844N384049Q578186R463318R846888
$$ 33956088 37167377 40006499 44704626 49987470 55371519 63949705 73413023 83259911
3109H3259911J0062897J0665612J2623223J1894697Q430997K367041m601882r259673
$$ 83259911 93322808 103988420 116611643 128506340 136937337 139304378 134702496 125442823
3101A25442823j2132822j2086618j1434993q081371n381593k773076O76022L552409
$$ 125442823 113310001 101223383 89788390 81707019 76325426 73552350 74228372 77780781
3093G7780781N330112O275161O614566N229519K696013J445707L421568O652867
$$ 77780781 83110893 89386054 96000620 101230139 103926152 105371859 108793427 115446294
3085A15446294J0045005J5655428K6292562L6049197M3264983M6704900M0575462
$$ 115446294 125491299 141146727 167439289 203488486 246753469 293458369 334033831
3078C34033831L0277949K1151302R250565q259390k5170520l4758247l2697458
$$ 334033831 364311780 385463082 394713647 386454257 361283737 326525490 293828032
3071B93828032k5907287j6723876r506210p139108q592205j1981710j6657338
$$ 293828032 267920745 251196869 241690659 234551551 225959346 213977636 197320298
3064A97320298k1633755k3564398k1270181j9121654j6344078j2006202r250209
$$ 197320298 175686543 152122145 130851964 111730310 95386232 83380030 74129821
3057G4129821p303047n549634l961857k780385l341316k786629l63726j186081
$$ 74129821 66826774 61277140 57315283 54534898 51193582 48406953 48043227 46857146
3049D6857146L82419J043206K052016M546518P050937J1185191J2506944J1284964
$$ 46857146 47239565 48282771 50334787 54881305 61932242 73117433 85624377 96909341
3041I6909341L241985o602454j0705309j3434284j2552164q392137p199292n203832
$$ 96909341 100151326 93548872 82843563 69409279 56857115 48464978 41265686 36061854
3033C6061854l449318l632865k002843o29896o43682r00379j619551j440118o08143
$$ 36061854 32612536 28979671 26976828 26346932 25703250 24802871 23183320 21743202 21135059
3024B1135059q3146o26104r51359P53934j343036q75328p69665p8260N05352o68345
$$ 21135059 21051913 20425809 19474450 20228384 18885348 18010020 17240355 17162095 17667447 16999102
3014A6999102o14641j25874j211325l20589J392183j557275q21737j99358O06068
$$ 16999102 16384461 16258587 15047262 14726673 16118856 14561581 13739844 13540486 14146554
3005A4146554Q54305K12181n77083l90900L69397M83899j211603o73531l24082
$$ 14146554 15000859 15213040 14635957 14245057 14614454 15098353 13886750 13213219 12889137
2996A2889137m54030j62833l5679N72261n12543J212129N71766j15310O70149
$$ 12889137 12435107 12272274 12236595 12808856 12296313 13508442 14080208 13964898 14635047
2987A4635047K0103J411842k49380k123198j81131j133312p01555N04054j642405
$$ 14635047 14655150 16066992 15817612 13694414 13513283 12379971 11678416 12182470 10540065
2978A0540065k71243M8M73702L9386p89945N23396J49984L51449J364888R40528
$$ 10540065 10268822 10268870 10742572 10781958 9992013 10515409 10665393 11016842 12381730 13322258
2968A3322258K46J15504k15466M67037m78946j682335p82580j419931m96894m12474
$$ 13322258 13322504 13438008 13222542 13689579 13210633 11528298 10745718 9325787 8828893 8416419
2958H416419o73194k3542M20011M04879j161063j8755j50011J052480k09633j01279
$$ 8416419 7743225 7719683 8139694 8544573 7383510 7364755 7214744 8267224 8057591 7956312
2948G956312k47892r7707l81405M84699q262j198587K63308j016297o5227m40694
$$ 7956312 7708420 7610713 7229308 7714007 7705745 6507158 6770466 5754169 5688942 5248248
2938E248248m0761L72119m34635j49501O66637N00269K06874J112852P12580J95121
$$ 5248248 5207487 5579606 5144971 4995470 5662107 6162376 6369250 7482102 8194682 8389803
2928H389803k80190J341923r77563m37960m13549m09880j492385k61101Q80059
$$ 8389803 8109613 9451536 8473973 8036013 7622464 7212584 5720199 5459098 6339157
2919F339157p94468q35284J90863O38269N59873J081977R5084J793438l22634
$$ 6339157 5544689 4709405 4900268 5538537 6098410 7180387 7275471 9068909 8746275
2910H746275l51178P26055l57923p28215l87775m70321j236557j064570K30580
$$ 8746275 8395097 9121152 8763229 8035014 7647239 7176918 5940361 4875791 5106371
2901E106371M31045r22910j272491j17386K57292n19832k47852j33974n42786
$$ 5106371 5537416 4614506 3342015 3224629 3481921 2962089 2714237 2580263 2037477
2892B037477M24551j4092k79487m54264P4281j28325j50725L09068Q17173N11658
$$ 2037477 2462028 2447936 2168449 1714185 1788466 1660141 1509416 1818484 2635657 3147315
2882C147315p41357j221986O08357J295000m68767j100578m70983k85071J032672
$$ 3147315 2405958 1183972 1792329 3087329 2618562 1517984 1047001 761930 1794602
2873A794602N01374p0628O4595j94176k14431J06445n38720N36310n78049m61122
$$ 1794602 2295976 2225348 2289943 2095767 1881336 1987781 1449061 1985371 1407322 946200
2863I46200L4424K68364Q05619l65986M84782p4979j292563n6798J00306k7124
$$ 946200 980624 1248988 2054607 1688621 2173403 2098424 805861 749063 849369 822245
2853H22245J241248j037359m32754P01369P18850O45978n52449m33748j5378j87475
$$ 822245 2063493 1026134 593380 1294749 2013599 2659577 2107128 1673380 1658002 1470527
2843A470527K96632L77264j72794k00756o69498Q31865l10543J18051J578818
$$ 1470527 1767159 2144423 1971629 1770873 1101375 1933240 1622697 1740748 3319566
2834C319566p19400J59140n13673n14830J93780l19637J234878j48773j542738
$$ 3319566 2600166 2759306 2245633 1730803 1924583 1604946 2839824 2691051 1148313
2825A148313J25384P38025m35545k52373N67191K38899J98480p69334j63196N97942
$$ 1148313 1273697 2011722 1576177 1323804 1890995 2129894 2328374 1559040 1395844 1993786
2815A993786m55680L34058r46653l99094K76550P76748M93330O1042o38584m50299
$$ 1993786 1538106 1872164 925511 526417 802967 1579715 2073045 2134087 1495503 1045204
2805A045204M54636J80179J269679o73950j6801p7106L14180O31538n40910j76817
$$ 1045204 1499840 1680019 2949698 2275748 2258947 2181841 2496021 3127559 2586649 2409832
2795B409832k11880J61023k69444J153121q5288l41005r08052j132609M4691L6983
$$ 2409832 2197952 2358975 2089531 3242652 3157364 2816359 1908307 775698 820389 857372
2785H57372J203653l98020l15682L5227l64915O06169J20201J37958J13660j144610
$$ 857372 2061025 1663005 1347323 1382550 1017635 1623804 1744005 1881963 1995623 851013
2775H51013j19168m81959J55759r9070k22183J84489R32756K58793p52602N04107
$$ 851013 731845 249886 405645 306575 84392 268881 1201637 1460430 707828 1211935
2765A211935j41035n50882l7404L53424l78614q52014Q62739J69387M6652J67666
$$ 1211935 1070900 520018 482614 836038 457424 -394590 468149 637536 684188 851854
2755H51854K64629j245675J8160M05313Q26082M20860p44330k37672m05842N96151
$$ 851854 1116483 -129192 -111032 294281 1120363 1541223 796893 559221 153379 749530
2745G49530L14259L84098j75068o77982Q93679J080416q25466q61944L94486j244305
$$ 749530 1063789 1447887 1272819 594837 1488516 2568932 1743466 881522 1276008 31703
2735C1703P81219j17278p00805Q09812r03461Q48876J29012o86262N10198k04401
$$ 31703 812922 695644 -5161 804651 -98810 750066 879078 192816 703014 498613
2725D98613J44626j016133J2818J267776l46363M44915j28080k54954O08226k07260
$$ 498613 643239 -372894 -360076 907700 561337 1006252 878172 623218 1231444 1024184
2715A024184K51839l21786q77256J747085p35730o03610P6179j06775L07024L69921
$$ 1024184 1276023 954237 76981 1824066 1088336 484726 560905 454130 761154 1131075
2705A131075K9360l37779l5997m32827K30456N2390q3846J41872p37998n38436
$$ 1131075 1160435 822656 786659 353832 584288 636678 552832 694704 -43294 -581730
2695e81730O09755J73490O12123l42303J64614J329048r52954Q2522P35317l24250
$$ -581730 28025 201515 813638 471335 635949 1964997 1012043 1094565 1829882 1505632
2685A505632k35716j52894r21977q1377J32861N80059N89166j304135M05417Q20596
$$ 1505632 1269916 1117022 195045 113668 246529 826588 1415754 111619 517036 1337632
2675A337632l10292q7449p91180q6553l39190l2867o62415m1548L24132j09169
$$ 1337632 1027340 939891 148711 62158 -277032 -309899 -972314 -1013862 -689730 -798899
2665g98899N50577K3648k32918O82367K47110m35506m10696j59208J086615P4606
$$ -798899 -248322 -224674 -457592 224775 471885 36379 -374317 -533525 553090 627696
2655F27696m10411K48229m73000L5003M30668N19081J23803K3447J20234P65576
$$ 627696 217285 465514 -7486 27517 458185 977266 1101069 1124516 1244750 2010326
2645B010326J1600r07868j87875R98189k98724L90938m19878n94351N69722l34413
$$ 2010326 2021926 1114058 926183 1924372 1625648 2016586 1596708 1002357 1572079 1237666
2635A237666m00920n2518k61871j35361l59147l48009L38558N14656j21504M44946
$$ 1237666 836746 784228 522357 386996 27849 -320160 18398 533054 411550 856496
2625H56496k90675J78518O51165k81676j69160L7038J143004j514178J88536P91605
$$ 856496 565821 744339 1395504 1113828 944668 981706 2124710 610532 799068 1590673
2615A590673r76808o8598L78738k60575r1807l16729M08644K62553J33730O55217
$$ 1590673 613865 545267 924005 663430 571623 254894 663538 926091 1059821 1715038
2605A715038K98517o44470l60929k38498n79502J128535K16358j154438J29077
$$ 1715038 2013555 1369085 1008156 769658 190156 1318691 1535049 380611 509688
2596E09688M02125j56964p48337R1680J17879O33749n74311k34560L68795O18762
$$ 509688 911813 754849 6512 98192 216071 849820 275509 40949 409744 1028506
2586A028506j9616p72818j93838K79095K46713j29664k95061R14775k19101m22104
$$ 1028506 1008890 236072 42234 321329 568042 438378 143317 1058092 838991 416887
2576D16887l76024k06855n1722O23205o70514k29715J057613M06365p3473n71595
$$ 416887 40863 -165992 -217714 405491 -265023 -494738 562875 969240 895767 324172
2566C24172K2945K00536m60100K84909R69989j97564j22486m42097K90011L08437
$$ 324172 347117 547653 87553 372462 1342451 1144887 1022401 580304 870315 1178752
2556A178752j55023n12148j14849l66137l36333N51659M55027M79109l11680P35935
$$ 1178752 1023729 511581 396732 30595 -305738 245921 700948 1180057 868377 1604312
2546A604312l22484n56029N72087m18878O72319n54538k11870j57918n40386R63794
$$ 1604312 1281828 725799 1297886 879008 1551327 996789 784919 627001 86615 1050409
2536A050409P91185j453817j23123j02985M3622M96456j159363J30636j79925
$$ 1050409 1841594 387777 264654 161669 205291 701747 -457616 -326980 -506905
2527e06905p5339Q13474m7553J20586J651812k34118l03058J12926j4702O13195
$$ -506905 -582244 231230 183677 304263 1956075 1721957 1418899 1531825 1517123 2130318
2517B130318j482120m96311J02367k73575J87537P43500j59474k37843o44091
$$ 2130318 648198 151887 254254 -19321 168216 911716 752242 514399 -129692
2508a29692L03340O7760M03667Q26009P09652j147614q32930J257306K00230J44097
$$ -129692 173648 241408 645075 1471084 2180736 1033122 200192 1457498 1657728 1801825
2498A801825j35078j755208K23450L00280J64530N40431j018785J68746N62227
$$ 1801825 1666747 -88461 134989 435269 599799 1140230 121445 290191 852418
2489H52418o34847L33353J74348o73521J492040j29334o91854K3090O54602N33184
$$ 852418 217571 550924 725272 51751 1543791 1414457 722603 745693 1400295 1933479
2479A933479j113417J633K29327m0332p56713M72971l47364M44722j22847q2752
$$ 1933479 820062 821695 1051022 1010690 253977 726948 379584 824306 701459 618707
2469F18707l82311r47157J076694K23017n36865l06247o3730M34823K98316J11509
$$ 618707 236396 -710761 365933 588950 52085 -254162 -317892 116931 415247 526756
2459E26756K55417j17793K1314J12390R28330o81714n05329q2083p42708K8150
$$ 526756 782173 664380 685694 798084 1726414 1044700 539371 457288 -285420 -257270
2449b57270N61260O74067k20896k43212M32818k74110o73531M38090N63365j541229
$$ -257270 303990 978057 757161 513949 946767 672657 -874 437216 1000581 -540648
2439e40648N04181O1500O21539L22309K60393N56891n63728J54161J080092k94911
$$ -540648 -36467 25033 646572 968881 1229274 1786165 1222437 1376598 2456690 2161779
2429B161779p82106P72325P07735k97692j059544o41781M15781J98211K50742
$$ 2161779 1379673 2151998 2859733 2562041 1502497 860716 1276497 1474708 1725450
2420A725450N6925j72143l6743L95317k31288m05153Q73228J296623j116619q16817
$$ 1725450 1782375 1610232 1573489 1968806 1737518 1332365 2205593 3502216 2385597 1568780
2410A568780J42127j13705J342973n0671j230681n17266J487194P12732p88584
$$ 1568780 1710907 1597202 2940175 2889504 1658823 1141557 2628751 3341483 2552899
2401B552899n6434p01947j31995N04798M59287O67278L60957n17743J328208Q89259
$$ 2552899 2496465 1794518 1662523 2167321 2626608 3293886 3654843 3137100 4465308 5354567
2391E354567J646070J757054o10916L26365K99259J250849M56107Q71106J004837
$$ 5354567 7000637 8757691 8146775 8473140 8772399 10023248 10479355 11350461 12355298
2382A2355298K216786K206929M681514N737875J2247035K5407700L6341929L4197140
$$ 12355298 14572084 16779013 21460527 27198402 39445437 64853137 101195066 135392206
2374A35392206K028857k7230958l0601065k2750889j5078236r961528q126910
$$ 135392206 137421063 110190105 79589040 56838151 41759915 31798387 23671477
2367B3671477n731495l872902k418402j519876o39659L0647n05876L36370n72365
$$ 23671477 17939982 14067080 11648678 10128802 9489143 9519790 9013914 9350284 8777919
2358H777919j179869n24570K33250m14183p22781r14227M52369q59548k81422
$$ 8777919 7598050 7073480 7306730 6892547 6169766 5255539 5707908 4848360 4566938
2349D566938j90835j146754o57541n10301J098748Q1329m90636L53386k60774
$$ 4566938 4376103 3229349 2571808 2061507 3160255 3241584 2750948 3104334 2843560
2340B843560m96743O14842n21733J16633k30809K0445L41930r27145m63258M71145
$$ 2843560 2346817 2961659 2439926 2556559 2325750 2346195 2688125 1760980 1297722 1768867
2330A768867M46J54974M02901O0567m36899n50272K20088k93488l46902O65683
$$ 1768867 1769313 1924287 2327188 2387755 1950856 1400584 1620672 1327184 980282 1645965
2320A645965O29621q1680n67166j01726N34495K31998j311062J41758M94573J19727
$$ 1645965 2275586 2193906 1626740 1525014 2059509 2291507 980445 1122203 1616776 1736503
2310A736503L57240p59796M76946l77236J65976l38884J05567M27076l7221l09144
$$ 1736503 2093743 1333947 1810893 1433657 1599633 1260749 1366316 1793392 1756171 1447027
2300A447027n31254P6022P98603r15675r04016R77984Q65570j17231l91006K04331
$$ 1447027 915773 991795 1790398 874723 -29293 948691 1814261 1697030 1306024 1510355
2290A510355N89160l92876m46886L52200j67929P43194o90478r36401P82996l19983
$$ 1510355 2099515 1706639 1259753 1611953 1444024 2187218 1496740 560339 1343335 1023352
2280A023352Q21424o08239n57712Q11430m02669n96473O31671j25412M19898l29226
$$ 1023352 1844776 1236537 678825 1490255 1087586 491113 1122784 997372 1417270 1088044
2270A088044j405321Q94701l40935k72081O42198q46612K73951Q05153k57196
$$ 1088044 -317277 577424 236489 -35592 606606 -240006 33945 839098 581902
2261E81902o2249l69073k55743l74601M05522j04947J158100m73837k01115N28830
$$ 581902 519653 150580 -105163 -479764 -74242 -179189 978911 505074 303959 832789
2251H32789r0110P5242M70512r68265K72683Q16287O70036m35299j181787J33687
$$ 832789 742679 817921 1288433 320168 592851 1409138 2079174 1643875 462088 595775
2241E95775l17783n40086L44518R84484N87953o4269p06099J83040J080922o46614
$$ 595775 277992 -262094 82424 1066908 1654861 1590592 884493 1067533 2148455 1501841
2231A501841m61613k78875o23843L00104n89294L79417M36711J36157o58524P10238
$$ 1501841 1040228 761353 137510 437614 -151680 227737 664448 800605 142081 852319
2221H52319L7228K63816J410675j266597k75724P37153N22397o80451o04683j78784
$$ 852319 889547 1153363 2564038 1297441 1021717 1758870 2281267 1600816 996133 817349
2211H17349m09338k48437m90739k28084P80761k00404o32002M45232p42508P47508
$$ 817349 408011 159574 -331165 -559249 221512 21108 -610894 -165662 -908170 -160662
2201a60662N6294n00245q33668J116199P02717L61396l92579m35818J03348m63485
$$ -160662 -104368 -604613 -1438281 -322082 380635 742031 349452 -86366 16982 -446503
2191d46503J70809O50881l51550m23581J528521q64221n67835K95830K82249m93870
$$ -446503 -275694 375187 23637 -399944 1128577 264356 -303479 -7649 274600 -219270
2181b19270L32686R09853q91862l39567K36012J342326m31555n80932M42740P20536
$$ -219270 113416 1023269 131407 -208160 27852 1370178 938623 357691 800431 1520967
2171A520967o07270n53695K73468o93144L64276n13029K80206M1563N21555n12723
$$ 1520967 913697 360002 633470 -59674 304602 -208427 71779 113342 634897 122174
2161A22174k93140K66160l05336j81384J66345K99297L56441O63316j058327j96945
$$ 122174 -170966 95194 -210142 -391526 -225181 74116 430557 1093873 35546 -161399
2151a61399O69120J17223M3219o54992J220400Q0207p34759J56160q14650n17888
$$ -161399 507721 624944 668163 13171 1233571 1313778 579019 735179 -79471 -597359
2141e97359N89002R2960M08395k34904m77212M56124l48253j66606m0258K6273
$$ -597359 -8357 84603 492998 258094 -219118 237006 -111247 -277853 -318111 -291838
2131b91838J031071n6557p37351o6412k37052Q40713k84740r11837K01815Q74148
$$ -291838 739233 682676 -54675 -121087 -358139 482574 197834 -714003 -512188 361960
2121C61960J058129j296834p00796M16363j16343n23286P28082j98286m69012
$$ 361960 1420089 123255 -577541 -161178 -277521 -800807 -72725 -271011 -740023
2112g40023J179234m75281K10561J02021P02440J35145k37795L23009R9310Q0829
$$ -740023 439211 -36070 174491 276512 978952 1114097 876302 1199311 1298621 1379450
2102A379450j051688q06590M95435K14295O30883q9992j31665Q28362K07219j198441
$$ 1379450 327762 -478828 16607 230902 861785 771793 640128 1468490 1675709 477268
2092D77268L60359j50414L91720N49269j440866j92275L98763J7595m21979m02323
$$ 477268 837627 687213 1078933 1628202 187336 -4939 393824 411419 -10560 -412883
2082d12883K57307L65319j57799k95541J26282r61j11322j085228L65754J101455
$$ -412883 -155576 209743 51944 -243597 -117315 -118276 -229598 -1314826 -949072 152383
2072A52383j24327l93192K34871Q93425j323307k29467J240736K81743n05190
$$ 152383 28056 -365136 -130265 763160 -560147 -789614 451122 732865 227675
2063B27675K24351r2430p53504r9626K25963J5595j00883N86616k38249q86397
$$ 227675 452026 359596 -393908 -493534 -267571 -251976 -352859 233757 -4492 -890889
2053h90889M28482M14961J81346o2517k93033N56099K8016M04654N29488o11441
$$ -890889 -462407 -47446 133900 71383 -221650 334449 362465 767119 1296607 685166
2043F85166r69516o36235R96379L09021k33657L76446m62019m58930K5952Q50844
$$ 685166 -284350 -920585 75794 384815 151158 527604 65585 -393345 -367393 483451
2033D83451k22153k18315l21781R6308M83237k11536l2289l68920m03045O38689
$$ 483451 261298 42983 -278798 -182490 300747 89211 56922 -311998 -715043 -76354
2023g6354N72846k01160J3864j156K74885O5924J10591L6685o90997K08547o24245
$$ -76354 496492 295332 309196 308040 582925 648849 759440 796125 105128 313675 -310570
2012c10570m29047M97489l13923J56238K29744p1161M74301m3086K47215k86143
$$ -310570 -739617 -242128 -556051 -399813 -170069 -241230 233071 189985 437200 151057
2002A51057j276138j65723M51954N08951m30203K7506k21691l2442K2940L37561
$$ 151057 -1125081 -1290804 -838850 -329899 -760102 -732596 -954287 -986729 -963789 -626228
1992f26228M76147n6173j03388L1049P21105L80278J82535n10539j120571J535154
$$ -626228 -150081 -206254 -309642 -278593 442512 822790 1005325 494786 -625785 909369
1982I09369N22869L39809K8770r86377q28718J08061O05810L58553r28671J58428
$$ 909369 1432238 1772047 1800817 814440 -14278 93783 699593 1058146 129475 287903
1972B87903K82593n78482K24679L39097R1676m90111m14121M54269k98083N28446
$$ 287903 570496 -7986 216693 555790 647466 157355 -256766 197503 -100580 427866
1962D27866P08659r51596m46498J24201K32429R17814j05036j318485K99161m71748
$$ 427866 1136525 184929 -261569 -137368 95061 1012875 907839 -410646 -111485 -583233
1952e83233J7010J362841r30234j53483K51559j76113M11996j06934j29961l44098
$$ -583233 -566223 796618 -133616 -287099 -35540 -211653 200343 93409 -36552 -380650
1942c80650O31730L58164K45220l06424j81353j88420m15348j043141j18582P06541
$$ -380650 251080 609244 854464 548040 366687 178267 -237081 -1280222 -1398804 -692263
1932f92263j40289K43646K11098n14467J368415k85887j13065J017759j020442
$$ -692263 -832552 -588906 -377808 -892275 476140 190253 77188 1094947 74505
1923G4505N81423l59387o79045K41453j02958M7053L7476Q1049K46478M40592
$$ 74505 655928 296541 -382504 -141051 -244009 -196956 -159480 -78431 168047 608639
1913F08639n79532M32829J66877r51974o99695L35729J389074K26800p49889M62817
$$ 608639 29107 461936 628813 -323161 -1022856 -687127 701947 928747 178858 641675
1903F41675q6656O57221k58298k95736Q02542j109235m38547O5272l05600L40256
$$ 641675 555019 1212240 953942 658206 1460748 351513 -87034 -21762 -327362 12894
1893A2894J20729m294k20571J20281J081259m31759l1368J73527l67535k61251
$$ 12894 133623 129329 -91242 29039 1110298 678539 647171 820698 453163 191912
1883A91912O89371J32987n50577o16931K52422R67004o9031J9329k31316p5179
$$ 191912 881283 1014270 463693 -153238 99184 1066188 997157 1016486 785170 709991
1873G09991Q23813l15171p49543O51970J82921P22089o74895m74040l68960n01132
$$ 709991 1533804 1218633 469090 1121060 1303981 2026070 1351175 877135 508175 7043
1863G043N91214q54294k80969N6435p14066Q38944P8495L67940j7977N9851k75805
$$ 7043 598257 -256037 -537006 -480571 -1194637 -355693 -277198 90742 72765 132616 -143189
1852a43189L40763R97635j14090O4102o57831m16296L15924m6356l71340L34194
$$ -143189 197574 1195209 1081119 1145221 487390 71094 387018 340662 -30678 303516
1842C03516J29364l67966J23881m92568J80996K58482q42796K86450M31581P388
$$ 303516 432880 64914 188795 -303773 -122777 135705 -707091 -420641 10940 18328
1832A8328J70134N29191K47534q35932j25225J156797j50494q23174J2753k12770
$$ 18328 188462 717653 965187 129255 4030 1160827 1010333 187159 199912 -12858
1822a2858M73024n4642L60924n70529m82293J149820o36309K57685Q3807Q99887
$$ -12858 460166 405524 766448 195919 -286374 863446 227137 484822 568629 1468516
1812A468516m83729p23997K72360L02113j13183n52786j190571L58569R06239
$$ 1468516 984787 260790 533150 835263 722080 169294 -1021277 -662708 243531
1803B43531l45974n24676j94346N54485P37848p15900P7324k57861K61827Q78642
$$ 243531 -102443 -627119 -821465 -266980 470868 -245032 -167708 -425569 -163742 714900
1793G14900k68907m64983P7010L23670k41779k91754l23878P56231j108740L81611
$$ 714900 445993 -18990 58020 381690 139911 -151843 -475721 280510 -828230 -446619
1783d46619k25960n28475J564767q42597p6213n390M5215O66449J38539o9854
$$ -446619 -672579 -1201054 363713 -478884 -555097 -560487 -515272 151177 289716 219862
1773B19862j43681o48923O15770L85487l49354K76182n61711L44495p0944K57939
$$ 219862 76181 -572742 43028 428515 79161 355343 -206368 138127 67183 325122
1763C25122J21982n69092j48488k57891m54529O38773K82685m16549Q0251N66685
$$ 325122 447104 -121988 -270476 -528367 -982896 -344123 -61438 -477987 -397736 168949
1753A68949K95003m13505Q82078L04867r55966J82372n958j61718K52557n59223
$$ 168949 463952 50447 932525 1237392 281426 463798 457840 296122 548679 -10544
1743a0544j114604J01005J005239N85934m64428n40124O3151k47314O62362o20363
$$ -10544 -1125148 -1024143 -18904 567030 102602 -437522 -374371 -621685 40677 -579686
1733e79686M29307O4945q1038J97305l97867O77482m55097N4524M26688m65101
$$ -579686 -150379 -85434 -166472 30833 -367034 310448 -144649 -90125 336563 -128538
1723a28538m53333J165344N94306K05221r41925k12290k2905j46916k13951l9490
$$ -128538 -581871 583473 1177779 1383000 441075 228785 205880 58964 -154987 -194477
1713a94477Q91485o87261J16536N3620K84930L52685L29014l67328J52555J63062
$$ -194477 697008 9747 126283 179903 464833 817518 1146532 779204 931759 1094821
1703A094821l62016Q13209j130286m91414q6747p31668J303644K06080q02294
$$ 1094821 732805 1546014 415728 -75686 -162433 -894101 409543 615623 -186671
1694a86671l91091k56988P08836M30086J64823m8607j083812l72839J040690O54613
$$ -186671 -577762 -834750 -125914 304172 468995 420388 -663424 -1036263 4427 659040
1684F59040N1269L7260k74648k96479R34297P9924m41658j75818q9966R5571o90243
$$ 659040 710309 747569 472921 176442 1110739 1190663 749005 573187 483221 578792 -111451
1673a11451K22271L06009K38894n15094k29789O56608m54953J71964K54830J64461
$$ -111451 110820 416829 655723 140629 -89160 567448 112495 284459 539289 703750
1663G03750j059353M35708j10295J59149k05798n16448P87678j82150O20265j60268
$$ 703750 -355603 80105 -30190 128959 -76839 -593287 194391 12241 632506 472238
1653D72238n21437J99570M71579O3304K0583o17533J190088j22091j593885K91820
$$ 472238 -49199 150371 621950 685254 705837 88304 1278392 1156301 -437584 -145764
1643a45764j21583P92044l34514K75658O25582k03916n43712R97984o5382P0920
$$ -145764 -267347 524697 190183 465841 1091423 887507 343795 1341779 1276397 1347317
1633A347317n35225p1032m3757l85354M43633j7601k65871o33502K19870L04190
$$ 1347317 812092 741060 697303 311949 755582 737981 472110 -161392 58478 362668
1623C62668j79046k23816M61864l7719m64326q87853J16429P16048k72877k56516
$$ 362668 183622 -40194 421670 383951 -80375 -968228 -851799 -135751 -408628 -665144
1613f65144K30286o92726N04484P01242p98139m69173J441107k73085j93392l19923
$$ -665144 -434858 -1127584 -623100 78142 -719997 -1189170 251937 -21148 -214540 -534463
1603e34463L19435N69436n07305j90993M5138R17699O4476k00674p70037K48951
$$ -534463 -215028 354408 -152897 -343890 -298752 618947 683423 482749 -287288 -38337
1593c8337R11510q15318p116R03392m37801m96302O82718J36828j08493j33124
$$ -38337 873173 57855 50739 954131 516330 20028 702746 839574 731081 597957
1583E97957P76354l61170j93178o0217O19423q33098k84453K47187p70798j32561
$$ 597957 1374311 1013141 819963 759746 1379169 546071 261618 508805 -261993 -394554
1573c94554O87403j65687M11604L00961L42723l28246n93811J227988r65619k36452
$$ -394554 292849 127162 538766 839727 1182450 854204 260393 1488381 522762 286310
1563B86310p0798L81101O03208k02897n23460K16699P85985L1621o95261l8500
$$ 286310 215512 596613 1199821 996924 473464 690163 1476148 1507769 812508 774008
1553G74008o32388P1937N07409j063858k52576P19027k24826o2915j0729K4472
$$ 774008 141620 213557 720966 -342892 -595468 123559 -101267 -164182 -174911 -150439
1543a50439N28356j2020Q31214n02869o21576N89569j40243p1315m05361p91808
$$ -150439 377917 365897 1197111 694242 72666 662235 521992 450677 45316 -746492
1533g46492l939M89903M80046O72755q63073M81760J67848m13057Q83310m51353
$$ -746492 -750431 -260528 219518 892273 29200 510960 678808 265751 1149061 697708
1523F97708l62029r22757k80069L84915L97231l62495N9865j16642l63479M61252
$$ 697708 335679 -587078 -867147 -482232 -85001 -447496 -387631 -504273 -867752 -406500
1513d06500J169708O90415o07682k52058j14644L21594L6629Q347m99296k07722
$$ -406500 763208 1453623 845941 593883 479239 800833 837462 845809 346513 138791
1503A38791M64708r2419R452j205138R57485M83877r12188k03467M59100J185172
$$ 138791 603499 511080 520532 -684606 272879 756756 -155432 -358899 100201 1285373
1493A285373l22157r56254n13293O50077Q00489n37299m16771K36006n3009O98391
$$ 1285373 963216 6962 -506331 143746 944235 406936 -9835 226171 173162 871553
1483H71553l61207l77948m93323N68765j55174l07066J68595R36337j19205r54337
$$ 871553 510346 132398 -360925 207840 52666 -254400 -85805 850532 731327 -223010
1473b23010k6319P99952q0817l41626M49223N49344j68653L50824r65169k19393
$$ -223010 -249329 550623 469806 128180 577403 1126747 958094 1308918 343749 124356
1463A24356K96601O1812m17103k33618K174j19876j05213K03539P00142J60815
$$ 124356 420957 482769 65666 -167952 -165778 -285654 -390867 -187328 512814 673629
1453F73629J49095l69140n17151k47423P85986j29081m23241J99155l05195L77211
$$ 673629 822724 453584 -63567 -310990 474996 345915 -77326 121829 -183366 193845
1443A93845k29956N19707J08580p37819L58998L5321k10789N45375L70328p92651
$$ 193845 -36111 483596 592176 -145643 213355 248676 37887 583262 953590 160939
1433A60939K45822j01838L90405o8554o27962p4664K26040m90784O90921j009018
$$ 160939 406761 304923 695328 626774 -1188 -75852 150188 -340596 350325 -658693
1423f58693j89436J84314p7591m98664L19864M03456R33181j253446J14391J028206
$$ -658693 -848129 -663815 -741406 -1240070 -920206 -516750 416431 -837015 -722624 305582
1413C05582j30231M90657o76963n26948P0480K18868L83485N31345o98699M69367
$$ 305582 175351 666008 -10955 -537903 -467423 -248555 134930 666275 -32424 436943
1403D36943O13801k83695n22890l23233K93774K61182J36444N8949q04077l2164
$$ 436943 1050744 767049 244159 -79074 214700 475882 612326 671275 -132802 -164966
1393a64966O32356m23361k43680j52027N77235j06454n7884N20821l26728p21534
$$ -164966 467390 44029 -199651 -351678 225557 119103 61219 582040 255312 -466222
1383d66222j4040R73766n33318j4422l91389N51933N71228K54917j040328l07710
$$ -466222 -480262 493504 -39814 -54236 -445625 106308 677536 932453 -107875 -415585
1373d15585M25707N98767k30910l14874k55141O87297j2824r48534k66572Q08698
$$ -415585 10122 608889 377979 63105 -192036 495261 482437 -466097 -732669 76029
1363G6029N64860n85956N75496J58494m64016k25682L25603l19416o38628k72255
$$ 76029 640889 54933 630429 788923 324907 99225 424828 105412 -533216 -805471
1353h05471j468L80779m0979N446n21549J26262K89400O43107k14899o48363J173691
$$ -805471 -806939 -426160 -467139 -461693 -983242 -856980 -567580 75527 -139372 -787735 385956
1342C85956q49012J176187O85248q31082l21586n69973J16660N09770j48172k60955
$$ 385956 -463056 713131 1398379 567297 245711 -324262 -207602 302168 153996 -106959
1332a06959R0336K23180M62282o82113j04597J77583l8969L89976j564692R80176
$$ -106959 -16623 206557 668839 -13274 -117871 59712 20743 410719 -1153973 -173797
1322a73797N03354j172457p0137k00331O66429J476056q01535P17184M93774l49141
$$ -173797 329557 -842900 -913037 -1113368 -446939 1029117 227582 944766 1438540 1089399
1312A089399p1482o54908J12706m15442O97443o38279k97733R14710j77807j443
$$ 1089399 1017917 363009 475715 60273 757716 119437 -178296 736414 558607 557164
1302E57164l32069j131667P32039P53649k74335L8329m73631o13604j28091j24410
$$ 557164 225095 -906572 -174533 579116 304781 343110 -130521 -744125 -872216 -996626
1292i96626O68633J86877j62901J029272P87160j89513q78451J36553J28729k12420
$$ -996626 -327993 -141116 -304017 725255 1512415 1322902 444451 581004 709733 497313
1282D97313P7384o9058n39347p0039L57723q99220m09619k18657J184447L30713
$$ 497313 574697 505639 -33708 -103747 253976 -645244 -1054863 -1273520 -89073 241640
1272B41640J48187j53170P47199n70960n36351J66180r49157L61944j1136p306
$$ 241640 389827 236657 983856 412896 -123455 42725 -906432 -544488 -555624 -562930
1262e62930j62240O07545J83286p79237j10573J445233o28840P3650N92559N4823
$$ -562930 -725170 -117625 65661 -713576 -824149 621084 -7756 65894 658453 713276
1252G13276K65043r56200J38368Q3426k50839J295048n8566r79721K85668k86497
$$ 713276 978319 22119 160487 243913 -6926 1288122 1229556 249835 535503 249006
1242B49006o28810m54099L97101J037008K14166n93993n2225k24613J12351N61904
$$ 249006 -379804 -833903 -436802 600206 814372 220379 168154 -56459 55892 617796
1232F17796m42523j25115r1246m03278J046545j48895L77246n73957o90503M96481
$$ 617796 175273 50158 -41088 -444366 602179 453284 830530 256573 -433930 62551
1222F2551J111479K19222j072455p11408q14687P54116j5083n07217L04338P48020
$$ 62551 1174030 1393252 320797 -390611 -1205298 -451182 -466265 -973482 -669144 78876
1212G8876K70151N26366M06926o85928O51882l00967j020332k36936L39172P3296
$$ 78876 349027 875393 1282319 596391 1248273 947306 -73026 -309962 29210 102506
1202A02506K71110j238830K30495Q53376q8736J814719p09375j751269O68602
$$ 102506 373616 -865214 -634719 218657 129921 1944640 1235265 -516004 152598
1193A52598p43973k81378J18375l78847J164600O525K96176q32923l11749O40055
$$ 152598 -591375 -872753 -754378 -1133225 31375 37900 334076 -498847 -810596 -170541
1183a70541m30323o83712P55607k22591M1025J29913J41242O97685p10012m95034
$$ -170541 -600864 -1284576 -528969 -751560 -710535 -580622 -439380 258305 -451707 -946741
1173i46741J181645O9852O14901p9695n90458K26364l69662n81871j3168o06814
$$ -946741 234904 304756 919657 839962 249504 475868 106206 -475665 -488833 -1095647
1163a095647J94691J499330k01399l65538p35622L84367J142586l53700m94723
$$ -1095647 -900956 598374 396975 31437 -704185 -319818 822768 469068 -25655
1154b5655m5342M30945k68327J52734K38525K04981j86657N24266M76509r11013
$$ -25655 -70997 359948 91621 244355 482880 687861 501204 1025470 1501979 590966
1144E90966O45840L19747j875448q81096N23221J079890N26781r17027J147138
$$ 590966 1236806 1556553 -318895 -1199991 -676770 403120 929901 12874 1160012
1135A160012q40479M51025M44626n04012K28400o25658Q7825p98064L37631o31990
$$ 1160012 319533 770558 1215184 711172 939572 313914 401739 -396325 -58694 -690684
1125f90684M37655K30377n42871L23804m41822J354753K87438N61274o28780j07552
$$ -690684 -253029 -22652 -565523 -241719 -683541 671212 958650 1519924 891144 783592
1115G83592L85421j34489m79184K36353k25434k57465j78925m22922Q93044J05823
$$ 783592 1169013 1034524 555340 791693 566259 308794 129869 -293053 599991 705814
1105G05814O20334m52995j114287n69479K93105N02644J61638k43876p33176K84047
$$ 705814 1326148 873153 -241134 -810613 -517508 -14864 146774 -97102 -830278 -546231
1095e46231Q99324O3722q53241N4150o97524L54268O75988l80806N23866K3344
$$ -546231 353093 416815 -436426 -382276 -1079800 -725532 -49544 -430350 93516 116860
1085A16860P2512l38159P42976J22148J90777n43841p42579J33918n71258K86484
$$ 116860 189372 -148787 594189 716337 907114 363273 -379306 -245388 -816646 -530162
1075e30162P8883K44547N90692j83996l90050K38862M82141n17456L4545J48012
$$ -530162 -451279 -206732 383960 199964 -190086 48776 530917 13461 48006 196018
1065A96018m70976R0475m3611K62009R90031l08003K75553n82457J83124Q90163
$$ 196018 -274958 -184483 -228094 33915 1023946 715943 991496 409039 592163 1482326
1055A482326l73758l12190p23727j250575O87252N59683m37339K17086k01003
$$ 1482326 1108568 796378 72651 -1177924 -490672 69011 -368328 -151242 -352245
1046c52245P4638n00443J006550K13446m91273R7849K71375J22069o22005l49525
$$ -352245 -277607 -778050 228500 441946 -49327 48522 319897 441966 -180039 -529564
1036e29564P12705m68933K18523p53512n48635K175189n09369j121327r28153
$$ -529564 183141 -285792 -67269 -820781 -1369416 805773 296404 -824923 -1753076
1027a753076j58562J138715M98513Q7559n01097o16114R32163P70278j105810
$$ -1753076 -1911638 -772923 -274410 -186851 -687948 -1304062 -371899 398379 -707431
1018g07431j0856J597460n10784m01775l93268P46350n6365j054571O85974o37290
$$ -707431 -718287 879173 368389 -33386 -426654 319696 263331 -791240 -105266 -742556
1008g42556m03384J022328O37574n55851n33285j71965R66075o88707n4180R03985
$$ -742556 -1145940 -123612 513962 -41889 -575174 -747139 218936 -469771 -523951 380034
998C80034l63264J24224R8673N4296j97292O45915l55935n34142k77300Q07277
$$ 380034 16770 140994 239667 293963 96671 742586 386651 -147491 -424791 382486
988C82486k01323m66774O14799J29672k49613M10820P67246M0128j83086m00579
$$ 382486 181163 -285611 329188 458860 209247 620067 1387313 1427441 1244355 843776
978H43776j23824j43772O66855j174176k28643J18816M86847J86855q48551M77680
$$ 843776 719952 576180 1243035 68859 -159784 -40968 445879 632734 -215817 261863
968B61863N9772k22745L79492j271394k02518P69079p70798M16777M88803R6588
$$ 261863 321635 98890 478382 -793012 -995530 -226451 -997249 -580472 -91669 4919
958D919K35557K1492j5618l95093M77717k02634L0857o43777o8236L94563O97305
$$ 4919 240476 261968 246350 -148743 328974 126340 157197 -486580 -554816 -160253 537052
947E37052m83109j78806L32080L79708L98998p50345m43636o13092P06186L83357
$$ 537052 53943 -124863 207217 586925 985923 235578 -208058 -821150 -114964 268393
937B68393o05644o28333j24318Q29275J00785m01632j4721l25529N04657K42888
$$ 268393 -337251 -965584 -1089902 -260627 -159842 -561474 -576195 -901724 -397067 -154179
927a54179n45646K58419J302735k24399l36582l50908K48012J196716n94287j304322
$$ -154179 -699825 -441406 861329 636930 300348 -50560 197452 1394168 799881 -504441
917e04441q34577P19419L57495m07899O4448k02823O65104Q34861k87479n024
$$ -504441 -1339018 -619599 -262104 -670003 -605555 -808378 -143274 691587 404108 399084
907C99084j42544n46479K85099n77375P40794q9089j090439j26906R03506n45121
$$ 399084 256540 -289939 -4840 -582215 158579 69490 -1020949 -1147855 -244349 -789470
897g89470M60710K40330K97871o6723j418456R82307J288019r68993n20022l82250
$$ -789470 -328760 -88430 209441 142718 -1275738 -293431 994588 25595 -494427 -876677
887h76677L40745P64784l22498k04598r1094m21828P22768K96818m8375M4285
$$ -876677 -535932 228852 -93646 -298244 -389338 -811166 -88398 208420 160045 204330
877B04330j1103k70375r89040L89134O7705j96903M14397m84366K32773M97693
$$ 204330 193227 -77148 -1066188 -677054 -609349 -806252 -391855 -876221 -643448 -145755
867a45755k37324J041780m70095m01392K81384P5661J98320O3219K18807J34174
$$ -145755 -383079 658701 188606 -212786 68598 144259 342579 405798 624605 758779
857G58779N98819k47950p50086K13575J21185n4960n56795K22952p15807M5607
$$ 758779 1357598 1109648 359562 573137 694322 639362 82567 305519 -410288 -364681
847c64681J52013J012524n11156K1861K66596Q5645l7263M6868P73646p41449
$$ -364681 -212668 799856 288700 310561 577157 662802 625539 672407 1446053 704604
837G04604r7090q52966p4731M90022k76156J41020m63378N7318L25867n2681O32045
$$ 704604 607514 -245452 -320183 169839 -106317 34703 -428675 -371357 -45490 -98171 533874
826E33874J68051m45219P99731l31256n70714R78880o13805o85151R78099m16090
$$ 533874 701925 256706 1056437 725181 154467 1133347 519542 -165609 812490 396400
816C96400P83244J62564L43055k19960q59484J78739n40624K6660l91741L19855
$$ 396400 1179644 1342208 1685263 1465303 605819 784558 243934 270594 -121147 198708
806A98708l42014M44785o20355L72731m92461Q13288j49645p04845P21626j68654
$$ 198708 -143306 301479 -318876 53855 -438606 374682 225037 -479808 241818 73164
796G3164L00876L18755p24784j073414J047948J170532n47340o70176j91906Q73526
$$ 73164 374040 692795 -31989 -1105403 -57455 1113077 565737 -104439 -296345 577181
786E77181J98273j027173q59709J76347J386745J157360m20696l43223k91628
$$ 577181 775454 -251719 -1111428 -935081 451664 1609024 1188328 845105 553477
777E53477p122P3070r43722j28369J213645k49582p92442P77176J62016K58372
$$ 553477 546355 619425 -324297 -452666 760979 511397 -281045 496131 658147 916519
767I16519o39808j324191N67977j21681q61266M95942N69423k47117j03074m12197
$$ 916519 276711 -1047480 -479503 -601184 -1462450 -966508 -397085 -644202 -747276 -1159473
757a159473P33123M62819m85265J029376K17555J1118k57853L44154n27087k7150
$$ -1159473 -426350 36469 -448796 580580 798135 809253 551400 895554 368467 341317
747C41317k68919K30126j02915L99711M42527p46785L32247k89827m92617M4300
$$ 341317 72398 302524 199609 599320 1041847 295062 627309 337482 -155135 -110835
737a10835m77815K36649L58301n57067J30498J18368L33516N4191p43245N47311
$$ -110835 -588650 -352001 6300 -550767 -420269 -301901 31615 85806 -657439 -110128
727a10128k39058Q7721M4507M78098P74310p68323j56046J160752p23967L41731
$$ -110128 -349186 -261465 -216958 261140 1035450 267127 111081 1271833 547866 889597
717H89597J39676q66809J61331l09924l38799r5063j68607J03111Q9453J15055
$$ 889597 1029273 162464 323795 13871 -324928 -419991 -588598 -485487 -396034 -280979
707b80979m73663q82800Q41636M70364L39243j61475j74732J092282l62652l13667
$$ -280979 -754642 -1637442 -795806 -325442 13801 -147674 -322406 769876 407224 93557
697I3557N90262p92682K06768K88587p14752k59263R24976P27635p75472o26790
$$ 93557 683819 -108863 97905 386492 -328260 -587523 337453 1065088 289616 -337174
687c37174J173244M04900m80535J76703q66761q1924R95348l14258j14943j094433
$$ -337174 836070 1240970 760435 937138 70377 -11547 983801 669543 554600 -539833
677e39833J60361N38665q08624K5189L69298K98387N66939l75762L48301j5083
$$ -539833 -379472 159193 -649431 -624242 -254944 43443 610382 234620 582921 567838
667E67838K8005P94820j060733k57501L44287m40317N69868j05896k25278J96648
$$ 567838 595843 1390663 329930 72429 416716 -23601 546267 440371 215093 411741
657D11741j232961j44340J289535n74337M00833m05213L82888J08499n59521N77624
$$ 411741 -821220 -965560 323975 -250362 150471 -254742 128146 236645 -322876 254748
647B54748M36939m68837l02688M70795l24159J60782j57202l46529n85907Q67771
$$ 254748 691687 222850 -79838 390957 66798 227580 70378 -276151 -862058 5713
637E713q0810k31596Q41825n83995k71254m90126R66857r464j59511J79693J26482
$$ 5713 -75097 -306693 535132 -48863 -320117 -810243 156614 147150 -12361 167332 293814
626B93814j59380J76881K31711n34210L31914j76910J38512p8744O30179M88015
$$ 293814 134434 311315 543026 8816 340730 163820 302332 223588 853767 1341782
616A341782n71194l93060O08119n24462l29692j062332M06165Q10982k81936J85315
$$ 1341782 770588 377528 985647 461185 131493 -930839 -524674 286308 4372 189687
606A89687o22413N21186O27014r49871m9985N6415j43057K75342k28215K98350
$$ 189687 -432726 88460 715474 -234397 -284382 -227967 -371024 -95682 -323897 -25547
596b5547M71056K2615n37836q85116n0357L62166L79593l69863K57039O959J85785
$$ -25547 445509 468124 -69712 -954828 -1005185 -643019 -263426 -633289 -376250 -369291 -183506
585a83506J23614o85396J160315j44428K8562J196085o93792n03101K34906n16062
$$ -183506 -59892 -745288 415027 270599 299161 1495246 801454 298353 533259 17197
575A7197L81811N49953p82804O97461l63712j41184M63032q58942n8449J38784
$$ 17197 399008 948961 166157 863618 499906 358722 821754 -37188 -95637 43147
565D3147k19864O11514J40572K0233r43639j293670J108235M61474m86791j12462
$$ 43147 -176717 434797 575369 595602 -348037 -1641707 -533472 -71998 -558789 -671251
555f71251k8212M96508M52443j041086O81967k28524K35462o4409l80177M37317
$$ -671251 -699463 -202955 249488 -791598 -109631 -338155 -102693 -167102 -547279 -109962
545a09962J96978j01492n07779P72055n02478P76963L39246K11369m49706p35160
$$ -109962 87016 -14476 -522255 249800 -252678 524285 863531 1074900 625194 -109966
535a09966m59168r06342J85179Q03217L6268M39936P6739j37513L011o92945J31308
$$ -109966 -569134 -1475476 -1290297 -487080 -450812 -10876 65863 -71650 -68639 -761584 -630276
524f30276J51490J31508O23422k56607q82266r3460R21230N48462p9167r02395
$$ -630276 -478786 -347278 276144 19537 -862729 -956189 -34959 513503 434336 -468059
514d68059L56001M07090k01278J08873j44372k44998n5871K15683l0112p0443
$$ -468059 -112058 295032 93754 202627 58255 -186743 -242614 -26931 -57043 -127486
504a27486N20421K97284j432002l67533N91498L58968L0294J30240M5938q14103
$$ -127486 392935 690219 -741783 -1109316 -517818 -158850 -128556 1684 47622 -766481
494g66481N35142R36878k52005j01203j2042N93843j23551p06814l0068j50426
$$ -766481 -231339 705539 453534 352331 340289 934132 810581 103767 73699 -76727
484g6727m97247k70113O49259K95358K64517L40932o24974J62155L20943N50886
$$ -76727 -573974 -844087 -194828 100530 365047 705979 81005 243160 564103 1114989
474A114989p64427J46315j03553M74746r20349n76936K25475R39456L75282k56348
$$ 1114989 350562 496877 393324 868070 -52279 -629215 -403740 535716 910998 654650
464F54650k4157O7416Q1499n4857l67749J25541K51985p57893j21789L98214J224960
$$ 654650 630493 697909 779408 724551 356802 482343 734328 -23565 -145354 252860 1477820
453A477820o96082o71598o26495P9777J146446N09558J46940j446659o16561N3132
$$ 1477820 781738 110140 -516355 -436578 709868 1219426 1366366 -80293 -696854 -643722
443f43722N47242k66353l6163o71715j0244O01299m89953M84722m77857K65222
$$ -643722 -96480 -362833 -398996 -1070711 -1080955 -479656 -969609 -484887 -962744 -697522
433f97522l31481J87885Q40469L76639J0542l66093m34280k33073J098065J69067
$$ -697522 -1029003 -841118 -649 375990 386532 20439 -413841 -646914 451151 620218
423F20218n49431N12714j10557O46492j382985M5404R56192n8184k36832l20162
$$ 620218 70787 583501 472944 1119436 -263549 -218145 738047 679863 443031 122869
413A22869R9122o2298R73659p10317j649523J271375j31090j49172l8865k76468
$$ 122869 221991 159693 1133352 423035 -1226488 44887 -86203 -235375 -274240 -550708
403e50708J63927j41247l13535O65058j66511M22616P12462j286994q8318O83635
$$ -550708 -386781 -528028 -841563 -176505 -343016 79600 792062 -494932 -583250 100385
393A00385l53623l86813O76023K81054L22721m96675J30623P06188j108832n4823
$$ 100385 -253238 -640051 35972 317026 639747 143072 273695 979883 -128949 -183772
383a83772n71645o48319k6992P48853L23651p60097J26376Q73683p0315P46165
$$ -183772 -755417 -1403736 -1430728 -681875 -358224 -1118321 -991945 -118262 -188577 557588
373E57588k0900j186939M54853k38473L94358p12682L69205J102573k67371q73459
$$ 557588 536688 -650251 -195398 -433871 -39513 -752195 -382990 719583 452212 -421247
363d21247Q08086L30880L56789L49816j324937r5676N13294O77454k86539j591746
$$ -421247 386839 717719 1074508 1424324 99387 3711 517005 1194459 907920 -683826
353f83826m89876N10289O06182O51672J45191r37029J59683j25633J014919q2520
$$ -683826 -1173702 -663413 -57231 594441 739632 -197397 -37714 -163347 851572 769052
343G69052j409335O73609J64028r3835j61211M04766r1050p33446l6575o09234
$$ 769052 -640283 33326 197354 103519 -57692 347074 256024 -477422 -513997 -1123231
333a123231O19308P77356m30917r40865p6453O90969M24085m89105O95295J24538
$$ -1123231 -503923 273433 -157484 -1098349 -1174802 -483833 -59748 -548853 146442 270980
323B70980l47646N2834l83432K04039k67708q2734K35550M53025M30793M85730
$$ 270980 -76666 -23832 -407264 -203225 -470933 -553667 -318117 134908 565701 1051431
313A051431O0728l58754j46089l91350M96878l13250l24247O30087j13059J02163
$$ 1051431 1112159 753405 607316 215966 712844 399594 75347 705434 592375 694538
303F94538P8925n87400M46795Q7950n30892N77054p81852n32273N53844j42132
$$ 694538 773463 186063 632858 720808 189916 766970 -14882 -547155 6689 -135443
293a35443j10116M60789j77739O02116L16126m01503K0901K96439n10848n54861
$$ -135443 -245559 215230 37491 639607 955733 554230 575131 871570 360722 -194139
283a94139P72387n44375O22860K30521r13100J54490P07636K16819j106982k32511
$$ -194139 578248 33873 656733 887254 -25846 128644 836280 1053099 -53883 -286394
273b86394l430M26068k62141m7993N70779M11315R56502p13381j157843N44675
$$ -286394 -289824 136244 -125897 -173890 396889 808204 1764706 1051325 -106518 438157
263D38157J06941n60554j356430k708Q90023j80406N97962L89857o43924k40441
$$ 438157 545098 -15456 -1371886 -1374594 -484571 -664977 -67015 322842 -321082 -561523
253e61523N33461K20566R1438L14603r05680P00413p07976n99918L01068K73206
$$ -561523 -28062 192504 283942 598545 -307135 393278 -314698 -914616 -613548 -340342
243c40342l68307J07411n06451k64451J236357J241851j0003j236147l10402J07204
$$ -340342 -708649 -601238 -1107689 -1372140 -135783 1106068 1096065 -140082 -450484 -343280
233c43280J059562J92379k93186n04156n81681Q12445K87998m72767k99213m5489
$$ -343280 716282 908661 615475 111319 -470362 342083 630081 157314 -141899 -187388
223a87388l55872l93807J99172L88857L87240L10326k22368l85212l35394o7523
$$ -187388 -543260 -937067 -737895 -349038 38202 348528 126160 -259052 -594446 -661969
213f61969R36929K1875m83364K94501J65860O2980K25122N0196q96588J96470
$$ -661969 274960 296835 -186529 107972 273832 336812 561934 612130 -284458 -87988
203h7988m40465L40399M98010r39605l62630r88497R03107R41534p7710n21708
$$ -87988 -528453 -188054 309956 -629649 -992279 -1980776 -1077669 -136135 -213845 -735553
193g35553P97910M1246R44579l36365k01905m60256l83109K30406n72082j90300
$$ -735553 62357 103603 1048182 711817 509912 49656 -333453 -103047 -675129 -865429
183h65429K44353j86268j19618Q57713K51912k97848L00465m28005J38211L8633
$$ -865429 -621076 -807344 -926962 -69249 182663 -115185 185280 -242725 -104514 -65881
173f5881q27260L21544M40041k62074K15792M6543O84655O92702m26246j52371
$$ -65881 -893141 -571597 -131556 -393630 -177838 -131295 553360 1246062 819816 667445
163F67445M00007p25935N65727K17494j630861j182212n6301R11444J009940n27519
$$ 667445 1067452 341517 907244 1124738 -506123 -1688335 -1744636 -833192 176748 -350771
153c50771J12138j2989K44570P3157q12740k57338J14709N58989n30764k32117
$$ -350771 -238633 -251622 -7052 66105 -746635 -1003973 -889264 -330275 -861039 -1093156
$$ [...]
##END NTUPLES=NMR SPECTRUM
##END=
