##TITLE=1H_DE-80H_X3
 200.13MHz, d2o
 8 sc
 
 19ns.26.2.2025
##JCAMPDX= 6.0         $$ Bruker NMR JCAMP-DX V2.0
##DATA TYPE= NMR SPECTRUM
##DATA CLASS= NTUPLES
##ORIGIN= UXNMR, Bruker Analytische Messtechnik GmbH
##OWNER= pz
$$ XWIN-NMR		Version 3.5
$$ Mon Apr 20 10:26:26 2026 Russian Standard Time (UT+4h)  Yarkov@DPX200
##.OBSERVE FREQUENCY= 200.1313
##.OBSERVE NUCLEUS= ^1H
##.ACQUISITION MODE= SIMULTANEOUS
##.ACQUISITION SCHEME= undefined
##.AVERAGES= 8
##.DIGITISER RES= 18
##SPECTROMETER/DATA SYSTEM= spect
##.PULSE SEQUENCE= zg30
##.SOLVENT NAME= CDCl3
##.SHIFT REFERENCE= (INTERNAL, CDCl3, 0, 15.4263)
##AUDIT TRAIL= $$ (NUMBER, WHEN, WHO, WHERE, WHAT)
$$ ##TITLE= Audit trail, XWIN-NMR		Version 3.5
$$ ##JCAMPDX= 5.01
$$ ##ORIGIN= Bruker BioSpin GmbH
$$ ##OWNER= Yarkov
$$ C:/Bruker/XWIN-NMR/data/yarkov2/nmr/H-C/1/pdata/1/auditp.txt
$$ ##AUDIT TRAIL=  $$ (NUMBER, WHEN, WHO, WHERE, WHAT)
(   1,<2026-04-20 10:25:29.84 +0400>,<Yarkov>,<DPX200>,
      <created by zg, POWCHK disabled, PULCHK disabled
       configuration hash MD5:
       00 E9 B6 7A A2 85 ED C7 34 08 36 98 17 FE 4E 26
       data hash MD5: 16K
       B5 B4 C5 3A 40 63 C2 42 A0 E0 6C C2 D9 8D BC 06>)
(   2,<2026-04-20 10:25:35.39 +0400>,<Yarkov>,<DPX200>,
      <Start of raw data processing
       efp BC_mod = 2 LB = 0.25 FT_mod = 6 PKNL = 1 PHC0 = -5294.948 PHC1 = 6.821927 SI = 16K 
       data hash MD5: 16K
       AD B0 BB 54 32 A9 F8 88 96 CC B7 AA E4 7F 2E 4B>)
(   3,<2026-04-20 10:25:54.65 +0400>,<Yarkov>,<DPX200>,
      <pk PHC0 = -10.82319 PHC1 = 14.8 
       data hash MD5: 16K
       BA 7C 83 02 DB 87 35 49 35 7B 83 9E B6 C5 B1 29>)
$$ ##END=
$$ 
$$ hash MD5
$$ 09 20 C0 60 E7 1E 9B 6A CB BA B9 9E FB 3E 8E FF
##$RELAX= 
##$RELAX= 
##$RELAX= 
##$RELAX= 
##$RELAX= 
##$RELAX= 
$$ Bruker specific parameters
$$ --------------------------
##$DU= <C:/Bruker/XWIN-NMR>
##$EXPNO= 1
##$NAME= <H-C>
##$PROCNO= 1
##$TYPE= <nmr>
##$USER= <yarkov2>
##$AMP= (0..31)
100 100 100 100 100 100 100 100 100 100 100 100 100 100 100 100 100 100 
100 100 100 100 100 100 100 100 100 100 100 100 100 100 
##$AQSEQ= 0
##$AQ_mod= 1
##$AUNM= <au_zg>
##$AUTOPOS= <>
##$BF1= 200.13
##$BF2= 200.13
##$BF3= 200.13
##$BF4= 200.13
##$BF5= 200.13
##$BF6= 200.13
##$BF7= 200.13
##$BF8= 200.13
##$BYTORDA= 1
##$CFDGTYP= 0
##$CFRGTYP= 5
##$CHEMSTR= <none>
##$CNST= (0..31)
1 1 145 1 1 1 1 1 1 1 1 1 1 1 1 1 1 1 1 1 1 1 1 1 1 1 1 1 1 1 1 1 
##$CPDPRG= <>
##$CPDPRG1= <>
##$CPDPRG2= <>
##$CPDPRG3= <>
##$CPDPRG4= <mlev>
##$CPDPRG5= <mlev>
##$CPDPRG6= <mlev>
##$CPDPRG7= <mlev>
##$CPDPRG8= <mlev>
##$CPDPRGB= <>
##$CPDPRGT= <>
##$D= (0..31)
0 0.7 0 0 0 0 0 0 0 0 0 0.03 0 0 0 0 0 0 0 0 0 0 0 0 0 0 0 0 0 0 0 0 
##$DATE= 1776666329
##$DBL= (0..7)
120 120 120 120 120 120 120 120 
##$DBP= (0..7)
150 150 150 150 150 150 150 150 
##$DBP07= 0
##$DBPNAM0= <>
##$DBPNAM1= <>
##$DBPNAM2= <>
##$DBPNAM3= <>
##$DBPNAM4= <>
##$DBPNAM5= <>
##$DBPNAM6= <>
##$DBPNAM7= <>
##$DBPOAL= (0..7)
0.5 0.5 0.5 0.5 0.5 0.5 0.5 0.5 
##$DBPOFFS= (0..7)
$$ [...]
##$SUBNAM2= <"">
##$SUBNAM3= <"">
##$SUBNAM4= <"">
##$SUBNAM5= <"">
##$SUBNAM6= <"">
##$SUBNAM7= <"">
##$SUBNAM8= <"">
##$SUBNAM9= <"">
##$SW= 18.0517328524113
##$SWIBOX= (0..15)
0 0 2 0 0 0 0 0 0 0 0 0 0 0 0 0 
##$SW_h= 3612.71676300578
##$TD= 16384
##$TD0= 1
##$TE= 0
##$TE2= 300
##$TE3= 300
##$TEG= 300
##$TL= (0..7)
0 120 120 120 120 120 120 120 
##$TP= (0..7)
150 150 150 150 150 150 150 150 
##$TP07= 0
##$TPNAME0= <>
##$TPNAME1= <>
##$TPNAME2= <>
##$TPNAME3= <>
##$TPNAME4= <>
##$TPNAME5= <>
##$TPNAME6= <>
##$TPNAME7= <>
##$TPOAL= (0..7)
0.5 0.5 0.5 0.5 0.5 0.5 0.5 0.5 
##$TPOFFS= (0..7)
0 0 0 0 0 0 0 0 
##$TUNHIN= 0
##$TUNHOUT= 0
##$TUNXOUT= 0
##$USERA1= <user>
##$USERA2= <user>
##$USERA3= <user>
##$USERA4= <user>
##$USERA5= <user>
##$V9= 5
##$VALIST= <valist>
##$VCLIST= <CCCCCCCCCCCCCCC>
##$VD= 0
##$VDLIST= <DDDDDDDDDDDDDDD>
##$VPLIST= <PPPPPPPPPPPPPPP>
##$VTLIST= <TTTTTTTTTTTTTTT>
##$WBST= 1024
##$WBSW= 4
##$XGAIN= (0..3)
0 0 0 0 
##$XL= 0
##$YL= 0
##$YMAX_a= 201787
##$YMIN_a= -250026
##$ZGOPTNS= <>
##$ZL1= 120
##$ZL2= 120
##$ZL3= 120
##$ZL4= 120
##$ABSF1= 0
##$ABSF2= 0
##$ABSG= 0
##$ABSL= 0
##$ALPHA= 0
##$AQORDER= 0
##$ASSFAC= 0
##$ASSFACI= 0
##$ASSFACX= 0
##$ASSWID= 0
##$AUNMP= <proc_1d>
##$AZFE= 0.1
##$AZFW= 0.1
##$BCFW= 0
##$BC_mod= 2
##$BYTORDP= 0
##$COROFFS= 0
##$CY= -3
##$DATMOD= 1
##$DC= 0
##$DFILT= <>
##$DTYPP= 0
##$F1P= 0
##$F2P= 0
##$FCOR= 1
##$FTSIZE= 16384
##$FT_mod= 6
##$GAMMA= 0
##$GB= 0
##$INTBC= 1
##$INTSCL= 3.241238e-09
##$ISEN= 128
##$LB= 0.25
##$LEV0= 0
##$LPBIN= 0
##$MAXI= 10000
##$MC2= 0
##$MEAN= 0
##$ME_mod= 0
##$MI= 1.114404
##$NCOEF= 0
##$NC_proc= -7
##$NLEV= 6
##$NOISF1= 3.799351
##$NOISF2= 2.8
##$NSP= 0
##$NTH_PI= 0
##$NZP= 0
##$OFFSET= 15.42626
##$PC= 1
##$PHC0= -5305.771
##$PHC1= 21.62193
##$PH_mod= 1
##$PKNL= yes
##$PPARMOD= 0
##$PSCAL= 0
##$PSIGN= 0
##$REVERSE= no
##$SF= 200.130019100655
##$SI= 16384
##$SIGF1= 3
##$SIGF2= 2
##$SINO= 0.751879
##$SIOLD= 32768
##$SREGLST= <19F.Aceton>
##$SSB= 0
##$STSI= 16384
##$STSR= 0
##$SW_p= 3612.71676300578
##$SYMM= 0
##$S_DEV= 0
##$TDeff= 16384
##$TDoff= 0
##$TI= <>
##$TILT= no
##$TM1= 0
##$TM2= 0
##$TOPLEV= 0
##$USERP1= <user>
##$USERP2= <user>
##$USERP3= <user>
##$USERP4= <user>
##$USERP5= <user>
##$WDW= 1
##$XDIM= 16384
##$YMAX_p= 360211438
##$YMIN_p= -8360916
$$ End of Bruker specific parameters
$$ ---------------------------------
##NTUPLES= NMR SPECTRUM
##VAR_NAME=  FREQUENCY,     SPECTRUM/REAL,   SPECTRUM/IMAG
##SYMBOL=    X,             R,               I
##VAR_TYPE=  INDEPENDENT,   DEPENDENT,       DEPENDENT
##VAR_FORM=  AFFN,          ASDF,            ASDF
##VAR_DIM=   16384,         16384,           16384
##UNITS=     HZ,            ARBITRARY UNITS, ARBITRARY UNITS
##FACTOR=    0.220516191357247, 1,           1
##FIRST=     3087.25770735232, 0,            0
##LAST=      -525.459055653457, 0,           0
##MIN=       -525.459055653457, -8360916,    0
##MAX=       3087.25770735232, 360211438,    0
$$ Real data points
##PAGE= N=1
##DATA TABLE= (X++(R..R)), XYDATA
$$ [...]
5883A011177K06048L00643j51431k51012L3970m14849q1151k31265K9475n69718
5873a18113J17884k24245K59772j76048k44959L30686P34578K64274k146p09877
5863B31806K66241L98324K51427l91222j79182L75922M04161o42112l99125l23120
5853f880J19623l30581j23858L43373L81880K77628k71575P0931L27495j5329
5843G72707j07346m14421P7923Q27283n275l9808l01123K10839k42257m71590
5833C06932J21331K75890K81724L56858l43661J40793j8911j10984n30847k66770
5823B12355M76264j87346J08203J22849r7306M49330l89262m40699k70664K46769
5813B30493L96490L80863n9068n06253l07294L10846j48975J26644k77667j503
$$ plain form
5883 1011177 1217225 1517868 1366437 1115425 1149395 734546 653395 422130 451605 -118113
5873 -118113 -229 -224474 35298 -140750 -385709 -55023 679555 943829 941683 231806
5863 231806 498047 896371 1147798 756576 577394 953316 1357477 715365 316240 -6880
5853 -6880 112743 -217838 -341696 1677 383557 661185 389610 460541 788036 772707
5843 772707 665361 250940 328863 1156146 1150871 1111063 809940 1020779 778522 306932
5833 306932 428263 704153 985877 1342735 999074 1139867 1120956 1009972 479125 212355
5823 212355 688619 501273 609476 732325 635019 1084349 695087 254388 -16276 230493
5813 230493 626983 1007846 948778 442525 135231 446077 297102 423746 146079 144576
5803A44576k00273j8487O54300o905K60075R6023p8274J11852q9111J02142J43682
5792A119600q8124j35903l17293j20127j80176K27927J09015n33089K48217j74835
5782A55212p6751j48584N60536K43542J94940l60883L1288M27174J35048k42353
5772I19169l46407k9310K05293m0533k0276J12022n19919M12121l67802j06545
5762B17813K76214K09436l32634J42339L43895k57146Q2940J63205n00907r6313
5752B48842N7985J58325j56092K02937M27586J44903m04625l05881k83604L06719
5742C97095l65119l47716R1961N49553P7934q930l60549j76590L50194J49869
5732C57702k14820K49023N70946J09026K52732M5121P0774j8736m00420Q6722
$$ plain form
5803 144576 -55697 -74184 580116 573211 833286 929309 851035 962887 873776 975918 1119600
5792 1119600 1031476 895573 578280 458153 277977 505904 614919 81830 330047 155212
5782 155212 78461 -70123 490413 733955 928895 568012 599300 1026474 1161522 919169
5772 919169 572762 543452 748745 708212 687936 799958 280039 692160 324358 217813
5762 217813 494027 703463 370829 513168 857063 599917 682857 846062 345155 248842
5752 248842 306827 465152 309060 511997 939583 1084486 679861 373980 90376 397095
5742 397095 31976 -315740 -223779 325774 403708 394778 34229 -142361 207833 357702
5732 357702 142882 391905 962851 1071877 1324609 1369730 1440504 1421768 1021348 1108070
5722A108070m37452l50506J80370O46612M86154o32634l59131m26589J32647m5485
5712C02056L67522K47672M56043J22121q3555q47774K95732k41037k38725K32346
5702F12401K8330l46508k33184K58894L12726L20924l10852n82204L20933M30375
5692H11835J50536m17192j28428K93007L59124r5477n81520m80310N09233j28639
5682B92169j23695K93904L2196J03469J28945r865n13571O69096N9125L16171
5672A247944J6257r2801n5041o2613O245L4006j5975K5545M8070j58720j23405
5661H69512o24050J16320L39046j27389n50444L1859L30451j46987J48387o23012
5651b36307K07300Q73055j52979j93966k27831p4525K47041N21651j18074R735
$$ plain form
5722 1108070 670618 320112 500482 1147094 1633248 1000614 641483 214894 347541 302056
5712 302056 669578 917250 1373293 1495414 1411859 564085 859817 618780 380055 612401
5702 612401 640731 294223 61039 319933 632659 953583 642731 60527 381460 811835
5692 811835 962371 545179 416751 709758 1068882 973405 391885 -88425 420808 292169
5682 292169 168474 462378 494574 598043 726988 717123 203552 872648 931773 1247944
5672 1247944 1264201 1171400 1116359 1053746 1059991 1093997 1078022 1103567 1151637 992917 869512
5661 869512 245462 361782 700828 573439 22995 54854 385305 238318 386705 -236307
5651 -236307 -29007 844048 691069 497103 269272 194747 441788 963439 845365 855100
5641H55100L70803k60156p10247n9183M83703K62158l58103k54271K25844K11528
5631G67176K55748p90616Q0800P22385N478m05160J17946K930K76978K12143n74146
5620F71662j84307L43290j15274k41443J11484o8086m6425q3866P7632L31382
5610G96049n5692j32517m71267j37256M56659K46700N3316j25325l30712j44079
5600A55876J96991k79502J94347K95652K5308j379J22534n22442N04341M11260
5590A102986k26190L34161J512K74224n38079L5226j62896M59187m74893m33280
5580C71958L9098L52158P6536m27401j71106N45257j24289j15893k08395j9509
5570C18414M65061J67860q56773j46588K88488K3836p9731K1733k14069L89639
$$ plain form
5641 855100 1225903 965747 255500 196317 680020 942178 584075 329804 555648 767176
5631 767176 1022924 232308 313108 1035493 1040971 635811 753757 756687 1033665 1245808 671662
5620 671662 487355 830645 715371 473928 585412 517326 470901 387035 464667 796049
5610 796049 740357 607840 136573 -683 455976 702676 755992 630667 299955 155876
5600 155876 352867 73365 267712 563364 588672 587293 709827 187385 691726 1102986
5590 1102986 876796 1210957 1212469 1486693 948614 983840 820944 1280131 805238 371958
5580 371958 411056 763214 839750 412349 241243 786500 662211 546318 337923 318414
5570 318414 783475 951335 94562 -52026 236462 260298 180567 202300 -11769 377870
5560C77870K00193j703l83934j22846K64111O12935K49166l14654l09775k5850
5550E45513R56276n02990l59218l29079P5252L75439J11332k62550L29172Q9664
5540A028811k99566n24060j414J45436K04021k06692p6797J85064l58082o3533
5530C3188O39538l10155j26709o98407K21846J2061O49957K69951M87095k23105
5520I55260k86250o91376o2316P97771N38759n28144J71734J82492j09021o18445
5510C50464r0185K68135L09240j13644n83178M14869M08744M15661j65831l98311
5500H15964R0995j05742J29745k25364J43908K23053k42396O9339K23636M0300
5490A163438m25587m59854L56206J87022J28911q6093K0193N60601j34913l18969
$$ plain form
5560 377870 578063 576360 192426 69580 333691 946626 1195792 881138 571363 545513
5550 545513 1501789 998799 639581 310502 385754 761193 872525 609975 939147 1028811
5540 1028811 729245 205185 203771 349207 553228 346536 269739 454803 96721 33188
5530 33188 672726 362571 235862 -462545 -240699 -228638 421319 691270 1178365 955260
5520 955260 669010 -22366 -84682 713089 1251848 723704 895438 1077930 968909 350464
5510 350464 260279 528414 837654 724010 140832 555701 964445 1380106 1214275 815964
5500 815964 906959 801217 930962 705598 849506 1072559 830163 899502 1123138 1163438
5490 1163438 737851 277997 634203 821225 950136 864043 884236 1444837 1309924 990955
5480I90955p59105q4088N23492N71250m30023L80773K47807J26410p40043J85346
5470A012774R694M22070j76316k85762m13918J72367m47477J8879n6955K55964
5460E11320l50853n31700M0432K49723M68698K65616M24564M66627k43830q02686
5450D97911J39514M16044K38824k46519J48189l25299o4281o2024q38630n9125
5440a55396P208M70549j72183N82232K15346M48691k41911J39783K06427j75911
5430A324835k84562L07759L00449m22900k71029j91581N48951l3680m2399q74423
5420C61420j02027M4514K87892j29268M28421K93397o1021j11082l53003o2517
5410E96726J49197M8363K6450P8675m48593m4712L90137K44442k81309l83735
$$ plain form
5480 990955 231850 147762 671254 1242504 812481 1193254 1441061 1567471 827428 1012774
5470 1012774 1022468 1444538 1268222 982460 568542 740909 293432 312311 255356 511320
5460 511320 160467 -371233 -330801 -81078 387620 653236 1077800 1544427 1300597 497911
5450 497911 637425 1053469 1292293 1045774 1193963 868664 804383 742359 -96271 -155396
5440 -155396 -148188 322361 150178 732410 947756 1396447 1154536 1294319 1500746 1324835
5430 1324835 1040273 1348032 1648481 1225581 954552 762971 1311922 1278242 1235843 361420
5420 361420 259393 303907 591799 462531 890952 1184349 1123328 1012246 659243 596726
5410 596726 745923 794286 820736 899411 450818 406106 796243 1040685 759376 375641
5400C75641J69541M6776K67277K38262R329N3300K46443r0395l98871j38415P66344
5389A545232J61009K2072l83656K52931M22820J8869j77749j27719J27261K48439
5379B109509k50426L85614Q6550P53414K9092l40489k16115j45168L19571P9948
5369B811500O9375K35879p3665J20191l55414k55358K52453j38571M18402o0882
5359C023910K11754j67246L62993j22996k80630k37250j14668M5861N61194N9242
5349C342164J06759j77498k29063n54710k05160J61703L13605K3710K09445r0438
5339B900517k68043j21096Q3201m783k54278m14959l66082M34264M10747J97731
5329B597219m3522j3285m24189k18473o73410N1339O45701M04716m02354l90037
$$ plain form
5400 375641 545182 591958 859235 1097497 1106826 1160126 1406569 1316174 917303 778888 1545232
5389 1545232 1706241 1728313 1344657 1597588 2020408 2039277 1861528 1733809 1861070 2109509
5379 2109509 1859083 2244697 2331247 3084661 3113753 2773264 2557149 2411981 2731552 2811500
5369 2811500 2880875 3116754 3043089 3163280 2807866 2552508 2804961 2666390 3084792 3023910
5359 3023910 3235664 3068418 3431411 3308415 3027785 2790535 2675867 2721728 3282922 3342164
5349 3342164 3448923 3271425 3042362 2487652 2282492 2444195 2757800 2781510 2990955 2900517
5339 2900517 2632474 2511378 2594579 2589796 2335518 1920559 1554477 1988741 2399488 2597219
5329 2597219 2553697 2540412 2116223 1897750 1224340 1275679 1921380 2326096 1923742 1533705
5319A533705L2794k84338m94532p7610L34855k41784l02481K98892K06683k154
5309A004030k99511R2138J10081K9710m71035M02634K47748O25625j25181n913
5299A610326m74661M04873n65051n34618m66333J62233L47060r9306K70407K46125
5289I01055m8811l65401n8845j27543P50383r8009K43971K14369M57577l59838
5279A508908m38764m10535j66528J26823l59027j60075k72801j75706L12590L93598
5269C58483J94015L2474M1035L22416j2272l6766J35102n8078M94632r8993j91746
5258A180302p67276P7714k37458J70462K66264J87711l06383K27017j21144N13534
5248A190743m4299j35875l98454N62558K54291k7582j79474j78042O8463N9062
$$ plain form
5319 1533705 1566499 1282161 787629 710019 1044874 803090 500609 799501 1006184 1004030
5309 1004030 704519 796657 906738 936448 465413 868047 1115795 1741420 1616239 1610326
5299 1610326 1135665 1540538 975487 440869 -25464 136769 483829 384523 654930 901055
5289 901055 852244 486843 427998 300455 1050838 952829 1196800 1411169 1868746 1508908
5279 1508908 1070144 659609 493081 619904 260877 100802 -171999 -347705 -35115 358483
5269 358483 552498 584972 626007 948423 936151 899385 1034487 976409 1471041 1372048 1180302
5258 1180302 413026 490740 253282 423744 690008 877719 571336 798353 677209 1190743
5248 1190743 1146444 1010569 612115 1174673 1428964 1401382 1221908 1043866 1112329 1171391
5238A171391j88150n05772J36232J4825l2534K04557J39789N0816J28912J90751
5228A310817k66353o22157m59804L91916N89294M76130l51330l70655k9635K48143
5218I16366l97418k80033K24207J87291K79736j82868l5589J72647Q5523m48995
5208E20867n6873o8059L16932j71729J5242K7524K07619m0399j02230J00935M73334
5197A223163k11034J96074k88060k4050J21682J62124p4214l79863k68665l09912
5187A47245j30379K56462K22254M61821n5248m6056m7824L14202l6479J48198
5177A234196K12620K03299o30628M24736j51128k34070k99891K10244p958l32095
5167F29325m7037p78958J58549L61942M21320M3054K02375K82157j9249l09532
$$ plain form
5238 1171391 983241 477469 613701 628526 595992 800549 940338 991154 1120066 1310817
5228 1310817 1044464 422307 -37497 354419 943713 1419843 1068513 697858 668223 916366
5218 916366 518948 238915 463122 650413 930149 747281 711692 884339 969862 520867
5208 520867 463994 395935 712867 541138 556380 583904 791523 751124 648894 749829 1223163
5197 1223163 1012129 1208203 920143 896093 1017775 1179899 1105685 725822 457157 147245
5187 147245 16866 273328 495582 957403 902155 856099 808275 1122477 1085998 1234196
5177 1234196 1446816 1650115 1019487 1444223 1293095 1059025 759134 969378 961420 629325
5167 629325 582288 -196670 -38121 323821 745141 788195 990570 1272727 1253478 943946
5157I43946r2017K52843j85256k62999J32047M81970m4937j02922m21166O4023
5147G65532J3431L5935l72495K81240M57894K96730m33643l53761J06455K05061
5137A002379K14125o0321J06870k54310l32704l44996J10492N42637L03014m0945
5127A246241n44893l74035P09840L65987J17800l68456m8672j61937j34971J78412
5117I85316J244N4359P92446k45433o67110m53194L72686J6875l9794M4831l09457
5106E52769J80626J82724J64194J17516q93730J58966K20244N75689m52920R2404
5096H98482J78347j56112n70558M1952N5073L70800M51139L99585m21047n0441
5086A197220k2944q1728L59145k67322Q458J35388J23173m5475l06322P744M09538
$$ plain form
5157 943946 851929 1104772 919516 656517 788564 1270534 1225597 1122675 701509 765532
5147 765532 778963 814898 442403 723643 1181537 1478267 1044624 690863 797318 1002379
5137 1002379 1216504 1156183 1263053 1008743 676039 331043 441535 984172 1287186 1246241
5127 1246241 701348 327313 1037153 1403140 1520940 1152484 1103812 941875 806904 985316
5117 985316 986560 1040919 1833365 1587932 920822 467628 840314 857189 817395 862226 552769
5106 552769 733395 916119 1080313 1197829 304099 463065 683309 1258998 806078 898482
5096 898482 1076829 920717 350159 392111 447184 817984 1269123 1668708 1247661 1197220
5086 1197220 1174276 1092548 1451693 1184371 1192829 1328217 1451390 1405915 1099593 1107337 1516875
5075A516875M68597p36022m79415j36443K09316L3917L62806J79657J37005k80232
5065A276061m20682j56976m53775M08761K55505L96903J79777k19768j01227L58655
5055A523234K30006O9455n27312K04605M64684M85915n03783j08672J57583r87386
5045A008329n48302L51363N32454K38746o41270j9463l214J92135j96111k2195
5035H92472K23112N21899n6033n84517L51218M82004j71696n1543o37640n31039
5025D38237k91923J84898N87233J97998l15057J83144L46813l26965m16366O39690
5015A227702j18815K40030k36013j3349K00136k20040j34038m1342K82629M06310
5005A593210j9884n85947j02554N58074j06869k72586J28982R80426l2650q45001
$$ plain form
5075 1516875 1985472 1249450 770035 633592 842908 876825 1239631 1419288 1556293 1276061
5065 1276061 855379 698403 244628 653389 908894 1305797 1485574 1265806 1164579 1523234
5055 1523234 1753240 1822695 1295383 1499988 1964672 2450587 1946804 1838132 1995715 1008329
5045 1008329 460027 811390 1343844 1582590 941320 921857 918643 1110778 914667 892472
5035 892472 1115584 1637483 1581450 996933 1348151 1830155 1658459 1606916 969276 438237
5025 438237 146314 331212 918445 1116443 801386 984530 1331343 1004378 588012 1227702
5015 1227702 1108887 1348917 1112904 1099555 1299691 1079651 945613 904271 1186900 1593210
5005 1593210 1573326 987379 884825 1442899 1336030 1063444 1192426 2172852 2140202 1295201
4995A295201r4124L50709k35403q7960M1798l89757K4475L42758Q160l41315K69670
4984A184212N5012O9807m71556P40849K70472n0231k98082J57186J97055l16248
4974A538476J87160k29806k17678J00055j0270J9459k65287R38147n0036j363251
4964F46969l77692M15132P96461L52375J59176j11991l07484J63842k97912P5483
4954A514359k16604M36998M63276m24477K32125K88143O81242L03859n7546j7585
4944C203790j97918O82056N86205J9969m5953K28120k5770j111718R5663O1534
4934C495978j98214l23153K93432N05828J97425l67182k46753m3200R227K07399
4924C530787P46252K68843M96971J384047M75889M10268L05847J145536K01540
$$ plain form
4995 1295201 1201077 1551786 1316383 1228423 1270221 880464 904939 1247697 1255857 914542 1184212
4984 1184212 1239224 1309031 837475 1578324 1848796 1798565 1500483 1657669 1854724 1538476
4974 1538476 1725636 1495830 1278152 1378207 1367937 1387396 1122109 2060256 2010220 646969
4964 646969 269277 684409 1480870 1833245 1992421 1880430 1572946 1736788 1438876 1514359
4954 1514359 1297755 1734753 2198029 1773552 2005677 2293820 2975062 3278921 3221375 3203790
4944 3203790 3005872 3687928 4274133 4294102 4248149 4476269 4450499 3338781 3434444 3495978
4934 3495978 3297764 2974611 3268043 3773871 3971296 3604114 3357361 3314161 3323388 3530787
4924 3530787 4277039 4545882 5042853 6426900 6902789 7313057 7618904 8764440 8965980
4915H965980K19956P24871P99974j01663J5342k50306r11802r77916p78314p86475
4905F919647r9632j40883J0124j66792J01138N47844M52693n52626p70503j92064
4895F108946j06139J52402J9446Q08449P18612P8064o6800L01758O23044R30505
4885I568287M54728k6420r0573K64458o5173O0768l18818m26134J03973l57010
4875I168086P8967M66161P03487Q99279N04497N95048J179757J167571J018516
4866A5781369J494746J316548Q92376k44377k94823o73099p73645r59281j599760
4857A4940054j338648q13757K32183J58016K74269R71906O39911Q65971R61558
4848A6891463N38172J059765J411461O66289K25814n44098j016451j510918j124195
$$ plain form
4915 8965980 9185936 9910807 10710781 10609118 10624460 10374154 9462352 8484436 7706122 6919647
4905 6919647 6820015 6679132 6689256 6522464 6623602 7171446 7624139 7071513 6301010 6108946
4895 6108946 6002807 6155209 6174655 6983104 7701716 7779780 7712980 8014738 8637782 9568287
4885 9568287 10023015 9996595 9906022 10170480 10105307 10166075 9847257 9421123 9525096 9168086
4875 9168086 9247053 9713214 10416701 11315980 11820477 12415525 13595282 14762853 15781369
4866 15781369 17276115 18592663 19485039 19240662 18945839 18272740 17499095 16539814 14940054
4857 14940054 13601406 12787649 13019832 13177848 13452117 14424023 15063934 15929905 16891463
4848 16891463 17429635 18489400 19900861 20567150 20792964 20248866 19232415 17721497 16597302
4839A6597302j230979j585839p74934p21688p54521j163253j91140K22325K4379
4830A0421652q4748P3271O27958R16374O68766J96213P68499K71217K82451j9912
4820A4121741M44512M15244N53072N19122K84666K20911O86089R15408J140537
4811A9301302J112691O86932Q42645O89849P69290n73050n80044q81398q19517
4802B0548700r16371m53125J79549L50810k09332J99870L62884N03160J003771
4793B1569916J478538K029121J964619J967477J239887J14947J16623j043301
4785B9437827j801204k271566k055273j663367j660905q25103o75982j36783K82095
4776A8629739N62671N22693J023905J464995J488013P55379Q68022O76890K18615
$$ plain form
4839 16597302 15366323 13780484 13005550 12283862 11529341 10366088 10174948 10397273 10421652
4830 10421652 10336904 10410175 11038133 11954507 12623273 12819486 13587985 13859202 14141653 14121741
4820 14121741 14566253 14981497 15534569 16053691 16338357 16559268 17245357 18160765 19301302
4811 19301302 20413993 21100925 21943570 22633419 23402709 22829659 22249615 21368217 20548700
4802 20548700 19632329 19179204 19358753 19709563 19500231 19700101 20062985 20566145 21569916
4793 21569916 23048454 25077575 27042194 29009671 30249558 30364505 30481128 29437827
4785 29437827 27636623 25365057 23309784 21646417 19985512 19160409 18484427 18347644 18629739
4776 18629739 19192410 19715103 20739008 22204003 23692016 24447395 25315417 25992307 26210922
4767B6210922j685517k010816j382769r28296j439699j155292j061268j26057
4759A6421208J25222l10197o85726l44939K67359k04059k94492L03251N26464
4750A5804091j34168m60922n51395k471m0005L916j47438m59161l43357M3375
4740A3712465M31050J50632M82052Q60709Q46298P40631J32999J07208j13631
4731A7350413Q8439o15308j684471j605780r98330j30505n68646j73815O84839
4722A2346836R83486M58516N16050Q60864J01788J72813j01870m24801o48483
4713A4265199p52274j84326k11064m27631L5112j44022Q06774N89635M81475K6035
4703A4484913o3182O0595o54772q16124r97781l75304o58712p61365m32918j35573
$$ plain form
4767 26210922 24525405 22514589 21131820 20203524 18763825 17608533 16547265 16421208
4759 16421208 16546430 16236233 15550507 15205568 15472927 15268868 14974376 15277627 15804091
4750 15804091 15669923 15209001 14657606 14655135 14615130 14619046 14471608 14012447 13669090 13712465
4740 13712465 14143515 14294147 14776199 15636908 16483206 17223837 17356836 17464044 17350413
4731 17350413 17438852 16823544 15139073 13533293 12534963 12404458 11835812 11661997 12346836
4722 12346836 13330322 13788838 14304888 15165752 15267540 15440353 15338483 14913682 14265199
4713 14265199 13512925 13328599 13117535 12689904 12725016 12580994 13387768 13977403 14458878 14484913
4703 14484913 14421731 14482326 13827554 13011430 12013649 11638345 10979633 10218268 9785350 9649777
4693I649777n4064K08457K83801j01066R9896N44817J087173N53498J231634R65431
4683A4469354J400084N63644N77213M23506O00552L93575K09876j23534o0809
4674A8453461K18510o4255m7210N15506J503930J522596J364356J410304J400550
4665B6277748J706527J806157O18912m81617o73738r06472j392202k252266k133973
4656B2569076j358371o30798q06491j162689l50282O49812N37871L25659K60497
4647B0034284L57140L67799j95509p82939P7220Q42538M95420J41037L05764P91656
4637B2434410k0906r17755j266270m17742J80368P81926Q56141R48152J445866
4628B4024190J857513L20053k25712r52770o01200j188756j829632j204527j130502
$$ plain form
4693 9649777 9595713 9804170 10087971 9986905 10086801 10631618 11718791 12272289 13503923 14469354
4683 14469354 15869438 16433082 17010295 17433801 18034353 18427928 18637804 18514270 18453461
4674 18453461 18671971 18607716 18560506 19076012 20579942 22102538 23466894 24877198 26277748
4665 26277748 27984275 29790432 30409344 29927727 29253989 28347517 26955315 24703049 22569076
4656 22569076 21210705 20579907 19773416 18610727 18260445 18910257 19448128 19773787 20034284
4647 20034284 20391424 20759223 20563714 19780775 19857995 20700533 21195953 21336990 21642754 22434410
4637 22434410 22413504 21495749 20229479 19811737 19992105 20774031 21630172 22578324 24024190
4628 24024190 25881703 26201756 25976044 25023274 24422074 23233318 21403686 20199159 19068657
4619A9068657p74059p11722j75663J51270k77742L96174J96668J082928O63707
4610A9620218O19704L72871L98826R2909q51197j696508j186365j029623n78995
4601A5761840j066744n03715k04997k70918p99754n51725K97018O33252J041371
4592A4335628R03387L92401P30856J074626N21375J99419M981n9068l55794j92613
4582A7555198j139804n56641O0817N93931K67696r1410N16970Q13863J039675
4573A9060295P02981N41804N18449J5343n61270m60949J56359J24736K97721N27247
4563B0922716N74772M84642M85935l41885j08196n58026m71555m21353L06189
4554B0873239l8307N202p4922K05642J996j38261j92783R476J94328l64166p39157
$$ plain form
4619 19068657 18294598 17582876 17407213 17558483 17280741 17676915 17873583 18956511 19620218
4610 19620218 20239922 20612793 21011619 21104528 20253331 18556823 17370458 16340835 15761840
4601 15761840 14695096 14191381 13986384 13715466 12915712 12363987 12661005 13294257 14335628
4592 14335628 15239015 15631416 16362272 17436898 17958273 18157692 18162673 18103605 17747811 17555198
4582 17555198 16415394 15858753 15919570 16513501 16781197 16689787 17206757 18020620 19060295
4573 19060295 19763276 20305080 20823529 20838872 20277602 19816653 19973012 20097748 20395469 20922716
4563 20922716 21497488 21982130 22468065 22126180 22017984 21459958 20988403 20567050 20873239
4554 20873239 20834932 20840134 20765212 20970854 20972850 20834589 20641806 20651282 20845610 20481444 19742287
4543A9742287j041227p52572q68485n67008m09990o6178O2159P62101L27659R15941
4533A8104687J501821J437600J030687L2902k56974p576J22456l05021J05066
4524B1765648J76649J92972p44052n32609j025312p2597l02437m31750o52437
4515A8374075k24811J99775j57736m39602p8130l81439n62791m36340r93926l88149
4505A4910926m97873k29433p07497n21356n85144o12864l2923l53783m82160j84515
4495A0703378k2435O6354M84952K38160L08640J56093N38544M19027M59111O27101
4485A3978925m6772m22819j211825j444764r19143j71283p09067o55697k53297
4476H144258o8750q25404l68856r18440J22819K39240j77766l23376k35425k3419
$$ plain form
4543 19742287 18701060 17948488 17080003 16512995 16103005 16036827 16098986 16861087 17188746 18104687
4533 18104687 19606508 21044108 22074795 22107697 21850723 21843147 21965603 21660582 21765648
4524 21765648 21942297 22135269 21391217 20858608 19833296 19760699 19458262 19026512 18374075
4515 18374075 18149264 18349039 18191303 17751701 17673571 17292132 16729341 16293001 15299075 14910926
4505 14910926 14413053 14183620 13476123 12954767 12369623 11756759 11723836 11370053 10887893 10703378
4495 10703378 10680943 10747297 11232249 11470409 11779049 11935142 12473686 12892713 13351824 13978925
4485 13978925 13932153 13509334 12297509 10852745 9933602 9762319 9053252 8397555 8144258
4476 8144258 8075508 7250104 6881248 5962808 6085627 6324867 6147101 5823725 5588300 5564881
4466E564881J76510l24872j42555n0327J91653j01813m69970K08198J19082M10986
4456E581773p2028J615n17578j26863P8935L484m10157M39103J34294J69219n45436
4445D736361p18398R4240J59706p3469L3442L39058J19209j75006K3702K4305
4435D563150j64017J32320J48526K70919J45074k93542n40434p1120n168P5355
4425D261063J63103K89626L4646L50871K16057L3001J39987P19202P37733Q01802
4415G747091n80168r66116m28542J36846l05473o98580n30470k1563j39709l5218
4405D178098m28077M35873O91282k92302j151546o39292N37400K05563k75099
4396C261900l97724L35276N45627l0326p46434J72651M44235K47165j66593m59094
$$ plain form
4466 5564881 5741391 5416519 5273964 5223637 5415290 5313477 4843507 5051705 5170787 5581773
4456 5581773 5509745 5511360 4993782 4866919 4945854 4949338 4539181 4978284 5112578 5281797 4736361
4445 4736361 4017963 4112203 4271909 4198440 4231882 4570940 4690149 4515143 4538845 4563150
4435 4563150 4399133 4531453 4679979 4950898 5095972 4802430 4261996 4190876 4185708 4261063
4425 4261063 4424166 4713792 4748438 5099309 5315366 5348367 5488354 6207556 6945289 7747091
4415 7747091 7166923 6200807 5772265 5909111 5603638 4905058 4374588 4353025 4213316 4178098
4405 4178098 3750021 4185894 4877176 4584874 3433328 2794036 3331436 3536999 3261900
4396 3261900 2864176 3199452 3745079 3714753 2968319 3140970 3585205 3832370 3665777 3206683
4386C206683N97542M94415J89994j022331o27344j14712K23769l5030L16706j42876
4376C086816N8465j55143K00050L3869K39k3932j76036N57012m26416j01202L27968
4365C381690L14166l09501m64338m55467K28247o9208J99896l65551J84219L90232
4355C034385O0014J02755J35860Q4488O1491k50005L28450N6518K53518m09523
4345C457951N9869K83291p466m82388K77871j03196J44401n7743K32968n083J41866
4334C942341O581j92831m43629K758J72483L32565j17381k3849k15052J92864
4324C656850o8823Q7830n7883P4357J45429J65679R2382J6262O11905l60611M113
4313D367490o86292k20569m76853L25254L91411N86576j55506r8288M39496P35318
$$ plain form
4386 3206683 3804225 4298640 4488634 3466303 2838959 2724247 2948016 2912986 3229692 3086816
4376 3086816 3145281 2990138 3190188 3224057 3224296 3200364 3024328 3581340 3154924 3053722 3381690
4365 3381690 3695856 3386355 2922017 2466550 2694797 2625589 2825485 2459934 2644153 3034385
4355 3034385 3094399 3197154 3333014 3417502 3478993 3228988 3557438 3613956 3867474 3457951
4345 3457951 3517820 3801111 3793645 3311257 3589128 3485932 3630333 3572590 3805558 3800475 3942341
4334 3942341 3948922 3756091 3312462 3315220 3487703 3820268 3702887 3679038 3463986 3656850
4324 3656850 3588027 3675857 3617974 3692331 3837760 4003439 4095821 4112083 4723988 4363377 4367490
4313 4367490 3681198 3460629 2983776 3309030 3700441 4287017 4131511 4033223 4472719 5208037
4303E208037K24011j38629K6975O82268N12683l18710l61730k55780K13507O6192
4293E858824l73598m9447O42244M24308q7670R0393n93702M26190L22147M13564
4283G073253J46115K31746K07757J38606M23626m3250p30617k83809K13443L458
4273G380328o56274K93134M23232J68224K10379l84932m93553m9052q3174P8251
4263F886563j88974K05700p3105M5164k65756M7927j32892k3797L55529K33935
4253G090294J76229j98053L25037K80193O493l02105m1479L78795K6299K63244
4243H004947N24180k0208N47275m12000j62129p0999Q7909J61279J25657M23407
4233I209318N07526M76858M77349m94240o5836l75981j35239j58175P4304K22214
$$ plain form
4303 5208037 5432048 5293419 5320394 6002662 6515345 6196635 5834905 5579125 5792632 5858824
4293 5858824 5485226 5435779 6078023 6502331 6414661 6505054 5911352 6337542 6659689 7073253
4283 7073253 7219368 7451114 7658871 7797477 8221103 8177853 7447236 7163427 7376870 7380328
4273 7380328 6724054 7017188 7440420 7608644 7819023 7434091 6940538 6891486 6808312 6886563
4263 6886563 6697589 6903289 6830184 6875348 6609592 6657519 6524627 6500830 6856359 7090294
4253 7090294 7266523 7068470 7393507 7673700 7680193 7378088 7336609 7715404 7741703 8004947
4243 8004947 8529127 8508919 9056194 8644194 8482065 8411066 8498975 8660254 8785911 9209318
4233 9209318 9716844 10193702 10671051 10176811 10110975 9734994 9599755 9441580 9515884 9738098
4223I738098L14918L22221m90072n65342j41961j43049k24321j78984l65084J06168
4213H372592R14389m1634n14361k5516j7627j38411l95387m61019n70982K31907
4203G353951O735l85970j69187j65535m67767l00299n37536P24755K86687N82791
4193F928625l23706n8930K2189m08504J69756L53764K78943k04233j76760k33604
4183F347540j03565J98891J93641m02917J04771m38152k49022R0140O45566N25065
4173F911958J19317n05855n21681p2050K26362j9133r5043k64801k13213L08347
4163E874208L90479m47864q4615j22852k35910l12219j21313J68012J66693M3118
4153E317737o44360q21171M44354J17752k98722j60300N7255l39545j00244k94199
$$ plain form
4223 9738098 10053016 10375237 9885165 9319823 9177862 9034813 8810492 8631508 8266424 8372592
4213 8372592 9286981 9245347 8730986 8705470 8687843 8549432 8154045 7693026 7122044 7353951
4203 7353951 7360686 6974716 6805529 6639994 6172227 5871928 5334392 6059147 6345834 6928625
4193 6928625 6604919 6545989 6568178 6159674 6329430 6683194 6962137 6757904 6581144 6347540
4183 6347540 6243975 6442866 6636507 6233590 6338361 5900209 5651187 5741327 6386893 6911958
4173 6911958 7031275 6525420 6003739 5931689 6158051 6138918 6043875 5779074 5565861 5874208
4163 5874208 6264687 5816823 5732208 5609356 5373446 5061227 4939914 5107926 5274619 5317737
4153 5317737 4673377 3852206 4296560 4414312 4115590 3955290 4012545 3673000 3572756 3278557
4143C278557L18716K55582N65525l32918K98447q8759K03578O57221K45253J69192
4133E570394L76350Q20915O05316K14757J75400L99846j43006p02447j635300
4124E682225j139348o90412k05049l7297K65671K07092j43657j79489p09097l38986
4114B711653L33057P3786j63741k76513k34175j40147J69854l00367M48931P0496
4104B692834K94150k05590K4439J98477L5273k55448K93449p60507J41061P7681
4094B535819L72997o12036j7486j45004J48060K09745j38889L43861R09841k78176
4084C328732q7744l12080P00412M82364J34914k02116l19092L87220P6803n934
4074D183479l5703k17756n03903j97954L8695K33818J52215K96872l7187j89836
$$ plain form
4143 3278557 3597273 3852855 4418380 4085462 4383909 4295150 4498728 5155949 5401202 5570394
4133 5570394 5946744 6767659 7372975 7587732 7763132 8162978 8019972 7317525 5682225
4124 5682225 4542877 3852465 3647416 3610119 3875790 4082882 3939225 3759736 3050639 2711653
4114 2711653 3044710 3118496 2954755 2678242 2444067 2303920 2473774 2173407 2622338 2692834
4104 2692834 2986984 2781394 2805833 3004310 3039583 2784135 3077584 2317077 2458138 2535819
4094 2535819 2908816 2296780 2279294 2134290 2282350 2492095 2353206 2697067 3606908 3328732
4084 3328732 3240988 2928908 3629320 4111684 4246598 4044482 3725390 4112610 4189413 4183479
4074 4183479 4147776 3930020 3426117 3228163 3266858 3500676 3652891 3949763 3912576 3722740
4064C722740l81744k99303l44629M13339J76031M68650j79819l20845J64968J50582
4054C569970j22793l13593m31811N28197J07674L25980m43371q8730J87627J79690
4044C498840m60036o61733j478K41399j84276J49450k68500k88975k84912L33580
4034B073359M9975K89633L49756M00261J74990r2607J5402k44026n9421n74622
4024B382700j92449j86327J40599J85696J94814m3429m40557m54801L33125J51986
4014B071357L76068l9468j33942M91369j27319K69335l52110O40705M13040j41052
4004C467983p72536l49004L14826L27478J94554K22829K86284o5518l15817L0632
3994C341711R9487o6925j38499k00831j50153L6751K43217k32381J5429J72389
$$ plain form
4064 3722740 3340996 3041693 2697064 3110403 3286434 3755084 3575265 3254420 3419388 3569970
4054 3569970 3447177 3133584 2701773 3229970 3337644 3663624 3220253 3131523 3319150 3498840
4044 3498840 3038804 2377071 2375593 2616992 2432716 2582166 2313666 2024691 1739779 2073359
4034 2073359 2123334 2412967 2762723 3162984 3337974 3245367 3260769 3016743 2957322 2382700
4024 2382700 2190251 2003924 2144523 2330219 2525033 2481604 2041047 1586246 1919371 2071357
4014 2071357 2447425 2407957 2274015 2765384 2638065 2907400 2555290 3195995 3609035 3467983
4004 3467983 2695447 2346443 2661269 2988747 3183301 3406130 3692414 3626896 3311079 3341711
3994 3341711 3441198 3374273 3235774 3034943 2884790 2921541 3164758 2932377 2947806 3120195
3984C120195j07478J67257n6970J41971k39323P63813M76572n35959o56842l91370
3974B681866P27192L88859l74163l42146p2978M10962k49896J41358k97318K32132
3964C245868L32600j30794K91272L66242L97138k27439L27609m06017o35461j66855
3954C394163O48462L3144M3665J05352M69205j71685K86063j24780N42895L8306
3944E264790k55996O2877j13172L94202K90634P87472R6244O8628L44257R7578
3934G037514L32219L91337N81193K0025L51455M10162K30665j05064N57441n2829
3924I754118N0831k08500M569m14470j21285K17921L78898O17206L34299N99477
3914A1213064M98209N69419P66158O36822k28049O6269J15658J73345K96766N67972
$$ plain form
3984 3120195 3012717 3179974 3123004 3264975 3025652 3789465 4266037 3730078 3073236 2681866
3974 2681866 3409058 3797917 3423754 3081608 3008630 3419592 3169696 3311054 3013736 3245868
3964 3245868 3578468 3447674 3738946 4105188 4502326 4274887 4602496 4196479 3561018 3394163
3954 3394163 4042625 4075769 4119434 4224786 4693991 4522306 4808369 4683589 5226484 5264790
3944 5264790 5008794 5071671 4958499 5352701 5643335 6430807 6527051 6595679 6939936 7037514
3934 7037514 7369733 7761070 8342263 8362288 8713743 9123905 9354570 9249506 9806947 9754118
3924 9754118 9804949 9596449 9601018 9186548 9065263 9283184 9662082 10279288 10613587 11213064
3914 11213064 11711273 12280692 13046850 13683672 13455623 13521892 13637550 13810895 14107661 14675633
3904A4675633N9195q3948K59606L95652m3344L91803P06611M70169O51155L09097
3894A7791629M84978N21706J158245R11469J10163J48948P09641J444779P32085
3885B4013643K11658N95493J355103R09723Q51504R21818J211823J420455J022255
3876C2513475L15852J01822M04871M76114m9581R4679M41204M878M48901P29864
3866C5482079P05436N10425J015173O37411Q44751O02291O78125O18970M37630
3857D1532291j22553j79170l79391p41189r48574j187446p48265m32469j45515
3848C6647719r32281n8940N32710M11148l55934o6041m29722l00825r13476q31753
3838C3702605j298341q46748p51763j121202o67575p36094j9914k60021n27618
$$ plain form
3904 14675633 14734828 14650880 14910486 15306138 15262794 15654597 16361208 16831377 17482532 17791629
3894 17791629 18276607 18798313 19956558 20868027 20978190 21127138 21836779 23281558 24013643
3885 24013643 24225301 24820794 26175897 27085620 27937124 28858942 30070765 31491220 32513475
3876 32513475 32829327 32931149 33336020 33812134 33762553 33857232 34298436 34303314 34752215 35482079
3866 35482079 36187515 36697940 37713113 38350524 39195275 39797566 40475691 41094661 41532291
3857 41532291 41409738 41230568 40851177 40109988 39161414 37973968 37225703 36793234 36647719
3848 36647719 35715438 35656498 36189208 36600356 36244422 36178381 35748659 35447834 34534358 33702605
3838 33702605 32404264 31557516 30805753 29684551 29016976 28280882 28260968 28000947 27473329
3829B7473329o92114l96137k95334m1924o7903k07041m93910L54561O16847k5081
3819B6225293K73790M27782N42917J38520M53677J8258j01150P00828J073546
3810B9753461L27417j09849K23671Q33338Q89831j36515j63214M55259P69336
3801C2842735L241o45718j12324K97270P8609n85477j084397l57707j95106o25226
3791B9615900r84550n04838P65896P1055Q95842N33875J077302J116851Q56343
3782C3443676O38441K12028m3659k22600k41740l16822r04984k49420n28799p30925
3772C1055196q71715r64719m62046r2086J54474n8663J131215J884758J893093
3763C3669507J742868K506946K554047K118427J707644J454230R08048O72356
$$ plain form
3829 27473329 26781215 26385078 26089744 26047820 25979917 25772876 25278966 25633527 26250374 26225293
3819 26225293 26499083 26926865 27469782 27608302 28061979 28080237 27979087 28679915 29753461
3810 29753461 30080878 29971029 30194700 31028038 31917869 31781354 31618140 32073399 32842735
3801 32842735 32845976 32200258 32087934 32385204 32463813 31878336 30793939 30436232 30241126 29615900
3791 29615900 28631350 28126512 28892408 28963463 29859305 30393180 31470482 32587333 33443676
3782 33443676 34082117 34294145 34250486 34027886 33786146 33469324 32564340 32314920 31786121 31055196
3772 31055196 30183481 29218762 28756716 28664630 28819104 28760441 29891656 31776414 33669507
3763 33669507 35412375 37919321 40473368 42591795 44299439 45753669 46661717 47334073
3755D7334073M6192j71008n83044j341993j634893j369425p91239j271403q00690
3746C9416570j09382K68099J256830O93452L23057M3105J63424m09186r74282
3737D0671687q28596p05542m06594K48179K86261L61030P90566J392528J537257
3728D3346776J224146J151117J581070K357698J382207K7705L62118j86765m21107
3719E0824965q70283m15617m28878N41782m39090o86590j212744j184921j357536
3710D4771088j685684j562582j448622r91475j46095m15074o12523m98865o49286
3701C6760882o38493j155171j226073j345142r11793j331742j822015q14226q99534
3692B6616693p32496q60394j140936m52024j97329K74454n39997k22774n04106
$$ plain form
3755 47334073 47380265 47209257 46626213 45284220 43649327 42279902 41488663 40217260 39416570
3746 39416570 39307188 39575287 40832117 41525569 41848626 41891731 42055155 41645969 40671687
3737 40671687 39843091 39137549 38730955 38979134 39265395 39626425 40416991 41809519 43346776
3728 43346776 44570922 45722039 47303109 49660807 51043014 51070719 51432837 51246072 50824965
3719 50824965 49954682 49539065 49110187 49651969 49212879 48526289 47313545 46128624 44771088
3710 44771088 43085404 41522822 40074200 39082725 38936630 38521556 37909033 37410168 36760882
3701 36760882 36122389 34967218 33741145 32396003 31484210 30152468 28330453 27516227 26616693
3692 26616693 25884197 25023803 23882867 23430843 23233514 23507968 22967971 22745197 22241091
3683B2241091r55896j182205j038044o71823n53135n24766o21495j020640m76892
3674A5196195p0940J57178l16816m75044M10221Q69981l59313m79406L02840J70160
3664A5405056l93673o46506o82864O1824o11707m63658k31917O10567Q82827o8559
3654A3861390M03579K18012J28471n77324k03799M21033O15969K05439l93406
3645A4679364k90925K18978j96649l45739p12061q32215l41101o04052p59554
3636A0816046p36543M9813m25826m79228p5732k4213k10043m1689K0150j84682
3626H708053J95342K61575K64710l73252k88780j41j66350k78517M3135M13034
3616H778809O10547o54369l08062m85468j55726M99730O47506M24464J09630Q45591
$$ plain form
3683 22241091 21285195 20102990 19064946 18393123 17839988 17315222 16693727 15673087 15196195
3674 15196195 15125255 15282433 14965617 14490573 14900794 15770775 15411462 14932056 15234896 15405056
3664 15405056 15011383 14364877 13682013 13743837 13132130 12668472 12436555 13047122 13929949 13861390
3654 13861390 14264969 14482981 14611452 14034128 13830329 14251362 14867331 15072770 14679364
3645 14679364 14388439 14607417 14410768 14065029 13352968 12520753 12179652 11575600 10816046
3636 10816046 10079503 10129316 9703490 9224262 9148530 9124317 8914274 8872585 8892735 8708053
3626 8708053 8903395 9164970 9429680 9056428 8767648 8767507 8601157 8322640 8365775 8778809
3616 8778809 9389356 8734987 8426925 7941457 7785731 8285461 8932967 9357431 9467061 10312652
3606A0312652m886K29545K06446M89149Q87303L9922k64027L89686N98641O25576
3596A3510007M7460m4975N9157J61577R6988l76970k44139O28840O95069J22104
3586A4655118j35194M07128k41003J99381O3991M65480N85360N65914L49184M44138
3576A7359497N12466P96311J120317R72315N75983Q88993J006598J114279M96639
3567B4843398L30340O68694N43619J154550P15500K94522P78216O11761J072782
3558C1013382J47618J33615M47070J243082O91690O00876R10079J383811J866735
3549C8437958J817562J491646J468429J984887J356237J597176J672859J821075
3541E1647829J947975J721287J837331J916932K614265L527847L572721N106509
$$ plain form
3606 10312652 10307766 10537311 10743757 11232906 12120209 12160131 11896104 12285790 12884431 13510007
3596 13510007 13557467 13512492 13571649 13733226 13830214 13453244 13209105 13837945 14533014 14655118
3586 14655118 14519924 14927052 14686049 14885430 14949421 15414901 16000261 16566175 16915359 17359497
3576 17359497 17871963 18668274 19788591 20760906 21336889 22225882 23232480 24346759 24843398
3567 24843398 25173738 25842432 26386051 27540601 28256101 28550623 29328839 29940600 31013382
3558 31013382 31161000 31294615 31741685 32984767 33676457 34277333 35187412 36571223 38437958
3549 38437958 40255520 41747166 43215595 45200482 46556719 48153895 49826754 51647829
3541 51647829 53595804 55317091 57154422 59071354 61685619 65213466 68786187 73892696
3533G3892696N497301O016599P416883Q569720Q522437Q487321Q369973P965133
3525A34738063O611841O205557L403541J672588p94211k820567m755633n891100
3517A38370079o424268o073127n989356m947770n004089m358325m181550m425179
3509I6966415m602546m588962m646157m172497l854651l620613l635221l294204
3501F4551564l607720l242118l050431k669415l024892k270736k486715j918470
3493D2281067k485476k076142j819123j708585j316093k203814j196976j060803
3485B8414055m22634l34774r95569o60565l14345l60071o04630l73556N7499o41953
3475B3763457L62948l5443l43968p10879k97959k24834n5370n96691o00053m42195
$$ plain form
3533 73892696 79389997 85406596 92823479 101393199 109915636 118402957 126772930 134738063
3525 134738063 141349904 147555461 150959002 152631590 151837379 149016812 144261179 138370079
3517 138370079 131945811 125872684 119883328 114935558 109931469 105573144 101391594 96966415
3509 96966415 92363869 87774907 83128750 78956253 75101602 71480989 67845768 64551564
3501 64551564 60943844 57701726 54651295 51981880 48956988 46686252 44199537 42281067
3493 42281067 39795591 37719449 35900326 34191741 32875648 30671834 29474858 28414055
3485 28414055 27991421 27656647 26661078 26000513 25686168 25326097 24721467 24347911 24405410 23763457
3475 23763457 24126405 24090962 23746994 23036115 22738156 22513322 22457952 21861261 21261208 20819013
3465B0819013L82787n54806k82870r06429K75114k88621L08569m03402k52652
3456A9096703M34080l98201q5173r6925m28890o42577L1266J64718p09332p50360
3446A6615309l20543j64942R7459r09431m70884k32616k58136k17991j036335
3437A3101890k28816N4924K30748n18396k49424n09349j66671m263J17432o6766
3427A1761309p17437M9388J66077m40851k74097L8016J43678l38142l28725j08226
3417I950990m3253J36294o99653J15630j85704j4508P714m81521M36532J53227
3407I375748j58507l49263m33605L90630M02820L3135k61756j1895m39343P5033
3397H622997P40110M53952j70044L32488K20584J82121q7611m769L31649O48441
$$ plain form
3465 20819013 21201800 20646994 20364124 19457695 19732809 19444188 19752757 19349355 19096703
3456 19096703 19530783 19132582 19047409 18950484 18521594 17879017 17910283 18075001 17365669 16615309
3446 16615309 16294766 16129824 16227283 15317852 14846968 14614352 14356216 14138225 13101890
3437 13101890 12873074 12927998 13158746 12640350 12390926 11881577 11714906 11710643 11828075 11761309
3427 11761309 11043872 11093260 11259337 10818486 10544389 10582405 10726083 10387941 10059216 9950990
3417 9950990 9907737 10044031 9344378 9460008 9274304 9259796 9267510 8785989 9222521 9375748
3407 9375748 9217241 8867978 8434373 8825003 9227823 9260958 8999202 8987307 8547964 8622997
3397 8622997 9363107 9817059 9647015 9979503 10200087 10382208 10294597 10289828 10621477 11269918
3387A1269918l63141l18599r10069K74683l24754k0337R9722n20914o0862J82197
3377I307844J28925M19083K13509M10880k54806n0826k3821R1209L00510n76401
3367I966106O6494J07305K24075n7212j45893k17974N97814M82857m8066L05072
3357A1280578J438145J144028J49023k10529M4306K25551q4763n77916k24279
3348A3184144j71461k46305j44614L6477k7778k27654R6231L00754j24622L64969
3338A3040141P6178R76297O39187N01197k29533M85486N19348m74448p43900J28085
3328A4918038N34390J82534k32712n80100k75765j31453J1948N6915L98978P5116
3318A4957889K59661N84993P8982L7655N1745O42311j25029J30541k2865M38624
$$ plain form
3387 11269918 10906777 10588178 9678109 9952792 9628038 9607701 9707423 9186509 9125647 9307844
3377 9307844 9436769 9855852 10069361 10480241 10225435 10174609 10150788 10241997 10542507 9966106
3367 9966106 10032600 10139905 10363980 10306768 10160875 9942901 10540715 11023572 10975506 11280578
3357 11280578 12718723 13862751 14011774 13801245 13845551 14071102 13986339 13408423 13184144
3348 13184144 13012683 12766378 12621764 12658241 12630463 12402809 12499040 12799794 12675172 13040141
3338 13040141 13116319 14092616 14731803 15233000 15003467 15488953 16008301 15533853 14789953 14918038
3328 14918038 15452428 15634962 15402250 14822150 14546385 14414932 14426880 14483795 14882773 14957889
3318 14957889 15217550 15802543 15881525 15919180 15970925 16613236 16488207 16618748 16595883 17034507
3308A7034507Q50766O11947J33506M79319L13109L14867Q62531J199104O21757
3299B2421413Q20592J285102J305547J825110J573934J743539K106775K593190
3291C5675202K398001K346249K838268L031343J482357O34690j45351J47452o30600
3282D7777611j320953j885195k054973k295831k219976k642732k364283l068396
3274B9925272j528629j287227j569718j020733m91106j00549M96510N75427O09218
3265B5608465L72835Q26915R59942O82070R63516J271004J647937J346130R81780
3256C4660594J855418J501560J340363R11832J716062J403392J37932N34103j99131
3247D3862125j146753o28675o20766j080157j522108q04596p90861o08427p52092
$$ plain form
3308 17034507 17885273 18497220 18630726 19110045 19423154 19738021 20600552 21799656 22421413
3299 22421413 23242005 24527107 25832654 27657764 29231698 30975237 33082012 35675202
3291 35675202 38073203 40419452 43257720 46289063 47771420 48406110 48260759 48408211 47777611
3282 47777611 46456658 44571463 42516490 40220659 38000683 35357951 32993668 29925272
3274 29925272 28396643 27109416 25539698 24518965 24027859 23927310 24423820 24999247 25608465
3265 25608465 25981300 26808215 27768157 28450227 29413743 30684747 32332684 33678814 34660594
3256 34660594 36516012 38017572 39357935 40269767 41985829 43389221 43527153 44061256 43862125
3247 43862125 42715372 42086697 41465931 40385774 38863666 38059070 37268209 36659782 35907690
3238C5907690j582765j178546j270797j784306k114992k186715j149103q06508
3230B3833958l67548k45939K31089J007799Q43165P5705L4581O41787N61910N41895
3220B7158402J57176Q36385J588729J274441P21700K056894K221821K332577K514684
3211D0862809L340704L593266M357465M327683M975969N432736N215758M984930
3203G7091320N317623O289554P858292Q478753J0194304J0167379J0624093Q760952
3195A44782270N529302J095215j407923m926268p725007p963720p577644p066001
3187A14740224m865048l107975j167205J116247M521477P919745J1943313J6157914
3179A47258692J9717433K0463871J8004765J4182975P901073l6350j2418409k0889238
$$ plain form
3238 35907690 34324925 33146379 31875582 30091276 27976284 25789569 24640466 23833958
3230 23833958 23466410 23220471 23451560 24459359 25302524 25378229 25412810 26054597 26616507 27158402
3220 27158402 27315578 28151963 29740692 31015133 31736833 33793727 36015548 38348125 40862809
3211 40862809 44203513 47796779 52154244 56481927 61457896 66890632 72106390 77091320
3203 77091320 82408943 88698497 96556789 105035542 115229846 125397225 136021318 144782270
3195 144782270 150311572 151406787 149998864 145072596 137347589 129383869 121806225 114740224
3187 114740224 109875176 106767201 105599996 106716243 111237720 119157465 131100778 147258692
3179 147258692 166976125 187439996 205444761 219627736 227528809 227492459 215074050 194184812
3171A94184812k2560113k1157364j7860983j4857291j3016650j0619108p792183
3164H6321120o070317n857433m517600l812703k411499k108692k064862j540475
3156E7937539n99607l81801K63942P38512J394164J231900J533555J831077K578568
3147F6527849K386080J523927J060379j84478j198172k749264l041127k179806
3139F2145388k423569p57597M06147J415965J936825L038774K102904K386833
3131G0251670K197699O2365l068292m723782n286148m095559l787402l122481
3123D8428070j891565j221979j15929n6479R30977J104030K253336L151806M959891
3114E7542158M900129O105550P923569Q794186R311710R905238R811627Q396851
$$ plain form
3171 194184812 171624699 150467335 132606352 117749061 104732411 94113303 86321120
3164 86321120 80250803 74393370 69875770 66063067 63651568 61542876 59478014 57937539
3156 57937539 57337932 56956131 57220073 57958585 59352749 60584649 62118204 63949281 66527849
3147 66527849 68913929 70437856 71498235 71313757 70115585 67366321 64325194 62145388
3139 62145388 59721819 58964222 59370369 60786334 62723159 65761933 67864837 70251670
3131 70251670 72449369 72511734 69443442 64719660 59433512 55337953 51550551 48428070
3123 48428070 46536505 45314526 45198597 45142118 46073095 47177125 49430461 52582267 57542158
3114 57542158 62442287 68547837 76471406 85265592 94577302 104482540 114294167 122691018
3106A22691018P272279N507559L957819J845742m95722k311100m438419n828897
3098A28200279o715281o988360o540546m042334j420388J379463L165316N221088
3090A12259237N589173N677395N220984N359167N164549N611154P976630J2378202
3082A65236491J7943596K3948029K8090544L1290637L1018928K8381002K2191758
3075C48100985J1613469M96984p349822j0934949j3251093j5164632j5889582
3068B97621360j4041950j0444093q205930r260603j1488253j4635142j7965513
3061B11579876k2478065k2942899k1211326j8096936j5059400j1894562r335880
3054I0560808p315387o025776n160723l730925k385060j555794r84109o93778
$$ plain form
3106 122691018 129963297 135470856 139428675 141274417 140778695 138467595 134029176 128200279
3098 128200279 121484998 114496638 107956092 103913758 102493370 103872833 107038149 112259237
3090 112259237 117848410 123525805 128746789 134105956 139270505 144881659 152858289 165236491
3082 165236491 183180087 207128116 235218660 266509297 297528225 325909227 348100985
3075 348100985 359714454 360211438 352861616 341926667 328675574 313510942 297621360
3068 297621360 283579410 273135317 264929387 255668784 244180531 229545389 211579876
3061 211579876 189101811 166158912 144947586 126850650 111791250 99896688 90560808
3054 90560808 83245421 77219645 72058922 68327997 65942937 64387143 63403034 62709256
3046F2709256N99257K431503L103474M643313O860348Q436868Q308048O571609
3038A03663676N570545K222461k679528q429485j1235073j0774649r161799p300603
3030F1875545o526103n413110m305801l147584k577123k290862k112677j489665
3022C4012620j583435j197750j007603p70184M60203N87588k76279j007493n28828
3013B8688839l30566k12187m65221l14599r20198r9607p76303n66533p27228n16323
3003B3760074k82234n93754m04823l37181L59711R6682o585J64216M0136l28736
2993B2467506K50810j5659J34383p43307K95421l87912k14241J57278L29348J73314
2983B2446941Q31756Q22794M21049L94749M95852K41150p94735j149634j370710
$$ plain form
3046 62709256 63308513 65740016 68843490 73486803 80347151 88784019 97092067 103663676
3038 103663676 109234221 111456682 108777154 100347669 89112596 78337947 69176148 61875545
3030 61875545 55349442 49936332 45630531 42482947 39905824 37614962 35502285 34012620
3022 34012620 32429185 31231435 30223832 29453648 29913851 30501439 30225160 29217667 28688839
3013 28688839 28358273 28146086 27680865 27366266 26446068 26346461 25570158 25003625 24276397 23760074
3003 23760074 23477840 22884086 22479263 22142082 22501793 22598475 22591890 22756106 22796242 22467506
2993 22467506 22718316 22702657 22837040 22093733 22389154 22001242 21787001 21944279 22273627 22446941
2983 22446941 23278697 24101491 24522540 24917289 25413141 25654291 24859556 23709922 22339212
2974B2339212p86715j380134n85591n36624q31900j91591J10894n51486n30585
2965A7055480K49764L38057O06079O91914O11479k5049j77655K20042j26207j59386
2955A9284518k37823m32577j014282o00414p38824l09101p30395n58458l74621
2946A4288023k74442n47075k0831k19816j76864L0482N04097p16552j1519O05793
2936A3461296p2518k2741J6119P80731l25723l64845K72647j49577r11917m68761
2926A2214711J17145R61999L43396P21428l11316O0522o27755k89603l98274p61743
2916A2030510O41920Q6828r34208K40017O40539l4965o52155j36549M28232L20283
2906A2630452j4848n3859K13698K07839l47087l23141r34191m57437n48974m97965
$$ plain form
2974 22339212 21552497 20172363 19586772 19050148 18218248 18026657 18137551 17586065 17055480
2965 17055480 17305244 17643301 18249380 18941294 19552773 19527724 19350069 19570111 19443904 19284518
2955 19284518 19046695 18614118 17599836 16999422 16260598 15951497 15221102 14662644 14288023
2946 14288023 14013581 13466506 13445675 13225859 13048995 13079477 13583574 12867022 12855503 13461296
2936 13461296 13388778 13366037 13382156 14162887 13837164 13472319 13744966 13595389 12683472 12214711
2926 12214711 12331856 13293855 13637251 14358679 14047363 14107885 13480130 13190527 12792253 12030510
2916 12030510 12672430 12759258 11825050 12065067 12705606 12670641 12018486 11881937 12310169 12630452
2906 12630452 12615604 12561745 12775443 12983282 12636195 12313054 11378863 10921426 10372452 9874487
2896I874487n12706k5097K36596j68992q33440j62192K39138o53787k19224K69756
2886H044539k5621N47139l72340p12446q17799l90943J6535M71069J99163k34895
2876F724401R0313N2842k33078l96581o66632M8180R4369K85609J07211m90514
2866E616120J3815K54456j34710J3830j39592o68058L98950R7454k64318P3888
2856E261835N14549j2263J80905n09181l16356n26374L79857K15122K89893l87302
2846E090685p1448l32215J9924j18691l4087k75851j27949N655O64523k24128
2836D596418j04665N09754K46611n72724k63917j13339K87806N49046N46867l02383
2826E379474l9966R039K56180j27657n90096l71113J63762K20926l53899j81403
$$ plain form
2896 9874487 9361781 9336684 9573280 9404288 8570848 8408656 8647794 7994007 7774783 8044539
2886 8044539 8018918 8566057 8193717 7481271 6663472 6272529 6289064 6760133 6959296 6724401
2876 6724401 6814714 6867556 6634478 6237897 5571265 5619445 5713814 5999423 6106634 5616120
2866 5616120 5629935 5884391 5749681 5763511 5623919 4955861 5354811 5452265 5187947 5261835
2856 5261835 5776384 5764121 5945026 5435845 5119489 4593115 4972972 5188094 5477987 5090685
2846 5090685 5019237 4687022 4706946 4588255 4554168 4278317 4150368 4156023 4820546 4596418
2836 4596418 4491753 5001507 5248118 4675394 4411477 4298138 4585944 5134990 5681857 5379474
2826 5379474 5339508 5348547 5604727 5477070 4886974 4515861 4679623 4900549 4546650 4365247
2816D365247q586K29198j72273l18723m20921J75253R07954J47090l42907N88809
2806E150141N713l92332k00729K0740j14899k49129j03228j34866j52603J72154
2796D000962j62859L24773K65736M74101L09832N6607J30229R2487J65240j77148
2786E479960J06800L3169n06033k34654N62663k58193l44995j82889l03684k88247
2776D063897n8736M07154m28705J73302O21407K76780q77534n78061K80808M73873
2766D354185j62133r4878k97396R3986K28624l10835p2196k25333K86664J81596
2756C982284r97716J77470O11449Q89449m65313n01899l5306l57578j3848j43438
2746C145554P6011J63033j30625K91841l30467j67440k1319m07831M18985l01250
$$ plain form
2816 4365247 4356661 4585859 4413586 4094863 3673942 3849195 4757149 4904239 4561332 5150141
2806 5150141 5155854 4763522 4562793 4583533 4468634 4219505 4116277 3981411 3828808 4000962
2796 4000962 3838103 4162876 4428612 4902713 5212545 5269152 5399381 5491868 5657108 5479960
2786 5479960 5586760 5619929 5113896 4879242 5441905 5183712 4838717 4655828 4352144 4063897
2776 4063897 4005161 4412315 3983610 4156912 4778319 5055099 4177565 3599504 3880312 4354185
2766 4354185 4192052 4097174 3799778 3893764 4122388 3811553 3739357 3514024 3800688 3982284
2756 3982284 2984568 3162038 3773487 4662936 4197623 3695724 3660418 3302840 3288992 3145554
2746 3145554 3221565 3384598 3253973 3545814 3215347 3047907 3026588 2618757 3037742 2736492
2736B736492o2589J84913o4178M13698j13555n9902k46494m9093l12292J22444
2726B549444O56495L14455k65456R4357K15462J32427l38715m16590l44924L10581
2716B907536R72691o6200m07968j63959M16935k66341l29037o58965l67497Q76451
2706B913646J96852J40537j70398j13344n7552k58362j67390k61075L16689L84722
2696B924325R952j09490l20736R2896K12996j97288j36790n81930L12957K50483
2686B457375m052K26957Q2927Q7987J14558p23432l53501j0483O90703P52985
2676C322024R6930n69301l73181J97642j62647m03264J72839L37859M46101J29687
2666C194689o32639M48846L1079K71574j78461n32872K28228J92727M7035L64283
$$ plain form
2736 2736492 2673903 2858816 2794638 3208336 3094781 3034879 2788385 2739292 2427000 2549444
2726 2549444 3205939 3520394 3254938 3349295 3564757 3697184 3358469 2941879 2596955 2907536
2716 2907536 3880227 3814027 3406059 3242100 3659035 3392694 3063657 2404692 2037195 2913646
2706 2913646 3110498 3251035 3080637 2967293 2909741 2651379 2483989 2222914 2539603 2924325
2696 2924325 2934277 2824787 2504051 2596947 2809943 2612655 2475865 1893935 2206892 2457375
2686 2457375 2453323 2680280 2763207 2851194 2965752 2242320 1888819 1878336 2569039 3322024
2676 3322024 3418954 2849653 2476472 2674114 2511467 2108203 2281042 2618901 3065002 3194689
2666 3194689 2562050 3010896 3041975 3313549 3135088 2602216 2830444 3023171 3070206 3434489
2656C434489l09226K55086m3233n10599N1907j10082j94298q2157P90367l20717
2646B961537j09687M05043j65358Q2531k43672p4643L69951l44482k12817j50332
2636B518071J15000M35813n45652o73368J62243K26843K76546l54789p4767q7605
2626A998335J55108m21913J68883L99518n4041l79826M03695p0954L86340m11724
2616B173421j99265N65178Q8158m88153j91748j13344K75048K61423N2368k99708
2606B123378j84106K75861K16777K7922K514j54634J3504N03383J45960j49914
2596B820645j89518O21114p10120O8003R0175l29141N24637J88503l91701j41983
2586B550614m45739J32970k55739K47343M7167l9396k28363n07049j28121j18809
$$ plain form
2656 3434489 3125263 3380349 3337116 2826517 2878424 2768342 2574044 2491887 3282254 2961537
2646 2961537 2851850 3256893 3091535 3174066 2930394 2855751 3225702 2881220 2668403 2518071
2636 2518071 2633071 3068884 2523232 1849864 2012107 2238950 2515496 2160707 2085940 1998335
2626 1998335 2153443 1731530 1900413 2299931 2245890 1866064 2269759 2198805 2585145 2173421
2616 2173421 1974156 2539334 2627492 2139339 1947591 1834247 2109295 2370718 2423086 2123378
2606 2123378 1939272 2215133 2431910 2459832 2462346 2307712 2321216 2824599 2970559 2820645
2596 2820645 2631127 3252241 2542121 2610124 2700299 2371158 2895795 3084298 2692597 2550614
2586 2550614 2104875 2237845 1982106 2229449 2276616 2237220 2008857 1501808 1373687 1254878
2576A254878K73876P47251R5312P0753l09917k01909K88437m04391P09852J60394
2566B684536l04998k30708Q8867K53914k60660j13848j71183R4475n88277q8459
2556A363659o6417L95570J21415O66996l16441r0592k87564q7595p8783J87802
2546A808050L79547K98028j60074J11581j36048q89829J01209j5331J53816N40067
2536B191016P16554J37246k48402o35546k17072K75433l5505l81704O6659K51565
2526B120244j71781j34368m54618j31191O53086r384k40363n25168k63582K13058
2516A055933j13435J111511R43871j24226m79393q24179K0696j70848P07582L25080
2506B452592P15606n3112l57183o53922j09013l60678L87601k83858M8195k76159
$$ plain form
2576 1254878 1528754 2276005 2371317 2442070 2132153 1930244 2218681 1814290 2524142 2684536
2566 2684536 2379538 2148830 2237697 2491611 2230951 2117103 1945920 2040395 1452118 1363659
2556 1363659 1297242 1692812 1814227 2481223 2164782 2074190 1786626 1699031 1620248 1808050
2546 1808050 2187597 2485625 2325551 2437132 2301084 1411255 1512464 1497133 1650949 2191016
2536 2191016 2907570 3044816 2796414 2160868 1943796 2219229 2183724 1802020 1868679 2120244
2526 2120244 1948463 1814095 1359477 1228286 1881372 1871988 1631625 1106457 842875 1055933
2516 1055933 942498 2054009 2997880 2873654 2394261 1570082 1590778 1419930 2127512 2452592
2506 2452592 3168198 3115086 2757903 2103981 1994968 1634290 2021891 1738033 1786228 1510069
2496A510069l09075K89437N95578K13253l84556o50990J89485P12735k13766M8848
2486B001018J02456Q64699L47178m98431o64143j39774J52047o23173P5042L79860
2476A996779N01484L05515o33761n59178j71943l87364O3432J92978P96776M09161
2466B513879k41806Q0157r85019L3445j32285P37766N3434O2499K61133L12839
2456B696042J84466n85751n60290M54415M28157J20154n74130l38676J64174M73924
2446B462485J45923o33995J31474j48059j98413n23026O52059P48180M91608j14726
2436C013510k18264k66821j60977K79229K10173K41887j46140J81219m70389o1854
2426B601573p04097K99146J9352L76697l32208m2451L98765O29779m40447l85224
$$ plain form
2496 1510069 1200994 1490431 2086009 2299262 1914706 1263716 1453201 2165936 1952170 2001018
2486 2001018 2103474 2968173 3315351 2816920 2152777 2013003 2165050 1541877 1616919 1996779
2476 1996779 2498263 2803778 2170017 1610839 1438896 1051532 1114964 1307942 2104718 2513879
2466 2513879 2272073 2352230 1367211 1400656 1268371 2006137 2059571 2122070 2383203 2696042
2456 2696042 2880508 2294757 1734467 2188882 2617039 2737193 2163063 1824387 1988561 2462485
2446 2462485 2608408 1974413 2105887 1957828 1759415 1236389 1888448 2636628 3128236 3013510
2436 3013510 2795246 2528425 2367448 2646677 2856850 3098737 2952597 3133816 2663427 2601573
2426 2601573 1897476 2196622 2215974 2592671 2260463 2218012 2616777 3246556 2806109 2420885
2416B420885J80274N08975r9943j57490N09913L18302j28520j52448K26679N41691
2406D168318M8882K01295l75541O4427O22829P30876K37731M20534K01869P83388
2396G104608M92054J317804J032898P86029J412748J663711J764494Q01401Q35628
2387A7211375L82352J517993K307223L998606N003394P795505J2835643K1555006
2379G2607097K6634991K0241591J6952681J7645824J7688707l720667l5218837
2372A32831387l1706053k1190259j5276152j2472667r948683p473821n033807
2365B9729945l075824k430895j851504j289338j252643j219719j822816j519198
2357A5268008j022541n03618j216668j035905q96415O97472l98180l71447q66943
$$ plain form
2416 2420885 2601159 3110134 3010191 2852701 3362614 3680916 3552396 3399948 3626627 4168318
2406 4168318 4217200 4418495 4042954 4107381 4730210 5461086 5698817 6119351 6321220 7104608
2396 7104608 7596662 8914466 9947364 10733393 12146141 13809852 15574346 16375747 17211375
2387 17211375 17593727 19111720 21418943 25417549 30420943 38216448 51052091 72607097
2379 72607097 99242088 119483679 136436360 154082184 171770891 168050224 132831387
2372 132831387 101125334 79935075 64658923 52186256 42237573 34763752 29729945
2365 29729945 26654121 24223226 22371722 21082384 19829741 18610022 16787206 15268008
2357 15268008 14245467 13741849 12525181 11489276 10592861 11290333 10892153 10520706 9653763
2348I653763j31571m55485J68300o99278k08780J65820p5690q18544q32357k44231
2338F521947m35682N8105n1151p8097n04306j29969K78378R2569n72807k32155
2328D946832J29806O21271l67674k84400j65485j506J31791l98420n76010n19253
2318C516952L65070J10446l23112L13009K97825Q9598m87287l25918K52120L80788
2308D189491j14179j56219o0965O4387j38822N7166k42817L21661n77299K58545
2298C600949o35154K92948L24631j68o05602K91598L8830R2387j08563J43231
2288C435087m3368L77446n23472n68924j26526M30984M85955M08833n10677k21146
2278C144192m52852p5834k76677J68911L26375K36384j72148m27m73599M8602
$$ plain form
2348 9653763 9522192 9066707 9235007 8535729 8326949 8492769 8417079 7598535 6766178 6521947
2338 6521947 6086265 6144370 6093219 6015122 5510816 5380847 5659225 5751794 5178987 4946832
2328 4946832 5076638 5697909 5330235 5045835 4880350 4878844 5010635 4612215 4036205 3516952
2318 3516952 3882022 3992468 3669356 3982365 4280190 4369788 3882501 3556583 3808703 4189491
2308 4189491 4075312 3919093 3858128 3922515 3783693 3840859 3598042 3919703 3342404 3600949
2298 3600949 2965795 3258743 3583374 3583206 2977604 3269202 3308032 3400419 3291856 3435087
2288 3435087 3391719 3769165 3245693 2676769 2550243 2981227 3467182 3876015 3365338 3144192
2278 3144192 2691340 2615506 2338829 2507740 2834115 3070499 2898351 2897924 2424325 2472927
2268B472927J3336J43961K7968j72461m4749m620N52440P2955k8752J69763m55887
2257B746881J88391R0263k12157K22390m12373J27098l58123k51531J29137l34855
2247A935121Q874m183J21507L17317N077L94498m50272k84843k00973M15626M21514
2236B679263m01479j66230O47583k00067m51811n25275K7517M96467O27175k07506
2226B525637m84019K25512L36411l49206j66120M6011M9458J73149p16540k83608
2216A356685K7823M43868K31049n5097N63926m17103k53440M870O3449J43819
2206B109849L85748K16950R2226l30152j72498m39206L20467m36241l47985k76247
2196A122911J66993K10065M61870l45641J67293J3656j88215l8827M30079r2124
$$ plain form
2268 2472927 2486263 2630224 2658192 2485731 2440982 2436362 2988802 3061757 3033005 3202768 2746881
2257 2746881 2935272 3025535 2813378 3035768 2623395 2750493 2392370 2140839 2269976 1935121
2247 1935121 1943995 1939812 2061319 2378636 2383713 2778211 2327939 2043096 1842123 2257749 2679263
2236 2679263 2277784 2111554 2759137 2559070 2107259 1581984 1609501 2105968 2733143 2525637
2226 2525637 2041618 2267130 2603541 2254335 2088215 2134226 2183684 2356833 1640293 1356685
2216 1356685 1384508 1828376 2059425 2004328 2568254 2151151 1897711 1902581 1966030 2109849
2206 2109849 2495597 2712547 2804773 2474621 2302123 1862917 2183384 1747143 1399158 1122911
2196 1122911 1289904 1499969 1961839 1616198 1783491 1797147 1608932 1570105 2000184 1908060
2186A908060J19083j5583L50441j57205l43148o4962k47537o9737j36856j25313
2176A217243L13428M53375K03206l81706j9566m54285N6621J86218l17724M76953
2166A733763N97591m90398k48635j77548N09694j93051k11452K883K39726O94737
2156B457310P1465k66856j18809M61940j76369l06063o4469k138J1131K78255
2146B345397m08149K43979N44929k85056n30005k62170k35916J66415l03549l4933
2136A240942P7483J89416M0204r5224k76904J51444l2689K16528j82186L04893
2126A633907N28999L47436l19172m35202m2017l53909k02650L86928n16570L97556
2116A425306j38840j81731k14311O2968K02854N74287j07514L27547N62185R84857
$$ plain form
2186 1908060 2027143 2011560 2362001 2204796 1861648 1796686 1549149 1479412 1342556 1217243
2176 1217243 1530671 1984046 2187252 1805546 1785980 1331695 1388316 1574534 1256810 1733763
2166 1733763 2331354 1840956 1592321 1414773 1924467 1731416 1519964 1522847 1762573 2457310
2156 2457310 2528775 2261919 2143110 2605050 2428681 2122618 2058149 2056011 2067142 2345397
2146 2345397 1937248 2181227 2726156 2441100 1911095 1648925 1413009 1579424 1275875 1240942
2136 1240942 1318425 1507841 1548045 1452821 1175917 1327361 1294672 1511200 1329014 1633907
2126 1633907 2162906 2510342 2191170 1755968 1713951 1360042 1157392 1544320 1027750 1425306
2116 1425306 1286466 1104735 890424 953392 1156246 1730533 1623019 1950566 2512751 3497608
2106C497608k13387k47832j72718l66764m72533j97647J87705q7820J68961L45787
2096B441360k89084k01505q8604o51583J61452M27562R0167L50030O8467K70855
2086B579117k21411o71694m86943N0362M28073k03318j50441K13849J98553J62529
2076A898676o59806j20510J7829Q8683J68032k27144M96505L81699l56804j06203
2066A580957N1364j22085P8373L633K77876k15279j07675k49580L61420n5922
2056A603082j97836m62776Q7357K34001O17396j54193j25308m1146N0592j50248
2046A460921r1710P1431K60017K7954O18118k91892o50874j4537L84632j9748
2036A754312l9935j53531n0964r8582m9372j93426j53841j3900K42288M05958
$$ plain form
2106 3497608 3284221 3036389 2863671 2496907 2024374 1826727 2014432 1926612 2095573 2441360
2096 2441360 2152276 1950771 1862167 1210584 1372036 1799598 1889765 2239795 2308262 2579117
2086 2579117 2357706 1686012 1199069 1249431 1677504 1474186 1323745 1537594 1736147 1898676
2076 1898676 1238870 1118360 1136189 1224872 1392904 1165760 1662265 2043964 1687160 1580957
2066 1580957 1632321 1510236 1588609 1592242 1870118 1654839 1547164 1297584 1659004 1603082
2056 1603082 1405246 942470 1029827 1263828 1881224 1727031 1601723 1560577 1611169 1460921
2046 1460921 1369211 1440642 1700659 1728613 2346731 2054839 1403965 1389428 1774060 1754312
2036 1754312 1714377 1560846 1509882 1411300 1361928 1168502 1014661 1000761 1243049 1649007
2026A649007l86867p136J74613J68445k24522J12246L86296M45826j60300J66609
2016B324217j2631l73760Q3033l14592l15527o1985J5406J54970l26399k16845
2006I55887m9674J29768j8926M6194L08641J1145K90207J2568j32553J94401K33717
1995A981375j25985j70211n81689N86642j15674m69584K84599J5856J13093m88198
1985A030224o09714K35638N36404M59650k46179j16191p9932N0325l46645m38651
1975D74929L18993O20487O9855J45616j71836N84192R0207k04765O735k40464
1965A693949n7623K57190j19350n70649N97647L44647J48069q23874l51436K18579
1955A337149L64168n37525m09598l96933L96380N03188j66347m44623J94717L42984
$$ plain form
2026 1649007 1262140 1255004 1429617 1598062 1373540 1485786 1872082 2317908 2157608 2324217
2016 2324217 2311586 1937826 2020859 1706267 1390740 1328755 1344161 1499131 1172732 955887
2006 955887 906213 1035981 1017055 1063249 1371890 1383035 1673242 1685810 1553257 1747658 1981375
1995 1981375 1855390 1685179 1103490 1690132 1574458 1104874 1389473 1405329 1518422 1030224
1985 1030224 420510 656148 1192552 1652202 1406023 1289832 1209900 1260225 913580 474929
1975 474929 793922 1414409 1484264 1629880 1458044 2042236 2132443 1927678 1934413 1693949
1965 1693949 1636326 1893516 1774166 1203517 1801164 2145811 2293880 1470006 1118570 1337149
1955 1337149 1701317 1163792 754194 357261 753641 1256829 1090482 645859 840576 1183560
1945A183560k18964l69926N7361P90019J20018m06459l2330K8262M52568k3702
1935A580407o707m25750j28374m1817M61032k72000j40379L48872M78217j71993
1925A681508k83120l09864M77816L90352L4697k07412J0791Q3107l3582o36650
1915A207643j57713O59602r5057j68836K89191K43739l19713m93773j39349N68948
1905A594682k37329j25959k98194N72860L13912N8810o04454M2011J22934m90553
1895I48720l59966q3929N61613P4547l38150N8701N48145j67118k41499J15079
1885A116143k55033R9995P107L02966n1346j03731K31472J79078o52517j09610
1875G64524l4406M32069M34129j07622l91416p6404M47107r654M94o0786N91246
$$ plain form
1945 1183560 964596 594670 652031 1442050 1562068 1155609 1123279 1151541 1604109 1580407
1935 1580407 1573700 1147950 1019576 977759 1438791 1166791 1026412 1375284 1853501 1681508
1925 1681508 1398388 1088524 1566340 1956692 1991389 1783977 1794768 1877875 1844293 1207643
1915 1207643 1049930 1709532 1614475 1445639 1734830 1978569 1658856 1165083 1025734 1594682
1905 1594682 1357353 1231394 933200 1506060 1819972 1878782 1274328 1316339 1439273 948720
1895 948720 588754 504825 1066438 1140985 802835 861536 1409681 1242563 1001064 1116143
1885 1116143 861110 961105 968212 1271178 1219832 1116101 1347573 1526651 874134 764524
1875 764524 730118 1162187 1596316 1488694 1097278 1020874 1467981 1458327 1458821 1398035 1989281
1864A989281L16523p37003K11447M4947l71396n95866j00733J51515L18239k69775
1854I57179Q8596l7299M42475j65083l62357n23148L36939J35490K30327K50068
1844A353187j20107K26767J78328J55539N700l93696m95019L98735K60918m08052
1834A162300K53234J17820k56750J24843m19968J24479k43061L66793j30449o1829
1824A037412J44478r3018l25452j19907O29248L62154k33947J73577m09963K14988
1814A379570j40607l80090K31221R8812l51027J80304n9980L88301J3460R3727
1804A453691n97589L22939J18667P0305m55477r7516M17813P10527k5075l65459
1794A552826l89123Q8101L73380l31343J96474j20973M26213L15985k75629o76122
$$ plain form
1864 1989281 2305804 1568801 1780248 1825195 1453799 857933 757200 908715 1226954 957179
1854 957179 1045775 1008476 1450951 1285868 923511 400363 737302 872792 1103119 1353187
1844 1353187 1233080 1459847 1638175 1793714 1799414 1405718 910699 1309434 1570352 1162300
1834 1162300 1415534 1533354 1276604 1401447 981479 1105958 862897 1229690 1099241 1037412
1824 1037412 1181890 1088872 763420 643513 1272761 1634915 1400968 1574545 1164582 1379570
1814 1379570 1238963 858873 1090094 1188906 837879 1018183 958203 1346504 1359964 1453691
1804 1453691 856102 1179041 1297708 1368013 912536 815020 1232833 1943360 1918285 1552826
1794 1552826 1163703 1251804 1625184 1293841 1490315 1369342 1795555 2111540 1835911 1159789
1784A159789J74963O9763n03914L7520K2394J63210k07757l45792k50756O03665
1774I23085L16108l03743j26359L36472Q22836M36473j88931n04704l23991N6201
1764A443447l04159r25923l00909J92171M01513N34806o4382l65737J99884l4353
1754G76358J0025p7466J88321M08914N46058R8k51422K51632K57537n91235q29194
1743F89626n18198L60284J38408m1370q9718J91957L88734K38941l74664k92478
1733F91522K9162N15079L69683k60347k07057N86555J14721l94658n92794J45340
1723I97206k42458M17275j95159Q0898J14907j9231N7316j37020o0600N8081p4359
1712I96856J75422k4818J52987K86270m2939L96453j74020l56970l79796o2150
$$ plain form
1784 1159789 1334752 1404515 900601 938121 960515 1123725 915968 570176 319420 923085
1774 923085 1239193 935450 809091 1145563 1968399 2404872 2215941 1711237 1387246 1443447
1764 1443447 1139288 213365 -87544 104627 506140 1040946 976564 610827 810711 776358
1754 776358 786383 708917 897238 1306152 1852210 1852308 1600886 1852518 2110055 1518820 689626
1743 689626 171428 531712 670120 628750 539032 730989 1119723 1358664 984000 691522
1733 691522 720684 1235763 1605446 1345099 1138042 1724597 1839318 1444660 851866 997206
1723 997206 754748 1172023 976864 1057762 1172669 1153438 1210754 1073734 1013134 1071215 996856
1712 996856 1172278 1147460 1300447 1586717 1543778 1940231 1766211 1409241 1029445 967295
1702I67295p1670j04486P87142M41417p4787m92536o39375k17854j55524J42176
1692E81798N3885J85479K69681J38363L19498R2819m94669l70276l53120L64399
1682G87857M43618R5735j7714L07400K40594m36431l97782k28276M58583K3510
1672A277094P7954l11742K00045P5837l6970J51391k19576r252p09151K44185
1662G39815N64643N87564P6781j19205o50266j63316m68483J85595K31992K11732
1652A196852K00981N3417r5110l88505n05989k53914M21505L28539k8345P7907
1642A007338j23485L54481K58325j65181j5477O8225k40448k50385k75441M9026
1632F66978O9893J94647k09693K31446r2252j73444n07127o2769M25629L83689
$$ plain form
1702 967295 895625 791139 1578281 2019698 1944911 1452375 813000 595146 439622 581798
1692 581798 635683 821162 1090843 1229206 1548704 1641523 1146854 776578 423458 787857
1682 787857 1231475 1327210 1309496 1616896 1857490 1421059 1023277 795001 1253584 1277094
1672 1277094 1355048 1043306 1243351 1319188 1282218 1433609 1214033 1204781 495630 739815
1662 739815 1304458 1892022 1968803 1849598 1199332 1036016 567533 753128 985120 1196852
1652 1196852 1397833 1451250 1356140 967635 461646 207732 629237 957776 929431 1007338
1642 1007338 883853 1238334 1496659 1331478 1316001 1384226 1143778 893393 617952 666978
1632 666978 736871 931518 721825 953271 861019 687575 180448 117679 543308 926997
1622I26997r917K22167Q5335L82053J33784K76788k72686R9085m4992P7720P8682
1611A955016m10733m79568n31570N22861J57161K643l85004J49604j07093n9659
1601H13658Q3149M65799N90029P2122o36579l66090k28479K76346K17904q7549
1591A200310j05737J00886l22901k99044l47846K33599R7904P26013j84982K16710
1581A314912l35357L19167M89012J30567n75010m72699o8906O9773j2801m16527
1571D42131j36237P95061O71047j23146m71584l80863J60892O8843K21414O6553
1561A314111j1714K30029J31096j76228k62425P6813l5703O705q8627O0169J74857
1550A419083o0197l39280j68911L86442M15853j80196l45798k34198N3649r4159
$$ plain form
1622 926997 917080 1139247 1224582 1606635 1740419 2017207 1744521 1843606 1798614 1876334 1955016
1611 1955016 1544283 1064715 533145 1056006 1213167 1215810 830806 980410 873317 813658
1601 813658 896807 1362606 1952635 2024757 1388178 1022088 793609 1069955 1287859 1200310
1591 1200310 1094573 1195459 872558 573514 225668 459267 557171 1283184 1098202 1314912
1581 1314912 979555 1298722 1787734 1918301 1343291 870592 801686 871459 858658 442131
1571 442131 305894 1100955 1772002 1648856 1177272 796409 957301 1026144 1247558 1314111
1561 1314111 1302397 1532426 1663522 1487294 1224869 1301682 1265979 1272684 1184057 1244226 1419083
1550 1419083 1358886 1019606 850695 1237137 1652990 1472794 1126996 892798 946447 852288
1540H52288j56390j6628N9359K64534l86089k06034P6823O00872J77936K96110
1530A562781m46673l35236k75119K77760J62132J45192o1082P8193O6388K00335
1520A374671k86770l8711K68347k8311q0074M3094K19516J51671o45496j18860
1510H59077k7736L77038m34270j86406K09103L27096m17898l19044R1803P54965
1500A233728l99916j86546j53676K70572M53909k90422J9379J5118L0830n53107
1490D39869l19915K45606Q40231o4559q7899m5673O06661k40616j14731q6382
1480A172592J22074j32366j16007j6173L54721k31830k16418j87548N66509j6747
1470A298807l86177j31552j37245j22351Q6002M5282P82909J11795m12757l46452
$$ plain form
1540 852288 695898 679270 738629 1003163 617074 411040 487863 1088735 1266671 1562781
1530 1562781 1116108 780872 505753 783513 945645 1090837 1029755 1107948 1174336 1374671
1520 1374671 1087901 1049190 1317537 1289226 1209152 1252246 1471762 1623433 977937 859077
1510 859077 831341 1208379 774109 587703 796806 1123902 706004 386960 478763 1233728
1500 1233728 833812 647266 493590 764162 1218071 927649 947028 962146 992976 439869
1490 439869 119954 365560 1205791 1141232 1053333 1007660 1614321 1373705 1258974 1172592
1480 1172592 1294666 1162300 1046293 1030120 1384841 1153011 936593 749045 1315554 1298807
1470 1298807 912630 781078 643833 521482 607484 652766 1435675 1547470 1134713 788261
1460G88261J18492R1175r4559o7659K77746K27301l7338l04962p2628J56526J45906
1449A228261j35674l86102K01650O5702p828J68460p1798n047R3251J63536j75850
1438A138561m17166j4536L59513K29659l97991j91520K36561J50289k70835l59176
1428D63359P0562N61022K20371j24029n50136K28089K63853J07694k73535J28718
1418A095968K26676R2437k59032p8220J29344J00827k65525J94894k41866k769
1408I92734P827m78814l2903L090L22832L02904j20264l19259j61398j02004M78319
1397H93064L0217k76389j50009N21335J27293j56342j12669L5584L46277l3167
1387A225194m18149k31387J60851J32879M65091k22040J02314J5289N8247m17905
$$ plain form
1460 788261 906753 997928 903369 835710 1113456 1340757 1303419 998457 925829 1082355 1228261
1449 1228261 1092587 706485 908135 973837 966009 1134469 1062671 1057624 1150875 1314411 1138561
1438 1138561 721395 706859 1066372 1296031 898040 706520 943081 1093370 822535 463359
1428 463359 533921 1094943 1315314 1191285 641149 869238 1133091 1240785 967250 1095968
1418 1095968 1322644 1415081 1156049 1077829 1207173 1308000 1042475 1237369 995503 992734
1408 992734 1000561 521747 488844 491934 814766 1117670 997406 678147 516749 414745 893064
1397 893064 923281 646892 496883 1018218 1145511 989169 876500 912084 1258361 1225194
1387 1225194 807045 575658 736509 869388 1334479 1112439 1214753 1230042 1288289 870384
1377H70384j19499N90567K63785J27487l33381k61256k54060J03031J23220j49126
1367I61152j3066M73539k05751r6025k19296j29459J68536L897L11163L4449l31096
1356I58043j56705L11587j83591o0475j46301K81525O2239l0827j78082J7091
1346H74504o21k4338K15445l13282J2965J88739O7824k56989j59210j50622M95469
1335I49884j04702l14945n75138k03897O19349Q42444j02162m91442J70005L04276
1325A093672L832r4253J31628R41949K16703m48934n53092m85213P1309j0383
1315H67218j09613P862n8776l06125j84418n4894P2943L30391o7196j38450N18704
1304H77646P7590L76803L0954N2517N8882P8400j84422m7648m08639k04151j81470
$$ plain form
1377 870384 750885 1341452 1605237 1732724 1399343 1138087 884027 987058 1110278 961152
1367 961152 948086 1421625 1215874 1119849 900553 771094 939630 943527 1254690 1289139 958043
1356 958043 801338 1112925 929334 868859 722558 1004083 1066322 1035495 857413 874504
1346 874504 873883 849545 1064990 751708 764673 953412 1021236 764247 605037 454415 949884
1335 949884 845182 530237 -44901 -248798 370551 1212995 1110833 619391 789396 1093672
1325 1093672 1097504 1003251 1134879 2076828 2293531 1844597 1291505 806292 877601 867218
1315 867218 757605 765467 706691 400566 216148 161254 234197 564588 497392 358942 877646
1304 877646 955236 1332039 1362993 1415510 1474392 1552792 1368370 1320722 912083 707932 526462
1293E26462K37929Q4900N62855k37509k19580l51036j56309k38819K38755N25760
1283I73408N18855L06623j79207k04542n90163J85142n4348j35324K54103K71959
1273A346506l92213k5634J07786k8691j01821j93801k51620R1337l21222j666
1263B28961O51898L36540Q6650l61504k53777L47125m66222j09699N6019O08221
1253A124212M42870l37821o28337L04472r7069l61147m59898K81311M30843K31659
1243I31095j46601K60096L98179k30177k52214j66432R3947K21254O99561J45196
1233A953904J66995o94978j61970k3854P3957l88450m30374q9090N00486j23977
1223G82649q9115N70593M39998j23629n50943l02301K73479N08483n79098J37756
$$ plain form
1293 526462 764391 849291 1412146 1174637 955057 604021 447712 208893 447648 973408
1283 973408 1492263 1798886 1619679 1415137 824974 1010116 955768 820444 1074547 1346506
1273 1346506 954293 928659 1036445 1007754 905933 712132 460512 551849 230627 228961
1263 228961 880859 1217399 1304049 942545 688768 1035893 569671 459972 515991 1124212
1253 1124212 1567082 1229261 600924 905396 808327 447180 -12718 268593 699436 931095
1243 931095 784494 1044590 1442769 1212592 960378 793946 887893 1109147 1808708 1953904
1233 1953904 2120899 1425921 1263951 1240097 1314054 925604 495230 406140 906626 782649
1223 782649 693534 1264127 1704125 1580496 1029553 727252 1000731 1509214 930116 1067872
1213A067872N16477n7406q53338l18767r9165M30914k02681q3376K82001m5827
1203F36704O5099J03753J88643L08422q69382l11699N62198M69065k90018l53151
1193E09634J8842M61049k15475q53643q3175Q56676J75827J51237p1725J44970
1183A094217O56488j96518l78539O8124R1088k44356n19382k5518P86199k64284
1173A067519o88630L52115P9906k76668k42408K47872P98698P8030j60109k05368
1163A050957L50002j98488J17639l30792l9778O28930k09777o77581J45203k24340
1153F11975K98865j70505l73321M50108k49483J18302J68487K29566p0673J06868
1143A120189k53980l67463J11397m22278N91499K61744J59606M1949l31818l20128
$$ plain form
1213 1067872 1584349 1526943 673605 354838 255673 686587 483906 400530 682531 636704
1203 636704 701803 805556 994199 1302621 433239 121540 683738 1152803 862785 509634
1193 509634 528476 989525 774050 -79593 -162768 693908 869735 1020972 949247 1094217
1183 1094217 1750705 1554187 1175648 1243772 1334860 1090504 571122 545604 1331803 1067519
1173 1067519 378889 731004 810910 534242 291834 539706 1338404 1416434 1256325 1050957
1163 1050957 1400959 1202471 1320110 989318 949540 1578470 1368693 691112 836315 611975
1153 611975 910840 740335 367014 817122 567639 685941 854428 1083994 1013321 1120189
1143 1120189 866209 498746 610143 187865 779364 1041108 1200714 1242663 910845 590717
1133E90717M76239j81780k38304P4755R4997l32281N97713p2822K02849k50091
1123I61992l17547R6197n79428L82403O52867K57937K3211k26505j01045l70286
1113G79796M36616l93204J445r861O2075N10300o95063l14193N58614l63055k15057
1102C58413J33666J56802N25568Q652j9898o5290N5753n53897R4658j28560K84089
1091H49956L33031q3954j10692L0699O9208n4518m16622r8858J77779K43327m60566
1080D78790L65672l06837M01968R04079n59816l56691k74309J1993M59328o3745
1070A060432j10196k63661M5591Q9829R982j11417m12681J85558m0664k39941
1060B12832P4887l66549N08100k9238L04346L24740m07743l26946P46200J50021
$$ plain form
1133 590717 1066956 885176 646872 721627 816624 484343 1082056 1009234 1212083 961992
1123 961992 644445 740642 161214 543617 1196484 1454421 1477632 1251127 1150082 779796
1113 779796 1216412 823208 824653 814792 876867 1387167 692104 377911 936525 573470 358413
1102 358413 492079 648881 1174449 1183101 1163203 1097913 1153666 599769 694427 565867 849956
1091 849956 1182987 1099033 988341 1019040 1088248 1033730 617108 518250 696029 939356 478790
1080 478790 844462 537625 939593 1843672 1283856 927165 652856 664849 1124177 1060432
1070 1060432 950236 686575 732166 821995 831977 720560 307879 493437 452773 212832
1060 212832 287719 -78830 429270 400032 704378 1029118 621375 294429 1040629 1190650
1050A190650K93900j88480j45866J80972J79191j44407K52257m71207k24119L26333
1040A249224L23477j38289J48638k54722k74203j44568k70522N419M1925L85040
1030A071419L44073l95955m70478N10795m23804j13877k95502P9600L30069J31824
1020G68164k59571L38016K76749j33083p0222k8299m29224M34050l6740j76630
1010F83210m56307L18017L4059O5077l06965M03357n29595J03345m5984l3430
1000B34784o4986K96958j99467m0312L70094K04264N42375j40904m93624L3745
990G42927M60281m3908j66331k55698M59733N55891j68371n67037k67478n427
980G44582J32183q59Q7780q5839l49084j40484O1399m67568N11937k0555J86593
$$ plain form
1050 1190650 1484550 1296070 1150204 1331176 1510367 1365960 1618217 1147010 922891 1249224
1040 1249224 1572701 1434412 1583050 1328328 1054125 909557 639035 644454 686379 1071419
1030 1071419 1415492 1019537 549059 1059854 636050 522173 226671 306271 636340 768164
1020 768164 508593 846609 1123358 990275 920053 891754 462530 896580 859840 683210
1010 683210 226903 544920 578979 644056 337091 740448 210853 314198 268214 234784
1000 234784 169798 466756 267289 226977 597071 801335 1343710 1202806 709182 742927
990 742927 1203208 1159300 992969 737271 1197004 1752895 1584524 1017487 750009 744582
980 744582 876765 875906 963686 877847 528763 388279 449678 -17890 494047 473492 660085
969F60085J63912K17832O7020L14332L0109J59517N1744k73009o95189J18565
959H14918M96464L38335J17084o86037m62103l48318J98661j35359n33153P99932
949F00424N66885J75510k86236J40902Q3494L4485p66799m16851L60442M74716
939I66972P6520N6055r5184j8891L78810m81695k14415k47815J91458Q9881J38945
928H40641j872j96718p9251L61356J67475p62261k02482K03830O57743M38977
918A427438m14855k82314O6845K53817j61005Q35k59861L70323P54312j52502
908A603033q74771m47014P144J60289l37092O0320N20597j76449k67307j47779
898A00971P83851Q33771N8292o29111l93666K34478K22252L67211m41108J48523
$$ plain form
969 660085 823997 1041829 1108849 1423181 1453290 1612807 1664551 1391542 696353 814918
959 814918 1311382 1649717 1766801 1080764 618661 270343 469004 333645 -199508 600424
949 600424 1167309 1342819 1056583 1197485 1280979 1315464 548665 131814 492256 966972
939 966972 1043492 1099547 1004363 985472 1364282 882587 668172 420357 611815 701696 840641
928 840641 838769 642051 562800 924156 1091631 329370 126888 330718 988461 1427438
918 1427438 1012583 730269 797114 1050931 889926 890761 630900 1001223 1755535 1603033
908 1603033 728262 281248 288392 448681 111589 171909 692506 516057 248750 100971
898 100971 884822 1718593 1776885 1147774 754108 988586 1210838 1578049 1136941 1285464
888A285464M68362n78278n05332n2224j3164j69258M4116J59074l4705J85630
878G89685R8924L11963L25754m35678m71711l2599L56939O3117m10419N1965k04925
867D43015N10143j63620L0964m58336j28792k6104K96548N00891M15347m3126
857A376930J54580m72668m19357q8248M36641O70708j09817m88434k36894L29421
847A152862n40271n95381k65093L62630M52214k3470k17178J75677P3203j85998
837C89195k61552K80837N75711P9308l63147L9732J68747K09531M6634k70637
827H94359n9418N56724p11526l47160j2449P21869L4308k29672o87355K7696K34270
816D21646L57549Q8852j09233k14686J92705R6797j6323J1144j93120L46058j68442
$$ plain form
888 1285464 1753826 1175548 670216 617992 604828 435570 479686 638760 604055 789685
878 789685 888609 1200572 1526326 1090648 618937 586338 943277 1006394 595975 647940 443015
867 443015 953158 789538 820502 362166 233374 207270 503818 1004709 1420056 1376930
857 1376930 1531510 1058842 639485 551237 987878 1658586 1548769 1060335 823441 1152862
847 1152862 612591 17210 -247883 114747 566961 543491 326313 501990 575193 389195
837 389195 127643 408480 984191 1063499 700352 740084 908831 1118362 1164996 894359
827 894359 834941 1391665 680139 332979 320530 1042399 1076707 847035 159680 187376 421646
816 421646 779195 868047 758814 544128 736833 833630 817307 828451 635331 981389 812947
805H12947J13519j28209J84615k25398K59867l6956J37799K94086k96967k41270
795H74033r9759J255N7289k33478k1584K67443J37498k41932m59407k62429M57943
784D76872P40066j97142k03265J72327J51936K41709j48922k89677R5791l81071
774F58624k33264L7691K19304q5431q7528l26474m3056L04047J24152j85603l6913
763C45549L69781L38910J84386O6955L8909k15448k38924k0414l09353L02893
753H63244m687j98032k12127k60883l08654K70827M17355N6293K3404j36555j48634
742C61551k95716P86455M64736M94392p34075m382m27521m2218k59407r6452J76829
731D24192L17547L08754k12459r5384j30655N56935n25386j67316O1097P40259
$$ plain form
805 812947 926466 798257 982872 757474 1017341 980385 1118184 1412270 1115303 874033
795 874033 774274 775529 832818 599340 577756 845199 982697 740765 281358 18929 476872
784 476872 1216938 1019796 816531 988858 1140794 1382503 1233581 943904 1039695 658624
774 658624 425360 463051 682355 596924 509396 182922 139866 443913 568065 382462 345549
763 345549 715330 1054240 1238626 1305581 1344490 1129042 890118 869704 560351 863244
753 863244 858557 660525 448398 187515 -121139 149688 567043 623336 646740 510185 361551
742 361551 65835 852290 1317026 1811418 1077343 1072961 645440 603222 343815 247363 424192
731 424192 741739 1050493 838034 742650 611995 1168930 643544 476228 537325 1277584
721A277584l15796l24151J50541L42393j84650n12954n98679O01326L23257J0288
711G69159J5265r9463J20130J17409M6844k81337l00406K58110J78699N47455
701A371865j68935k93579l46052J38209j95701o36262J11366O09589Q27783M73332
691A891615k41423n41123L1462J41163n53084j70257N74572K99900L95945p55577
681A073193m88163J1804L00125j32876J9560k13555J91885J30290K69955l55398
671H06820M19982Q2409K34414j093699N3701R1872r65j51984j4329j1147L47814
660G64888k00439o56254P917M70394J84015J93861l24677M0743M53129k78153
650F55424k16360L4601K07590L32158J55867j37022k60244K21316K4481L69801
$$ plain form
721 1277584 961788 637637 788178 1130571 945921 432967 -165712 435614 758871 769159
711 769159 784424 684961 805091 922500 969344 688007 387601 645711 824410 1371865
701 1371865 1202930 909351 563299 701508 505807 -130455 -19089 590500 1418283 1891615
691 1891615 1650192 1109069 1140531 1281694 728610 558353 1132925 1432825 1828770 1073193
681 1073193 585030 596834 896959 764083 783643 570088 761973 892263 1162218 806820
671 806820 1226802 1309211 1543625 449926 503627 595499 594534 442550 428221 417074 764888
660 764888 564449 -91805 -83888 386506 570521 764382 439705 480448 933577 655424
650 655424 439064 473665 681255 1013413 1169280 1032258 772014 993330 1017811 1387612
640A387612m08531j74936J84447l66234O52017k02083j18015R5001K72180j221
630A320237k88361o87679J26411J82071o3540l84544O24070K82901N1212m52012
620G10766o36210O1850M90567q7729O6563j46397O05095N1065n19896l58700N64036
609H01010K46490N0656m45491m18124K23818R6352Q8993k0473J51470L09511N40296
598A624508m66602m20855P4464K5420K49558l71769o23860K28707J99717K19926
588G39214J74031j23803K86158j77462k18549K53804M12657k51812j91996J43980
578A046222P114K51205o03252m72313J22064j64225K69708l81618j02804L55449
568C27550M09071m25167l93477k13343L37122N79416M40000P5533K18017j74354
$$ plain form
640 1387612 979081 804145 988592 622358 1274375 1072292 954277 1049278 1321458 1320237
630 1320237 1031876 344197 470608 652679 589139 204595 828665 1111566 1162778 710766
620 710766 74556 136406 626973 539244 605807 459410 1064505 1115570 595674 236974 801010
609 801010 1047500 1098156 652665 234541 458359 554711 643704 623231 774701 1084212 1624508
598 1624508 1157906 737051 811515 836935 1086493 714724 90864 319571 519288 739214
588 739214 913245 789442 1075600 898138 679589 933393 1346050 1094238 902242 1046222
578 1046222 1053336 1304541 701289 228976 351040 186815 456523 74905 -27899 327550
568 327550 736621 311454 -82023 -295366 41756 621172 1061172 1136705 1354722 1180368
558A180368m41419j73346k35482N96614P2494J38192j72783k19872M28778q9604
548A083940o59725l9175L23656j26064j54492L35047J49135N80993J20814j29790
538A484339k97671k22870j35058p8626l18574J52679N76713j0955L5641m17220
528G68398j59939q8612j41679J20411K25282N31564L60198n27445l54672j05344
518F28162K10344J6772L359l7790l72379M70889m04870n9529J24018M7879O58803
507A285658k61566m90421K3571M57935K15867l13277j66983R1411m24017m78788
497f0610m71146K26361M88736L60857o4408k00509R25718k94312m10292r8198
487D02197N95249L89346r4669o97274q2596Q4689l65109k73709l43062K22571
$$ plain form
558 1180368 738949 565603 330121 926735 999229 1137421 964638 744766 1173544 1083940
548 1083940 424215 385040 708696 582632 428140 763187 912322 1493315 1614129 1484339
538 1484339 1186668 963798 828740 750114 431540 584219 1160932 1149977 1185618 768398
528 768398 608459 519847 378168 498579 723861 1255425 1615623 1088178 733506 628162
518 628162 838506 855278 858637 820847 448468 919357 514487 454958 578976 626855 1285658
507 1285658 1024092 533671 557242 1015177 1231044 917767 750784 842195 418178 -60610
497 -60610 -531756 -305395 183341 544198 479790 279281 1204999 910687 500395 402197
487 402197 997446 1386792 1292123 594849 512253 596942 231833 -41876 -384938 -162367
477a62367N02481P4637K27914N3949J38716L96222K52592L37759K07408N1450
467B080761k55479k92499k50973Q3273N45523k90951m33557l78000l53873K12439
457F66664j2699j7461L74084m8345n0929k98330o74383K9445L95535P9457k47907
446A95131k24595K08236k26068n6557M06907K22027l21966k37465M03756K08122
436E77528K47724J70746k75250j58502q2244k61446j2578j90035K01999J59868
426C77810k36386M91557j62859p5902m2039N20406N23016l99521j60152O47049
416A482979N43993q1040m56123k85179j70221j54670N9293q3305M70757k64780
406A061704k64546j53855P836K30203p409l24583O32636n3674K31825m34281j48890
$$ plain form
477 -162367 340114 414751 642665 696614 835330 1231552 1484144 1821903 2029311 2080761
467 2080761 1825282 1532783 1281810 1365083 1910606 1619655 1186098 808098 454225 666664
457 666664 653965 636504 1010588 962243 911314 612984 -61399 -31954 363581 443038 195131
446 195131 -29464 178772 -47296 -103853 303054 525081 203115 -34350 369406 577528
436 577528 825252 995998 720748 562246 480002 218556 205978 15943 217942 377810
426 377810 141424 632981 470122 394220 352181 872587 1395603 996082 835930 1482979
416 1482979 2026972 1945932 1489809 1204630 1034409 879739 939032 855727 1326484 1061704
406 1061704 797158 643303 651139 881342 873933 549350 1181986 1128312 1360137 925856 776966
395G76966K00998p5945k62197m26505M02425P9971J58066k81263r2016L24626
385H05126j13917l09610r6719M30746N45744j17435n98657j55852R2953K39225
375G21604l48964l62569l0641O01745m51474P5919j66256p1366M81483k04004
365B45477M6633j2877M9653J23077J80926L28828L8611N9346k07674k58764N46666
354A139902M74438N64675o36522n19674j9086L320K72555k91319k12832K95001
344A070458K6594o43175l94388J47733J28717M71184j42701R7370L08167K21086
334A291045j84466j294K05835k62825J18376k45236p5592J13202l11599o0601
324E86845m79059K59045M09983K16145k57659n60978k91271N33601M117O4249
$$ plain form
395 776966 977964 902019 639822 213317 615742 695713 853779 572516 480500 805126
385 805126 691209 381599 284880 715626 1261370 1143935 545278 389426 482379 721604
375 721604 372640 10071 -20570 581175 129701 205620 39364 -32002 449481 245477
365 245477 292110 279233 328886 451963 632889 961717 1000328 1059674 852000 593236 1139902
354 1139902 1614340 2179015 1542493 1022819 1003733 1007053 1279608 988289 775457 1070458
344 1070458 1097052 453877 59489 207222 335939 807123 664422 761792 1069959 1291045
334 1291045 1106579 1105285 1311120 1048295 1166671 921435 845843 959045 647446 586845
324 586845 107786 366831 776814 992959 735300 174322 -116949 416652 420769 485018
314D85018j1858r1474R5369J84085J75099m97800J38789J28217K40053l23937
304E21561l25911p7564L37554K22429L09082o57342j50539O73994O1349m15811
294D98802o04271M48851Q42744o4121k39877k54019k09859K86682K67831O6295
284A039058R1735N67051j13023q43784m08486L43156O38814R299l75196k6743
274I21881J04616M0302m39931j76880j58496J69395J18641o2585k73191J5315
264B59067L80119n22520j74253J70709K06555k92469J09721J29232P8311M77537
254H22009L13862L7557L2534K40003N9262n76645n69586K28983M74920L03620
244A366519p21786m73561J05502L8408l80157j44671N20469M90460J15866p9063
$$ plain form
314 485018 473160 381686 477055 661140 836239 338439 477228 605445 845498 521561
304 521561 195650 118086 455640 678069 987151 329809 179270 853264 914613 498802
294 498802 -105469 343382 1186126 1122005 882128 628109 418250 704932 972763 1039058
284 1039058 1130793 1697844 1584821 741037 332551 675707 1314521 1323820 948624 921881
274 921881 1026497 1066799 626868 449988 291492 460887 579528 516943 243752 259067
264 259067 639186 116666 -57587 113122 319677 27208 136929 266161 344472 822009
254 822009 1135871 1173428 1205962 1445965 1505227 928582 358996 587979 1062899 1366519
244 1366519 644733 171172 276674 315082 -65075 -209746 310723 801183 917049 837986
234H37986j02023P6343j10617j65223L81500O29312l28282n89122j76731N17491
224I70634L36952m34290o37852j11749O2268K14506J16154K90091L78964J8193
214A203871j02010l79699P9083l33340Q110N2231J67528k3814N4263K75671l40133
203F61761p65021o9800L67348N40114O1223j18863M89747j91232n11902o07089
193a43714L29215N02360j05914J17231l74623j69121J64039k6258j71949k95824
183a74558K17077p1333j67969K91520K52337Q4675j83306J37344J75833j06568
173D55052N4886r3871L70907K0498L01567j55862J91298k18102j94373l38734
163C93266n1288L38466K52874k97062m46074k49622N55699J83802N8619P4995
$$ plain form
234 837986 735963 812306 701689 536466 917966 1547278 1218996 629874 453143 970634
224 970634 1307586 873296 235444 123695 185963 400469 516623 806714 1185678 1203871
214 1203871 1101861 722162 801245 467905 476015 528246 695774 671960 726223 1001894 661761
203 661761 -103260 -173060 194288 734402 795625 676762 1166509 975277 463375 -143714
193 -143714 185501 687861 581947 699178 324555 155434 319473 293215 121266 -174558
183 -174558 42519 -28814 -196783 94737 347074 431749 248443 385787 561620 455052
173 455052 509938 416067 786974 807472 1109039 953177 1144475 926373 732000 393266
163 393266 341978 680444 933318 636256 190182 -59440 496259 680061 738680 813675
153H13675J81860j6044m09530l86126J21339N55010J30936j21091l44369l00253
143B25407n5142K08509k9282k8496q3636Q31742o0696K925l10391N7599l25414
$$ plain form
153 813675 995535 979491 569961 183835 305174 860184 991120 870029 525660 225407
143 225407 170265 378774 349492 320996 237360 1069102 1008406 1011331 700940 758539 433125
$$ [...]
##END NTUPLES=NMR SPECTRUM
##END=
