##TITLE=1H_DE-80H_X3
 200.13MHz, d2o
 8 sc
 
 19ns.26.2.2025
##JCAMPDX= 6.0         $$ Bruker NMR JCAMP-DX V2.0
##DATA TYPE= NMR SPECTRUM
##DATA CLASS= NTUPLES
##ORIGIN= UXNMR, Bruker Analytische Messtechnik GmbH
##OWNER= pz
$$ XWIN-NMR		Version 3.5
$$ Tue Apr 21 13:27:46 2026 Russian Standard Time (UT+4h)  Yarkov@DPX200
##.OBSERVE FREQUENCY= 200.1313
##.OBSERVE NUCLEUS= ^1H
##.ACQUISITION MODE= SIMULTANEOUS
##.ACQUISITION SCHEME= undefined
##.AVERAGES= 8
##.DIGITISER RES= 18
##SPECTROMETER/DATA SYSTEM= spect
##.PULSE SEQUENCE= zg30
##.SOLVENT NAME= DMSO
##.SHIFT REFERENCE= (INTERNAL, DMSO, 0, 15.4935)
##AUDIT TRAIL= $$ (NUMBER, WHEN, WHO, WHERE, WHAT)
$$ ##TITLE= Audit trail, XWIN-NMR		Version 3.5
$$ ##JCAMPDX= 5.01
$$ ##ORIGIN= Bruker BioSpin GmbH
$$ ##OWNER= Yarkov
$$ C:/Bruker/XWIN-NMR/data/yarkov2/nmr/H-C/1/pdata/1/auditp.txt
$$ ##AUDIT TRAIL=  $$ (NUMBER, WHEN, WHO, WHERE, WHAT)
(   1,<2026-04-21 13:26:56.65 +0400>,<Yarkov>,<DPX200>,
      <created by zg, POWCHK disabled, PULCHK disabled
       configuration hash MD5:
       00 E9 B6 7A A2 85 ED C7 34 08 36 98 17 FE 4E 26
       data hash MD5: 16K
       AD 6B 94 AE 47 1E A2 1E 9C A7 74 40 97 64 5A F4>)
(   2,<2026-04-21 13:27:02.35 +0400>,<Yarkov>,<DPX200>,
      <Start of raw data processing
       efp BC_mod = 2 LB = 0.25 FT_mod = 6 PKNL = 1 PHC0 = -5302.316 PHC1 = 11.42193 SI = 16K 
       data hash MD5: 16K
       79 BB 5B AC FE FC F6 3E C8 B1 A0 02 9C AB 6E 1A>)
(   3,<2026-04-21 13:27:13.93 +0400>,<Yarkov>,<DPX200>,
      <abs ABSG = 5 
       data hash MD5: 16K
       69 5A 8C 75 A9 89 BC 19 C3 87 91 34 B9 97 0E 63>)
$$ ##END=
$$ 
$$ hash MD5
$$ F7 64 C2 34 F5 93 74 21 E9 33 EC 3F D0 7A 2F 95
##$RELAX= 
##$RELAX= 
##$RELAX= 
##$RELAX= 
##$RELAX= 
##$RELAX= 
$$ Bruker specific parameters
$$ --------------------------
##$DU= <C:/Bruker/XWIN-NMR>
##$EXPNO= 1
##$NAME= <H-C>
##$PROCNO= 1
##$TYPE= <nmr>
##$USER= <yarkov2>
##$AMP= (0..31)
100 100 100 100 100 100 100 100 100 100 100 100 100 100 100 100 100 100 
100 100 100 100 100 100 100 100 100 100 100 100 100 100 
##$AQSEQ= 0
##$AQ_mod= 1
##$AUNM= <au_zg>
##$AUTOPOS= <>
##$BF1= 200.13
##$BF2= 200.13
##$BF3= 200.13
##$BF4= 200.13
##$BF5= 200.13
##$BF6= 200.13
##$BF7= 200.13
##$BF8= 200.13
##$BYTORDA= 1
##$CFDGTYP= 0
##$CFRGTYP= 5
##$CHEMSTR= <none>
##$CNST= (0..31)
1 1 145 1 1 1 1 1 1 1 1 1 1 1 1 1 1 1 1 1 1 1 1 1 1 1 1 1 1 1 1 1 
##$CPDPRG= <>
##$CPDPRG1= <>
##$CPDPRG2= <>
##$CPDPRG3= <>
##$CPDPRG4= <mlev>
##$CPDPRG5= <mlev>
##$CPDPRG6= <mlev>
##$CPDPRG7= <mlev>
##$CPDPRG8= <mlev>
##$CPDPRGB= <>
##$CPDPRGT= <>
##$D= (0..31)
0 0.7 0 0 0 0 0 0 0 0 0 0.03 0 0 0 0 0 0 0 0 0 0 0 0 0 0 0 0 0 0 0 0 
##$DATE= 1776763616
##$DBL= (0..7)
120 120 120 120 120 120 120 120 
##$DBP= (0..7)
150 150 150 150 150 150 150 150 
##$DBP07= 0
##$DBPNAM0= <>
##$DBPNAM1= <>
##$DBPNAM2= <>
##$DBPNAM3= <>
##$DBPNAM4= <>
##$DBPNAM5= <>
##$DBPNAM6= <>
##$DBPNAM7= <>
##$DBPOAL= (0..7)
0.5 0.5 0.5 0.5 0.5 0.5 0.5 0.5 
##$DBPOFFS= (0..7)
0 0 0 0 0 0 0 0 
##$DE= 6
$$ [...]
##$SUBNAM3= <"">
##$SUBNAM4= <"">
##$SUBNAM5= <"">
##$SUBNAM6= <"">
##$SUBNAM7= <"">
##$SUBNAM8= <"">
##$SUBNAM9= <"">
##$SW= 18.0517328524113
##$SWIBOX= (0..15)
0 0 2 0 0 0 0 0 0 0 0 0 0 0 0 0 
##$SW_h= 3612.71676300578
##$TD= 16384
##$TD0= 1
##$TE= 0
##$TE2= 300
##$TE3= 300
##$TEG= 300
##$TL= (0..7)
0 120 120 120 120 120 120 120 
##$TP= (0..7)
150 150 150 150 150 150 150 150 
##$TP07= 0
##$TPNAME0= <>
##$TPNAME1= <>
##$TPNAME2= <>
##$TPNAME3= <>
##$TPNAME4= <>
##$TPNAME5= <>
##$TPNAME6= <>
##$TPNAME7= <>
##$TPOAL= (0..7)
0.5 0.5 0.5 0.5 0.5 0.5 0.5 0.5 
##$TPOFFS= (0..7)
0 0 0 0 0 0 0 0 
##$TUNHIN= 0
##$TUNHOUT= 0
##$TUNXOUT= 0
##$USERA1= <user>
##$USERA2= <user>
##$USERA3= <user>
##$USERA4= <user>
##$USERA5= <user>
##$V9= 5
##$VALIST= <valist>
##$VCLIST= <CCCCCCCCCCCCCCC>
##$VD= 0
##$VDLIST= <DDDDDDDDDDDDDDD>
##$VPLIST= <PPPPPPPPPPPPPPP>
##$VTLIST= <TTTTTTTTTTTTTTT>
##$WBST= 1024
##$WBSW= 4
##$XGAIN= (0..3)
0 0 0 0 
##$XL= 0
##$YL= 0
##$YMAX_a= 397755
##$YMIN_a= -373102
##$ZGOPTNS= <>
##$ZL1= 120
##$ZL2= 120
##$ZL3= 120
##$ZL4= 120
##$ABSF1= 15.46593
##$ABSF2= -2.585919
##$ABSG= 5
##$ABSL= 3
##$ALPHA= 0
##$AQORDER= 0
##$ASSFAC= 0
##$ASSFACI= 0
##$ASSFACX= 0
##$ASSWID= 0
##$AUNMP= <proc_1d>
##$AZFE= 0.1
##$AZFW= 0.1
##$BCFW= 0
##$BC_mod= 2
##$BYTORDP= 0
##$COROFFS= 0
##$CY= -3
##$DATMOD= 1
##$DC= 0
##$DFILT= <>
##$DTYPP= 0
##$F1P= 0
##$F2P= 0
##$FCOR= 1
##$FTSIZE= 16384
##$FT_mod= 6
##$GAMMA= 0
##$GB= 0
##$INTBC= 1
##$INTSCL= 3.241238e-09
##$ISEN= 128
##$LB= 0.25
##$LEV0= 0
##$LPBIN= 0
##$MAXI= 10000
##$MC2= 0
##$MEAN= 0
##$ME_mod= 0
##$MI= 1.114404
##$NCOEF= 0
##$NC_proc= -4
##$NLEV= 6
##$NOISF1= 3.799351
##$NOISF2= 2.8
##$NSP= 0
##$NTH_PI= 0
##$NZP= 0
##$OFFSET= 15.49348
##$PC= 1
##$PHC0= -5302.316
##$PHC1= 11.42193
##$PH_mod= 1
##$PKNL= yes
##$PPARMOD= 0
##$PSCAL= 0
##$PSIGN= 0
##$REVERSE= no
##$SF= 200.130005649574
##$SI= 16384
##$SIGF1= 3
##$SIGF2= 2
##$SINO= 0.751879
##$SIOLD= 32768
##$SREGLST= <19F.Aceton>
##$SSB= 0
##$STSI= 16384
##$STSR= 0
##$SW_p= 3612.71676300578
##$SYMM= 0
##$S_DEV= 0
##$TDeff= 16384
##$TDoff= 0
##$TI= <>
##$TILT= no
##$TM1= 0
##$TM2= 0
##$TOPLEV= 0
##$USERP1= <user>
##$USERP2= <user>
##$USERP3= <user>
##$USERP4= <user>
##$USERP5= <user>
##$WDW= 1
##$XDIM= 16384
##$YMAX_p= 342304283
##$YMIN_p= -372463
$$ End of Bruker specific parameters
$$ ---------------------------------
##NTUPLES= NMR SPECTRUM
##VAR_NAME=  FREQUENCY,     SPECTRUM/REAL,   SPECTRUM/IMAG
##SYMBOL=    X,             R,               I
##VAR_TYPE=  INDEPENDENT,   DEPENDENT,       DEPENDENT
##VAR_FORM=  AFFN,          ASDF,            ASDF
##VAR_DIM=   16384,         16384,           16384
##UNITS=     HZ,            ARBITRARY UNITS, ARBITRARY UNITS
##FACTOR=    0.220516191357247, 1,           1
##FIRST=     3100.71018563604, 0,            0
##LAST=      -512.006577369743, 0,           0
##MIN=       -512.006577369743, -372463,     0
##MAX=       3100.71018563604, 342304283,    0
$$ Real data points
##PAGE= N=1
##DATA TABLE= (X++(R..R)), XYDATA
$$ [...]
##PAGE= N=2
##DATA TABLE= (X++(I..I)), XYDATA
$$ plain form
7198 1483195 1486787 1607409 1644773 1558290 1535661 1456030 1453222 1514802 1511293 1523674 1503213 1466129
7186 1466129 1493182 1540586 1476328 1709372 1637279 1547297 1595134 1626868 1607486 1586840 1648795
7175 1648795 1637952 1622062 1522439 1550096 1570264 1480606 1438730 1529668 1521216 1531543 1584206 1645626
7163 1645626 1659134 1572866 1464363 1530048 1558332 1500188 1471165 1499321 1581266 1583732 1400029
7152 1400029 1429535 1517374 1537587 1636719 1602853 1564311 1530134 1555940 1532855 1636532 1634726
7141 1634726 1695476 1687208 1556556 1580301 1637191 1530455 1607589 1721013 1634332 1589005 1542499
7130 1542499 1580786 1594665 1543727 1495538 1614568 1722326 1620289 1683296 1775595 1650242 1594120
7119 1594120 1593050 1541167 1588127 1521025 1526391 1614135 1586868 1513525 1604889 1556105 1567412 1653463
$$ packed form
7198A483195L592J20622L7364q6483k2629p9631k808O1580l509J2381k0461l7084
7186A466129K7053M7404o4258K33044p2093q9982M7837L1734j9382k0646O1955
7175A648795j0843j5890r9623K7657K0168q9658m1876R0938q452J0327N2663O1420
7163A645626J3508q6268j08503O5685K8284n8144k9023K8156Q1945K466j83703
7152A400029K9506Q7839K0213R9132l3866l8542l4177K5806k3085J03677j806
7141A634726O0750q268j30652K3745N6890j06736P7134J13424q6681m5327m6506
7130A542499L8287J3879n0938m8189J19030J07758j02037O3007R2299j25353n6122
7119A594120j070n1883M6960o7102N366Q7744k7267p3343R1364m8784J1307Q6051
$$ plain form
7107 1653463 1765381 1717147 1730176 1590998 1616421 1715302 1626753 1742398 1733310 1650658 1620519
7096 1620519 1492981 1432996 1510195 1491300 1617274 1606710 1605129 1548641 1547584 1654277 1697817
7085 1697817 1745513 1755645 1751263 1646160 1636257 1637293 1579670 1658480 1816106 1682307 1727323
7074 1727323 1802558 1738493 1712364 1690336 1656715 1589920 1642341 1756979 1747324 1796869 1814179
7063 1814179 1861062 1797183 1613347 1763553 1822812 1851944 1818051 1772031 1686797 1694927 1698049
7052 1698049 1575616 1574322 1646746 1683296 1641062 1673723 1735211 1774026 1642290 1671029 1763728
7041 1763728 1770924 1787930 1661907 1665808 1704261 1690600 1649109 1729930 1802895 1905672 1839022
7030 1839022 1718823 1667694 1735889 1714998 1716480 1761650 1817441 1788441 1738569 1750670 1763768
$$ packed form
7107A653463J11918m8234J3029j39178K5423R8881q8549J15645r088q2652l0139
7096A620519j27538n9985P7199j8895J25974j0564j581n6488j057J06693M3540
7085A697817M7696J0132m382j05103r903J036n7623P8810J57626j33799M5016
7074A727323P5235o4065k6129k2028l3621o6795N2421J14638r655M9545J7310
7063A814179M6883o3879j83836J50206N9259K9132l3893m6020q5234Q130L122
7052A698049j22433j294P2424L6550m2234L2661O1488L8815j31736K8739R2699
7041A763728P196J7006j26023L901L8453j3661m1491Q0821P2965J02777o6650
7030A839022j20199n1129O8195k0891J482M5170N5791k9000m9872J2101J3098
$$ plain form
7019 1763768 1770932 1753003 1857022 1943272 1913514 1765125 1724245 1865625 1881767 1890586 1986963
7008 1986963 2022348 1964965 1870049 1894758 1808517 1642703 1680274 1813952 1887855 1883904 1804207
6997 1804207 1764050 1822855 1852398 1900957 1915397 1916159 1869472 1818881 1777054 1730702 1668333 1806073
6985 1806073 1906633 1855507 1804577 1817726 1747921 1696632 1836931 1836149 1851373 1917465 1933208
6974 1933208 1927085 1932095 1942249 2038270 2021964 2013064 2047982 2020045 1954508 1791879 1862497 1980450
6962 1980450 1956229 1946036 1940320 1960007 1877757 1953842 2045100 2066174 1962980 2000659 1953939
6951 1953939 1903975 1859950 1844431 1959209 1921263 1988763 1966537 1819951 1799327 1825307 1881211
6940 1881211 1908827 1934779 1845862 1848728 1881728 1714434 1862491 2042285 1947009 2048122 2063149
$$ packed form
7019A763768P164j7929J04019Q6250k9758j48389m0880J41380J6142Q819R6377
7008A986963L5385n7383r4916K4709q6241j65814L7571J33678P3903l951p9697
6997A804207m0157N8805K9543M8559J4440P62m6687n0591m1827m6352o2369J37740
6985A806073J00560n1126n0930J3149o9805n1289J40299p82J5224O6092J5743
6974A933208o123N010J0154R6021j6306q900L4918k7937o5537j62629P0618J17953
6962A980450k4221j0193n716J9687q2250P6085R1258K1074j03194L7679m6720
6951A953939m9964m4025j5519J14778l7946O7500k2226j46586k0624K5980N5904
6940A881211K7616K5952q8917K866L3000j67294J48057J79794r5276J01113J5027
$$ plain form
6929 2063149 1872371 1851701 1763476 1876096 1839605 1891145 1998003 1966797 1945639 1944752 2015337
6918 2015337 2024303 2158798 2035249 1931122 1960773 1906619 1860066 1967373 1899193 2063108 2117533
6907 2117533 2062764 2066637 2048031 2096633 2133803 2094605 2071182 2051177 2024747 2069141 2137418 2127872
6895 2127872 2119048 2100587 2037086 2062975 2084157 1998244 1921626 2001514 1888510 1914580 2015801
6884 2015801 2131880 2128844 2217848 2199823 2199461 2208404 2245030 2146712 2137952 2170951 2046211 2086119
6872 2086119 1973693 1979924 2090240 2179080 2048102 2068786 2125499 2140558 2115643 2130923 2213446
6861 2213446 2076221 2075474 2058762 2212737 2243695 2069990 2119732 2226850 2141561 2018235 1999310
6850 1999310 2071949 2013965 2056320 2006698 1989780 2042447 2115276 2268332 2241502 2093943 2129469
$$ packed form
6929B063149j90778k0670q8225J12620l6491N1540J06858l1206k1158q87P0585
6918B015337Q966J34495j23549j04127K9651n4154m6553J07307o8180J63915N4425
6907B117533n4769L873j8606M8602L7170l9198k3423k0005k6430M4394O8277r546
6895B127872q824j8461o3501K5889K1182q5913p6618P9888j13004K6070J01221
6884B015801J16079l036Q9004j8025l62Q943L6626r8318q760L2999j24740L9908
6872B086119j12426O231J10316Q8840j30978K0684N6713J5059k4915J5280Q2523
6861B213446j37225p47j6712J53975L0958j73705M9742J07118q5289j23326j8925
6850A999310P2639n7984M2355m9622j6918N2667P2829J53056k6830j47559L5526
$$ plain form
6839 2129469 2148949 2145685 2229059 2278591 2296283 2152729 2219078 2251122 2184704 2198177 2289888
6828 2289888 2252777 2249615 2227807 2225410 2213693 2274730 2283752 2353886 2315335 2120249 2108812 2042112
6816 2042112 2084795 2063493 2177413 2212102 2148575 2148507 2225870 2225393 2254743 2316610 2329489 2333504
6804 2333504 2275564 2240689 2244144 2312812 2341952 2395084 2388464 2328925 2270984 2304932 2416658 2389881
6792 2389881 2275319 2442046 2322309 2364977 2422404 2356439 2488890 2587593 2494583 2459522 2461626
6781 2461626 2357435 2310700 2311190 2324255 2344102 2279621 2337601 2383170 2293817 2379869 2468855 2388617
6769 2388617 2336980 2422986 2372257 2529875 2558752 2453342 2394804 2532057 2533115 2462036 2479955
6758 2479955 2475792 2525302 2472973 2427879 2532088 2593465 2526033 2501151 2510859 2567845 2591820 2543413
$$ packed form
6839B129469J9480l264Q3374M9532J7692j43554O6349L2044o6418J3473R1711
6828B289888l7111l162k1808k397j1717O1037R022P0134l8551j95086j1437o6700
6816B042112M2683k1302J13920L4689o3527o8P7363m77K9350O1867J2879M015
6804B333504n7940l4875L455O8668K9140N3132o620n9539n7941L3948J11726k6777
6792B389881j14562J66727j19737M2668N7427o5965J32451R8703r3010l5061K104
6781B461626j04191m6735M90J3065J9847o4481N7980M5569q9353Q6052Q8986q0238
6769B388617n1637Q6006n0729J57618K8877j05410n8538J37253J058p1079J7919
6758B479955m163M9510n2329m5094J04209O1377o7432k4882R708N6986K3975m8407
$$ plain form
6746 2543413 2606218 2651014 2588820 2524612 2504129 2531349 2584257 2558262 2449382 2500724 2476882
6735 2476882 2516637 2503116 2471726 2430674 2450089 2339828 2332557 2411722 2467368 2423500 2491530
6724 2491530 2521492 2373013 2472866 2517444 2578977 2517263 2494181 2487352 2444166 2368346 2454911
6713 2454911 2538307 2559377 2624498 2563564 2458054 2596801 2643420 2575331 2655753 2666041 2568681
6702 2568681 2561575 2610144 2642996 2720722 2769365 2676496 2627913 2627489 2598024 2647689 2635963 2735541
6690 2735541 2744606 2670945 2678545 2697695 2680008 2618408 2668716 2639375 2658674 2626717 2574653 2652627
6678 2652627 2624485 2483183 2613344 2683059 2676800 2754089 2657391 2749533 2689330 2698141 2761587
6667 2761587 2824042 2827318 2756259 2720125 2689969 2744857 2645417 2728907 2835778 2729022 2812308
$$ packed form
6746B543413O2805M4796o2194o4208k0483K7220N2908k5995j08880N1342k3842
6735B476882L9755j3521l1390m1052J9415j10261p271P9165N5646m3868O8030
6724B491530K9962j48479R9853M4578O1533o1714k3082o829m3186p5820Q6565
6713B454911Q3396K1070O5121o0934j05510J38747M6619o8089Q0422J0288r7360
6702B568681p106M8569L2852P7726M8643r2869m8583m24k9465M9665j1726R9578
6690B735541R065p3661P600J9150j7687o1600N0308k9341J9299l1957n2064P7974
6678B652627k8142j41302J30161O9715o259P7289r6698R2142o0203Q811O3446
6667B761587O2455L276p1059l6134l0156N4888r9440Q3490J06871j06756Q3286
$$ plain form
6656 2812308 2852382 2772124 2847784 2947685 2917380 2816376 2971991 3020038 2987304 2926569 2986392
6645 2986392 2963439 2959568 3009583 3003162 3084157 3057188 3055812 3076780 3002374 3032798 3140279 3090491
6633 3090491 3190987 3141352 3008747 3070675 3089954 3000437 3120764 3106646 3084233 3075545 2994994
6622 2994994 3035029 2986432 3107565 3199184 3196818 3185934 3291779 3268776 3211484 3196892 3163734
6611 3163734 3217899 3287581 3227097 3270310 3256972 3232774 3322472 3305635 3329325 3357081 3497436
6600 3497436 3538061 3481614 3491565 3571465 3621321 3732810 3745060 3689289 3564802 3573179 3658725
6589 3658725 3605648 3625492 3606666 3693425 3639376 3654146 3631241 3726998 3844501 3714253 3687925
6578 3687925 3759209 3820950 3766237 3872261 3824764 3852748 3713414 3813488 3817286 3735805 3767753
$$ packed form
6656B812308M0074q0258P5660R9901l0305j01004J55615M8047l2734o0735N9823
6645B986392k2953l871N0015o421Q0995k6969j376K0968p4406L0424J07481m9788
6633C090491J00496m9635j32605O1928J9279q9517J20327j4118k2413q688q0551
6622B994994M0035m8597J21133R1619k366j0884J05845k3003n7292j4592l3158
6611C163734N4165O9682o0484M3213j3338k4198Q9698j6837K3690K7756J40355
6600C497436M0625n6447R951P9900M9856J11489J2250n5771j24487Q377Q5546
6589C658725n3077J9844j8826Q6759n4049J4770k2905R5757J17503j30248k6328
6578C687925P1284O1741n4713J06024m7497K7984j39334J00074L798q1481L1948
$$ plain form
6567 3767753 3837014 3923089 3768376 3796808 3807105 3792909 3869616 3856972 3838612 3931855 3871250
6556 3871250 3903865 3804255 3801751 3785627 3666081 3661343 3533725 3586048 3572473 3539638 3546895 3547511
6544 3547511 3546225 3415591 3484798 3477137 3410587 3410282 3389975 3337360 3324147 3349897 3322806 3451248
6532 3451248 3425735 3383658 3369686 3357496 3224919 3301248 3265193 3292166 3299448 3283402 3300998
6521 3300998 3194834 3110731 3090788 3269977 3256257 3241533 3100110 3003270 2951232 2970278 2885827
6510 2885827 2890947 2854197 2755067 2629772 2464500 2505155 2561316 2518441 2510525 2460607 2470760
6499 2470760 2429896 2319373 2395289 2416707 2372576 2392072 2436152 2429680 2434434 2482406 2393425 2317711
6487 2317711 2434137 2286369 2346993 2414281 2385677 2389017 2316411 2375521 2232946 2202445 2168325
$$ packed form
6567C767753O9261Q6075j54713K8432J0297j4196P6707j2644j8360R3243o0605
6556C871250L2615r9610k504j6124j19546m738j27618N2323j3575l2835P257O16
6544C547511j286j30634O9207p661o6550l05k0307n2615j3213K5750k7091J28442
6532C451248k5513m2077j3972j2190j32577P6329l6055K6973P282j6046J7596
6521C300998j06164q4103j9943J79189j3720j4724j41423r6840n2038J9046q4451
6510B885827N120l6750r9130j25295j65272M0655N6161m2875p916m9918J0153
6499B470760m0864j10523P5916K1418m4131J9496M4080o472M754M7972q8981p5714
6487B317711J16426j47768O0624O7288k8604L340p2606N9110j42575l0501l4120
$$ plain form
6476 2168325 2060312 2018360 1994484 1993900 1969718 1871749 1900218 1836327 1827691 1771173 1759839 1857778
6464 1857778 1901552 1864945 1777471 1817814 1811114 1835809 1833980 1770293 1865649 1891401 1820661 1765467
6452 1765467 1924946 1945276 1933998 1993264 1901433 1894146 1897614 1981191 2043552 1957515 1920389 1915924
6440 1915924 1882659 1907430 1780976 1796517 1731492 1736957 1721834 1690271 1755371 1685622 1740908
6429 1740908 1732537 1610033 1589805 1706072 1678569 1679140 1667721 1639830 1615852 1646590 1700489 1768308
6417 1768308 1746450 1702995 1754807 1760869 1758924 1683147 1736313 1866970 1874378 1856536 1924642 1900013
6405 1900013 1829017 1894955 1862952 1872936 1844535 1861767 1945677 1896856 1796835 1791175 1918754
6394 1918754 1858020 1897125 1910314 1924022 1813349 1824296 1923037 1959390 2082548 2104951 2025243
$$ packed form
6476B168325j08013m1952k3876n84k4182r7969K8469o3891q636n6518j1334R7939
6464A857778M3774l6607q7474M0343o700K4695j829o3687R5356K5752p0740n5194
6452A765467J59479K0330j1278N9266r1831p287L468Q3577O2361q6037l7126m465
6440A915924l3265K4771j26454J5541o5025N465j5123l1563O5100o9749N5286
6429A740908q371j22504k0228J16267k7503N71j1419k7891k3978L0738N3899O7819
6417A768308k1858m3455N1812O062j945p5777N3166J30657P408j7842O8106k4629
6405A900013p0996O5938l2003R984k8401J7232Q3910m8821j00021n660J27579
6394A918754o0734L9105J3189J3708j10673J0947R8741L6353J23158K2403p9708
$$ plain form
6383 2025243 2030522 2108856 2058318 2104669 2212907 2135754 2048422 2025356 1997015 2086569 2145549
6372 2145549 2205030 2183739 2090692 2155318 2137932 2195886 2269284 2347142 2225342 2223118 2287084
6361 2287084 2218068 2269557 2326432 2323969 2305862 2327269 2381628 2399166 2440686 2454780 2449031 2494474
6349 2494474 2399008 2447381 2577773 2570606 2432252 2265364 2313996 2354664 2440833 2384139 2410708
6338 2410708 2456379 2399946 2334332 2235372 2309232 2474027 2552598 2576646 2599698 2463800 2355707
6327 2355707 2546248 2619496 2558774 2567328 2506620 2647774 2565661 2455303 2616507 2698593 2691475
6316 2691475 2659084 2666412 2674551 2625315 2609361 2541865 2647048 2624012 2655040 2733890 2605275
6305 2605275 2623404 2598324 2610282 2701896 2782352 2718316 2760413 2722854 2644914 2648376 2684258 2788388
$$ packed form
6383B025243N279P8334n0538M6351J08238p7153q7332k3066k8341Q9554N8980
6372B145549N9481k1291r3047O4626j7386N7954P3398P7858j21800k224O3966
6361B287084o9016N1489N6875k463j8107K1407N4359J7538M1520J4094n749M5443
6349B494474r5466M8373J30392p167j38354j66888M8632M0668Q6169n6694K6569
6338B410708M5671n6433o5614r8960P3860J64795P8571K4048K3052j35898j08093
6327B355707J90541P3248o0722Q554o0708J41154q2113j10358J61204Q2086p118
6316B691475l2391P328Q139m9236j5954o7496J05183k3036L1028P8850j28615
6305B605275J8129k5080J1958R1614Q0456o4036M2097l7559p7940L462L5882J04130
$$ plain form
6293 2788388 2912613 2929316 2765874 2845478 2954361 2902966 3006715 2978551 2944927 2937436 2719995
6282 2719995 2810682 2979073 3024190 2977886 2953957 2995174 2962429 2816864 3002356 3072999 3119647
6271 3119647 3031644 2997771 3021127 3143756 3188492 3258364 3447706 3394741 3191319 3069823 3121102
6260 3121102 3120707 3084372 3145751 3252814 3248841 3299721 3183514 3238939 3320682 3238968 3289299 3326100
6248 3326100 3322312 3236165 3353068 3352545 3337125 3306776 3315701 3502094 3496178 3422310 3426826 3426315 3434702
6235 3434702 3491752 3419654 3499293 3590008 3559122 3516836 3631300 3531187 3560177 3722594 3789099
6224 3789099 3692606 3711520 3630053 3541318 3718921 3731856 3765051 3692965 3776093 3835748 3771134
6213 3771134 3775657 3824049 3928563 3938976 3890897 3890582 3965896 3953813 4050826 4050140 4070438 4038323
$$ packed form
6293B788388J24225J6703j63442P9604J08883n1395J03749k8164l3624p491k17441
6282B719995R0687J68391M5117m6304k3929M1217l2745j45565J85492P0643M6648
6271C119647q8003l3873K3356J22629M4736O9872J89342n2965k03422j21496N1279
6260C121102l95l6335O1379J07063l973N0880j16207N5425Q1743q1714N0331L6801
6248C326100l788q6147J16903n23j5420l0349Q925J86393n916p3868M516n11Q387
6235C434702N7050p2098P9639R0715l0886m2286J14464j00113K8990J62417O6505
6224C789099r6493J8914q1467q8735J77603J2935L3195p2086Q3128N9655o4614
6213C771134M523M8392J04514J0413m8079l15P5314j2083R7013o86K0298l2115
$$ plain form
6201 4038323 4007253 4150610 4253846 4275723 4247147 4291205 4296765 4195402 4242170 4386465 4428305
6190 4428305 4452097 4553662 4591694 4574333 4567641 4629378 4782033 4771468 4769365 4847568 4708833
6179 4708833 4562420 4667755 4756497 4767854 4820646 4787673 4713776 4719943 4588559 4560944 4679674
6168 4679674 4596380 4692029 4829403 4924610 4943709 4881837 4882976 4620605 4445960 4429575 4419423
6157 4419423 4464805 4304807 4116041 4026004 3728992 3698991 3778592 3886412 3937357 3952068 4159679
6146 4159679 4184929 4309995 4323227 4634482 4908817 4862240 4974864 5120142 5165155 5192198
6136 5192198 5173249 5202800 5374295 5313599 5307375 5254472 5405086 5537887 5711776 5914985 5998411
6125 5998411 6074443 6344097 6458909 6485675 6604777 6590002 6532071 6399820 6346777 6062012
$$ packed form
6201D038323l1070J43357J03236K1877k8576M4058N560j01363M6768J44295M1840
6190D428305K3792J01565L8032j7361o692O1737J52655j0565k103P8203j38735
6179D708833j46413J05335Q8742J1357N2792l2973p3897O167j31384k7615J18730
6168D679674q3294R5649J37374R5207J9099o1872J139k62371j74645j6385j0152
6157D419423M5382j59998j88766r0037k97012l0001P9601J07820N0945J4711K07611
6146D159679K5250J25066J3232L11255K74335m6577J12624J45278M5013K7043
6136E192198j8949K9551J71495o0696o224n2903J50614J32801J73889K03209Q3426
6125E998411P6032K69654J14812K6766J19102j4775n7931j32251n3043k84765
$$ plain form
6115 6062012 5956867 5830511 5652992 5662530 5544733 5557342 5687754 5563704 5471778 5354802
6105 5354802 5121169 4748363 4399064 4205286 4026310 3853141 3683130 3626159 3632093 3662763
6095 3662763 3582533 3464461 3252600 2956877 2623921 2265254 2042590 1886589 1959100 2062301
6085 2062301 2251391 2413339 2345264 2520088 2629262 2684730 2970947 3134496 3340671 3499764
6075 3499764 3426809 3244295 3016325 2753956 2462080 2349776 2275015 2211851 2267727 2023798
6065 2023798 1888188 1762923 1447463 1106298 721593 350712 -63686 -441097 -667299 -812577
6055 -812577 -951014 -1054468 -1079414 -1123173 -1024369 -931178 -934853 -763871 -483263 -265328 -207689
6044 -207689 -8155 184860 386453 405885 488878 773449 856808 939510 1012326 997490 1060982
$$ packed form
6115F062012j05145j26356j77519R538j17797J2609J30412j24050r1926j16976
6105E354802k33633l72806l49299j93778j78976j73169j70011n6971N934L0670
6095C662763q0230j18072k11861k95723l32956l58667k22664j56001P2511J03201
6085B062301J89090J61948o8075J74824J09174N5468K86217J63549K06175J59093
6075C499764p2955j82514k27970k62369k91876j12304p4761o3164N5876k43929
6065B023798j35610j25265l15460l41165l84705l70881m14398l77411k26202j45278
6055h12577j38437j03454k4946m3759R8804R3191l675J70982K80608K17935N7639
6044b07689J99534J93015K01593J9432Q2993K84571Q3359Q2702P2816j4836O3492
$$ plain form
6033 1060982 1022235 977372 1076660 1121955 1117940 1246142 1327456 1330842 1447164 1626038 1625718 1757151
6021 1757151 1800752 1672988 1481513 1228168 1110315 992350 843251 772286 792729 795146
6011 795146 780901 850999 1073511 1222592 1273954 1300762 1361414 1444920 1465792 1631571 1652686
6000 1652686 1789985 1881499 1904643 1949593 2030679 2106235 2301194 2475128 2481776 2572603 2417430
5989 2417430 2123664 1723998 1354186 1188152 1052280 961305 1082823 1215359 1156767 1247318
5979 1247318 1339780 1349785 1404575 1519686 1486947 1502837 1498046 1544706 1632723 1627810 1721485 1773642
5967 1773642 1876199 1858561 1799005 1785899 1727628 1710237 1785876 1884553 1958314 1903490 2001690
5956 2001690 2097576 2170864 2108009 2191796 2328086 2350081 2354829 2318100 2275978 2326826 2373500
$$ packed form
6033A060982l8747m4863R9288M5295m015J28202Q1314L386J16322J78874l20J31433
6021A757151M3601j27764j91475k53345j17853j17965j49099p0965K0443K417
6011G95146j4245P0098K22512J49081N1362K6808O0652Q3506K0872J65779K1115
6000A652686J37299R1514K3144M4950Q1086P5556J94959J73934O648R0827j55173
5989B417430k93766l99666l69812j66034j35872r0975J21518J32536n8592R0551
5979A247318R2462J0005N4790J15111l2739J5890m791M6660Q8017m913R3675N2157
5967A773642J02557j7638n9556j3106n8271j7391P5639R8677P3761n4824R8200
5956B001690R5886P3288o2855Q3787J36290K1995M748l6729m2122N0848M6674
$$ plain form
5945 2373500 2355673 2399834 2410658 2372641 2350397 2345672 2426902 2373167 2407653 2562229 2559127 2533878
5933 2533878 2469278 2547243 2603416 2623379 2637144 2605569 2761455 2860622 2859285 2826502 2817162 2894301
5921 2894301 2936327 2843419 3007764 2978474 2938263 2951235 3064643 3088767 3082968 3202698 3254060
5910 3254060 3348836 3310973 3341703 3317973 3311208 3340745 3454976 3476902 3551021 3525955 3338766
5899 3338766 3430372 3467844 3390160 3383581 3440940 3451453 3464406 3499211 3552565 3641773 3808436
5888 3808436 3912148 3919223 3987864 3993066 3929726 3972684 4102557 4073795 3998237 4067477 4172136
5877 4172136 4149204 4094204 4115964 4236146 4373123 4314219 4247224 4299427 4274057 4313834 4228288
5866 4228288 4397879 4400651 4494929 4562485 4512236 4664846 4728963 4876092 4886327 4960721 5088142
$$ packed form
5945B373500j7827M4161J0824l8017k2244m725Q1230n3735L4486J54576l102k5249
5933B533878o4600P7965N6173J9963J3765l1575J55886R9167j337l2783r340P7139
5921B894301M2026r2908J64345k9290m0211J2972J13408K4124n799J19730N1362
5910C254060R4776l7863L0730k3730o765K9537J14231K1926P4119k5066j87189
5899C338766R1606L7472p7684o579N7359J0513J2953L4805N3354Q9208J66663
5888C808436J03712P075O8641N202o3340M2958J29873k8762p5558O9240J04659
5877D172136k2932n5000K1760J20182J36977n8904o6995N2203k5370L9777q5546
5866D228288J69591K772R4278O7556n0249J52610O4117J47129J0235P4394J27421
$$ plain form
5855 5088142 5212382 5317844 5389436 5474623 5592089 5566658 5662581 5732539 5733223 5797724 5828656
5844 5828656 6046822 6060502 6018614 6160438 6332578 6354713 6386055 6583855 6678893 6575641
5834 6575641 6502417 6346768 6160359 6027562 5749359 5631563 5585796 5239152 5088641 4874512
5824 4874512 4767303 4528186 4351650 4238329 3969592 3926318 3785877 3650072 3515492 3624304
5814 3624304 3692392 3593058 3454345 3493906 3347041 3154175 3075166 3098497 3089262 2961338 2887588
5803 2887588 2843285 2777753 2704219 2793266 2883199 2919840 2825252 2817818 2867833 2869317 2879285 2806893
5791 2806893 2810498 2601184 2475608 2455187 2340503 2367121 2262408 2281793 2466232 2501691 2565164
5780 2565164 2622610 2589862 2653362 2580509 2404307 2256283 2111629 1792016 1476800 1087032
$$ packed form
5855E088142J24240J05462P1592Q5187J17466k5431R5923O9958O84O4501L0932
5844E828656K18166J3680m1888J41824J72140K2135L1342J97800R5038j03252
5834F575641p3224j55649j86409j32797k78203j17796m5767l46644j50511k14129
5824D874512j07209k39117j76536j13321k68737m3274j40441j35805j34580J08812
5814C624304O8088r9334j38713L9561j46865j92866p9009K3331r235j27924p3750
5803B887588m4303o5532p3534Q9047Q9933L6641r4588p434N0015J484R968p2392
5791B806893L605k09314j25576k0421j14684K6618j04713J9385J84439L5459O3473
5780B565164N7446l2748O3500p2853j76202j48024j44654l19613l15216l89768
$$ plain form
5770 1087032 582881 263104 37531 -133285 -115488 -123391 -73056 -35603 4813 145819 187148
5759 187148 213849 497236 593421 641122 764408 833749 914187 928511 960721 935382 835790
5748 835790 613885 275839 -79783 -493436 -848486 -1163271 -1339655 -1423480 -1516066 -1620452
5738 -1620452 -1721540 -1734101 -1639919 -1461126 -1360537 -1182227 -1028220 -990285 -975453 -988023
5728 -988023 -768009 -587557 -402355 -379261 -448303 -383591 -436581 -362425 -266109 -252053 -147746
5717 -147746 -30857 -67086 52949 166451 377093 476073 468734 497005 565800 493688 482838
5706 482838 603182 648411 554054 639675 741368 721906 815335 861898 972895 1029073 1044979
5695 1044979 1283824 1237926 1176248 1307848 1194269 1166008 1189554 1181294 1158457 1209726 1310135
$$ packed form
5770A087032n04151l19777k25573j70816J7797p903N0335L7453M0416J41006M1329
5759A87148K6701K83387R6185M7701J23286O9341Q0438J4324L2210k5339r9592
5748H35790k21905l38046l55622m13653l55050l14785j76384q3825r2586j04386
5738a620452j01088j2561R4182J78793J00589J78310J54007L7935J4832j2570
5728i88023K20014J80452J85202K3094o9042O4712n2990P4156R6316J4056J04307
5717a47746J16889l6229J20035J13502K10642R8980p339K8271O8795p2112j0850
5706D82838J20344M5229r4357Q5621J01693j9462R3429M6563J10997N6178J5906
5695A044979K38845m5898o1678J31600j13579k8261K3546q260k2837N1269J00409
$$ plain form
5684 1310135 1191352 1294430 1339068 1283664 1389707 1452978 1447018 1535312 1493683 1513703 1545134
5673 1545134 1722317 1732965 1674536 1629469 1687009 1668058 1650062 1758348 1735790 1842049 1874698
5662 1874698 1895089 2000774 2100192 2155677 2163234 2230336 2166726 2264701 2326710 2229052 2248874
5651 2248874 2140318 2033201 2116593 2206828 2402339 2365014 2293819 2305221 2333063 2328181 2372106
5640 2372106 2535656 2558854 2554260 2444243 2476390 2532890 2576692 2535107 2697686 2670635 2585046
5629 2585046 2553639 2730144 2703635 2855414 3010181 3012514 3028181 3168984 3289032 3339465 3464864
5618 3464864 3572300 3569406 3382450 3282686 3283835 3197458 3103133 3104476 3185747 3266016 3231864 3309540
5606 3309540 3458388 3461818 3483627 3488412 3472931 3522402 3619843 3644166 3558121 3507530 3570079 3604293
$$ packed form
5684A310135j18783J03078M4638n5404J06043O3271n960Q8294m1629K0020L1431
5673A545134J77183J0648n8429m5067N7540j8951j7996J08286k2558J06259L2649
5662A874698K0391J05685R9418N5485P557O7102o3610R7975O2009r7658J9822
5651B248874j08556j07117Q3392R0235J95511l7325p1195J1402K7842m882M3925
5640B372106J63550K3198m594j10017L2147N6500M3802m1585J62579k7051q5589
5629B585046l1407J76505k6509J51779J54767K333J5667J40803J20048N0433J25399
5618C464864J07436k894j86956r9764J149q6377r4325J343Q1271Q0269l4152P7676
5606C309540J48848L430K1809M785j5481M9471R7441K4323q6045n0591O2549L4214
$$ plain form
5594 3604293 3758758 3709649 3763605 3766198 3768506 3698599 3773608 3837227 4014708 3997371 4012729
5583 4012729 4129845 4167809 4383144 4492965 4638024 4784681 4925048 5017253 5179861 5334284
5573 5334284 5527451 5740482 5974688 6133225 6427793 6666361 6623391 6486845 5987760 5437496
5563 5437496 4749621 4097943 3763252 3597344 3482588 3404099 3550737 3879470 4157111 4335845
5553 4335845 4635054 4738939 4763871 4607596 4426926 4063078 3597067 3013000 2427177 1719602
5543 1719602 982393 322033 -160875 -520173 -697494 -835978 -873864 -882320 -829739 -800727
5533 -800727 -835871 -748937 -788649 -838546 -944936 -1058785 -1082474 -1422565 -1632758 -1814078 -1897186
5522 -1897186 -2027052 -2053980 -1962099 -1743762 -1560845 -1400495 -1246079 -971520 -821287 -814128
$$ packed form
5594C604293J54465m9109N3956K593K308o9907P5009O3619J77481j7337J5358
5583D012729J17116L7964K15335J09821J45059J46657J40367R2205J62608J54423
5573E334284J93167K13031K34206J58537K94568K38568m2970j36546m99085n50264
5563E437496o87875o51678l34691j65908j14756p8489J46638L28733K77641J78734
5553D335845K99209J03885K4932j56275j80670l63848m66011n84067n85823p07575
5543A719602p37209o60360m82908l59298j77321j38484l7886q456N2581K9012
5533h00727l5144Q6934l9712m9897j06390j13849k3689l40091k10193j81320q3108
5522a897186j29866k6928R1881K18337J82917J60350J54416K74559J50233P159
$$ plain form
5512 -814128 -603643 -495961 -466986 -369791 -236285 -193687 -157979 -25333 78174 216302
5502 216302 372411 403770 310726 391143 322134 327572 357512 436791 400278 363305 300314 209251
5490 209251 370225 368452 448041 631485 787730 704428 667892 792443 859565 868872 855772
5479 855772 871207 899739 761074 755394 797946 842583 841649 729536 708422 765525 753790 751602
5467 751602 893411 966310 917825 984669 1027072 1093259 1169327 1192195 1158584 1143613 1258109
5456 1258109 1292211 1150064 1218683 1384961 1412387 1239324 1307642 1397349 1430264 1344213 1439479
5445 1439479 1468796 1372763 1478412 1577009 1513270 1406610 1450130 1519268 1487429 1538984 1529667
5434 1529667 1641273 1658407 1669245 1615192 1640655 1779547 1801606 1858459 1849669 1750002 1849899
$$ packed form
5512h14128K10485J07682K8975R7195J33506M2598L5708J32646J03507J38128
5502B16302J56109L1359r3044Q0417o9009N438K9940P9279l6513l6973o2991r1063
5490B09251J60974j773P9589J83444J56245q3302l6536J24551O7122R307j3100
5479H55772J5435K8532j38665n680M2552M4637r34j12113k1114N7103j1735k188
5467G51602J41809P2899m8485O6844M2403O6187P6068K2868l3611j4971J14496
5456A258109L4102j42147O8619J66278K7426j73063O8318Q9707L2915q6051R5266
5445A439479K9317r6033J05649R8597o3739j06660M3520O9138l1839N1555r317
5434A529667J11606J7134J0838n4053K5463J38892K2059N6853q790r9667R9897
$$ plain form
5423 1849899 1722116 1689114 1775865 1834146 1840275 1758571 1810018 1911212 1916597 1907203 2023412
5412 2023412 2141784 2052598 2006047 2046301 2058014 2006202 1943006 2038929 2133410 2120799 2134780
5401 2134780 2175846 2159244 2135964 2055683 2248695 2277811 2297889 2272142 2293730 2439858 2344683
5390 2344683 2220969 2363059 2354626 2329001 2312482 2328196 2334706 2290315 2334590 2311194 2391378
5379 2391378 2383790 2399011 2345004 2272278 2341794 2396380 2338911 2528606 2682851 2627872 2502984
5368 2502984 2394838 2616646 2491226 2487431 2524568 2610182 2550043 2396072 2457080 2563525 2546834
5357 2546834 2659632 2694010 2687813 2709639 2609246 2621177 2711047 2825937 2867658 2859736 2870342
5346 2870342 2769396 2709091 2730729 2714168 2702729 2719817 2778575 2718940 2691024 2944743 2830325
$$ packed form
5423A849899j27783l3002Q6751N8281O129q1704N1447J01194N385r394J16209
5412B023412J18372q9186m6551M0254J1713n1812o3196R5923R4481j2611J3981
5401B134780M1066j6602k3280q0281J93012K9116K0078k5747K1588J46128r5175
5390B344683j23714J42090q433k5625j6519J5714O510m4391M4275k3396Q0184
5379B391378p588J5221n4007p2726O9516N4586n7469J89695J54245n4979j24888
5368B502984j08146K21808j25420l795L7137Q5614o0139j53971O1008J06445j6691
5357B546834J12798L4378o197K1826j00393J1931Q9870J14890M1721p922J0606
5346B870342j00946o0305K1638j6561j1439J7088N8758n9635k7916K53719j14418
$$ plain form
5335 2830325 2874410 2965923 2906391 2958573 2855543 2800031 2929851 2894150 2749456 2881091 2930760
5324 2930760 2972770 2988436 2936807 2945188 3045966 2934162 2926246 3011254 2966410 3023659 3072549
5313 3072549 2964449 2928125 2992154 3041539 3142450 3090082 3040806 3003701 3076778 3074183 3072248
5302 3072248 3022021 3094045 3122705 3081699 3041215 3027788 3154200 3133427 3143724 3198138 3174867
5291 3174867 3196928 3320800 3292802 3384270 3356514 3301982 3187665 3235760 3261088 3277864 3346640
5280 3346640 3341472 3373045 3257011 3255091 3349556 3439522 3406629 3279642 3394658 3456024 3366985
5269 3366985 3311866 3451595 3443427 3505648 3443719 3239365 3256021 3385796 3398618 3319003 3391028
5258 3391028 3470494 3503860 3452622 3409629 3402991 3458816 3437504 3468078 3382851 3411641 3550331
$$ packed form
5335B830325M4085R1513n9532N2182j03030n5512J29820l5701j44694J31635M9669
5324B930760M2010J5666n1629Q381J00778j11804p916Q5008m4844N7249M8890
5313C072549j08100l6324O4029M9385J00911n2368m9276l7105P3077k595j935
5302C072248n0227P2024K8660m1006m0484j3427J26412k0773J0297N4414k3271
5291C174867K2061J23872k7998R1468k7756n4532j14317M8095K5328J6776O8776
5280C346640n168L1573j16034j920R4465Q9966l2893j26987J15016O1366q9039
5269C366985n5119J39729q168O2221o1929k04354J6656J29775J2822p9615P2025
5258C391028P9466L3366n1238m2993o638N5825k1312L0574q5227K8790J38690
$$ plain form
5247 3550331 3486307 3525840 3562280 3581610 3487890 3523039 3632871 3551356 3566134 3651899 3652870 3659823
5235 3659823 3591514 3649865 3647369 3647807 3672643 3560288 3557905 3589649 3638748 3728775 3696616 3769155
5223 3769155 3743195 3746434 3787209 3712468 3772688 3824043 3833976 3817116 3860448 3801039 3673523 3808937
5211 3808937 3801283 3777157 3849258 3811558 3814078 3706630 3786708 3887303 3860583 3913127 3905144 3922402
5199 3922402 3988817 3839851 3851178 3868789 3885099 3896071 3944398 4003524 3872260 3976552 4044660
5188 4044660 4000619 3950172 4079206 4087921 4019779 3966346 3966396 3913668 3939348 4080866 4076517 4108837
5176 4108837 4137579 4083222 4200852 4212585 4275593 4268178 4250832 4251560 4172217 4231942 4221618 4181826
5164 4181826 4281173 4398433 4328504 4355077 4382593 4478413 4319083 4372011 4386562 4438470 4473863
$$ packed form
5247C550331o4024L9533L6440J9330r3720L5149J09832q1515J4778Q5765R71O953
5235C659823o8309N8351k496M38K4836j12355k383L1744M9099R0027l2159P2539
5223C769155k5960L239M0775p4741O0220N1355R933j6860M3332n9409j27516J35414
5211C808937p654k4126P2101l7700K520j07448Q0078J00595k6720N2544p983J7258
5199C922402O6415j48966J1327J7611J6310J0972M8327N9126j31264J04292O8108
5188D044660m4041n0447J29034Q715o8142n3433N0n2728K5680J41518m349L2320
5176D108837K8742n4357J17630J1733O3008p415j7346P28p9343N9725j0324l9792
5164D181826R9347J17260o9929K6573K7516R5820j59330N2928J4551N1908L5393
$$ plain form
5153 4473863 4360375 4443030 4606150 4544579 4573208 4666685 4624968 4645499 4693457 4644369 4585416
5142 4585416 4575040 4653028 4626688 4625230 4674963 4700687 4669494 4700038 4742602 4637219 4702126
5131 4702126 4842347 4717647 4810441 4937245 4852840 4875350 4919764 4935563 4966683 4945172 4925182
5120 4925182 4853252 4954278 5037299 4918238 4845302 4961662 5059588 5000735 5033152 5151780 5106745
5109 5106745 5171026 5107422 5143320 5300167 5227716 5127420 5197042 5235892 5206900 5271433 5331635
5098 5331635 5276696 5301990 5378246 5300134 5279880 5214577 5274864 5260023 5269742 5369393 5237788
5087 5237788 5219607 5415715 5382766 5395652 5419236 5524279 5564451 5515472 5528433 5493224 5547983
5076 5547983 5585357 5541102 5642439 5688874 5632655 5639439 5736722 5824827 5837058 5944087 5948534
$$ packed form
5153D473863j13488Q2655J63120o1571K8629R3477m1717K0531M7958m9088n8953
5142D585416j0376P7988k6340j458M9733K5724l1193L0544M2564j05383O4907
5131D702126J40221j24700R2794J26804q4405K2510M4414J5799L1120k1511j9990
5120D925182p1930J01026Q3021j19061p2936J16360R7926n8853L2417J18628m5035
5109E106745O4281o3604L5898J56847p2451j00296O9622L8850k8992O4533O0202
5098E331635n4939K5294P6256p8112k0254o5303O0287j4841R719R9651j31605
5087E237788j8181J96108l2949J2886K3584J05043M0172m8979J2961l5209N4759
5076E547983L7374m4255J01337M6435n6219O784R7283Q8105J2231J07029M447
$$ plain form
5065 5948534 5874038 5961106 6001984 6059966 6128735 6164652 6193596 6279533 6224264 6309541 6262036
5054 6262036 6492165 6475378 6512966 6604645 6594397 6527604 6702625 6852986 6714398 6569391
5044 6569391 6515558 6463677 6381267 6302922 6230249 6205678 6111408 5943732 5892188 5848278 5813615
5033 5813615 5691175 5652504 5687307 5591801 5526901 5557529 5665930 5763806 5872021 5905114 5918574
5022 5918574 6019618 6028966 5980132 6142792 6241812 6224140 6205539 6307858 6322026 6493251 6523420
5011 6523420 6574661 6816362 6892856 6919655 6861537 7012091 7134239 7092156 7242209 7366740
5001 7366740 7354979 7417042 7554277 7488936 7392800 7485592 7434106 7445584 7465252 7265831 7096789
4990 7096789 7009503 6890470 6640720 6440596 6393597 6247497 5965091 5830926 5632181 5526846
$$ packed form
5065E948534p4496Q7068M0878N7982O8769L5917K8944Q5937n5269Q5277m7505
5054F262036K30129j6787L7588R1679j0248o6793J75021J50361j38588j45007
5044F569391n3833n1881q2410p8345p2673k4571r4270j67676n1544m3910l4663
5033E813615j22440l8671L4803r5506o4900L0628J08401R7876J08215L3093J3460
5022E918574J01044R348m8834J62660R9020j7672j8601J02319J4168J71225L0169
5011F523420N1241K41701P6494K6799n8118J50554J22148m2083J50053J24531
5001G366740j1761O2063J37235o5341r6136R2792n1486J1478J9668j99421j69042
4990G096789q7286j19033k49750k00124m6999j46100k82406j34165j98745j05335
$$ plain form
4980 5526846 5334640 5236880 5230214 5263044 5083389 4980414 4895904 4920110 4935877 5018448 5188941
4969 5188941 5280693 5197595 5281359 5296513 5439112 5629138 5773989 5834433 5943001 6004722 5941959
4958 5941959 6038255 6181013 6334905 6439961 6432914 6451090 6606609 6708951 6735005 6813138 6960962
4947 6960962 7130610 7105019 7090767 7266134 7220463 7106022 7111916 6893251 6766794 6644945
4937 6644945 6418086 6247717 6095540 5952740 5860400 5820159 5603417 5471112 5339137 5270096
4927 5270096 5312966 5173952 5202126 5340669 5480150 5520541 5487270 5574979 5703376 5865439
4917 5865439 5941097 6024735 6023618 6088749 6079190 6154023 6300461 6498689 6555850 6604240 6538311
4906 6538311 6606861 6692547 6722566 6964290 7024976 6987013 7006133 6940198 6922464 7024804 7045473
$$ packed form
4980E526846j92206r7760o666L2830j79655j02975q4510K4206J5767Q2571J70493
4969E188941R1752q3098Q3764J5154J42599J90026J44851O0444J08568O1721o2763
4958E941959R6296J42758J53892J05056p047J8176J55519J02342K6054P8133J47824
4947F960962J69648k5591j4252J75367m5671j14441N894k18665j26457j21849
4937F644945k26859j70369j52177j42800r2340m0241k16742j32305j31975o9041
4927E270096M2870j39014K8174J38543J39481M0391l3271Q7709J28397J62063
4917E865439P5658Q3638j117O5131r559P4833J46438J98228N7161M8390o5929
4906F538311O8550Q5686L0019K41724O0686l7963J9120o5935j7734J02340K0669
$$ plain form
4895 7045473 7156002 7179025 7240307 7245884 7251423 7399120 7556656 7587083 7697341 7852104 7764568
4884 7764568 7743146 7866125 8012373 8016047 8091558 8090598 8239396 8286461 8208519 8267547 8379957
4873 8379957 8375487 8451732 8431469 8572506 8595984 8651451 8882095 8933259 8986672 9009066 9129021
4862 9129021 9158870 9193884 9269823 9307679 9335047 9384188 9490916 9536538 9647177 9639124 9851072
4851 9851072 9916325 9780708 9841905 9884004 9932415 10013391 10120128 10161298 10246831 10369225 10507860
4840 10507860 10673433 10784243 10882937 11063346 11127840 11232261 11386456 11352560 11566615 11667486
4830 11667486 11694235 11769730 11731124 11789888 11809668 11756170 11782058 11742348 11728363 11538867 11473834
4819 11473834 11455288 11333572 11199652 11006503 11144746 11107900 10806889 10812746 10721015 10734122
$$ packed form
4895G045473J10529K3023O1282N577N539J47697J57536L0427J10258J54763q7536
4884G764568k1422J22979J46248L674P5511r60J48798M7065p7942N9028J12410
4873H379957m470P6245k0263J41037K3478N5467K30644N1164N3413K2394J19955
4862I129021K9849L5014P5939L7856K7368M9141J06728M5622J10639q053K11948
4851I851072O5253j35617O1197M2099M8411Q0976J06737M1170Q5533J22394J38635
4840A0507860J65573J10810R8694J80409O4494J04421J54195l3896K14055J00871
4830A1667486K6749P5495l8606N8764J9780n3498K5888l9710j3985j89496o5033
4819A1473834j8546j21716j33920j93149J38243l6846l01011N857r1731J3107
$$ plain form
4809 10734122 10653936 10590576 10567874 10457311 10336128 10147131 10172718 10020259 9894653 9821305
4799 9821305 9736805 9621206 9536024 9408729 9379214 9469587 9595401 9642736 9638108 9627961 9717548
4788 9717548 9705369 9794617 10042954 10119832 10029687 9900398 9846565 9659821 9421771 9162195
4778 9162195 8840428 8598467 8196080 7850729 7578141 7185050 6941245 6772203 6603765 6401754
4768 6401754 6185411 6045498 5940337 5888356 5762351 5758262 5710307 5650592 5646258 5600683 5587836
4757 5587836 5585168 5667347 5776760 5789459 5829067 5903467 6081598 6123433 6332136 6540523 6477293
4746 6477293 6382162 6413620 6437004 6554632 6495263 6405404 6216711 6062065 5784361 5771574 5770403
4735 5770403 5761882 5940293 6187204 6347903 6429154 6628212 6932675 7210640 7407110 7634892
$$ packed form
4809A0734122q0186o3360k2702j10563j21183j88997K5587j52459j25606p3348
4799I821305q4500j15599q5182j27295k9515R0373J25814M7335m628j0147Q9587
4788I717548j2179Q9248K48337P6878r0145j29289n3833j86744k38050k59576
4778I162195l21767k41961m02387l45351k72588l93091k43805j69042j68438k02011
4768F401754k16343j39913j05161n1981j26005m089m7955n9715m334m5575j2847
4757E587836k668Q2179J09413J2699L9608P4400J78131M1835K08703K08387o3230
4746F477293r5131L1458K3384J17628n9369q9859j88693j54646k77704j2787j171
4735E770403q521J78411K46911J60699Q1251J99058L04463K77965J96470K27782
$$ plain form
4725 7634892 7885590 7938325 8099872 8187489 8152498 8096963 7870514 7598786 7183999 6848122
4715 6848122 6464701 5857131 5178544 4452555 3798523 3209280 2726952 2495410 2199295 2091491
4705 2091491 1836829 1632374 1658111 1683374 1855100 1863851 1914067 2007567 2027968 2041388 2145801
4694 2145801 2272810 2315497 2391335 2340794 2200671 2076435 2077988 1936896 1813303 1764171 1690236
4683 1690236 1545239 1502861 1514152 1409025 1323548 1216820 1146734 1020192 869844 756815
4673 756815 673178 523855 422898 493763 339413 291082 275261 258571 164821 292660 272432
4662 272432 382575 430363 594242 589227 541493 681623 759037 798582 856312 778442 722080
4651 722080 589046 460393 268694 122123 42416 -48444 -125101 -401137 -553708 -622877
$$ packed form
4725G634892K50698N2735J61547Q7617l4991n5535k26449k71728m14787l35877
4715F848122l83421o07570o78587p25989o54032n89243m82328k31542k96115j07804
4705B091491k54662k04455K5737K5263J71726Q751N0216R3500K0401J3420J04413
4694B145801J27009M2687P5838n0541j40123j24236J553j41092j23593m9132p3935
4683A690236j44997m2378J1291j05127q5477j06728p0086j26542j50348j13029
4673G56815q3637j49323j00957P0865j54350m8331j5821j6690r3750J27839k0228
4662B72432J10143M7788J63879n015m7734J40130P7414L9545N7730p7870n6362
4651G22080j33034j28653j91699j46571p9707r0860p6657k76036j52571o9169
$$ plain form
4641 -622877 -776625 -948365 -1151932 -1287183 -1328112 -1473741 -1634790 -1644061 -1723127 -1795167 -1835474
4630 -1835474 -1836198 -1968668 -2015210 -2068934 -2050165 -2071699 -2142401 -2145652 -1925719 -1969851 -1913217 -1818297
4618 -1818297 -1936261 -1842595 -1871477 -1752579 -1782695 -1624161 -1468542 -1425299 -1354021 -1362025 -1124980
4607 -1124980 -990269 -965027 -726027 -548474 -428932 -307027 -174017 72179 186729 418731
4597 418731 680288 858832 981145 1071590 1206579 1244929 1445680 1406966 1334675 1286664 983593
4586 983593 719929 591254 414217 266403 76725 -75653 -391481 -559799 -722288 -826960
4576 -826960 -888365 -747542 -584068 -570974 -526079 -265074 -116860 70071 195337 453148
4566 453148 493224 433028 399521 314878 161872 -32848 -137610 -159999 -113366 -127087 23883
$$ packed form
4641f22877j53748j71740k03567j35251m0929j45629j61049r271p9066p2040m0307
4630a835474p24j32470m6542n3724J8769k1534p0702l251K19933m4132N6634R4920
4618a818297j17964R3666k8882J18898l0116J58534J55619M3243P1278q004K37045
4607a124980J34711K5242K39000J77553J19542J21905J33010K46196J14550K32002
4597D18731K61557J78544J22313R0445J34989L8350K00751l8714p2291m8011l03071
4586I83593k63664j28675j77037j47814j89678j52378l15828j68318j62489j04672
4576h26960o1405J40823J63474J3094M4895K61005J48214J86931J25266K57811
4566D53148M0076o0196l3507q4643j53006j94720j04762k2389M6633j3721J50970
$$ plain form
4555 23883 206955 235936 269146 382919 568514 627674 738113 867562 970149 1070853
4545 1070853 1074425 1158614 1318169 1413082 1521230 1612811 1679131 1712837 1780397 1897841 2124914
4534 2124914 2182981 2190739 2232344 2317818 2517455 2671652 2698557 2756166 2884279 2899567 2892314
4523 2892314 2893539 3014736 3190810 3251468 3266126 3310274 3351199 3367832 3549888 3611919 3733480
4512 3733480 3748743 3868369 4017211 4142454 4191694 4380460 4631786 4583178 4727835 4930537
4502 4930537 5021670 5057151 5252522 5381158 5493640 5562866 5780782 5929944 6097735 6139958
4492 6139958 6369475 6371660 6476966 6842783 7002655 7073513 7119211 7295562 7362638 7294010 7092610
4481 7092610 7004815 6823534 6356599 6034297 5682303 5278028 4982745 4675377 4262819 3830250
$$ packed form
4555B3883J83072K8981L3210J13773J85595N9160J10439J29449J02587J00704
4545A070853L572Q4189J59555R4913J08148R1581O6320L3706O7560J17444K27073
4534B124914N8067P758M1605Q5474J99637J54197K6905N7609J28113J5288p253
4523B892314J225J21197J76074O0658J4658M4148M0925J6633J82056O2031J21561
4512C733480J5263J19626J48842J25243M9240J88766K51326m8608J44657K02702
4502D930537R1133L5481J95371J28636J12482O9226K17916J49162J67791M2223
4492F139958K29517K185J05306L65817J59872P0858M5698J76351O7076o8628k01400
4481G092610q7795j81281m66935l22302l51994m04275k95283l07368m12558m32569
$$ plain form
4471 3830250 3364098 2989466 2831912 2689655 2701990 2770462 2914864 3021758 3089854 3270006
4461 3270006 3370258 3487191 3621172 3801558 3873938 4039975 4323566 4562157 4615085 4796126
4451 4796126 4954454 5009939 4987708 5197540 5259320 5340595 5471916 5594070 5754300 5755907 5783624
4440 5783624 5939017 6071660 6140581 6252630 6441824 6503386 6637116 6799022 6960747 6958277
4430 6958277 7032823 7230624 7259570 7250998 7359427 7482237 7577376 7704671 7757666 7748940 7833178
4419 7833178 8036806 8160493 8253897 8366292 8491169 8587578 8715461 8822369 8853190 9008402
4409 9008402 9017534 9191251 9152278 9061618 9006045 9019444 9207317 9207211 9361066 9396164 9396307 9439235
4397 9439235 9439333 9602158 9695761 9831571 10000218 10039184 10080930 10079401 10301941 10487691 10569793
$$ packed form
4471C830250m66152l74632j57554j42257J2335O8472J44402J06894O8096J80152
4461C270006J00252J16933J33981J80386P2380J66037K83591K38591N2928J81041
4451D796126J58328N5485k2231K09832O1780Q1275J31321J22154J60230J607K7717
4440E783624J55393J32643O8921J12049J89194O1562J33730J61906J61725k470
4430F958277P4546J97801K8946q572J08429J22810R5139J27295N2995q726Q4238
4419G833178K03628J23687R3404J12395J24877R6409J27883J06908L0821J55212
4409I008402R132J73717l8973r0660n5573J3399J87873j06J53855L5098J43M2928
4397I439235R8J62825R3603J35810J68647L8966M1746j529K22540J85750Q2102
$$ plain form
4386 10569793 10780464 10922213 11025418 11111492 11214819 11384119 11598516 11800997 11990340 12187439
4376 12187439 12318906 12442460 12544012 12692923 12940507 13132555 13154672 13094170 13185745 13195784
4366 13195784 13212188 13471665 13697750 13950908 14120871 14384282 14540038 14660290 14813411 14957296
4356 14957296 15217123 15558465 15807615 16103842 16222180 16361722 16543191 16819101 17033755
4347 17033755 17321033 17686955 17959336 18207229 18465326 18722865 19121538 19462253 19717576
4338 19717576 19985401 20240670 20391762 20663954 20867135 21187320 21619977 22060667 22476369
4329 22476369 22986276 23303749 23699626 24135889 24472570 24912707 25395050 25849585 26236474
4320 26236474 26691385 27333848 27987203 28691587 29429061 30315572 31039131 31899497 32662213
$$ packed form
4386A0569793K10671J41749J03205Q6074J03327J69300K14397K02481J89343J97099
4376A2187439J31467J23554J01552J48911K47584J92048K2117o0502R1575J0039
4366A3195784J6404K59477K26085K53158J69963K63411J55756J20252J53121J43885
4356A4957296K59827L41342K49150K96227J18338J39542J81469K75910K14654
4347A7033755K87278L65922K72381K47893K58097K57539L98673L40715K55323
4338A9717576K67825K55269J51092K72192K03181L20185M32657M40690M15702
4329B2476369N09907L17473L95877M36263L36681M40137M82343M54535L86889
4320B6236474M54911O42463O53355P04384P37474Q86511P23559Q60366P62716
$$ plain form
4311 32662213 33350607 34053220 34952131 35856463 36955823 37997992 39085684 40334482 41533821
4302 41533821 42723472 44305845 46024374 47892088 49813939 51858860 53724321 55979999
4294 55979999 58536635 61754233 65170166 68940712 72484233 76420163 80823796 86468173
4286 86468173 93028518 101111064 110960342 123532975 139862257 162745922 191473422 209913828
4278 209913828 177536558 92597817 -5898120 -95914208 -143066040 -155382610 -153607586
4271 -153607586 -145186323 -135353498 -124627794 -114235933 -104688188 -95590511 -87443894 -81048488
4263 -81048488 -75442351 -70563161 -66281008 -62508273 -59071238 -55920019 -53036541 -50411348
4255 -50411348 -47749423 -45498763 -43432070 -41601706 -39827459 -38556113 -37388880 -36318636
$$ packed form
4311C2662213O88394P02613Q98911R04332J099360J042169J087692J248798J199339
4302D1533821J189651J582373J718529J867714J921851K044921J865461K255678
4294E5979999K556636L217598L415933L770546L543521L935930M403633N644377
4286H6468173O560345Q082546R849278J2572633J6329282K2883665K8727500J8440406
4278B09913828l2377270q4938741r8495937r0016088m7151832j2316570J775024
4271a53607586Q421263R832825J0725704J0391861R547745R097677Q146617O395406
4263h1048488N606137M879190M282153L772735L437035L151219K883478K625193
4255e0411348K661925K250660K066693J830364J774247J271346J167233J070244
$$ plain form
4247 -36318636 -35338800 -34426491 -33345458 -32353453 -31369118 -30452018 -29533057 -28730630 -27942998
4238 -27942998 -27138875 -26424924 -25632297 -24897635 -24325311 -23702945 -23377081 -22975688 -22602855
4229 -22602855 -22036459 -21619064 -21233336 -20710620 -20365865 -20080926 -19605550 -19262644 -18898439
4220 -18898439 -18382879 -17914303 -17607467 -17286810 -16971373 -16714368 -16562635 -16320618 -15987310
4211 -15987310 -15530589 -15202364 -14857408 -14603516 -14332990 -14002623 -13656546 -13447810 -12996536
4202 -12996536 -12718435 -12454698 -12180173 -11880964 -11720144 -11583387 -11280436 -11000002 -10810422
4193 -10810422 -10634643 -10531033 -10455298 -10284648 -10245921 -10209839 -9920256 -9646124 -9421256 -9250821
4183 -9250821 -9089699 -8932954 -8832591 -8607964 -8410765 -8237378 -8170679 -8137140 -8123202 -7926029
$$ packed form
4247c6318636R79836R12309J081033R92005R84335R17100R18961Q02427P87632
4238b7942998Q04123P13951P92627P34662N72324O22366L25864M01393L72833
4229b2602855N66396M17395L85728N22716L44755K84939M75376L42906L64205
4220a8898439N15560M68576L06836L20657L15437K57005J51733K42017L33308
4211a5987310M56721L28225L44956K53892K70526L30367L46077K08736M51274
4202a2996536K78101K63737K74525K99209J60820J36757L02951K80434J89580
4193a0810422J75779J03610P5735J70650L8727L6082K89583K74132K24868J70435
4183i250821J61122J56745J00363K24627J97199J73387O6699L3539J3938J97173
$$ plain form
4173 -7926029 -7892105 -7854044 -7615339 -7412520 -7249465 -7170998 -7012845 -6905710 -6810000 -6708722
4163 -6708722 -6588219 -6499989 -6408958 -6272921 -6001238 -5762001 -5693881 -5589153 -5503146 -5379033
4153 -5379033 -5311931 -5015913 -4739093 -4690811 -4583979 -4450957 -4339187 -4262681 -4155269 -3921870
4143 -3921870 -3832739 -3752341 -3664542 -3669258 -3502400 -3327512 -3073735 -2939400 -2877257 -2729771 -2749972
4132 -2749972 -2595240 -2471042 -2416105 -2268984 -2191415 -2107677 -2084187 -1999070 -2061640 -2021205 -1940385
4121 -1940385 -1798421 -1733104 -1654697 -1470958 -1323853 -1125100 -989151 -682766 -779703 -593147
4111 -593147 -363201 -281386 -235835 -262459 -157870 -20535 -19571 121330 439993 550911 763423
4100 763423 951538 1100468 1152508 1249203 1367949 1481080 1624714 1635841 1730118 1870701
$$ packed form
4173g926029L3924L8061K38705K02819J63055P8467J58153J07135R5710J01278
4163f708722J20503Q8230R1031J36037K71683K39237O8120J04728Q6007J24113
4153e379033O7102K96018K76820M8282J06832J33022J11770P6506J07412K33399
4143c921870Q9131Q0398Q7799m716J66858J74888K53777J34335O2143J47486k0201
4132b749972J54732J24198N4937J47121P7569Q3738K3490Q5117o2570M0435Q0820
4121a940385J41964O5317P8407J83739J47105J98753J35949L06385r6937J86556
4111e93147K29946Q1815M5551k6624J04589J37335R64J40901L18663J10918K12512
4100G63423J88115J48930N2040R6695J18746J13131J43634J1127R4277J40583
$$ plain form
4090 1870701 1911223 2000038 2045697 2126688 2286335 2403288 2449492 2580094 2638890 2811043 2854992
4079 2854992 2980240 3078058 3186059 3261155 3262692 3505668 3665453 3885195 3895902 3963169 4030067
4068 4030067 3922167 3838738 3980251 3954475 3930427 3962087 3932328 4002888 4145256 4256200 4391011
4057 4391011 4578945 4593835 4712334 4739704 4751076 4661332 4658098 4820369 4721755 4788848 4921363
4046 4921363 5016359 5296247 5552492 5741767 5813998 5781809 5763527 5718485 5542890 5436015
4036 5436015 5487678 5373830 5256039 5053548 4747977 4598998 4395235 4176084 4062834 3858184
4026 3858184 3732367 3658018 3581156 3547527 3595850 3581225 3685994 3676256 3505004 3457404 3254117
4015 3254117 3054268 2974428 2826683 2748069 2611258 2447154 2367839 2289047 2240074 2250132 2047527
$$ packed form
4090A870701M0522Q8815M5659Q0991J59647J16953M6204J30602N8796J72153M3949
4079B854992J25248R7818J08001P5096J537K42976J59785K19742J0707O7267O6898
4068D030067j07900q3429J41513k5776k4048L1660k9759P0560J42368J10944J34811
4057D391011J87934J4890J18499K7370J1372q9744l234J62271r8614O7093J32515
4046D921363R4996K79888K56245J89275P2231l2189j8282m5042j75595j06875
4036E436015N1663j13848j17791k02491l05571j48979k03763k19151j13250k04650
4026C858184j25817p4349p6862l3629M8323j4625J04769r738j71252m7600k03287
4015C254117j99849p9840j47745p8614j36811j64104p9315p8792m8973J0058k02605
$$ plain form
4004 2047527 1788422 1545706 1290900 986084 690845 519633 329812 140893 -139776 -303531
3994 -303531 -331832 -482678 -745681 -914755 -1169405 -1554487 -1968620 -2251737 -2448892 -2503577
3984 -2503577 -2738579 -2828855 -2877189 -2917403 -2991125 -2996882 -3154303 -3325764 -3442794 -3764421 -3856736
3973 -3856736 -4185715 -4394543 -4504494 -4745609 -5022887 -5197670 -5383724 -5523493 -5843487 -5926753
3963 -5926753 -6230514 -6628235 -6964014 -7068728 -7147952 -7290833 -7350030 -7503101 -7434939 -7480591
3953 -7480591 -7468196 -7532401 -7680299 -7842343 -7869935 -8002859 -8131464 -8125976 -8178191 -8229771 -8186812
3942 -8186812 -8397966 -8426975 -8400695 -8513207 -8546515 -8487717 -8513170 -8647509 -8670156 -8615323 -8540366
3931 -8540366 -8303062 -8197326 -8077584 -7875943 -7781148 -7704766 -7693700 -7599521 -7591655 -7431281 -7385399
$$ packed form
4004B047527k59105k42716k54806l04816k95239j71212j89821j88919k80669j63755
3994c03531k8301j50846k63003j69074k54650l85082m14133k83117j97155n4685
3984b503577k35002r0276m8334m0214p3722n757j57421j71461j17030l21627r2315
3973c856736l28979k08828j09951k41115k77278j74783j86054j39769l19994q3266
3963e926753l03761l97721l35779j04714p9224j42881n9197j53071O8162m5652
3953g480591J2395o4205j47898j62044k7592j32924j28605N488n2215n1580M2959
3942h186812k11154k9009K6280j12512l3308N8798k5453j34339k2647N4833P4957
3931h540366K37304J05736J19742K01641R4795P6382J1066R4179P866J60374M5882
$$ plain form
3920 -7385399 -7348706 -7240183 -7207245 -7233590 -7185020 -7075008 -7075598 -7197512 -7167747 -7158421 -7322800
3909 -7322800 -7477642 -7558113 -7572694 -7562778 -7495861 -7521562 -7578751 -7658878 -7726810 -7796453 -7796639 -7762914
3897 -7762914 -7825431 -7848516 -7683353 -7608281 -7514792 -7262519 -7062579 -7021448 -6779570 -6567465
3887 -6567465 -6433380 -6279193 -6035852 -5929492 -5807369 -5514208 -5378233 -5177195 -4941920 -4693320
3877 -4693320 -4530966 -4478973 -4430900 -4300689 -4279520 -4323845 -4272797 -4266673 -4380242 -4516096 -4587285
3866 -4587285 -4683347 -4811702 -4944975 -5009563 -5029876 -5201449 -5314563 -5326379 -5412941 -5565641
3856 -5565641 -5683595 -5639631 -5590062 -5544077 -5607260 -5474985 -5390732 -5382599 -5375802 -5350338 -5375090
3845 -5375090 -5326907 -5458073 -5595352 -5672768 -5720357 -5563321 -5572424 -5661288 -5635852 -5619480 -5748469
$$ packed form
3920g385399L6693J08523L2938k6345M8570J10012n90j21914K9765R326j64379
3909g322800j54842q0471j4581R916O6917k5701n7189q0127o7932o9643j86L3725
3897g762914o2517k3085J65163P5072R3489K52273J99940M1131K41878K12105
3887f567465J34085J54187K43341J06360J22123K93161J35975K01038K35275K48600
3877d693320J62354N1993M8073J30211K1169m4325N1048O124j13569j35854p1189
3866d587285r6062j28355j33273o4588k0313j71573j13114j1816q6562j52700
3856e565641j17954M3964M9569M5985o3183J32275Q4253Q133O797K5464k4752
3845e375090M8183j31166j37279p7416m7589J57036r103q8864K5436J6372j28989
$$ plain form
3834 -5748469 -5885521 -5973264 -6118830 -6348668 -6657480 -6957783 -7271052 -7695725 -7943622 -8118863
3824 -8118863 -8276595 -8468162 -8545348 -8622913 -8686780 -8751677 -8806826 -8764440 -8708182 -8614554 -8464256
3813 -8464256 -8281203 -8123995 -8198888 -8133465 -8016845 -8000959 -7974025 -7881689 -7886083 -7945353 -7970754
3802 -7970754 -7969168 -7904155 -7894738 -7806683 -7755233 -7777060 -7802739 -7820949 -7847302 -7704486 -7595793
3791 -7595793 -7494937 -7567236 -7714660 -7840658 -7846857 -7971318 -8164645 -8162193 -8244316 -8266844 -8309028
3780 -8309028 -8337010 -8166157 -8076975 -7972891 -7779749 -7808178 -7649341 -7695493 -7562989 -7482332
3770 -7482332 -7328112 -7214982 -7170505 -7013045 -6911906 -6874629 -6695396 -6581681 -6449414 -6325978
3760 -6325978 -6352034 -6181743 -6068420 -5983726 -5907437 -5744644 -5642343 -5420761 -5266146 -5282567
$$ packed form
3834e748469j37052q7743j45566k29838l08812l00303l13269m24673k47897j75241
3824h118863j57732j91567p7186p7565o3867o4897n5149M2386N6258R3628J50298
3813h464256J83053J57208p4893O5423J16620J5886K6934R2336m394n9270k5401
3802g970754J586O5013R417Q8055N1450k1827k5679j8210k6353J42816J08693
3791g595793J00856p2299j47424j25998o199j24461j93327K452q2123k2528m2184
3780h309028k7982J70853Q9182J04084J93142k8429J58837m6152J32504Q0657
3770g482332J54220J13130M4477J57460J01139L7277J79233J13715J32267J23436
3760f325978k6056J70291J13323Q4694P6289J62793J02301K21582J54615j6421
$$ plain form
3750 -5282567 -5118500 -5000800 -4972353 -4856362 -4707922 -4702547 -4435561 -4336198 -4242289 -4126357
3740 -4126357 -4105185 -3996118 -3949226 -3861488 -3783362 -3701056 -3596941 -3542237 -3502931 -3476365 -3432305
3729 -3432305 -3343217 -3433257 -3380537 -3327488 -3301870 -3317101 -3323310 -3235203 -3085560 -3051474 -3056978 -3015363
3717 -3015363 -3038093 -3116049 -3068953 -3031582 -3065805 -3019525 -3037749 -2943652 -3034374 -3102838 -3095502 -3070758
3705 -3070758 -3091433 -2961192 -2871281 -3039056 -3058430 -3071302 -3139769 -3151322 -3127650 -3128302 -3010565
3694 -3010565 -3165020 -3220977 -3251009 -3293811 -3253299 -3047155 -2997500 -2999237 -2961026 -3072680 -3060471
3683 -3060471 -3005944 -2898768 -2823310 -2676602 -2557691 -2629115 -2621418 -2624014 -2579941 -2560853 -2462069
3672 -2462069 -2432046 -2515970 -2540788 -2673804 -2658480 -2559024 -2601277 -2594015 -2621230 -2582192 -2632755
$$ packed form
3750e282567J64067J17700K8447J15991J48440N375K66986R9363R3909J15932
3740d126357K1172J09067M6892Q7738P8126Q2306J04115N4704L9306K6566M4060
3729c432305Q9088r0040N2720N3049K5618j5231o209Q8107J49643L4086n504M1615
3717c015363k2730p7956M7096L7371l4223M6280j8224R4097r0722o8464P336K4744
3705c070758k0675J30241Q9911j67775j9374j2872o8467j1553K3672o52J17737
3694c010565j54455n5957l0032m2802M0512K06144M9655j737L8211j11654J2209
3683c060471N4527J07176P5458J46708J18911p1424P697k596M4073J9088R8784
3672b462069L0023q3924k4818j33016J5324R9456m2253P262k7215L9038n0563
$$ plain form
3661 -2632755 -2760026 -2758619 -2823794 -2850000 -2839911 -2933348 -2901145 -3005902 -3173904 -3270002 -3234093
3650 -3234093 -3277074 -3433399 -3473812 -3499079 -3673239 -3869853 -3982360 -3959680 -3994189 -3909836 -3887139
3639 -3887139 -3927849 -3863005 -3897622 -4014231 -3833330 -3717527 -3801722 -3830944 -3594633 -3611190 -3686931
3628 -3686931 -3552629 -3478484 -3454303 -3365523 -3234610 -3239021 -3137197 -3108303 -3090906 -3177067 -3143969
3617 -3143969 -3036295 -2914009 -2940186 -2861478 -2676000 -2676625 -2771179 -2625224 -2505471 -2452137 -2487757
3606 -2487757 -2521683 -2511835 -2563763 -2617771 -2663156 -2578048 -2549653 -2541237 -2575820 -2652732 -2702594 -2659290
3594 -2659290 -2754854 -2734557 -2757634 -2784443 -2671879 -2707003 -2737038 -2703076 -2686080 -2629573 -2539954
3583 -2539954 -2624485 -2499718 -2536769 -2524913 -2600919 -2606909 -2636193 -2527304 -2456700 -2541385 -2606094
$$ packed form
3661b632755j27271J407o5175k6206J0089r3437L2203j04757j68002r6098L5909
3650c234093m2981j56325m0413k5267j74160j96614j12507K2680l4509Q4353K2697
3639c887139m0710O4844l4617j16609J80901J15803q4195k9222K36311j6557p5741
3628c686931J34302P4145K4181Q8780J30913m411J01824K8894J7397q6161L3098
3617c143969J07674J22286k6177P8708J85478o25r4554J45955J19753N3334l5620
3606b487757l3926R848n1928n4008m5385Q5108K8395Q416l4583p6912m9862M3304
3594b659290r5564K0297k3077k6809J12564l5124l0035L3962J6996N6507Q9619
3583b539954q4531J24767l7051J1856p6006n990k9284J08889P0604q4685o4709
$$ plain form
3572 -2606094 -2586311 -2473313 -2414504 -2343147 -2109619 -2014944 -2167721 -2167654 -2171742 -2210710 -2190394 -2182687
3560 -2182687 -2125397 -2210501 -2231889 -2139528 -2047120 -1947750 -1830053 -1934845 -1964420 -1910448 -1823750
3549 -1823750 -1785068 -1690443 -1697669 -1807299 -1735733 -1804720 -1806002 -1602229 -1558225 -1618748 -1641562
3538 -1641562 -1553813 -1547669 -1503298 -1305456 -1214120 -1109152 -1111667 -1187292 -1125153 -950867 -841535
3527 -841535 -856339 -853623 -870163 -875984 -793641 -673415 -535856 -463527 -379715 -298941 -186992
3516 -186992 -124222 9702 141425 250134 246806 163266 255563 407731 580560 617185 730994
3505 730994 820147 826285 987508 1123852 1211836 1263380 1345789 1267177 1352291 1514477 1709595
3494 1709595 1884920 2060902 2069055 2141322 2261263 2430291 2628875 2732070 2815066 2837279
$$ packed form
3572b606094J9783J12998N8809P1357K33528R4675j52777O7m088l8968K0316P707
3560b182687N7290q5104k1388R2361R2408R9370J17697j04792k9575N3972Q6698
3549a823750L8682R4625p226j09630P1566o8987j282K03773M4004o0523k2814
3538a641562Q7749O144M4371J97842R1336J04968k515p5625O2139J74286J09332
3527h41535j4804K716j6540n821Q2343J20226J37559P2329Q3812Q0774J11949
3516a86992O2770J33924J31723J08709l328q3540R2297J52168J72829L6625J13809
3505G30994Q9153O138J61223J36344Q7984N1544Q2409p8612Q5114J62186J95118
3494A709595J75325J75982Q153P2267J19941J69028J98584J03195Q2996K2213
$$ plain form
3484 2837279 2963155 3061158 3211697 3392458 3668110 3917832 4004700 4113053 4327758 4621138
3474 4621138 4820316 4998001 5091407 5353400 5390615 5486831 5722206 6013538 6223711 6425880
3464 6425880 6607504 6762349 6715854 6643095 6638256 6625997 6654598 6762266 6995617 7312374 7654269
3453 7654269 7998020 8544172 9191665 9763963 10291204 10691720 10848083 10681385 9980650 8599349
3443 8599349 6474254 3903621 786480 -2316843 -4839004 -6729833 -7964781 -8758400
3435 -8758400 -8905748 -8875400 -8574672 -8213958 -7817446 -7202293 -6644010 -6128173 -5581601 -5000715
3425 -5000715 -4625084 -4240666 -3647403 -3191554 -2909889 -2549924 -2148722 -1873584 -1741683 -1413812
3415 -1413812 -1313609 -1237860 -1234953 -1253438 -1197349 -1155111 -934299 -735425 -577669 -407465 -37554
$$ packed form
3484B837279J25876R8003J50539J80761K75652K49722Q6868J08353K14705K93380
3474D621138J99178J77685R3406K61993L7215R6216K35375K91332K10173K02169
3464F425880J81624J54845m6495p2759m839j2259K8601J07668K33351L16757L41895
3453G654269L43751N46152O47493N72298N27241M00516J56363j66698p00735j381301
3443H599349k125095k570633l117141l103323k522161j890829j234948p93619
3435h758400j47348L0348L00728L60714L96512O15153N58283N15837N46572N80886
3425e000715L75631L84418N93263M55849K81665L59965M01202K75138J31901L27871
3415a413812J00203P5749K907j8485N6089M2238K20812J98874J57756J70204L69911
$$ plain form
3404 -37554 287166 553559 921256 1229220 1405077 1711162 1773715 1800539 1944329 1861933
3394 1861933 1879538 1912121 1769912 1494318 1288842 997678 804169 506326 381320 475463
3384 475463 672136 820785 1026878 1214395 1376513 1534591 1645286 1738378 1783277 1778449
3374 1778449 1868256 1999215 2093156 2391090 2672196 3029868 3455229 3662224 4114321 4433619
3364 4433619 4807384 5487718 5998170 6511773 6973012 7273646 6925787 6046973 4622469
3355 4622469 2671947 847280 -817478 -1961391 -2792969 -3426685 -4021211 -4343580 -4530436
3346 -4530436 -4605221 -4548912 -4396348 -4417620 -4632202 -5109353 -5821180 -6751447 -7783115 -8872208
3336 -8872208 -10190291 -11378920 -12306498 -13013915 -13610586 -13807431 -13775683 -13742223 -13653107 -13578436
$$ packed form
3404c7554L24720K66393L67697L07964J75857L06085O2553K6824J43790q2396
3394A861933J7605L2583j42209k75594k05476k91164j93509k97843j25006R4143
3384D75463J96673J48649K06093J87517J62118J58078J10695R3092M4899m828
3374A778449Q9807J30959R3941K97934K81106L57672M25361K06995M52097L19298
3364D433619L73765O80334N10452N13603M61239L00634l47859q78814j424504
3355D622469j950522j824667j664758j143913q31578o33716n94526l22369j86856
3346d530436p4785N6309J52564k1272k14582m77151p11827r30267j031668j089093
3336h872208j318083j188629r27578p07417n96671j96845L1748L3460Q9116P4671
$$ plain form
3326 -13578436 -13322381 -13062582 -12863828 -12540092 -12253951 -11988819 -11704233 -11510708 -11301109
3317 -11301109 -10895971 -10746097 -10495442 -10261640 -10108668 -9916058 -9850535 -9790989 -9671225 -9492585
3307 -9492585 -9392272 -9127100 -8924610 -8686837 -8480945 -8332418 -8166195 -7936888 -7701456 -7463935
3297 -7463935 -7221953 -7115717 -6894162 -6851237 -6762782 -6618818 -6547095 -6404243 -6345594 -6337848 -6272217
3286 -6272217 -6204195 -6010176 -5872007 -5724547 -5583575 -5370559 -5169102 -5046496 -4759971 -4518156
3276 -4518156 -4311785 -3961135 -3725035 -3593631 -3515357 -3204604 -2972964 -2752916 -2501348 -2237523
3266 -2237523 -2037440 -1777268 -1563520 -1424382 -1204798 -961869 -779980 -585407 -276585 -108649
3256 -108649 139721 425845 663710 978523 1053954 646741 67055 -697274 -1391471 -1737498
$$ packed form
3326a3578436K56055K59799J98754L23736K86141K65132K84586J93525K09599
3317a1301109M05138J49874K50655K33802J52972J92610O5523N9546J19764J78640
3307i492585J00313K65172K02490K37773K05892J48527J66223K29307K35432K37521
3297g463935K41982J06236K21555M2925Q8455J43964P1723J42852N8649P746O5631
3286f272217O8022J94019J38169J47460J40972K13016K01457J22606K86525K41815
3276d518156K06371L50650K36100J31404P8274L10753K31640K20048K51568K63825
3266b237523K00083K60172K13748J39138K19584K42929J81889J94573L08822J67936
3256a08649K48370K86124K37865L14813P5431m07213n79686p64329o94197l46027
$$ plain form
3246 -1737498 -1999344 -1853430 -1456578 -1030362 -703081 -264981 148990 581796 1075653 1551849
3236 1551849 1976182 2486093 2879853 3297829 3650346 3998532 4293395 4538806 4797176 5115034
3226 5115034 5426954 5696330 6070998 6465884 6806232 7024280 7150220 6802401 5959164 4307495
3216 4307495 1825356 -1471167 -5184880 -8944731 -12419582 -15370501 -17629156 -19279357
3208 -19279357 -20176548 -20784825 -21047289 -20930081 -20599837 -20144867 -19869612 -19454758 -19094660
3199 -19094660 -18557090 -17997023 -17639206 -17339378 -16961734 -16654951 -16488286 -16340690 -16092909
3190 -16092909 -15785385 -15476767 -15246225 -15009289 -14725752 -14546396 -14282103 -14067918 -13786718
3181 -13786718 -13562622 -13355912 -13094177 -12618932 -12412479 -12247263 -11884614 -11502811 -11183491
$$ packed form
3246a737498k61846J45914L96852M26216L27281M38100M13971M32806M93857M76196
3236A551849M24333N09911L93760M17976L52517L48186K94863K45411K58370L17858
3226E115034L11920K69376L74668L94886L40348K18048J25940l47819q43237j651669
3216D307495k482139l296523l713713l759851l474851k950919k258655j650201
3208a9279357q97191o08277k62464J17208L30244M54970K75255M14854L60098
3199a9094660N37570N60067L57817K99828L77644L06783J66665J47596K47781
3190a6092909L07524L08618K30542K36936K83537J79356K64293K14185K81200
3181a3786718K24096K06710K61735M75245K06453J65216L62649L81803L19320
$$ plain form
3172 -11183491 -10806344 -10453322 -10147743 -9849237 -9467186 -9251240 -9006575 -8612499 -8323494
3163 -8323494 -8050294 -7735253 -7460869 -7147261 -6897048 -6594979 -6192695 -5941226 -5705749 -5509398
3153 -5509398 -5307769 -5167799 -5180309 -5402723 -5902267 -6735247 -8159766 -9719076 -11479989
3144 -11479989 -13424270 -15192635 -16558150 -17716146 -18375353 -18882510 -19061472 -19000777 -18853145
3135 -18853145 -18573953 -18354021 -18052799 -17761147 -17325607 -17010870 -16570876 -16257607 -16034488
3126 -16034488 -15789959 -15541611 -15404598 -15202844 -14994496 -14958501 -14780988 -14672042 -14552217 -14397152
3116 -14397152 -14320390 -14230590 -14131100 -13885808 -13706056 -13595036 -13370041 -13180125 -13038146 -12909738
3106 -12909738 -12889693 -12774199 -12656985 -12565364 -12499583 -12447534 -12438258 -12381910 -12221660 -12096285 -12031339
$$ packed form
3172a1183491L77147L53022L05579K98506L82051K15946K44665L94076K89005
3163h323494K73200L15041K74384L13608K50213L02069M02284K51469K35477J96351
3153e509398K01629J39970j2510k22414m99544q32980j424519j559310j760913
3144a1479989j944281j768365j365515j157996o59207n07157j78962O0695J47632
3135a8853145K79192K19932L01222K91652M35540L14737M39994L13269K23119
3126a6034488K44529K48348J37013K01754K08348L5995J77513J08946J19825J55065
3116a4397152P6762Q9800R9490K45292J79752J11020K24995J89916J41979J28408
3106a2909738K0045J15494J17214R1621O5781N2049R276N6348J60250J25375O4946
$$ plain form
3095 -12031339 -11904668 -11791031 -11799914 -11839768 -11726150 -11630842 -11624660 -11574893 -11456426 -11403854 -11311600
3084 -11311600 -11405373 -11354386 -11252414 -11198829 -11117713 -10932630 -10862004 -10721726 -10689653 -10757145 -10660725
3073 -10660725 -10617822 -10495932 -10377779 -10326085 -10228605 -10240459 -10282880 -10290592 -10235943 -10062771 -10088172
3062 -10088172 -10010801 -10026373 -10054922 -10014684 -9989594 -9947301 -9926617 -9811430 -9871148 -9830991 -9764871
3051 -9764871 -9770348 -9712650 -9560501 -9661554 -9534684 -9448248 -9488567 -9419657 -9466420 -9306990 -9229905
3040 -9229905 -9269284 -9226295 -9177261 -9127997 -9135096 -9147528 -9131102 -9053543 -9022083 -8976333 -8827222
3029 -8827222 -8842723 -8866671 -8655122 -8612506 -8641624 -8594171 -8524038 -8518161 -8616330 -8593463 -8571768
3018 -8571768 -8445270 -8505349 -8454402 -8457559 -8431394 -8497817 -8446027 -8397135 -8329819 -8354917 -8418077
$$ packed form
3095a2031339J26671J13637q883l9854J13618R5308O182M9767J18467N2572R2254
3084a1311600r3773N0987J01972N3585Q1116J85083P0626J40278L2073o7492R6420
3073a0660725M2903J21890J18153N1694R7480j1854m2421p712N4649J73172k5401
3062a0088172P7371j5572k8549M0238K5090M2293K0684J15187n9718M0157O6120
3051i764871n477N7698J52149j01053J26870Q6436m0319O8910m6763J59430P7085
3040i229905l9379M2989M9034M9264p099j2432J6426P7559L1460M5750J49111
3029h827222j5501k3948K11549M2616k9118M7453P0133N877r8169K2867K1695
3018h571768J26498o0079N0947l157K6165o6423N1790M8892O7316k5098o3160
$$ plain form
3007 -8418077 -8348701 -8403268 -8289845 -8148888 -8120380 -8122130 -8191427 -8201864 -8149315 -8105246 -8017352
2996 -8017352 -7946698 -7921169 -7973416 -7962287 -7952313 -7953038 -7875453 -7808189 -7816425 -7819219 -7806137 -7718183
2984 -7718183 -7744659 -7720824 -7474533 -7530127 -7440824 -7426109 -7382790 -7397179 -7415368 -7383532 -7359402
2973 -7359402 -7273574 -7229624 -7293121 -7258571 -7160261 -7209345 -7204322 -7137756 -7112485 -7208866 -7060734
2962 -7060734 -7105523 -7206297 -7204443 -7164291 -7139656 -7100018 -6903180 -6979868 -7005091 -7001660 -6998539 -7023523
2950 -7023523 -6908075 -6836997 -6782761 -6808820 -6846115 -6849644 -6962758 -6875998 -6860963 -6790136 -6755943
2939 -6755943 -6782501 -6818911 -6839614 -6748897 -6628086 -6610978 -6581353 -6568611 -6601135 -6683273 -6761152
2928 -6761152 -6689838 -6582850 -6562101 -6503402 -6536313 -6574306 -6752098 -6683200 -6648287 -6640404 -6550193
$$ packed form
3007h418077O9376n4567J13423J40957K8508j750o9297j0437N2549M4069Q7894
2996h017352P0654K5529n2247J1129R974p25P7585O7264q236k794J3082Q7954
2984g718183k6476K3835K46291n5594Q9303J4715M3319j4389j8189L1836K4130
2973g359402Q5828M3950o3497L4550R8310m9084N023O6566K5271r6381J48132
2962g060734m4789j00774J854M0152K4635L9638J96838p6688k5223L431L121k4984
2950g023523J15448P1078N4236k6059l7295l529j13114Q6760J5035P0827L4193
2939f755943k6558l6410k0703R0717J20811J7108K9625J2742l2524q2138p7879
2928f761152P1314J06988K0749N8699l2911l7993j77792O8898L4913P883R0211
$$ plain form
2917 -6550193 -6576753 -6574450 -6439137 -6515062 -6502363 -6470806 -6477006 -6462508 -6529271 -6458629 -6471323 -6461940
2905 -6461940 -6452270 -6461456 -6386525 -6378268 -6338607 -6277539 -6236917 -6319803 -6342566 -6237732 -6310352 -6269175
2893 -6269175 -6258292 -6254412 -6271006 -6235471 -6230547 -6208910 -6154241 -6067067 -6025804 -6039721 -6026519 -6076749
2881 -6076749 -5991101 -5962860 -5934148 -5936208 -5880648 -5899401 -5858879 -5814293 -5796356 -5803793 -5937349 -5784073
2869 -5784073 -5699145 -5762025 -5695558 -5608573 -5674296 -5682280 -5662579 -5711538 -5684282 -5638814 -5676622 -5748283
2857 -5748283 -5777158 -5807115 -5671867 -5636265 -5543286 -5574655 -5613076 -5577807 -5658213 -5581188 -5621240
2846 -5621240 -5621641 -5649608 -5606978 -5707174 -5715385 -5596445 -5488812 -5497137 -5522015 -5514602 -5546833 -5654733
2834 -5654733 -5609426 -5529117 -5565143 -5633395 -5582514 -5626469 -5541581 -5421398 -5530148 -5441454 -5384976
$$ packed form
2917f550193k6560K303J35313p5925J2699L1557o200J4498o6763P0642j2694R383
2905f461940R670r186P4931Q257L9661O1068M0622q2886k2763J04834p2620M1177
2893f269175J0883L880j6594L5535M924K1637N4669Q7174M1263j3917J3202n0230
2881f076749Q5648K8241K8712k060N5560j8753M0522M4586J7937p437j33556J53276
2869e784073Q4928o2880O6467Q6985o5723p984J9701m8959K7256M5468l7808p1661
2857e748283k8875k9957J35248L5602R2979l1369l8421L5269q0406P7025m0052
2846e621240m01k7967M2630j00196q211J18940J07633q325k4878P413l2231j07900
2834e654733M5307Q0309l6026o8252N0881m3955Q4888J20183j08750Q8694N6478
$$ plain form
2823 -5384976 -5480565 -5529933 -5552205 -5471036 -5360418 -5469533 -5352961 -5441603 -5452130 -5422944 -5436820
2812 -5436820 -5469039 -5555750 -5496968 -5618778 -5563707 -5493556 -5415012 -5469681 -5464699 -5452700 -5507626
2801 -5507626 -5504672 -5411157 -5325472 -5339363 -5283411 -5383357 -5359448 -5327724 -5389974 -5348417 -5265908 -5343010
2789 -5343010 -5426161 -5396610 -5375000 -5416549 -5371170 -5283518 -5237915 -5236504 -5231634 -5281683 -5236343 -5143886
2777 -5143886 -5125718 -5203280 -5155543 -5210702 -5272564 -5296023 -5364868 -5324484 -5329316 -5309211 -5354036 -5346595
2765 -5346595 -5450443 -5390268 -5357397 -5340497 -5242863 -5211870 -5291395 -5347470 -5310927 -5389286 -5297353
2754 -5297353 -5274003 -5236707 -5241099 -5243990 -5149059 -5231727 -5183667 -5190964 -5108839 -5062726 -5207235 -5215437
2742 -5215437 -5227577 -5239682 -5066831 -5001376 -5025255 -4979186 -4969796 -5020204 -5131286 -5114736 -5077074
$$ packed form
2823e384976r5589m9368k2272Q1169J10618j09115J16572q8642j0527K9186j3876
2812e436820l2219q6711N8782j21810N5071P0151P8544n4669M982J1999n4926
2801e507626K954R3515Q5685j3891N5952r9946K3909L1724o2250M1557Q2509p7102
2789e343010q3151K9551K1610m1549M5379Q7652M5603J411M870n0049M5340R2457
2777e143886J8168p7562M7737n5159o1862k3459o8845M0384m832K0105m4825P441
2765e346595j03848O0175L2871J6900R7634L0993p9525n6075L6543p8359R1933
2754e297353K3350L7296m392k891R4931q2668M8060p297Q2125M6113j44509q202
2742e215437j2140j2105J72851O5455k3879M6069R390n0408j11082J6550L7662
$$ plain form
2731 -5077074 -5048473 -4975722 -4905275 -4880341 -4851104 -4835657 -4925731 -4934441 -4888919 -4898432 -4865993 -4994712
2719 -4994712 -5005192 -4960463 -4977256 -5028387 -4783812 -4627781 -4717300 -4638517 -4635857 -4701800 -4921291
2708 -4921291 -4832452 -4740235 -4704999 -4780677 -4755903 -4709268 -4854920 -4805144 -4699387 -4689577 -4680930
2697 -4680930 -4621357 -4696378 -4697989 -4684585 -4708555 -4732561 -4625861 -4572987 -4569566 -4598763 -4694434 -4630438
2685 -4630438 -4649813 -4627267 -4655350 -4532008 -4507353 -4581029 -4473483 -4460733 -4506683 -4634984 -4493837
2674 -4493837 -4447726 -4455552 -4421326 -4419322 -4468033 -4553467 -4578862 -4573834 -4577340 -4494953 -4456758 -4434250
2662 -4434250 -4434826 -4424623 -4476849 -4367867 -4283485 -4411992 -4457278 -4424655 -4488339 -4458921 -4386749
2651 -4386749 -4456083 -4424375 -4316464 -4295834 -4411095 -4391137 -4339266 -4328187 -4470728 -4357663 -4321999
$$ packed form
2731e077074K8601P2751P0447K4934K9237J5447r0074q710M5522r513L2439j28719
2719d994712j0480M4729j6793n1131K44575J56031q9519P8783K660o5943k19491
2708d921291Q8839R2217L5236p5678K4774M6635j45652M9776J05757R810Q647
2697d680930N9573p5021j611J3404k3970k4006J06700N2874L421k9197r5671O3996
2685d630438j9375K2546k8083J23342K4655p3676J07546J2750m5950j28301J41147
2674d493837M6111p826L4226K004m8711q5434k5395N028l506Q2387L8195K2508
2662d434250n76J0203n2226J08982Q4382j28507m5286L2623o3684K9418P2172
2651d386749o9334L1708J07911K0630j15261J9958N1871J1079j42541J13065L5664
$$ plain form
2640 -4321999 -4360809 -4257288 -4186348 -4154102 -4237255 -4232376 -4316914 -4297892 -4353070 -4340852 -4366274
2629 -4366274 -4375148 -4404688 -4479721 -4374871 -4237037 -4266297 -4227006 -4166736 -4201963 -4258634 -4291689
2618 -4291689 -4275007 -4234950 -4163329 -4097880 -4144711 -4282730 -4101095 -4105842 -4165949 -4104504 -4057629
2607 -4057629 -4175778 -4211526 -4204849 -4221007 -4138210 -4171372 -4167646 -4039444 -4048626 -4049665 -4057971 -3969589
2595 -3969589 -3873387 -3980437 -3949805 -3934373 -4053701 -4045701 -4085919 -4088434 -4147784 -4087634 -4130470
2584 -4130470 -4114198 -3974894 -3977157 -4056909 -4071265 -4085837 -4123014 -4139323 -4100042 -4090155 -4142907 -4075104
2572 -4075104 -4064937 -3897653 -3759378 -3867870 -3887728 -3798423 -3797027 -3947737 -3949604 -3921974 -3955451
2561 -3955451 -3930247 -3886999 -3984508 -3985242 -3966020 -3959158 -3958197 -3812163 -3855767 -3924853 -3864816 -3917036
$$ packed form
2640d321999l8810J03521P0940L2246q3153M879q4538J9022n5178J2218k5422
2629d366274q874k9540p5033J04850J37834k9260L9291O0270l5227n6671l3055
2618d291689J6682M0057P1621O5449m6831j38019J81635m747o0107O1445M6875
2607d057629j18149l5748O677j6158Q2797l3162L726J28202r182j039q306Q8382
2595c969589R6202j07050L0632J5432j19328Q000m0218k515n9350O0150m2836
2584d130470J6272J39304k263p9752j4356j4572l7177j6309L9281R887n2752O7803
2572d075104J0167J67284J38275j08492j9858Q9305J396j50710j867K7630l3477
2561c955451K5204M3248r7509p34J9222O862R61J46034m3604o9086O0037n2220
$$ plain form
2549 -3917036 -3899422 -3875538 -3923729 -3853269 -3719939 -3865870 -3863909 -3758709 -3795772 -3866945 -3778717
2538 -3778717 -3812896 -3733317 -3733104 -3816306 -3847944 -3902725 -3865277 -3793255 -3785646 -3743473 -3682171 -3771521
2526 -3771521 -3738168 -3755152 -3758939 -3752863 -3644746 -3622858 -3731597 -3666076 -3660142 -3591408 -3717266
2515 -3717266 -3615785 -3601615 -3601844 -3662897 -3591062 -3653099 -3645928 -3583806 -3632822 -3636453 -3559802 -3474468
2503 -3474468 -3523315 -3473159 -3507944 -3410209 -3448523 -3377828 -3392965 -3459962 -3414364 -3477335 -3469759 -3604921
2491 -3604921 -3638054 -3560071 -3596990 -3598610 -3586460 -3528560 -3603731 -3639324 -3547059 -3571216 -3491784 -3518222
2479 -3518222 -3440859 -3405800 -3369394 -3360862 -3403988 -3312296 -3279737 -3443293 -3403760 -3345781 -3317992
2468 -3317992 -3359339 -3392903 -3373982 -3346101 -3294105 -3369842 -3325904 -3313779 -3376404 -3378226 -3238813
$$ packed form
2549c917036J7614K3884m8191P0460J33330j45931J961J05200l7063p1173Q8228
2538c778717l4179P9579K13q3202l1638n4781L7448P2022P609M2173O1302q9350
2526c771521L3353j6984l787O076J08117K1888j08739O5521N934O8734j25858
2515c717266J01481J4170k29o1053P1835o2037P171O2122m9016l631P6651Q5334
2503c474468m8847N0156l4785R7735l8314P0695j5137o6997M5598o2971P576j35162
2491c604921l3133P7983l6919j620J2150N7900p5171l5593R2265k4157P9432k6438
2479c518222P7363L5059L6406Q532m3126R1692L2559j63556L9533N7979K7789
2468c317992m1347l3564J8921K7881N1996p5737M3938J2125o2625j822J39413
$$ plain form
2457 -3238813 -3313112 -3328245 -3290223 -3211470 -3177537 -3280403 -3234746 -3270857 -3241855 -3233746 -3254271
2446 -3254271 -3171218 -3193224 -3139729 -3202868 -3210563 -3186995 -3222172 -3213275 -3099438 -3016456 -2963993 -2999540
2434 -2999540 -3071366 -3097108 -3057605 -3066360 -3132174 -2989807 -2950168 -3103181 -3057397 -3054364 -2965011
2423 -2965011 -2929528 -2888718 -2886364 -3005342 -3000223 -3045147 -3025143 -2870078 -2912535 -2964088 -2943880
2412 -2943880 -2954979 -2903502 -2856091 -2750811 -2804971 -2799634 -2718958 -2826765 -2755511 -2670034 -2663070
2401 -2663070 -2678582 -2746164 -2771590 -2756672 -2686354 -2574053 -2542175 -2588673 -2622920 -2669805 -2706148
2390 -2706148 -2664610 -2551412 -2548970 -2554770 -2483607 -2587693 -2508087 -2454867 -2456230 -2207579 -2226385
2379 -2226385 -2209790 -2196166 -2259510 -2146850 -2144379 -2169094 -2156275 -2264327 -2258739 -2162188 -2021375
$$ packed form
2457c238813p4299j5133L8022P8753L3933j02866M5657l6111K9002Q109k0525
2446c254271Q3053k2006N3495o3139p695K3568l5177Q897J13837Q2982N2463l5547
2434b999540p1826k5742L9503q755o5814J42367L9639j53013M5784L033Q9353
2423b965011L5483M0810K354j18978N119m4924K0004J55065m2457n1553K0208
2412b943880j1099N1477M7411J05280n4160N337Q0676j07807P1254Q5477O964
2401b663070j5512o7582k5426J4918P0318J12301L1878m6498l4247m6885l6343
2390b706148M1538J13198K442n800P1163j04086P9606N3220j363K48651j8806
2379b226385J6595J3624o3344J12660K471k4715J2819j08052N588R6551J40813
$$ plain form
2368 -2021375 -1863603 -1893370 -1850396 -1808348 -1810572 -1804247 -1747648 -1636169 -1744042 -1683275 -1530618
2357 -1530618 -1612091 -1408464 -1265043 -1396802 -1307819 -1269038 -1172024 -1123940 -1113649 -877517 -756116
2346 -756116 -655552 -584398 -415630 -154869 627 203907 329559 474828 600022 533651
2336 533651 642183 887359 1139739 1467820 1879233 2339209 3001484 3742992 4836089 6077515
2326 6077515 7792466 9498089 8987928 4650991 -1702756 -7905475 -11830938 -13018790
2318 -13018790 -13137966 -12717743 -12166826 -11473069 -10835615 -10059948 -9652298 -9039318 -8504924
2309 -8504924 -8178051 -7861308 -7694193 -7573007 -7577027 -7383154 -7130588 -6915155 -6697604 -6619791
2299 -6619791 -6546688 -6413801 -6438842 -6370737 -6221535 -6061958 -6015960 -5976318 -5934116 -5885904 -5850428
$$ packed form
2368b021375J57772k9767M2974M2048k224O325N6599J11479j07873O0767J52657
2357a530618q1473K03627J43421j31759Q8983L8781R7014M8084J0291K36132J21401
2346g56116J00564P1154J68768K60761J55496K03280J25652J45269J25194o6371
2336E33651J08532K45176K52380L28081M11413M59976O62275P41508J093097J241426
2326F077515J714951J705623n10161m336937o353747o202719l925463j187852
2318a3018790j19176M20223N50917O93757O37454P75667M07650O12980N34394
2309h504924L26873L16743J67115J21186m020J93873K52566K15433K17551P7813
2299f619791P3103J32887k5041O8105J49202J59577M5998L9642M2202M8212L5476
$$ plain form
2288 -5850428 -5738910 -5589683 -5611805 -5537027 -5497422 -5426044 -5453111 -5293682 -5208661 -5177587 -5094674
2277 -5094674 -4967030 -5050398 -5061168 -4855252 -4768290 -4877775 -4880930 -4847199 -4819526 -4815663 -4852864
2266 -4852864 -4785744 -4622112 -4732033 -4781690 -4601747 -4486602 -4465817 -4530887 -4544704 -4605613 -4641448
2255 -4641448 -4639584 -4461267 -4342495 -4337608 -4391535 -4511706 -4447984 -4377434 -4374835 -4379690 -4263954
2244 -4263954 -4354068 -4376766 -4338087 -4409782 -4288388 -4145305 -4135882 -4145077 -4121440 -4206134 -4254764
2233 -4254764 -4168001 -4036133 -4038233 -4055792 -4076467 -4108581 -4180172 -4170552 -4107733 -4090614 -4002153 -3929957
2221 -3929957 -3899817 -3988408 -4075851 -4121449 -4036532 -3884381 -3948646 -3991062 -4004110 -4012222 -3972531
2210 -3972531 -4002602 -3991340 -3870289 -3890077 -3898893 -3872220 -3943574 -3971089 -3920740 -3809958 -3738103
$$ packed form
2288e850428J11518J49227k2122P4778L9605P1378k7067J59429Q5021L1074Q2913
2277e094674J27644q3368j0770K05916Q6962j09485l155L3731K7673L863l7201
2266d852864O7120J63632j09921m9657J79943J15145K0785o5070j3817o0909l5835
2255d641448J864J78317J18772M887n3927j20171O3722P0550K599m855J15736
2244d263954r0114k2698L8679p1695J21394J43083R423r195K3637q4694m8630
2233d254764Q6763J31868k100j7559k0675l2114p1591R620O2819J7119Q8461P2196
2221c929957L0140q8591q7443m5598Q4917J52151o4265m2416j3048q112L9691
2210c972531l0071J1262J21051j9788q816K6673p1354k7515N0349J10782P1855
$$ plain form
2199 -3738103 -3842312 -3889145 -3831783 -3933005 -3987592 -3884467 -3915931 -3844617 -3764208 -3737636 -3867995
2188 -3867995 -3769181 -3743745 -3800156 -3724050 -3568492 -3605571 -3635850 -3617469 -3658568 -3787781 -3746712
2177 -3746712 -3643257 -3676541 -3652145 -3623510 -3679675 -3732928 -3787797 -3630621 -3643372 -3578209 -3571754
2166 -3571754 -3633057 -3625454 -3702528 -3690414 -3679220 -3624114 -3609362 -3621646 -3635018 -3643573 -3692058 -3595760
2154 -3595760 -3593712 -3617597 -3615289 -3662567 -3643171 -3668481 -3599104 -3594102 -3624476 -3603886 -3497555 -3520631
2142 -3520631 -3483991 -3490010 -3492619 -3539403 -3579526 -3520941 -3494349 -3379678 -3502154 -3568027 -3599676
2131 -3599676 -3576142 -3522619 -3503018 -3504584 -3494376 -3503969 -3556745 -3588719 -3569467 -3585183 -3540984 -3397980
2119 -3397980 -3404737 -3504075 -3556719 -3586700 -3513527 -3422322 -3373102 -3435414 -3489958 -3412555 -3427338 -3418381
$$ packed form
2199c738103j04209m6833N7362j01222n4587J03125l1464P1314Q0409K6572j30359
2188c867995R8814K5436n6411P6106J55558l7079l0279J8381m1099j29213M1069
2177c746712J03455l3284K4396K8635n6165n3253n4869J57176j2751O5163O455
2166c571754o1303P603p7074J2114J1194N5106J4752j2284j3372q555m8485R6298
2154c595760K048k3885K308m7278J9396k5310O9377N002l0374K0590J06331k3076
2142c520631L6640o019k609m6784m0123N8585K6592J14671j22476o5873l1649
2131c599676K3534N3523J9601j566J0208r593n2776l1974J9252j5716M4199J43004
2119c397980o757r9338n2644k9981P3173R1205M9220o2312n4544P7403j4783Q957
$$ plain form
2107 -3418381 -3304175 -3313886 -3273741 -3344250 -3320133 -3247721 -3367408 -3405630 -3272397 -3311899 -3351123
2096 -3351123 -3392967 -3356639 -3396086 -3344767 -3316328 -3326397 -3326909 -3385976 -3381513 -3290344 -3259923 -3353689
2084 -3353689 -3396793 -3417441 -3376594 -3306214 -3365603 -3330224 -3287659 -3214522 -3266295 -3325690 -3304465
2073 -3304465 -3295992 -3277601 -3329596 -3284240 -3134837 -3260854 -3305250 -3190963 -3111870 -3204075 -3248281
2062 -3248281 -3151208 -3188418 -3261557 -3244080 -3266036 -3271896 -3329548 -3273063 -3185153 -3199480 -3180350 -3344157
2050 -3344157 -3356601 -3279812 -3263731 -3217912 -3278775 -3257980 -3328686 -3311263 -3316794 -3251312 -3293217 -3278157
2038 -3278157 -3175583 -3284229 -3313002 -3389090 -3366122 -3335933 -3175225 -3168119 -3231622 -3271931 -3258221
2027 -3258221 -3229447 -3184030 -3161781 -3054807 -3072308 -3151254 -3138642 -3226332 -3274313 -3245729 -3075965
$$ packed form
2107c418381J14206r711M0145p0509K4117P2412j19687l8222J33233l9502l9224
2096c351123m1844L6328l9447N1319K8439j0069n12n9067M463R1169L0421r3766
2084c353689m3104k0648M0847P0380n9389L5379M2565P3137n1773n9395K1225
2073c304465Q473J8391n1995M5356J49403j26017m4396J14287P9093r2205m4206
2062c248281R7073l7210p3139J7477k1956n860n7652N6485Q7910j4327J9130j63807
2050c344157j2444P6789J6081M5819o0863K0795p0706J7423n531O5482m1905J5060
2038c278157J02574j08646k8773p6088K2968L0189J60708P106o3503m0309J3710
2027c258221K8774M5417K2249J06974j7501p8946J2612q7690m7981K8584J69764
$$ plain form
2016 -3075965 -3042974 -3159192 -3270097 -3254020 -3168696 -3149430 -3067922 -3046305 -3083711 -3125306 -3073705
2005 -3073705 -3133884 -3165075 -3197114 -3194738 -3093299 -3092328 -3150803 -3286501 -3287678 -3194871 -3099513 -3058625
1993 -3058625 -3127538 -3077875 -3039915 -3088535 -3190429 -3171348 -3149634 -3107886 -3096417 -2984173 -2974645
1982 -2974645 -3114050 -3075155 -3044351 -3062405 -2986985 -3069170 -3002661 -2965899 -3035627 -3143780 -3106267
1971 -3106267 -3045064 -3089242 -3066378 -2874486 -2925716 -3081544 -3086701 -3014852 -3035478 -3132107 -3073942
1960 -3073942 -3011939 -3045006 -3086695 -3029480 -3080489 -3029185 -2980180 -3050812 -2900275 -2829468 -2845448
1949 -2845448 -3036025 -3001867 -3019651 -2985571 -2971406 -2945889 -2804500 -2891876 -3047632 -3045336 -3088615
1938 -3088615 -3104865 -3116077 -2983525 -2816484 -2953711 -2937950 -2947952 -2983651 -2895660 -2695483 -2657113
$$ packed form
2016c075965L2991j16218j10905J6077Q5324J9266Q1508K1617l7406m1595N1601
2005c073705o0179l1191l2039K376J01439R71n8475j35698j177R2807R5358M0888
1993c058625o8913M9663L7960m8620j01894J9081K1714M1748J1469J12244R528
1982b974645j39405L8895L0804j8054P5420q2185O6509L6762o9728j08153L7513
1971c106267O1203m4178K2864J91892n1230j55828n157P1849k0626r6629N8165
1960c073942O2003l3067m1689N7215n1009N1304M9005p0632J50537P0807j5980
1949b845448j90577L4158j7784L4080J4165K5517J41389q7376j55756K296m3279
1938c088615j6250j1212J32552J67041j37227J5761j0002l5699Q7991K00177L8370
$$ plain form
1927 -2657113 -2749307 -2849864 -2980883 -2971228 -2862383 -2900007 -2880359 -2764412 -2728622 -2911284 -2997320
1916 -2997320 -3009488 -3051611 -2979689 -2982329 -2983946 -2906781 -2955630 -2996349 -3040289 -2926038 -2818209
1905 -2818209 -2931735 -2967033 -2891905 -2959426 -3050320 -3062353 -2988230 -3030041 -2977637 -2983367 -2912219
1894 -2912219 -2921238 -2934674 -2919713 -2876162 -2897315 -2831255 -2817420 -2882870 -2845295 -2900985 -2917996 -2944417
1882 -2944417 -2872959 -2765114 -2769726 -2678379 -2782082 -2847811 -2885882 -2823014 -2905517 -2861372 -2849347
1871 -2849347 -2899734 -2961744 -2906189 -2920649 -2931079 -2835891 -2723786 -2728682 -2773876 -2745038 -2879087
1860 -2879087 -2919501 -2851770 -2781143 -2698758 -2738770 -2732653 -2815455 -2900064 -2852164 -2766720 -2650866
1849 -2650866 -2718525 -2771350 -2758421 -2802148 -2881987 -2810653 -2753443 -2804069 -2783138 -2781200 -2814142 -2805169
$$ packed form
1927b657113r2194j00557j31019R655J08845l7624J9648J15947L5790j82662q6036
1916b997320j2168m2123P1922k640j617P7165m8849m0719m3940J14251J07829
1905b818209j13526l5298P5128o7521r0894j2033P4123m1811N2404n730P1148
1894b912219r019j3436J4961M3551k1153O6060J3835o5450L7575n5690j7011k6421
1882b944417P1458J07845m612R1347j03703o5729l8071O2868q2503M4145J2025
1871b849347n0387o2010N5555j4460j0430R5188J12105m896m5194K8838j34049
1860b879087m0414O7731P0627Q2385m0012O117q2802q4609M7900Q5444J15854
1849b650866o7659n2825J2929m3727p9839P1334N7210n0626K0931J938l2942Q973
$$ plain form
1837 -2805169 -2790390 -2724346 -2709627 -2688037 -2686635 -2812288 -2819845 -2837824 -2801153 -2798324 -2764842 -2725881
1825 -2725881 -2815724 -2762127 -2785782 -2702370 -2631348 -2636167 -2755080 -2745536 -2813659 -2763190 -2756464 -2712843
1813 -2712843 -2686239 -2789075 -2834308 -2751932 -2702462 -2709177 -2640869 -2486228 -2629881 -2644487 -2668226
1802 -2668226 -2773654 -2801926 -2782998 -2643646 -2655530 -2740629 -2794201 -2802616 -2814709 -2798648 -2674816
1791 -2674816 -2688794 -2624707 -2636756 -2717523 -2721292 -2626229 -2826893 -2694608 -2664552 -2744433 -2793842
1780 -2793842 -2744037 -2760415 -2746076 -2637937 -2696642 -2705910 -2732655 -2612172 -2688980 -2808297 -2733386
1769 -2733386 -2752096 -2808987 -2639056 -2633202 -2621513 -2633689 -2655020 -2678146 -2634950 -2641439 -2730893 -2626127
1757 -2626127 -2538467 -2634061 -2843877 -2725739 -2735175 -2824749 -2777237 -2705461 -2649467 -2683667 -2679253
$$ packed form
1837b805169J4779O6044J4719K1590J402j25653p557j7979L6671K829L3482L8961
1825b725881q9843N3597k3655Q3412P1022m819j18913R544o8123N0469O726M3621
1813b712843K6604j02836m5233Q2376M9470o715O8308J54641j43653j4606k3739
1802b668226j05428k8272J8928J39352j1884q5099n3572q415j2093J6061J23832
1791b674816j3978O4087j2049q0767l769R5063k00664J32285L0056p9881m9409
1780b793842M9805j6378J4339J08139n8705r268k6745J20483p6808j19317P4911
1769b733386j8710n6891J69931N854J1689j2176k1331k3126M3196o489q9454J04766
1757b626127Q7660r5594k09816J18138r436q9574M7512P1776N5994l4200M414
$$ plain form
1746 -2679253 -2660068 -2686676 -2622416 -2613451 -2638572 -2665130 -2691173 -2526455 -2573980 -2620584 -2734058
1735 -2734058 -2637780 -2763637 -2749640 -2591371 -2664129 -2700089 -2650318 -2629337 -2689620 -2662747 -2533647
1724 -2533647 -2544463 -2588981 -2557639 -2593957 -2601191 -2640394 -2645308 -2633348 -2610615 -2530278 -2592053 -2516571
1712 -2516571 -2549728 -2598058 -2617055 -2633632 -2621890 -2555191 -2675562 -2685051 -2721360 -2613236 -2614941
1701 -2614941 -2708944 -2605030 -2443783 -2546921 -2584700 -2587958 -2560721 -2664017 -2592769 -2549537 -2610530
1690 -2610530 -2571541 -2644836 -2521332 -2558384 -2608814 -2542858 -2488866 -2575202 -2537093 -2437646 -2378564
1679 -2378564 -2416568 -2408422 -2395449 -2558145 -2584131 -2515907 -2502102 -2528077 -2480256 -2467424 -2632327
1668 -2632327 -2614530 -2376529 -2379031 -2537835 -2486614 -2595059 -2594773 -2648501 -2706397 -2622352 -2473072
$$ packed form
1746b679253J9185k6608O4260Q965k5121k6558k6043J64718m7525m6604j13474
1735b734058R6278j25857J3997J58269p2758l5960M9771K0981o0283K6873J29100
1724b533647j0816m4518L1342l6318p234l9203m914J1960K2733Q0337o1775P5482
1712b516571l3157m8330j8997j6577J1742O6699j20371r489l6309J08124j705
1701b614941r4003J03914J61247j03138l7779l258K7237j03296P1248M3232o0993
1690b610530L8989p3295J23504l7052n0430O5956N3992q6336L8109R9447N9082
1679b378564l8004Q146J2973j62696k5986O8224J3805k5975M7821J2832j64903
1668b632327J7797K38001k502j58804N1221j08445K86n3728n7896Q4045J49280
$$ plain form
1657 -2473072 -2487970 -2633385 -2557999 -2524548 -2533583 -2615863 -2498761 -2559163 -2693609 -2588094 -2487646
1646 -2487646 -2524735 -2598130 -2554569 -2551458 -2467885 -2494265 -2507829 -2452728 -2406915 -2583126 -2565604
1635 -2565604 -2645400 -2645840 -2663480 -2541263 -2491035 -2562390 -2533113 -2582896 -2597048 -2411404 -2393116
1624 -2393116 -2539879 -2543532 -2460027 -2594600 -2649579 -2566460 -2438338 -2481867 -2574829 -2409789 -2453229
1613 -2453229 -2498517 -2448495 -2542944 -2532609 -2465532 -2565570 -2553458 -2469033 -2464462 -2524991 -2612172
1602 -2612172 -2516565 -2500099 -2504504 -2553573 -2331783 -2438335 -2532075 -2448639 -2416425 -2461943 -2510862
1591 -2510862 -2493090 -2411597 -2497318 -2624232 -2482940 -2467453 -2474639 -2469993 -2473473 -2504244 -2439203 -2447207
1579 -2447207 -2410630 -2320754 -2227673 -2332384 -2382890 -2409728 -2354284 -2439776 -2486367 -2439906 -2425828
$$ packed form
1657b473072j4898j45415P5386L3451r035q2280J17102o0402j34446J05515J00448
1646b487646l7089p3395M3561L111Q3573k6380j3564N5101M5813j76211J7522
1635b565604p9796m40j7640J22217N0228p1355K9277m9783j4152J85644J8288
1624b393116j46763l653Q3505j34573n4979Q3119J28122m3529r2962J65040m3440
1613b453229m5288N0022r4449J0335O7077j00038J2112Q4425M571o0529q7181
1602b612172R5607J6466m405m9069K21790j06552r3740Q3436L2214m5518m8919
1591b510862J7772Q1493q5721j26914J41292J5487p186M646l480l0771O5041q004
1579b447207L6577Q9876R3081j04711n0506k6838N5444q5492m6591M6461J4078
$$ plain form
1568 -2425828 -2433046 -2410327 -2468760 -2408427 -2354551 -2363085 -2423108 -2305499 -2334941 -2400614 -2437729 -2464644
1556 -2464644 -2340640 -2320986 -2361453 -2310887 -2382757 -2433219 -2552118 -2508297 -2375014 -2365108 -2418393
1545 -2418393 -2379948 -2388990 -2504999 -2531588 -2392583 -2321437 -2360350 -2416746 -2412905 -2419604 -2497667 -2493935
1533 -2493935 -2498974 -2508072 -2447593 -2409057 -2435537 -2512571 -2412670 -2432054 -2376852 -2394052 -2321306 -2403428
1521 -2403428 -2455028 -2366958 -2347928 -2414300 -2393672 -2307471 -2296415 -2277708 -2286634 -2342504 -2338851 -2426799
1509 -2426799 -2446383 -2340199 -2337992 -2315505 -2346785 -2326996 -2410928 -2422217 -2397870 -2423890 -2395584
1498 -2395584 -2400381 -2398827 -2382975 -2430710 -2361588 -2394974 -2377639 -2374616 -2342517 -2288939 -2276656 -2337918
1486 -2337918 -2266738 -2368093 -2375997 -2260095 -2266917 -2275056 -2322984 -2383534 -2341158 -2379644 -2238712
$$ packed form
1568b425828p218K2719n8433O0333N3876q534o0023J17609k9442o5673l7115k6915
1556b464644J24004J9654m0467N0566p1870n0462j18899M3821J33283R906n3285
1545b418393L8445r042j16009k6589J39005P1146l8913n6396L841o699p8063L732
1533b493935n039r098O0479L8536k6480p7034R9901j9384N5202j7200P2746q2122
1521b403428n1600Q8070J9030o6372K0628Q6201J1056J8707q926n5870L653q7948
1509b426799j9584J06184K207K2487l1280J9789q3932j1289K4347k6020K8306
1498b395584m797J554J5852m7735O9122l3386J7335L023L2099N3578J2283o1262
1486b337918P1180j01355p904J15902o822q139m7928o0550M2376l8486J40932
$$ plain form
1475 -2238712 -2220470 -2251644 -2251927 -2373114 -2427027 -2465170 -2432299 -2347222 -2391070 -2401974 -2393300 -2287655
1463 -2287655 -2367425 -2335136 -2290232 -2295810 -2354297 -2255746 -2363891 -2344786 -2412753 -2283469 -2209541
1452 -2209541 -2261221 -2287911 -2267922 -2293923 -2356640 -2253348 -2336574 -2399999 -2360996 -2349055 -2333598
1441 -2333598 -2283753 -2224204 -2262773 -2280160 -2239389 -2210116 -2222690 -2195222 -2205569 -2234335 -2357668
1430 -2357668 -2342060 -2426132 -2433950 -2315904 -2279449 -2325706 -2322390 -2305318 -2304143 -2234277 -2253214 -2222160
1418 -2222160 -2252066 -2235634 -2269323 -2314642 -2348951 -2309859 -2363861 -2268122 -2204570 -2204201 -2279829 -2256686
1406 -2256686 -2307343 -2243206 -2219660 -2200202 -2148896 -2212275 -2273118 -2315349 -2324232 -2343352 -2318536 -2195318
1394 -2195318 -2260690 -2248332 -2248235 -2322255 -2349581 -2210913 -2192105 -2164877 -2163749 -2128247 -2252344 -2221837
$$ packed form
1475b238712J8242l1174k83j21187n3913l8143L2871Q5077m3848j0904Q674J05645
1463b287655p9770L2289M4904n578n8487R8551j08145J9105o7967J29284P3928
1452b209541n1680k6690J9989k6001o2717J03292q3226o3425L9003J1941J5457
1441b333598M9845N9549l8569j7387M0771K9273j2574K7468j0347k8766j23333
1430b357668J5608q4072p818J18046L6455m6257L316J7072J175O9866j8937L1054
1418b222160k9906J6432l3689m5319l4309L9092n4002R5739O3552L69p5628K3143
1406b256686n0657O4137K3546J9458N1306o3379o0843m2231q883j9120K4816J23218
1394b195318o5372J2358R7p4020k7326J38668J8808K7228J128L5502j24097L0507
$$ plain form
1382 -2221837 -2308564 -2244507 -2209517 -2222107 -2199306 -2293275 -2402601 -2317895 -2326489 -2279961 -2235294
1371 -2235294 -2195987 -2149047 -2118944 -2199521 -2235160 -2120777 -2128988 -2105612 -2125164 -2239068 -2220576
$$ packed form
1382b221837q6727O4057L4990j2590K2801r3969j09326Q4706q594M6528M4667
1371b235294L9307M6940L0103q0577l5639J14383q211K3376j9552j13904J8492
$$ [...]
##END NTUPLES=NMR SPECTRUM
##END=
