##TITLE=1H_DE-80H_X3
 200.13MHz, d2o
 8 sc
 
 19ns.26.2.2025
##JCAMPDX= 6.0         $$ Bruker NMR JCAMP-DX V2.0
##DATA TYPE= NMR SPECTRUM
##DATA CLASS= NTUPLES
##ORIGIN= UXNMR, Bruker Analytische Messtechnik GmbH
##OWNER= pz
$$ XWIN-NMR		Version 3.5
$$ Wed May  6 12:27:53 2026 Russian Standard Time (UT+4h)  Yarkov@DPX200
##.OBSERVE FREQUENCY= 200.1313
##.OBSERVE NUCLEUS= ^1H
##.ACQUISITION MODE= SIMULTANEOUS
##.ACQUISITION SCHEME= undefined
##.AVERAGES= 8
##.DIGITISER RES= 18
##SPECTROMETER/DATA SYSTEM= spect
##.PULSE SEQUENCE= zg30
##.SOLVENT NAME= DMSO
##.SHIFT REFERENCE= (INTERNAL, DMSO, 0, 18.0299)
##AUDIT TRAIL= $$ (NUMBER, WHEN, WHO, WHERE, WHAT)
$$ ##TITLE= Audit trail, XWIN-NMR		Version 3.5
$$ ##JCAMPDX= 5.01
$$ ##ORIGIN= Bruker BioSpin GmbH
$$ ##OWNER= Yarkov
$$ C:/Bruker/XWIN-NMR/data/yarkov2/nmr/H-C/1/pdata/1/auditp.txt
$$ ##AUDIT TRAIL=  $$ (NUMBER, WHEN, WHO, WHERE, WHAT)
(   1,<2026-05-06 12:23:37.37 +0400>,<Yarkov>,<DPX200>,
      <created by zg, POWCHK disabled, PULCHK disabled
       configuration hash MD5:
       00 E9 B6 7A A2 85 ED C7 34 08 36 98 17 FE 4E 26
       data hash MD5: 16K
       9B 47 CC E6 D8 B6 92 C0 E8 D9 0C 8E A0 B0 A2 C4>)
(   2,<2026-05-06 12:23:45.57 +0400>,<Yarkov>,<DPX200>,
      <Start of raw data processing
       efp BC_mod = 2 LB = 0.25 FT_mod = 6 PKNL = 1 PHC0 = -5504.716 PHC1 = 11.42193 SI = 16K 
       data hash MD5: 16K
       FF 1F 97 4F 5C FE 45 C7 A3 D5 B3 93 6D 8C B0 73>)
(   3,<2026-05-06 12:24:01.29 +0400>,<Yarkov>,<DPX200>,
      <pk PHC0 = -7 PHC1 = 0 
       data hash MD5: 16K
       CA 91 54 5D FF 7A FB B0 FF BE 8E 52 18 88 04 93>)
(   4,<2026-05-06 12:25:46.04 +0400>,<Yarkov>,<DPX200>,
      <abs ABSG = 5 
       data hash MD5: 16K
       CE 6A DA EC 6F 07 F8 60 24 31 C1 70 DA 44 5C 22>)
$$ ##END=
$$ 
$$ hash MD5
$$ ED 75 ED 2E 30 29 19 AF 36 49 62 4C DB C9 5E 85
##$RELAX= 
##$RELAX= 
##$RELAX= 
##$RELAX= 
##$RELAX= 
##$RELAX= 
$$ Bruker specific parameters
$$ --------------------------
##$DU= <C:/Bruker/XWIN-NMR>
##$EXPNO= 1
##$NAME= <H-C>
##$PROCNO= 1
##$TYPE= <nmr>
##$USER= <yarkov2>
##$AMP= (0..31)
100 100 100 100 100 100 100 100 100 100 100 100 100 100 100 100 100 100 
100 100 100 100 100 100 100 100 100 100 100 100 100 100 
##$AQSEQ= 0
##$AQ_mod= 1
##$AUNM= <au_zg>
##$AUTOPOS= <>
##$BF1= 200.13
##$BF2= 200.13
##$BF3= 200.13
##$BF4= 200.13
##$BF5= 200.13
##$BF6= 200.13
##$BF7= 200.13
##$BF8= 200.13
##$BYTORDA= 1
##$CFDGTYP= 0
##$CFRGTYP= 5
##$CHEMSTR= <none>
##$CNST= (0..31)
1 1 145 1 1 1 1 1 1 1 1 1 1 1 1 1 1 1 1 1 1 1 1 1 1 1 1 1 1 1 1 1 
##$CPDPRG= <>
##$CPDPRG1= <>
##$CPDPRG2= <>
##$CPDPRG3= <>
##$CPDPRG4= <mlev>
##$CPDPRG5= <mlev>
##$CPDPRG6= <mlev>
##$CPDPRG7= <mlev>
##$CPDPRG8= <mlev>
##$CPDPRGB= <>
##$CPDPRGT= <>
##$D= (0..31)
0 0.7 0 0 0 0 0 0 0 0 0 0.03 0 0 0 0 0 0 0 0 0 0 0 0 0 0 0 0 0 0 0 0 
##$DATE= 1778055817
##$DBL= (0..7)
120 120 120 120 120 120 120 120 
##$DBP= (0..7)
150 150 150 150 150 150 150 150 
##$DBP07= 0
##$DBPNAM0= <>
##$DBPNAM1= <>
##$DBPNAM2= <>
$$ [...]
##$SUBNAM3= <"">
##$SUBNAM4= <"">
##$SUBNAM5= <"">
##$SUBNAM6= <"">
##$SUBNAM7= <"">
##$SUBNAM8= <"">
##$SUBNAM9= <"">
##$SW= 18.0517328524113
##$SWIBOX= (0..15)
0 0 2 0 0 0 0 0 0 0 0 0 0 0 0 0 
##$SW_h= 3612.71676300578
##$TD= 16384
##$TD0= 1
##$TE= 0
##$TE2= 300
##$TE3= 300
##$TEG= 300
##$TL= (0..7)
0 120 120 120 120 120 120 120 
##$TP= (0..7)
150 150 150 150 150 150 150 150 
##$TP07= 0
##$TPNAME0= <>
##$TPNAME1= <>
##$TPNAME2= <>
##$TPNAME3= <>
##$TPNAME4= <>
##$TPNAME5= <>
##$TPNAME6= <>
##$TPNAME7= <>
##$TPOAL= (0..7)
0.5 0.5 0.5 0.5 0.5 0.5 0.5 0.5 
##$TPOFFS= (0..7)
0 0 0 0 0 0 0 0 
##$TUNHIN= 0
##$TUNHOUT= 0
##$TUNXOUT= 0
##$USERA1= <user>
##$USERA2= <user>
##$USERA3= <user>
##$USERA4= <user>
##$USERA5= <user>
##$V9= 5
##$VALIST= <valist>
##$VCLIST= <CCCCCCCCCCCCCCC>
##$VD= 0
##$VDLIST= <DDDDDDDDDDDDDDD>
##$VPLIST= <PPPPPPPPPPPPPPP>
##$VTLIST= <TTTTTTTTTTTTTTT>
##$WBST= 1024
##$WBSW= 4
##$XGAIN= (0..3)
0 0 0 0 
##$XL= 0
##$YL= 0
##$YMAX_a= 159065
##$YMIN_a= -167706
##$ZGOPTNS= <>
##$ZL1= 120
##$ZL2= 120
##$ZL3= 120
##$ZL4= 120
##$ABSF1= 18.08519
##$ABSF2= 0.03329277
##$ABSG= 5
##$ABSL= 3
##$ALPHA= 0
##$AQORDER= 0
##$ASSFAC= 0
##$ASSFACI= 0
##$ASSFACX= 0
##$ASSWID= 0
##$AUNMP= <proc_1d>
##$AZFE= 0.1
##$AZFW= 0.1
##$BCFW= 0
##$BC_mod= 2
##$BYTORDP= 0
##$COROFFS= 0
##$CY= -3
##$DATMOD= 1
##$DC= 0
##$DFILT= <>
##$DTYPP= 0
##$F1P= 0
##$F2P= 0
##$FCOR= 1
##$FTSIZE= 16384
##$FT_mod= 6
##$GAMMA= 0
##$GB= 0
##$INTBC= 1
##$INTSCL= 3.241238e-09
##$ISEN= 128
##$LB= 0.25
##$LEV0= 0
##$LPBIN= 0
##$MAXI= 10000
##$MC2= 0
##$MEAN= 0
##$ME_mod= 0
##$MI= 1.114404
##$NCOEF= 0
##$NC_proc= -8
##$NLEV= 6
##$NOISF1= 3.799351
##$NOISF2= 2.8
##$NSP= 0
##$NTH_PI= 0
##$NZP= 0
##$OFFSET= 18.02987
##$PC= 1
##$PHC0= -5511.716
##$PHC1= 11.42193
##$PH_mod= 1
##$PKNL= yes
##$PPARMOD= 0
##$PSCAL= 0
##$PSIGN= 0
##$REVERSE= no
##$SF= 200.129498048811
##$SI= 16384
##$SIGF1= 3
##$SIGF2= 2
##$SINO= 0.751879
##$SIOLD= 32768
##$SREGLST= <19F.Aceton>
##$SSB= 0
##$STSI= 16384
##$STSR= 0
##$SW_p= 3612.71676300578
##$SYMM= 0
##$S_DEV= 0
##$TDeff= 16384
##$TDoff= 0
##$TI= <>
##$TILT= no
##$TM1= 0
##$TM2= 0
##$TOPLEV= 0
##$USERP1= <user>
##$USERP2= <user>
##$USERP3= <user>
##$USERP4= <user>
##$USERP5= <user>
##$WDW= 1
##$XDIM= 16384
##$YMAX_p= 315730053
##$YMIN_p= -30916089
$$ End of Bruker specific parameters
$$ ---------------------------------
##NTUPLES= NMR SPECTRUM
##VAR_NAME=  FREQUENCY,     SPECTRUM/REAL,   SPECTRUM/IMAG
##SYMBOL=    X,             R,               I
##VAR_TYPE=  INDEPENDENT,   DEPENDENT,       DEPENDENT
##VAR_FORM=  AFFN,          ASDF,            ASDF
##VAR_DIM=   16384,         16384,           16384
##UNITS=     HZ,            ARBITRARY UNITS, ARBITRARY UNITS
##FACTOR=    0.220516191357247, 1,           1
##FIRST=     3608.30864878409, 0,            0
##LAST=      -4.4081142216869, 0,            0
##MIN=       -4.4081142216869, -30916089,    0
##MAX=       3608.30864878409, 315730053,    0
$$ Real data points
##PAGE= N=1
##DATA TABLE= (X++(R..R)), XYDATA
$$ [...]
2709C8645013o03932L3397J267616l00312n19422K4424n25086j104589l31690
2700C6585419j49349p79798N98355L97551l63204J69287J228716O66769l76235
2691C7977511J20523O85401Q33912l47302l60665m27979l63018L66667p08177
2682C7776873L99450j28122P17790k39456j027832m0536P34841Q02974Q9515O0619
2672C9146116P72383n35535M08166L87979k17369R21014J682150J43956m49001
2663D2259859J44801L2625M88246j098721n63983m91115L98909K18305m64338
2654D0924588M4922P0764p4114m93089l80292J86607O16698P4964K81827N08662
2644D1761537k02645m11634r24367Q70685J65804r52132q1087l03784O16075k62621
$$ plain form
2709 38645013 38041081 38074478 39342094 39041782 38522360 38546784 38021698 36917109 36585419
2700 36585419 36436070 35656272 36254627 36652178 36288974 36458261 37686977 38353746 37977511
2691 37977511 38098034 38783435 39617347 39270045 38909380 38481401 38118383 38485050 37776873
2682 37776873 38176323 38048201 38765991 38526535 37498703 37458167 38193008 38995982 39085497 39146116
2672 39146116 39918499 39382964 39791130 40179109 39961740 40882754 42564904 42708860 42259859
2663 42259859 42404660 42437285 42925531 41826810 41262827 40771712 41170621 41388926 40924588
2654 40924588 40969510 41040274 40966160 40473071 40092779 40279386 40896084 40971048 41252875 41761537
2644 41761537 41558892 41147258 40222891 41093576 41259380 40307248 40226161 39922377 40538452 40275831
2634D0275831L40731L13626k15351j74490k70901l3115q04018M34769K9702J146433
2624D1043217P83034L64454J58528k5796J186904N85771J069896P81397j88883
2615D5758522J200537P31505l1878l4442P22019J855546K32610L36755J181453
2606E1952627J534300P58964J359098Q21857J300526J591453J191451J433348
2598F1943624J448908J925304J070355N18445J010246J871791J084585J240554
2590G2113812J411727P22941M93153J95289r0000o39287o9529M35047L99670O93538
2580G5666361j11595K06775Q6680j452546k82877P48778j98322L46787P35090
2571G5745131R53156l63885j122847K8557j63250j480875k41022n82127o29259
$$ plain form
2634 40275831 40616562 40930188 40714837 40540347 40269446 40236331 39432313 39867082 39896784 41043217
2624 41043217 41826251 42190705 42349233 42323437 43510341 44096112 45166008 45947405 45758522
2615 45758522 46959059 47690564 47658686 47624244 48346263 50201809 50434419 50771174 51952627
2606 51952627 53486927 54245891 55604989 56426846 57727372 59318825 60510276 61943624
2598 61943624 63392532 65317836 66388191 66906636 67916882 69788673 70873258 72113812
2590 72113812 73525539 74248480 74741633 74936922 74846922 74207635 74138106 74573153 74972823 75666361
2580 75666361 75554766 75761541 75848221 74395675 74112798 74861576 74663254 75010041 75745131
2571 75745131 76698287 76334402 75211555 75240112 75076862 73595987 73354965 72772838 72143579
2562G2143579k11858j142477j535834j189191j411749j198586j266128J56756
2554F4344512P08484j680j70164J69119j58178p26993l48204j170304o632L14439
2544F2954399j064220L95964P55357K28656k95231L73849J89219Q04985J934388
2535F6277366R48265J264692J882221L656908M608919O509663J0898996J3884408
2527A09931438J5146149J2894879N167949n297915j0955522j1496235j0737926
2520A04652817r167352p634683o277045m954500l171560l505375j887622j407299
2512F6647381j523578j162544k236045j541272j293704j508664k82957j931647
2504E5166970j207910m07014j174730j452892q86473j412869n68081k55811j086274
$$ plain form
2562 72143579 71931721 70789244 69253410 68064219 66652470 65453884 64187756 64344512
2554 64344512 65052996 65051316 64881152 65050271 64892093 64165100 63816896 62646592 62639960 62954399
2544 62954399 61890179 62286143 63041500 63270156 62974925 63348774 63537993 64342978 66277366
2535 66277366 67225631 68490323 70372544 74029452 78638371 85148034 96047030 109931438
2527 109931438 125077587 137972466 143140415 137842500 126886978 115390743 104652817
2520 104652817 95485465 87850782 81573737 76619237 73447677 69942302 68054680 66647381
2512 66647381 65123803 63961259 61725214 60183942 58890238 57381574 57098617 55166970
2504 55166970 53959060 53552046 52377316 50924424 50037951 48625082 48057001 47801190 46714916
2495D6714916p56906l31221O88458p31848j061663Q4026m88558p25669r87654
2486D2403881L61357K25891o55265M39986l83655j079485k52663n35186l06834
2477D0218027L95278J44153K94835L68401k10844O38278o53790M02332M3552O07008
2467D2247230J189915l17174J323143J016523M96985O40167J60199J152230J494238
2458D9403456M19199Q72593J053519J48659J451979R53935l5089J971283J681350
2449E7920884O83801J483925J726681O74904J365161K083955Q10517K192361J991150
2440G0933339J452695K414051R12406K590048K395830Q13929J675648K712677
2432H5900623J943088L298473K312649J849374K296442J895364J059558J980391
$$ plain form
2495 46714916 45958010 45626789 46315247 45583399 44521736 44605762 44117204 43391535 42403881
2486 42403881 42765238 42991129 42335864 42775850 42392195 41312710 41060047 40524861 40218027
2477 40218027 40613305 40757458 41052293 41420694 41209850 41848128 41194338 41596670 41640222 42247230
2467 42247230 43437145 43119971 44443114 45459637 45956622 46596789 46756988 47909218 49403456
2458 49403456 49822655 50695248 51748767 51897426 53349405 54303340 54268251 56239534 57920884
2449 57920884 58604685 60088610 61815291 62490195 63855356 65939311 66749828 68942189 70933339
2440 70933339 72386034 74800085 75712491 78302539 80698369 81512298 83187946 85900623
2432 85900623 87843711 91142184 93454833 95304207 97600649 99496013 100555571 102535962
2424A02535962J904648J063939J210033J702650N46427L85299L69639K38055P76828
2415A10733480N2451J265878J428622J039266K351177J556781Q95037L101468
2407A22424160K808660J585160K866716L563954L416699L055015K381579K597461
2399A44699404K169831J466300J267765J95960m44104j123651j545884k810929
2391A43874692l523255l262713k645667l937380m010428l363251k760185k812937
2383A17558876l817639k321344k059764k093030k175024j846038j754256k555711
2375I8936070j312971j483084k873432k492017j773344k036950k429401k416079
2367H2118792l649457k919188l520069l140002l546771l650114k796170k717725
$$ plain form
2424 102535962 104440610 105504549 106714582 108417232 108963659 109348958 109718597 109956652 110733480
2415 110733480 110785931 112051809 113480431 114519697 116870874 118427655 119322692 122424160
2407 122424160 125232820 126817980 129684696 133248650 136665349 139720364 142101943 144699404
2399 144699404 146869235 148335535 149603300 149799260 149355156 148231505 146685621 143874692
2391 143874692 140351437 137088724 134443057 130505677 126495249 123131998 120371813 117558876
2383 117558876 113741237 111419893 109360129 107267099 105092075 103246037 101491781 98936070
2375 98936070 97623099 96140015 93266583 90774566 89001222 86964272 84534871 82118792
2367 82118792 78469335 75550147 72030078 68890076 65343305 61693191 58897021 56179296
2359E6179296k178877l290745l344567k066579k206712j327934k017378j426375
2351C8320129n16897q68370j565908j187431j611431r89206m57882j594879r0494
2342B9437631m81979k71833n0853O1852l24544k92362M9699n30616k63174R28940
2332B8262761N20908L11325J261163J575143J892717L308320L593990M024344
2324D4750671L227995K36280j427387l891522k659837k231272k580384k420233
2316C3004311j479475j468638n53276Q14435O99052R27549J712294K909569J398623
2307C7964444J632775J899998J435846J170637K004880K666721K907599L391214
2299E5074114L314432K770589P83397j46651P57171K09763K275545L904912K586634
$$ plain form
2359 56179296 54000419 50709674 47365107 45298528 43091816 41763882 39746504 38320129
2351 38320129 37803232 36934862 35368954 34181523 32570092 31580886 31123004 29528125 29437631
2342 29437631 28955652 28683819 28632966 28694818 28370274 28077912 28127611 27596995 27333821 28262761
2332 28262761 28783669 29094994 30356157 31931300 33824017 37132337 40726327 44750671
2324 44750671 47978666 48214946 46787559 42896037 40236200 38004928 35424544 33004311
2316 33004311 31524836 30056198 29502922 30317357 31016409 31943958 33656252 36565821 37964444
2307 37964444 39597219 41497217 42933063 44103700 46108580 48775301 51682900 55074114
2299 55074114 58388546 61159135 61942532 61795881 62553052 62762815 65038360 68943272 71529906
2290G1529906J973731q08846j247508k904402l253884j767069r53016n19049j735756
2281F0314107j773628k834514m201512l835201k722485k021565l033552j654626
2273C8237024k272620l166102k709658j954089k510048l096683j750475j904865
2265A8872484j423227k464635o95937n53061p77038q29039k96623K00367K17504
2256A2250795j7489p24507j88558j47636k52053J47017n14566m54797m2803r2081
2246I963322K49499P7182q49330L22721j51472m67621L88626K96615k92322j96384
2236I340836O83200L45440l60746j116505L02259O89598p15837L21043K74300
2227I763588M67589O93812l89551k39649j73377O7931J047811O32391n77066J25103
$$ plain form
2290 71529906 73503637 72694791 71447283 68542881 65288997 63521928 62568912 62049863 60314107
2281 60314107 58540479 55705965 51504453 47669252 44946767 42925202 39891650 38237024
2273 38237024 35964404 32798302 30088644 28134555 25624507 22527824 20777349 18872484
2265 18872484 17449257 14984622 14288685 13735624 12958586 12129547 11832924 12033291 12250795
2256 12250795 12233306 11508799 11320241 11172605 10920552 11067569 10553003 10098206 10055403 9963322
2246 9963322 10212821 10290003 9440673 9763394 9611922 9144301 9532927 9829542 9537220 9340836
2236 9340836 10024036 10369476 10008730 8892225 9194484 9884082 9168245 9489288 9763588
2227 9763588 10231177 10924989 10535438 10295789 10122412 10190343 11238154 11870545 11293479 11418582
2217A1418582M64635K14002o09340k51810k7116j51766k98098L79077o40844m44456
2207A0052866K80295N14420k26167n79843K85196O5911N2478L92216k72112k40368
2197A0324892m9970j90217J87919j201540o48541J106565k20493m89872k99086
2188H519657L26810L42675j035113L44500N32965o11658n38008p96714n02751
2179F582363K40955o76239j73131J4885L41366O05471j116825l77022M15628K80782
2169F138233m03193j220137N0795P73244J53410j75344p63221m84584J65472l35397
2159C899278o39310j21214J40365J173768M56800j86424j2395r63873L32424L9587
2149D119006o06439m24887m28581K80684P70224l15905l75210r40640j33455P04928
$$ plain form
2217 11418582 11883217 12097219 11487879 11236069 11208953 11057187 10759089 11138166 10497322 10052866
2207 10052866 10333161 10847581 10621414 10041571 10326767 10392678 10445156 10837372 10565260 10324892
2197 10324892 10274922 10084705 10272624 9071084 8422543 9529108 9308615 8818743 8519657
2188 8519657 8846467 9189142 8154029 8498529 9031494 8419836 7881828 7085114 6582363
2179 6582363 6823318 6147079 5973948 5988833 6330199 6935670 5818845 5441823 5857451 6138233
2169 6138233 5735040 4514903 4565698 5338942 5492352 5317008 4553787 4069203 4234675 3899278
2159 3899278 3259968 3138754 3279119 4452887 4909687 4723263 4710868 3746995 4079419 4119006
2149 4119006 3512567 3087680 2659099 2939783 3710007 3394102 3018892 2078252 1944797 2649725
2139B649725l88903k23376N92040N54342K02783p47198r03225L09273J75318j63309
2129B057470j38728L93344K7636P7291l50080M07393M13290K458j28515l9307
2119B722252Q84164L62748j70976r88278j66707O35052R9578k06765l39715o20962
2109B210391L11752L34700r78349L13615L15219K13534M03506q3916J26257n06733
2099B659976o4506r6461j4399K4372R3761R59971O71262m71206n73733k76347
2089B912690K71563n95296j00789J189792L92714O31223K70534o39810l53977
2080C978644m79199J82146j004537j83584R37787O04239L50257L31912L78775
2071E096440j098625j73913q1529L20818J57196j14993M20479q88637m47809M37758
$$ plain form
2139 2649725 2260822 2037446 2629486 3183828 3386611 2639413 1736188 2045461 2220779 2057470
2129 2057470 1918742 2312086 2339722 2417013 2066933 2474326 2887616 2890074 2761559 2722252
2119 2722252 3606416 3969164 3798188 2809910 2643203 3278255 3377833 3171068 2831353 2210391
2109 2210391 2522143 2856843 1878494 2192109 2507328 2720862 3124368 3040452 3166709 2659976
2099 2659976 2595470 2499009 2484610 2508982 2602743 3562714 4233976 3762770 3189037 2912690
2089 2912690 3184253 2588957 2488168 3677960 4070674 4701897 4972431 4332621 3978644
2080 3978644 3499445 3681591 2677054 2493470 3431257 4035496 4385753 4717665 5096440
2071 5096440 3997815 3823902 3742373 4063191 4220387 4105394 4525873 3637236 3189427 3627185
2061C627185k4883l27805O71015J072591N78192j17670J97273L90839j61512l58420
2051E546805L89889N31241k02107L50048J284822j83588p08664L44239Q972N97475
2041G959132o1454P76985O52298j57737J00102j79177o00540k66606L87161Q7434
2031H697598q16396L36993R5852j266k65121n40961m31732L87020O28985r65253
2021G125719O61741M19247l9885q3921m10903N94763k57274K73575j81977L88504
2011H489589M47006j42438k93631P07590N41450k44495R58376J08455O77885m0319
2001A1209468l01356P17207l56398O48400R44143J10953Q72057Q00947j36604
1992A4508817k61055P55860m56837N51941P80660k83653L15179o12283k14793
$$ plain form
2061 3627185 3602302 3274497 3945512 5018103 5596295 5478625 5675898 6066737 5905225 5546805
2051 5546805 5936694 6467935 6265828 6615876 7900698 7717110 7008446 7352685 7361657 7959132
2041 7959132 7897678 8674663 9326961 9169224 9269326 9090149 8489609 8223003 8610164 8697598
2031 8697598 7881202 8218195 8314047 8312781 8047660 7506699 7074967 7461987 8090972 7125719
2021 7125719 7787460 8206707 8166822 8082901 7671998 8266761 8009487 8283062 8101085 8489589
2011 8489589 8936595 8794157 8500526 9208116 9749566 9505071 10463447 10571902 11249787 11209468
2001 11209468 10908112 11625319 11268921 11917321 12861464 12972417 13844474 14645421 14508817
1992 14508817 14247762 15003622 14546785 15098726 15879386 15595733 15910912 15298629 15083836
1983A5083836o45661r89059m22230L11803n55721l62547Q46366o14511p81030
1974A1871246p1532k19769j296347m86615m57753r4826P23059j102832j3853J35488
1964H986266q29904Q2778Q40450L5482j50091n56r7518O5969j04671P0387J27089
1953I025681L46419L96822N30049k00913L63991J474979O0706m02856N55485N55479
1943A2705842k00399M26594K60552j386038K22559P9457m9835M07993K87376K14616
1933A2968717K56468j33750K40015O07044P19166J090335J433483O0971j308069
1924A5934380j683152j138166j140104m07132j581917o40521K86944q57423P62131
1915I535040p76543o06845q4849j23392m78791o68312O4844q6274M76359j09442
$$ plain form
1983 15083836 14438175 13449116 13026886 13338689 12782968 12420421 13266787 12652276 11871246
1974 11871246 11799714 11579945 10283598 9796983 9339230 9244404 9967463 8864631 8850778 8986266
1964 8986266 8156362 8239140 9079590 9115072 8964981 8964425 8866907 8932876 8828205 8898592 9025681
1953 9025681 9372100 9768922 10298971 10098058 10462049 11937028 11997734 11594878 12150363 12705842
1943 12705842 12505443 12932037 13192589 11806551 12029110 12108567 12058732 12466725 12754101 12968717
1933 12968717 13225185 13091435 13331450 13938494 14657660 15747995 17181478 17242449 15934380
1924 15934380 14251228 13113062 11972958 11565826 9983909 9343388 9630332 8772909 9535040
1915 9535040 8758497 8151652 8066803 7943411 7464620 6796308 6861152 6774878 7251237 7141795
1905G141795l70088p8333O76726l3972q91509n64720p99974K99667J091123K46383
1895F717098p68404L55011M66298k27750k18899m68142L05372k10343K02817O95300
1885F848358r72516l16246O86212K17389p27092l8469N03180J34830q5218j56308
1875F094120N96279L36808j13271l0967J255622o64708k07355P58703j84837K73809
1865H114203P4959O8454l64678M27892K03024J96161k04080P7590R29363k52914
1855I269974r6537L21135Q15165P3731L41437L62915P3425N84345j59198j51831
1845A1434561l03063Q95367J332924J370658p07546K64016J269763L26216K4232
1836A5907128K5879R47514P71304M43535N24186N23288n24922o5735J895016O79673
$$ plain form
1905 7141795 6771707 6693374 7370100 7336128 6444619 5879899 5079925 5379592 6470715 6717098
1895 6717098 5948694 6303705 6770003 6542253 6323354 5855212 6160584 5950241 6153058 6848358
1885 6848358 5875842 5559596 6245808 6463197 5736105 5697636 6200816 6335646 6250428 6094120
1875 6094120 6690399 7027207 6913936 6882969 8138591 7473883 7266528 8025231 7840394 8114203
1865 8114203 8189162 8257616 7892938 8320830 8523854 8720015 8515935 8593525 9522888 9269974
1855 9269974 9173437 9494572 10309737 10383468 10724905 11087820 11161245 11745590 11586392 11434561
1845 11434561 11131498 12026865 13359789 14730447 14022901 14286917 15556680 15882896 15907128
1836 15907128 15933007 16880521 17651825 18095360 18619546 19142834 18617912 18552177 20447193 21126866
1826B1126866k45438Q04092J756446J023077J027670J351217K04096L80565J085022
1817B8513613R76033N97755P86245J034135J125431J230381P97443O30977J200842
1808C6892855J426509J160617O66401J068823J684090J403496Q59372J198561
1800D6360724J406756J025189J542401J614138R82736M34566K216828J792147
1792E7375485R76830J479190J123148J416061J633296J086537J872369R39768
1784F7902684J796179K277397J832086J468473J434409K392214J768906K163504
1776H3035852J924335J172330J609040J854629J587012J066633O31275J285387
1768I4166493J077862P93555L90063J100944P82943Q71711J357964J575025J973941
$$ plain form
1826 21126866 20881428 21685520 23441966 24465043 25492713 26843930 27048026 27428591 28513613
1817 28513613 29489646 30087401 30873646 31907781 33033212 34263593 35061036 35692013 36892855
1808 36892855 38319364 39479981 40146382 41215205 42899295 44302791 45162163 46360724
1800 46360724 47767480 48792669 50335070 51949208 52931944 53366510 55583338 57375485
1792 57375485 58352315 59831505 60954653 62370714 64004010 65090547 66962916 67902684
1784 67902684 69698863 71976260 73808346 75276819 76711228 79103442 80872348 83035852
1776 83035852 84960187 86132517 87741557 89596186 91183198 92249831 92881106 94166493
1768 94166493 95244355 96037910 96427973 97528917 98311860 99183571 100541535 102116560 104090501
1759A04090501K523863L101547L686019M643285M049212K414467R37352o3839
1751A25382407Q46503P71885P72367J234575J488568J447441K206071J628182
1743A35777999J097737K414999J357587J257560J929252J382341N62612N60679
1735A46340766J135556J011992M71954K06283J051147N91676R47031O99164N46238
1726A53001807L77376R56826J283729J209234L42689M63912J159721K98100L45814
1717A59439208o82125m12504l95375p07613O7695j117149o6029q78312n29963
1708A54717833J39825q28451m93306m79318L41254k80298q11776m83176R7614
1699A51920201o10917j416474j575352j680849m80268j550869j475129k096386
$$ plain form
1759 104090501 106614364 109715911 113401930 118045215 122094427 124508894 125446246 125382407
1751 125382407 126228910 127000795 127773162 129007737 130496305 131943746 134149817 135777999
1743 135777999 136875736 139290735 140648322 141905882 143835134 145217475 145780087 146340766
1735 146340766 147476322 148488314 148960268 149166551 150217698 150809374 151756405 152455569 153001807
1726 153001807 153379183 154336009 155619738 156828972 157171661 157635573 158795294 159093394 159439208
1717 159439208 158757083 158344579 157949204 157241591 157309286 156192137 156126108 155247796 154717833
1708 154717833 154857658 154029207 153535901 153056583 153397837 153117539 152305763 151822587 151920201
1699 151920201 151309284 149892810 148317458 146636609 146156341 144605472 143130343 141033957
1691A41033957k043032j449412k201656j979220k437872k046500j792523j248447
1683A25835295j843080k312149j386058j091333r90089j446528j657879j059936
1675A14048243j563944q47345j007714r67657j395954j099263r21821j716008
1667A04528537j554141j301672j395244j567261j730473r29685j469732k019896
1659I2560433j246311j509993j086946q59056j165574k22039J362344J202122
1651H9034980R60793P90520Q50628o78424k304147k167480j926063j201084p47853
1642H2611870j205163j335523r06139k52351m51784j538702o35356o41197k79392
1633G5366263q43597q59957j186392j160967j036806q11262j042035j267528r02331
$$ plain form
1691 141033957 138990925 137541513 135339857 133360637 130922765 128876265 127083742 125835295
1683 125835295 123992215 121680066 120294008 119202675 118212586 116766058 115108179 114048243
1675 114048243 112484299 111636954 110629240 109661583 108265629 107166366 106244545 104528537
1667 104528537 102974396 101672724 100277480 98710219 96979746 96050061 94580329 92560433
1659 92560433 91314122 89804129 88717183 87858127 86692553 86470514 87832858 89034980
1651 89034980 89995773 90786293 91636921 90958497 88654350 86486870 84560807 83359723 82611870
1642 82611870 81406707 80071184 79165045 78912694 78460910 76922208 76286852 75645655 75366263
1633 75366263 74522666 73662709 72476317 71315350 70278544 69467282 68425247 67157719 66255388
1624F6255388j187740q47459n30262Q4597O82959N94996J80303j317697l574910
1615F0340175l327349l122183l154764k828267k106321j261507j647750j518228
1607D1373806r62934o22653j299495j186969o08752L44234k16180q37775L72489
1598C6355771K18153l43586k48672K11900K71768L6186J014753J99195l3400k4123
1588C7657945J33228N02614q29511k94639J75926L27839P24218J53485J91411
1579C8742516k0386J3978l42813K14572J90423o3181j69879P6131k68111n61694
1569C7811556q3968J50949N06241j75070L33144J226424R74923M60921N24779
1560D1729899O00609R57114J126778J680165J801334K584029K675690K454760
$$ plain form
1624 66255388 65067648 64220189 63689927 63774524 64457483 65052479 65232782 63915085 60340175
1615 60340175 57012826 53890643 50735879 47907612 45801291 44539784 42892034 41373806
1607 41373806 40410872 39788219 38488724 37301755 36693003 37037237 36821057 35983282 36355771
1598 36355771 36573924 36230338 35981666 36193566 36465334 36501520 37516273 37715468 37682068 37657945
1588 37657945 37791173 38293787 37464276 37169637 37345563 37673402 38397620 38551105 38742516
1579 38742516 38722130 38736108 38393295 38607867 38798290 38735109 38565230 38641361 38373250 37811556
1569 37811556 37727588 37878537 38384778 38209708 38542852 39769276 40744199 41205120 41729899
1560 41729899 42330508 43287622 44414400 46094565 47895899 50479928 53155618 55610378
1552E5610378J894923K647195K143029K072492K216331J690731J632041J964781
1544G1871901J338167J910393Q17220J564524K263489J157283J836792J495402
1536H4255171K785668K852248J433508J649552J128535J373399N15182o4247j87257
1527I5741759j058806p61397j212265j257225k244171j624232j188903j347648
1519H5047112k611953k222753q24759k239938j428239j863520o58747n73490r30775
1510G1692938m54133r61728n8497l58574J59514j40495J31447Q0045r61646n12145
1500F8616726j069840p0437k38146M22183N75201P76985K12287K24073J305213
1491G0754245R16655K123072J475545J405436K073951J672062K60312j26306m19760
$$ plain form
1552 55610378 57505301 60152496 62295525 64368017 66584348 68275079 69907120 71871901
1544 71871901 73210068 75120461 75937681 77502205 79765694 80922977 82759769 84255171
1536 84255171 87040839 89893087 91326595 92976147 94104682 95478081 95993263 95929016 95741759
1527 95741759 94682953 93921556 92709291 91452066 89207895 87583663 86394760 85047112
1519 85047112 82435159 80212406 79387647 77147709 75719470 73855950 73197203 72623713 71692938
1510 71692938 71238805 70277077 70218580 69860006 70019520 69879025 70010472 70090517 69128871 68616726
1500 68616726 67546886 67476449 67238303 67660486 68235687 69012672 69224959 69449032 70754245
1491 70754245 71670900 73793972 75269517 76674953 78748904 80420966 80681278 80554972 80135212
1482H0135212p23686j547078o92940j257258j130691r05341j558383k097243k545040
1473F7677552j870982k729971k321436j367118r70612k050617k672969q10411
1465E2883436k062637l408630k090858j190410j521557j660443j521027j385501
1457C8042373j223433j441128j700108o85166j683049o07473J01649j099845o21157
1448B9082663j95174j114234r78675q49466p29250K54172l80363k33341k36344
1439B4619988m99711o00384m15864k85835j89187m10680k90359L72383P31702
1430B3032053m58345J91235P13608p3617M1614M84665Q89060P78310j32143l6641
1420B5429799j31768n51418O80961n79892K77382P13797M30462j53389m19087
$$ plain form
1482 80135212 79411526 77864448 77171508 75914250 74783559 73878218 72319835 70222592 67677552
1473 67677552 65806570 63076599 60755163 59388045 58417433 56366816 53693847 52883436
1465 52883436 50820799 47412169 45321311 44130901 42609344 40948901 39427874 38042373
1457 38042373 36818940 35377812 33677704 32992538 31309489 30702016 30803665 29703820 29082663
1448 29082663 28887489 27773255 26794580 25945114 25215864 25470036 25089673 24856332 24619988
1439 24619988 24120277 23519893 23104029 22818194 22629007 22218327 21927968 22300351 23032053
1430 23032053 22573708 22764943 23478551 23404934 23446548 23931213 24820273 25598583 25466440 25429799
1420 25429799 25298031 24746613 25427574 24847682 25125064 25838861 26269323 26115934 25696847
1411B5696847M32229k58550o67784j092754J032511L77957k53568O94910p0673
1402B5891125K04585j12287p879Q34941j43747J48731Q35587J312937r17901m05990
1392B7640102L54757m20769n03214m98444L29406L72232M6309J39088J094503
1383B8553970k40621K05169O00605k44314O04990O17447R83086N38759J2577J502563
1373C3134231O33196O26853Q27478M66814K20867M01887n4284q72819N7830M15025
1363C5857078k6964j383693m34314j05681k15719r7877r130Q26056j9142J78039
1353C4568653K17343k06766J50167N2615J52148j07042j197701l29369K4659k36578
1343C3088129m81395m2976n89564O22507m05925o91680N10486q30750j75708m4715
$$ plain form
1411 25696847 26129076 25870526 25202742 24109988 25142499 25520456 25266888 25961798 25891125
1402 25891125 26095710 25983423 25975544 26810485 26666738 26815469 27651056 28963993 28046092 27640102
1392 27640102 27994859 27574090 27070876 26572432 26901838 27274070 27320379 27459467 28553970
1383 28553970 28313349 28518518 29119123 28874809 29479799 30097246 31080332 31619091 31631668 33134231
1373 33134231 33767427 34394280 35221758 35688572 35909439 36311326 36257042 35384223 35442053 35857078
1363 35857078 35830114 34446421 34012107 33906426 33690707 33592830 33583700 34409756 34390614 34568653
1353 34568653 34785996 34579230 34729397 34782012 34934160 34827118 33629417 33300048 33324707 33088129
1343 33088129 32606734 32563758 31974194 32596701 32190776 31499096 32009582 31178832 31003124 30958409
1333C0958409K18661K42759k92284J074045Q75001m24813m78575J1679M43123
1324C2628005O4823k56818L27734J38302M02507M71805j78757k60146J52368N10016
1314C3999839J089972M69982K64203O24249K44526J022285j081054q08640k28010
1305C5597352K7008M82223n90811n80105N78718r4333r8920j067461o61003k9027
1295C3563641P1230o08363n12426p14128m32959k14246j050962j147949o33877
1286B8319961L0950m73594l71918r2769L59845m2464p82037K00989L10339k74007
1276B7185295m97876K20025P93181J10341l28268k04331Q57077O584N91505P09914
1266B9443447m93558M45027J39855l46681P4657L00471R28408M33862j3140j42194
$$ plain form
1333 30958409 31177070 31419829 31127545 32201590 33076591 32651778 32173203 32184882 32628005
1324 32628005 32692828 32436010 32763744 32902046 33304553 33776358 33597601 33337455 33489823 33999839
1314 33999839 35089811 35559793 35823996 36448245 36692771 37715056 36634002 35825362 35597352
1305 35597352 35624360 36106583 35515772 34935667 35514385 35420052 35321132 34253671 33592668 33563641
1295 33563641 33634871 33026508 32514082 31799954 31366995 31152749 30101787 28953838 28319961
1286 28319961 28350911 27877317 27505399 27412630 27772475 27730011 26947974 27148963 27459302 27185295
1276 27185295 26687419 26907444 27700625 27810966 27482698 27278367 28135444 28142028 28733533 29443447
1266 29443447 28949889 29394916 29534771 29188090 29262747 29563218 30491626 30925488 30912348 30770154
1256C0770154P40419J65761R25788o16628j44170Q68669m20229q08248o55421
1247C0826095k1214q12982r83246l12178l89833R1704o27132M60481J42020l17137
1237B8056578l023j83528Q71040l5643j00235M10522Q26509O57532j21870j9479
1227C0358403L75393M96098J081466J44013M36693r674N36600P27956n19044k2626
1217C3605278Q89947K93171L82877P13666K06985J628562J092940J57321J204431
1208D0175178Q58150J549706R00478J159543J888660J440080J127480J592157
1200E0691432K111469K052727K559836K760910L057704L864378M482006N211027
1192G6791489N383733O944300P229528Q599287R652715J1432740J4519211J5124369
$$ plain form
1256 30770154 31510573 31676334 32602122 31985494 31841324 32709993 32289764 31481516 30826095
1247 30826095 30804881 29991899 29008653 28696475 28306642 28398346 27771214 28231695 28373715 28056578
1237 28056578 28053555 27870027 28741067 28705424 28605189 29015711 29842220 30499752 30377882 30358403
1227 30358403 30733796 31229894 32311360 32455373 32892066 32882392 33418992 34146948 33627904 33605278
1217 33605278 34495225 34788396 35171273 35884939 36091924 37720486 38813426 38970747 40175178
1208 40175178 41033328 42583034 43483512 44643055 46531715 47971795 49099275 50691432
1200 50691432 52802901 54855628 57415464 60176374 63234078 67098456 71580462 76791489
1192 76791489 82175222 89119522 96349050 104948337 114601052 126033792 140553003 155677372
1184A55677372J7868688J9624629K0575570K0694272J7885045J3433279R522067
1177B75280922M506390J105208q14908j811115l51197K008994M008581O598537
1169B90531412Q368965Q405275O201122K223279k954724j0122885j6125365j8316420
1161B68210659k0193396j9538318j8889483j7349375j5012055j3424023j0730289
1154A53073720r049855q772085p783649o332338n796912m938509m616408l099061
1146A02684903k467948k848443j971107j461529r16871k79937Q55407J633409
1138I5227884J724016L587705L502797K975150M789766O100206O987472P851751
1130A32746747Q691798J1375463J1707714J2822995J4242812J3648632J2755369
$$ plain form
1184 155677372 173546060 193170689 213746259 234440531 252325576 265758855 275280922
1177 275280922 279787312 280892520 280077612 278266497 277915300 279924294 283932875 290531412
1169 290531412 298900377 307305652 313506774 315730053 312775329 302652444 286527079 268210659
1161 268210659 248017263 228478945 209589462 192240087 177228032 163804009 153073720
1154 153073720 144023865 135251780 127468131 121135793 115338881 110400372 105783964 102684903
1146 102684903 100216955 97368512 95397405 93935876 93019005 92739068 93594475 95227884
1138 95227884 96951900 100539605 104042402 107017552 111807318 117907524 124894996 132746747
1130 132746747 141438545 152814008 164521722 177344717 191587529 205236161 217991530
1123B17991530J0310562Q287254N163749J326732k511500n063251p749859r801484
1115B17953733j0860782j1324593j1779473j0759148j0247676r106130q595023
1108A45280908p355951o037668n642432m534072m348213j847390j692247k007101
1100A11815834j471029j146297M78110m28619o79766P72779Q76863k48297J14992
1091A10084570L02994o9067L60077p28618M19128P79392J577368J501811Q01360
1082A15029015J203360J12766k76507j816150k416796k758996l491069k791035
1074A02794588k804103k525765j933781k433420j832865j690248k496905j740276
1066H5337225j199843n64122o38169k63985N60313O17400Q91880J44626J4389
$$ plain form
1123 217991530 228302092 236589346 241753095 243079827 240568327 235505076 227755217 217953733
1115 217953733 207092951 195768358 183988885 173229737 162982061 153875931 145280908
1108 145280908 137924957 131887289 126244857 121710785 117362572 115515182 113822935 111815834
1100 111815834 110344805 109198508 109676618 109247999 108568233 109341012 110217875 109969578 110084570
1091 110084570 110387564 110318497 110678574 109949956 110369084 111148476 112725844 114227655 115029015
1082 115029015 116232375 116345141 116068634 114252484 111835688 109076692 105585623 102794588
1074 102794588 99990485 97464720 95530939 93097519 91264654 89574406 87077501 85337225
1066 85337225 84137382 83573260 82935091 82671106 83231419 83848819 84740699 84885325 84899714
1057H4899714M25164J411005J875287O61709J564221J545648K297393J365024
1049I6045165j54473R70834J406826P44036N91988J073907J633563J659205J228209
1040A05199260J165121K094792J906027K373461M110401N429541O038279P979632
1032A36296514Q632139J0714486J2461152J1439199J4129012J4299091J2362025
1025B20333618J1327026P660009L022869k153015o086867j0135326j3887215j4323884
1017A95757215j4312025j4546452j3651085j1552142r694373r025984q456374
1010A14518780n955262n993592m955648m372177l656081k005950j861585j069579
1002H4648906r11902Q7039k46749j232165j360914k465469j935512j387541k016997
$$ plain form
1057 84899714 85324878 86735883 88611170 89272879 90837100 92382748 94680141 96045165
1049 96045165 95890692 96861526 98268352 99012388 99604376 100678283 102311846 103971051 105199260
1040 105199260 106364381 108459173 110365200 112738661 116849062 122278603 128316882 136296514
1032 136296514 144928653 155643139 168104291 179543490 193672502 207971593 220333618
1025 220333618 231660644 239320653 242343522 240190507 234103640 223968314 210081099 195757215
1017 195757215 181445190 166898738 153247653 141695511 132001138 122975154 114518780
1010 114518780 108563518 102569926 97614278 93242101 89586020 87580070 85718485 84648906
1002 84648906 83737004 83824043 83577294 82345129 80984215 78518746 76583234 75195693 73178696
993G3178696k401258l49689P53503m14629j99183J106112R96417J283845J330809
984G5284623K186452K168973K889076L813802L899349M122550N673266N681663
976A05719754N348277P424733Q189192Q847282J0261291J1262203J0432128J1047169
968A78532029R982756Q648683O242837L147775J052525j432501l799684n404853
960A96969567o429883o029145m513669m647281m102835j131299J127588L101365
952A74344408M588965O200934P761498P433105N103089K480699l35146n285818
944B02291734q833170j0590847j2636073j3354552j3318839j2323177j1251269
937A19983807j0438078p989101o522266p258864n759921m183418l598690m328187
$$ plain form
993 73178696 70777438 70427749 71181252 70766623 70567440 71673552 72669969 73953814 75284623
984 75284623 77471075 79640048 82529124 86342926 90242275 94364825 100038091 105719754
976 105719754 111068031 118492764 126681956 135529238 145790529 157052732 167484860 178532029
968 178532029 188514785 197163468 203406305 206554080 207606605 206174104 202374420 196969567
960 196969567 190539684 184510539 179996870 175349589 171246754 170115455 171243043 174344408
952 174344408 178933373 185134307 192895805 200328910 205431999 207912698 207577552 202291734
944 202291734 193458564 182867717 170231644 156877092 143558253 131235076 119983807
937 119983807 109545729 101556628 95034362 87775498 82015577 77832159 74233469 69905282
929F9905282k903856k500346k138985j290572j520481q90467j316897l47171o66515
920E6329992J110886O38346j53467N42065j026249j078338j420632r63911L03173
911E4281865l71460M31696j772106k122412k308256k019935l782177m255118j898277
902C6183820j856764j335968k057768j420065j558474j698724o51275j128251
894B4476531j421637j125106l31582p45863n65249m66484q38490p71685n36354
885A7674081l62641m96703J096n24449j3751k45910r42571m40759l91461P04858
875A4961790k13715j194419n77415k02386L82228m14730k43456k38021K58833
866A2518709m93997Q3628k80032p66833M63619k34218n17114m15145O08110L96914
$$ plain form
929 69905282 67001426 64501080 62362095 61071523 59551042 58660575 57343678 56996507 56329992
920 56329992 57440878 58079224 57925757 58467822 57441573 56363235 54942603 53978692 54281865
911 54281865 53910405 54342101 52569995 50447583 48139327 46119392 42337215 38082097 36183820
902 36183820 34327056 32991088 30933320 29513255 27954781 26256057 25604782 24476531
894 24476531 23054894 21929788 21598206 20852343 20287094 19820610 18982120 18210435 17674081
885 17674081 17311440 16814737 16815833 16291384 16277633 16031723 15089152 14648393 14256932 14961790
875 14961790 14748075 13553656 12976241 12773855 13156083 12741353 12497897 12259876 12518709
866 12518709 12024712 12108340 11828308 11061475 11525094 11290876 10773762 10358617 10966727 11363641
856A1363641j68422M47186k28181K32533j342951r26557P45566m107m64882L61253
846A0015079n12733j57363q3397p3960k45406Q26066J11179K98051L37665l48584
836A0166597L93263J72955o50579k05114P90560J022714J077558K04979K49776
827A3222709n2004j65776l29177j15926j052882m27472l93152j135625j213117
818H337578n71031n32442J17242n4361p21726M15577M66028l1199k19927n12747
808F692992k63026l89618L90666L05672P3738j66608l59371O01949k98733o8803
798F518858J59122L18194l14316R2560K14837p29148M51113r77761j72776l39002
788E221681m04362O01963n8646j24405k43759L48625p53084k74167J80123n93162
$$ plain form
856 11363641 11195219 11642405 11414224 11646757 10303806 9377249 10122815 10118708 9653826 10015079
846 10015079 9502346 9344983 9261586 9187626 8942220 9768286 9879465 10177516 10515181 10166597
836 10166597 10559860 10732815 10082236 9877122 10667682 11690396 12767954 12972933 13222709
827 13222709 13170705 13004929 12675752 12559826 11506944 11079472 10686320 9550695 8337578
818 8337578 7766547 7234105 7351347 7296986 6575260 6990837 7456865 7425666 7205739 6692992
808 6692992 6429966 6040348 6431014 6736686 6810424 6643816 6284445 6886394 6587661 6518858
798 6518858 6677980 6996174 6681858 6774418 6989255 6260107 6711220 5733459 5560683 5221681
788 5221681 4817319 5419282 5360636 5236231 4992472 5341097 4588013 4313846 4493969 3900807
778C900807K69569k91685J68387J96326l81148n63531K26154n0242o59472Q40730
768C655895J61744l81986J16526K89249J72120r73861r01097L49429P02454n32068
758B658405L45467Q36058k7171J19459l13117k20775r49196l17527R04624M4218
748C080445K64157l71404K05862o49270o11627J06873L79260j11568J56706J225497
738C674931p7795Q3048n98073n34827o4284L58585q7355k69712J02618Q03236
728C390372R10181j243972l95931K54513k49314J072J15947m1332J08883K32145
718C082564o83672l57960K76649n82700q19850P3106M86386L09652L10701l19194
708A775682j32828P5631r82527J67444l67358m8118J296391n6555n87370K27787
$$ plain form
778 3900807 4170376 3878691 4047078 4243404 3862256 3298725 3524879 3474637 2815165 3655895
768 3655895 3817639 3435653 3552179 3841428 4013548 3039687 2138590 2488019 3190473 2658405
758 2658405 3003872 3839930 3812759 3932218 3619101 3398326 2449130 2131603 3036227 3080445
748 3080445 3344602 2973198 3179060 2529790 1918163 2025036 2404296 2292728 2449434 3674931
738 3674931 3597136 3680184 3082111 2547284 2483000 2841585 2754230 2484518 2587136 3390372
728 3390372 4300553 3056581 2660650 2915163 2665849 2666921 2782868 2741536 2850419 3082564
718 3082564 2398892 2040932 2317581 1734881 915031 988137 1474523 1784175 2094876 1775682
708 1775682 1642854 1718485 735958 903402 536044 487926 1784317 1727762 1140392 1368179
698A368179J69875l26879k20468M84802L19079n17956K3328M82595J98792J12401
688B093748n59721L98104N58284n4694n56910N81753K11731l08961l73764k63392
678A726178M22045O81717J37105k41382j98352O5660M19169n28779p46918M12112
668B148555N59624M15982n14257p25066N4762l66781k0899l38685O11506j34025
658A690716N49255N18573j055522r0942m67768r8962L34110j69236m64913J75125
648I20436L1978M10066l53602n74758L24132K73198j80235p6612J50122M27112
638A351837j23257l36883q5118n94663m28492R04011j37100p26638Q21763J7478
628F62938m06351k82048K82381K37435J75978o56768R2008N42229l54318l69991
$$ plain form
698 1368179 1538054 1211175 990707 1475509 1794588 1276632 1299960 1782555 1981347 2093748
688 2093748 1534027 1932131 2490415 2435721 1878811 2460564 2672295 2363334 1989570 1726178
678 1726178 2148223 2829940 2967045 2725663 2527311 2592971 3012140 2483361 1736443 2148555
668 2148555 2708179 3124161 2609904 1884838 1939600 1572819 1551920 1213235 1824741 1690716
658 1690716 2239971 2758544 1703022 1612080 1144312 1045350 1379460 1210224 745311 920436
648 920436 952414 1362480 1008878 434120 758252 1031450 851215 774603 924725 1351837
638 1351837 1228580 891697 806579 211916 -216576 687435 550335 -176303 645460 662938
628 662938 256587 -25461 256920 494355 670333 13565 105573 647802 293484 -76507
618g6507P94276L47358p6507o1314o50397j1478O58740O48582k31260o63325L85712
607A063880M96318l03638m47915Q8933N2827l7336J05460n38349o25142P25767
597E80805L41312J61949l54049M32479K70598j010094m34302k24485p7630O66173
587C52756L14558m0283j01546Q4396K3523n92494o49995L34495L98328L15683
577D39421j30991q3026M62973P5074J0191o44992j5397k52991J80140O24176n78797
566H5781k35463Q13345l77656j48765j6504n66990K64632m44568N83379K402k21589
555b61996L84572L89001n11300m97856J87942k18158P73448m1452k393J47582
545C49390J22716J07086O8055J85592q30j57227m13914L99183j44384q8181M44919
$$ plain form
618 -76507 717769 1065127 988620 927306 276909 265431 924171 1572753 1341493 678168 1063880
607 1063880 1560198 1256560 808645 897578 950405 913069 1018529 480180 -144962 580805
597 580805 922117 1084066 730017 1162496 1433094 423000 -11302 -235787 -313417 352756
587 352756 667314 627031 525485 609881 633404 40910 -609085 -274590 123738 439421
577 439421 308430 225404 688377 763451 773642 128650 113253 -139738 40402 664578 85781
566 85781 -149682 663663 286007 137242 120738 -446252 -181620 -626188 -42809 -40407 -261996
555 -261996 122576 511577 277 -497579 -309637 -527795 245653 204201 201808 349390
545 349390 472106 579192 647247 832839 832009 674782 260868 660051 515667 427486 872405
534H72405m57424O09696q6908p04123q40291P20783l29151m00643O15160K90275
524B89779M4871m41220q8980L64773k38429L18025J09996J34218L13735L57318
514A164086j50953k65683J41396m65454J71673k09056q21885k34275J192329l69441
504A52737o47849K21351J79406o9268q4318J59886o66437J77868L90394L63936
494A77706l58406l54770O36851J81418M99478M56045K2237L25701p39235m05829
484D41196J5163j92313L50495K08546N10079k22778o26266p13743k72003m58207
474i59831j5631O34476M88435N82266K03160k12593p02236p10058P69994j068404
464i90422L93361O61440L43092Q04398q02788o83277N0080J86699o0238P54488
$$ plain form
534 872405 414981 1024677 937769 233646 -606645 114138 -215013 -615656 -496 289779
524 289779 334650 -106570 -195550 169223 -69206 248819 358815 493033 806768 1164086
514 1164086 1013133 747450 888846 423392 595065 386009 -435876 -670151 522178 152737
504 152737 -495112 -273761 -94355 -163623 -247941 -88055 -754492 -576624 -186230 177706
494 177706 -180700 -535470 101381 282799 782277 1238322 1260559 1586260 847025 441196
484 441196 456359 264046 614541 823087 1333166 1110388 484122 -229621 -501624 -959831
474 -959831 -975462 -340986 147449 729715 932875 720282 18046 -692012 77982 -990422
464 -990422 -597061 64379 407471 1211869 409081 -274196 -224116 -37417 -97655 656833
454F56833k09055m44378J014553l96501n80779k36984j74873m32182p19156L54567
444a167955M40840M60347m37343Q13176Q60984j446700Q5547O07998k86253p98879
434h68238N01245n430O9493M19404M3940k7227K5445J076067m37938M9495m49498
423C96758Q2528L26988n36131j84616j44750Q6890K67836l00323o23854j0733
413f39407P07649o49910K21802M61698J12704N99633k78220o20378K44509k92269
403a32189j010382Q42707j58512m9526N99890r01954L30478P72899P215n38585
393b37959k72660k6766M22896j41796l41915k0267J60798O4230k84184j60645
383h38268n24670R50981P76226r85917l01205M58283L55838J41986q3028l76962
$$ plain form
454 656833 447778 3400 1017953 621452 40673 -196311 -371184 -803366 -1522522 -1167955
444 -1167955 -727115 -266768 -704111 109065 970049 -476651 -391104 216894 -69359 -868238
434 -868238 -366993 -372423 -302930 116474 160414 133187 158632 1234699 796761 846256 396758
423 396758 479286 806274 270143 85527 -59223 27667 295503 -4820 -628674 -639407
413 -639407 68242 -581668 -359866 101832 214536 814169 535949 -84429 160080 -132189
403 -132189 -1142571 -299864 -458376 -507902 91988 -809966 -479488 293411 300626 -237959
393 -237959 -510619 -537385 -114489 -256285 -598200 -618467 -457669 -393439 -677623 -838268
383 -838268 -1362938 -411957 364269 -621648 -922853 -464570 -108732 33254 -49774 -426736
373d26736l88239R1241L31236o57324l72297R64718J90921K92042K414n00561
363d72585L50293m37897L70220k63543q55538R91010J15760n14524n12970K13418
353a016356q5494K27981m24226o18247J149307O71587j4746n30335n70488K60875
343i50142Q79028K65190o31805J46896m62140N92438k23232q51078J190037M63060
333D18252o61967J01998L01158M0709l29564L233k56559k61159K04260L31629
323a08010J73533K4085J14523m08530k28606M37800N56278K3187K53269l99255
313D38274J0125j24130n92970n19069n7491J95492M85862j55878l19831j63904
303h03520N90940O79409p22691o84683L51350N63250j01475M61061J66003m95405
$$ plain form
373 -426736 -814975 -723734 -392498 -1049822 -1422119 -457401 -266480 25562 27976 -472585
363 -472585 -122292 -560189 -189969 -453512 -1309050 -318040 -202280 -716804 -1229774 -1016356
353 -1016356 -1101850 -873869 -1298095 -1916342 -767035 -95448 -110194 -640529 -1211017 -950142
343 -950142 -71114 194076 -437729 -290833 -752973 -160535 -383767 -1234845 -44808 418252
333 418252 -243715 -141717 159441 200150 -129414 -126181 -382740 -643899 -439639 -108010
323 -108010 65523 89608 204131 -204399 -433005 4795 561073 584260 837529 438274
313 438274 448399 324269 -268701 -787770 -845261 -649769 -163907 -319785 -639616 -803520
303 -803520 -212580 466829 -255862 -940545 -589195 -25945 -127420 333641 499644 4239
293D239R42769J195618j34899l31816k14991N31185L06852r42012m73085M12947
283A296807j98368l10151l34595q96170J55121O6424l44505J78088k39192j21716
273g48257P32438M68920n50538K62186P932K62636k83583j107400r67628L28010
263a595284J118458K62245q346j78662L71809o49007m04833K80611k36138O45992
253c93155L83971j85627P9241J79952m87720j175426J83788K28376l388r3325
243a283313O2138O72827j43172L5481l66251m30249j546M17737j82239n74427
233a793014J065061k03965O1380j016179J81302Q71023p71682N34448L28098m67507
223a211035n04029o2458O9788n1549L00502O26939N36334n47744k13700J59344
$$ plain form
293 4239 947008 2142626 2007727 1675911 1460920 1992105 2298957 1356945 883860 1296807
283 1296807 1098439 788288 453693 -442477 -287356 -220932 -565437 -387349 -626541 -748257
273 -748257 -15819 453101 -97437 164749 172681 435317 151734 -955666 -1923294 -1595284
263 -1595284 -476826 -214581 -222927 -401589 -29780 -678787 -1083620 -803009 -1039147 -393155
253 -393155 -9184 -194811 -115570 64382 -423338 -1598764 -1414976 -1186600 -1189988 -1283313
243 -1283313 -1221175 -548348 -691520 -656039 -1022290 -1452539 -1454085 -1036348 -1218587 -1793014
233 -1793014 -727953 -931918 -870538 -1886717 -1705415 -834392 -1606074 -1071626 -743528 -1211035
223 -1211035 -1715064 -1777522 -1707734 -1759283 -1458781 -831842 -295508 -843252 -1056952 -897608
213h97608N2036R5571O6542j71549l28334Q11178P2954k27632p24133r14295J337174
202h28096L36607k21885J56410k17301K93995O8919r71643p8271N66065N0566
192h44634N0889N3423J09593M60984L76036l98228J10413l13863K01764J60300
182c3323k38460j26778M24602k97881l57130M36523M134m07814N94348Q9519m00114
171c12374m9717n7332Q5432K20652j04419J44444O3451M29756J89174j65251K67270
160G11086L2248M11940P3540m27566N46827l22218N45477L54518o78837J41067
150A388082o37729l10847k4856J06910K89321O6836N2047n49190j30886J84978
140D34666n68187k30612k37261l13588K72703N19686o3252M41079j53805k00837
$$ plain form
213 -897608 -845572 -750001 -683459 -855008 -1183342 -372164 -299210 -526842 -1250975 -2165270 -828096
202 -828096 -491489 -713374 -556964 -774265 -480270 -411351 -1382994 -1461265 -895200 -844634
192 -844634 -793745 -740322 -630729 -169745 206291 -191937 -81524 -395387 -193623 -33323
182 -33323 -271783 -398561 26041 -271840 -628970 -192447 -188313 -596127 -1779 87740 -312374
171 -312374 -362091 -419423 -333991 -113339 -217758 -73314 -9863 419893 609067 443816 711086
160 711086 743334 1155274 1228814 801248 1348075 1025857 1571334 1925852 1247015 1388082
150 1388082 750353 439506 414650 521560 810881 877717 929764 380574 249688 434666
140 434666 -133521 -364133 -601394 -914982 -642279 -122593 -185845 255234 101429 -99408
130i9408J92445j35558J81815k75318M50251P05380l88887J28395L33750l98191
120F94674n63165k17967J08794R649r0966O45641M31236K39768m26935j003221
110a72492J96281j92678m83794l17073O7948M22161M55284N02404k13344l00404
100c5707k70929K73331j20293j74578J23753M55015N53980m75556L89639j92330
90E26325l41448j63809n66485N21533p68669L1541K8468J13421R6291k02529j26008
79h51369J50225k98063o41555m1587J39427j51274m4997l05359l46174J52362
69b238364k16120l78159O9411J347m83638K17292J54155j0465J18568k00330M3435
58b922868q21654p31113l9138j98478K07093P2534r5269J42016O14474L69242
$$ plain form
130 -99408 93037 -42521 139294 -136024 314227 1019607 630720 759115 1092865 694674
120 694674 131509 -86458 22336 31985 -58981 586660 1017896 1257664 830729 -172492
110 -172492 23789 -168889 -652683 -969756 -901808 -479647 -24363 478041 264697 -35707
100 -35707 -306636 -33305 -153598 -328176 -204423 250592 804572 329016 718655 526325
90 526325 184877 21068 -545417 -23884 -792553 -761012 -732544 -619123 -522832 -725361 -851369
79 -851369 -701144 -999207 -1640762 -1682349 -1542922 -1694196 -1739193 -2044552 -2390726 -2238364
69 -2238364 -2454484 -2832643 -2763232 -2761885 -3245523 -3028231 -2874076 -2884541 -2765973 -2966303 -2922868
58 -2922868 -3744522 -4475635 -4514773 -4713251 -4506158 -4433624 -4528893 -4386877 -3772403 -3403161
48c403161P96614Q10598m96377P27028J148116J085747K267572K799393K644907
39H380437J553112J100011J50130J145987J705556L777566M845460O328498R489243
30C8476000J6435416K5181569L5886759N1460035O3134133N2839342K4515551
23C07928805j3018300m3273544m7917885m4177862l8083503l0819985k5624685
16F5013041k0187917j5973867j2518278q408527n472062l978050l424572k892344
8g842576l515766m327157l656074k632958l234029k514186j448454k058949
0c1230149
$$ plain form
48 -3403161 -2606547 -1795949 -2292326 -1565298 -417182 668565 2936137 5735530 8380437
39 8380437 9933549 11033560 11183690 12329677 14035233 17812799 22658259 28986757 38476000
30 38476000 54911416 80092985 115979744 167439779 230573912 283413254 307928805
23 307928805 294910505 251636961 203719076 159541214 121457711 90637726 65013041
16 65013041 44825124 28851257 16332979 7924452 2452390 -1525660 -4950232 -7842576
8 -7842576 -11358342 -15685499 -19341573 -21974531 -25208560 -27722746 -29171200 -31230149
0 -31230149
$$ Imaginary data points
##PAGE= N=2
##DATA TABLE= (X++(I..I)), XYDATA
16383f2583385K587497K668626J563594J655480K189153J944342J436751J579665
16375d6958277J575011R52892K225098Q98719J83883O77086J134209J416321Q80846
16366c7014212N35820Q34776Q59129Q99024J529784P58279M34211Q14117J060792
16357b9288280N40787k99959P07002M35433M63651J017074M28081O40581L3254
16348b5322376Q84241P87617J1750O64191Q75378M72092L62005M54372j65852
16339b0976582O72140l81397M10821J049349q665Q06645L48813O09113M01189
16330a7068574q9605r6941M41690L06864M52798M99165J73019N97150L91010k6907
16320a4420331r8490L82928O94544o2120M73785L44204R41223O15923m67995L81879
$$ plain form
16383 -62583385 -59995888 -57327262 -55763668 -54108188 -51919035 -49974693 -48537942 -46958277
16375 -46958277 -45383266 -44430374 -42205276 -41306557 -41122674 -40445588 -39311379 -37895058 -37014212
16366 -37014212 -36478392 -35643616 -34784487 -33885463 -32355679 -31597400 -31163189 -30349072 -29288280
16357 -29288280 -28747493 -29047452 -28340450 -27905017 -27441366 -26424292 -25996211 -25355630 -25322376
16348 -25322376 -24438135 -23650518 -23638768 -22974577 -22099199 -21627107 -21265102 -20810730 -20976582
16339 -20976582 -20304442 -20685839 -20275018 -19225669 -19234334 -18427689 -18078876 -17469763 -17068574
16330 -17068574 -17158179 -17255120 -16813430 -16506566 -16053768 -15554603 -15381584 -14784434 -14393424 -14420331
16320 -14420331 -14518821 -14135893 -13441349 -13503469 -13029684 -12685480 -11744257 -11128334 -11596329 -11214450
16310a1214450Q7429m16292L57126M19237M04668L36701J26581N14449l6665o4288
16300i485504N16106L96424O7488R5998K65331l34323N85038N30455j33628N1792
16290g444823K84542O40495L93320j29267j41023O54028K17455p0103l43575j92190
16280f131141K33924L70969j01350J57187L69280L48544O03304J64940M0969K57156
16270c686218l02575Q4388k33794j83550q4248Q7626P16585j60440R479k93985
16260d046732q6282O73261K17502L54834K67769K43336J69955o28379j001802
16251c836538j70279L85575O75885J42828j78165M80036O14746M89594m25103
16242a821421k54698P32960M4584J38757j07581P10209Q98218n01118n20145m9828
$$ plain form
16310 -11214450 -11127021 -11543313 -11186187 -10766950 -10362282 -10025581 -9899000 -9384551 -9421216 -9485504
16300 -9485504 -8969398 -8572974 -8505486 -8409488 -8144157 -8478480 -7893442 -7362987 -7496615 -7444823
16290 -7444823 -7160281 -6519786 -6126466 -6255733 -6396756 -5742728 -5525273 -5595376 -5938951 -6131141
16280 -6131141 -5897217 -5526248 -5627598 -5470411 -5101131 -4752587 -4149283 -3984343 -3943374 -3686218
16270 -3686218 -3988793 -3904405 -4138199 -4321749 -4405997 -4318371 -3601786 -3762226 -3752747 -4046732
16260 -4046732 -4133014 -3459753 -3242251 -2887417 -2619648 -2376312 -2206357 -2834736 -3836538
16251 -3836538 -4006817 -3621242 -2945357 -2802529 -2980694 -2500658 -1885912 -1396318 -1821421
16242 -1821421 -2076119 -1343159 -1298575 -1159818 -1267399 -557190 341028 -160090 -680235 -730063
16232g30063P98625l23747j77454J078341J067250R7385n99012k27887l03275
16223F80163k17198j00537l97259J36844J86789J218634j00q16885N57356k38672
16213A009135k36667l50970J38292L85040L47444K01807L45686J87419m14549
16204A612637k19619k05038K09712p1782j4867Q80551L20972J7857q77348q19602
16194H33473Q66019J20966K54112j198912M45376J252753m55096j86654j18650
16185A813387J319020K67758k67071L4737o70808J21311P62882k54046m29324
16176B697846J57978R8639L55042k33472L02002R7404m30533Q1397m91396r350
16166B625557k52533M42247K88629J28199J86422p65670n35262K48830L10254
$$ plain form
16232 -730063 68562 -255185 -432639 645702 1712952 1810337 1211325 983438 680163
16223 680163 462965 362428 -34831 102013 288802 1507436 1507336 690451 1247807 1009135
16213 1009135 772468 421498 559790 944830 1292274 1494081 1839767 2027186 1612637
16204 1612637 1393018 1187980 1397692 1325910 1311043 2191594 2512566 2530423 1653075 833473
16194 833473 1699492 1820458 2074570 875658 1321034 2573787 2118691 1932037 1813387
16185 1813387 3132407 3400165 3133094 3167831 2497023 2618334 3381216 3127170 2697846
16176 2697846 2855824 2954463 3309505 3076033 3378035 3475439 3044906 3126303 2634907 2625557
16166 2625557 2373024 2815271 3103900 3232099 3418521 2652851 2117589 2366419 2676673
16157B676673k27525O2308L35984R63226Q28643o4745l45048l94208m26148L17047
16147C726207l7880n76872M98295L54543R10693L05965o74465k04494o10770J31342
16137C822564l01335q60381M95722M53569M33352r3546q12410l5873K37202l1277
16127C307587K22706K72082o08803N72282N23022n58696j0425L21255k97975j96337
16117C546698L39887j28480L38451j28096j10822L21916n37208l19825Q32224
16108D154745Q02090m24610p28788l32852O68567L24373o60310q5000L16774j51073
16098C883916N92025J55514o50634M64301j31333j74949N0550j11159k36163R22214
16088D764282K46800q11972k00323j36741J25343N58623o2696R2402N04318n23730
$$ plain form
16157 2676673 2449148 2511456 2847440 3810666 4639309 4574564 4229516 3835308 3409160 3726207
16147 3726207 3688327 3111455 3609750 3964293 4874986 5180951 4506486 4301992 3691222 3822564
16137 3822564 3521229 2660848 3156570 3610139 4043491 3949945 3137535 3101662 3338864 3307587
16127 3307587 3530293 3802375 3193572 3765854 4288876 3730180 3719755 4041010 3743035 3546698
16117 3546698 3886585 3758105 4096556 3968460 3857638 4179554 3642346 3322521 4154745
16108 4154745 4956835 4532225 3803437 3470585 4139152 4463525 3803215 3718215 4034989 3883916
16098 3883916 4475941 4631455 3980821 4445122 4313789 4138840 4189390 4078231 3842068 4764282
16088 4764282 5011082 4199110 3998787 3862046 3987389 4546012 4483316 4575718 5080036 4556306
16078D556306Q42878l00463r00839q7612L05041m11901J53506K97068L53936N22876
16068E330796l73803n72331j11383r3260J27418K28636j04441K97198m21094J06996
16058D414732j75953K36979J41826l12151K00979J288401m88724o44546l0726
16049D630817P0841j09920m10747k253O50395K93506j03649n2565M71095l00846
16039E136674j93540K05151l88633M6197p33055k65564N6082l74864J38762K37819
16029C865029Q2765o5376K03648K21940k09517K58481k55849l44050N5730L5945
16019C848746M39780J44993n72672J45517P47999L09187N80325r54942q7126P03148
16009E304955n42267l28335p1526P55635j94171L06497k35701n11467J39081L08358
$$ plain form
16078 4556306 5399184 5098721 4197882 4110270 4415311 4003410 4156916 4453984 4807920 5330796
16068 5330796 4956993 4384662 4273279 4180019 4307437 4536073 4431632 4728830 4307736 4414732
16058 4414732 4238779 4475758 4617584 4305433 4506412 5794813 5306089 4661543 4630817
16049 4630817 4701658 4591738 4180991 4178738 4829133 5122639 5018990 4966425 5437520 5136674
16039 5136674 4943134 5148285 4759652 4805849 4072794 3807230 3863312 3488448 3627210 3865029
16029 3865029 3947794 3882418 4086066 4308006 4098489 4356970 4101121 3757071 3812801 3848746
16019 3848746 4288526 4433519 3860847 4006364 4754363 5063550 5643875 4688933 4601807 5304955
16009 5304955 4762688 4434353 4362827 5118462 4924291 5230788 4995087 4483620 4622701 4931059
15999D931059j22629K07534J18599k67672M12039J45326o11098l38917j029288
15990C444953J11869O07931P48264J84297k22165O140P74997K46185o68218p95857
15980D438396K73146j13986n78017L36725m30559K70539N45963m83981k30821
15971D027405L54285K9883L0297O28483K03523L16844o85955k00412M0131j113466
15961C631018L2726K41494L0829k18121J099185J13255O0468r5735j049243M53282
15951D299158k09278q51591K38595P85252K72510n76l23782k75824L89232P21672
15941E045368L95111n99333J74191N60391m8849k97418k20211n39783l09567M31208
15931D591108p7497j070452J260721P39427k36619j57870K04345l53043k56412
$$ plain form
15999 4931059 4808430 5015964 5134563 4866891 5278930 5424256 4813158 4474241 3444953
15990 3444953 3556822 4164753 4913017 5097314 4875149 4881289 5656286 5902471 5234253 4438396
15980 4438396 4711542 4597556 4019539 4356264 3925705 4196244 4742207 4258226 4027405
15971 4027405 4381690 4411573 4441870 5070353 5273876 5590720 4904765 4704353 4744484 3631018
15961 3631018 3663744 3905238 3936067 3717946 4817131 4930386 4990854 4895119 3845876 4299158
15951 4299158 4089880 3238289 3476884 4262136 4534646 4534070 4210288 3934464 4323696 5045368
15941 5045368 5440479 4841146 5015337 5575728 5526879 5229461 5009250 4469467 4159900 4591108
15931 4591108 4513611 3443159 4703880 5443307 5206688 5048818 5253163 4900120 4643708
15922D643708o43837J63814N44901j054712k49115L80602N93680K38470n47436
15913D070075J52594R22959M49194p73732K01582k01614k67907q5412q74119K24807
15903C818427N77472L71000K50157J39020l0761j86253j05669n37046L8843R7563
15893D432753j39270N75625l14628M57381j32884j038327M10684K50971n2605
15884D449700P9795M78788O08566K57036n98854j306672J34450L66621j1674q57622
15874C600134k56002J212835M83533k98260N4938J059036n5030j032275j67268
15865D601641k72111L57468K18763k87530k36837P12704K30202l14914J40455
15856E149841l55388K15385O5132l73406M40199P00716o82520o36361j61253J49094
$$ plain form
15922 4643708 3999871 4163685 4708586 3653874 3404759 3785361 4379041 4617511 4070075
15913 4070075 4222669 5145628 5594822 4821090 5022672 4821058 4553151 4467739 3593620 3818427
15903 3818427 4395899 4766899 5017056 5156076 5125315 4939062 4833393 4296347 4335190 4432753
15893 4432753 4293483 4869108 4554480 5011861 4878977 3840650 4251334 4502305 4449700
15884 4449700 4529495 5008283 5616849 5873885 5275031 3968359 4102809 4469430 4457756 3600134
15874 3600134 3344132 4556967 5040500 4742240 4797178 5856214 5801184 4768909 4601641
15865 4601641 4329530 4686998 4905761 4618231 4381394 5094098 5324300 5009386 5149841
15856 5149841 4794453 5009838 5074970 4701564 5141763 5842479 5159959 4523598 4362345 4511439
15846D511439L65451q04342m20742L46782M30054L28728N57300n51738j66777
15837D596155L51068j68066r94201J091459m61438K3333J010945l62591q0896
15828E005768m67738L52490K35486J18858m43997l00332M08608M94920J06349
15819E510412m39843m9242L87718n22653k25648O65000N9727j43950N04260p48173
15809D997608l33614P28361j37706n03046m03143J69879j63261J43365k36364
15800D262079L18687M67407k98897o5577M5101O13962n40541k04841m68210j78960
15790C950210Q20738L35242P8382N12639j73909n78111p6035N4530J32453j80123
15780D876016n37001R63582N33080n63647j17664j81636o67987p22991M32676
$$ plain form
15846 4511439 4876890 4072548 3651806 3998588 4428642 4757370 5314670 4762932 4596155
15837 4596155 4947223 4779157 3784956 4876415 4414977 4438310 5449255 5086664 5005768
15828 5005768 4538030 4890520 5126006 5244864 4800867 4500535 4909143 5404063 5510412
15819 5510412 5070569 5021327 5409045 4886392 4660744 5325744 5385471 5241521 5745781 4997608
15809 4997608 4663994 5392355 5254649 4751603 4348460 4518339 4355078 4498443 4262079
15800 4262079 4580766 5048173 4749276 4683699 4728800 5342762 4802221 4597380 4129170 3950210
15790 3950210 4770948 5106190 5184572 5697211 5523302 4945191 4869156 4923686 5056139 4876016
15780 4876016 4339015 5302597 5835677 5272030 5154366 4972730 4304743 3581752 4014428
15771D014428L88663P0666J017600J88373k33326l0082r12577o67418j84087P93268
15761D445508L51316J59412J75449N99575l04228j104177P6708k47584L15406
15752D467385N11314k82621r9588k96715J07419O0331p26766k37982J47125P76132
15742D426034J7298J8676O55164L17957m69566j68776j20309l00060K54423P4370
15732D705211M4270q3518k09644J99026J24718j01524P31233J55427l43275K03385
15722E425309L83749j21541q41400l34838l44588K7993P23117k80065r0847J21469
15712D668358O48830J7548q30240N04972J61190N32110L72972j23852n33826J657
15702E419719o03304j73714l51115o12940J198521L96877L82778P3150j67330
$$ plain form
15771 4014428 4403091 4473757 5491357 5679730 5446404 5416322 4503745 3836327 3652240 4445508
15761 4445508 4796824 4956236 5131685 5731260 5427032 4322855 4399563 4151979 4467385
15752 4467385 4978699 4696078 4596490 4299775 4407194 4467525 3740759 3502777 3649902 4426034
15742 4426034 4443332 4462008 5117172 5435129 4965563 4796787 4676478 4376418 4630841 4705211
15732 4705211 4749481 4665963 4456319 4655345 4780063 4678539 5409772 5565199 5221924 5425309
15722 5425309 5809058 5687517 4846117 4511279 4166691 4194684 4917801 4637736 4546889 4668358
15712 4668358 5317188 5334736 4504496 5009468 5170658 5702768 6075740 5951888 5418062 5419719
15702 5419719 4816415 4642701 4291586 3678646 4877167 5274044 5656822 5729972 5562642
15693E562642l41010n90516l52133l1413n36941q4619J081856j3352N3970J44315
15683D892799n77355M40835N80652o74483n26629L28247Q21673N36237m02312
15674E419664q32726k35269L43865J89670L82620K50280k72021R96328L01954
15665F544365o02433j72428o29256N48631K30773n8442k71388M80069k24535m88979
15655E356377J54259q00363P01094R87352m30246N2165J06824m55817n74925J40847
15645E237567o63367m69719K9889Q42826M46947r47278O16781Q46814m11332j069382
15635D459746l93664K28595K68046P18303N8930j78921m79062n48529L38615j84555
15625D287504M73143L6440K25180N48939J63290j67780l43447k04651k31343m29671
$$ plain form
15693 5562642 5221632 4631116 4278983 4247570 3710629 3626010 4707866 4694514 4748484 4892799
15683 4892799 4315444 4756279 5336931 4662448 4135819 4464066 5285739 5821976 5419664
15674 5419664 4586938 4351669 4695534 4885204 5267824 5518104 5246083 6242411 6544365
15665 6544365 5941932 5769504 5140248 5688879 5919652 5861210 5589822 6069891 5845356 5356377
15655 5356377 5510636 4710273 5411367 6398719 5968473 6020638 6127462 5671645 5096720 5237567
15645 5237567 4574200 4104481 4134370 4977196 5424143 4476865 5093646 5940460 5529128 4459746
15635 4459746 4066082 4294677 4562723 5281026 5339956 5161035 4681973 4133444 4472059 4287504
15625 4287504 4760647 4797087 5022267 5571206 5734496 5566716 5223269 5018618 4787275 4357604
15615D357604o4899J97566N16420J71127k98099k81523k85332O58328M17202m19677
15605D968717k34015J25379K36047j369778n97897P41945N65052K60668p90318
15596C905800L58141L22290K93392K23639n50882M13099N06947K68918l91696
15587E349648n78313O20869P25607p24097q50308k72590P17906K85930j79799
15578E094853L23983k26893O87448k50694n96476j70627n81872M44532k73852
15569D450402n79924R47864M46745j84223j25687M77365M19039R4377r50147J37773
15559E133584N28582k28245O93279l8117n64046l77601N04190n36261j10912M33198
15549E437651k64525O21007m49618m6962k21064l16121L87640J31197o12507p69829
$$ plain form
15615 4357604 4292705 4490271 5006691 5177818 4879719 4598196 4312864 4971192 5388394 4968717
15605 4968717 4734702 4860081 5096128 3726350 3128453 3870398 4435450 4696118 3905800
15596 3905800 4263941 4586231 4879623 5103262 4552380 4965479 5472426 5741344 5349648
15587 5349648 4771335 5392204 6117811 5393714 4543406 4270816 4988722 5274652 5094853
15578 5094853 5418836 5191943 5879391 5628697 5032221 4861594 4279722 4724254 4450402
15569 4450402 3870478 4818342 5265087 5080864 4955177 5432542 5851581 5945958 4995811 5133584
15559 5133584 5662166 5433921 6127200 6089083 5525037 5147436 5651626 5115365 5004453 5437651
15549 5437651 5173126 5794133 5344515 5297553 5076489 4760368 5148008 5279205 4666698 3896869
15539C896869M92459k75105N68169O41180m29771P87132J3962o12736m7190M19665
15529E454634l84792p05465o7884N70494N72840K33622j62373k62796j59459k16588
15519D872233R4826J81987l61428O62331J20349m14256K31290o86957n17082J87401
15509D370694L22291k9798L75190L00628L38534J69354n65048n88291K30218o0999
15499D862773k02725J43498l82918p5528O20102n49600n1245J42286P7606L55423
15489D939672o77118k20826L26784Q14040O5442k30847m25639o38150R41333J91180
15479E085871j5713K63468J8117k53047J82080K58798p1711M50739L65p93767
15469E125200N2421L24017L42423k68294k81696J28016k43629J02393l5287m3794
$$ plain form
15539 3896869 4389328 4114223 4682392 5323572 4893801 5680933 5694895 5082159 5034969 5454634
15529 5454634 5069842 4364377 4296493 4866987 5439827 5673449 5511076 5248280 5088821 4872233
15519 4872233 4967059 5149046 4787618 5449949 5570298 5156042 5387332 4700375 4183293 4370694
15509 4370694 4692985 4663187 5038377 5339005 5677539 5846893 5281845 4693554 4923772 4862773
15499 4862773 4660048 4803546 4420628 4345100 4965202 4415602 4364357 4506643 4584249 4939672
15489 4939672 4262554 4041728 4368512 5182552 5247994 5017147 4591508 3953358 4894691 5085871
15479 5085871 5070158 5333626 5351743 5098696 5280776 5539574 5467863 5918602 5918967 5125200
15469 5125200 5177621 5501638 5844061 5575767 5294071 5422087 5178458 5280851 5245564 5201770
15459E201770J76631k52949n06747k59432J54L29445K402k7714k02067n49813
15449C911680O01484k56196o56567K34286M65611J99944j42832l33313M55041
15440D479138K34832q44447K42680L09474p53849O45926P20661L69363o04153
15431D799625q60023O80694j95910K6029j09189N68507N33797j16361j56081M9198
15421E220286J33406L49887k25631r16412M75754K6027k8171j48978k47640J676509
15411F315037j46612l86489q70055q90986M89713K49814N16309r7757q8919K83007
15401E373062l06106j251384J25790O77470l16161P37995j93416J417248P12261
15392F976759o53524j90617m82867j08159p31070J38050L31767k12082j42328
$$ plain form
15459 5201770 5378401 5125452 4618705 4359273 4359427 4688872 4691274 4663560 4461493 3911680
15449 3911680 4513164 4256968 3600401 3834687 4300298 4500242 4357410 4024097 4479138
15440 4479138 4713970 3869523 4112203 4421677 3667828 4313754 5034415 5403778 4799625
15431 4799625 3939602 4620296 4424386 4450415 4341226 4909733 5443530 5327169 5171088 5220286
15421 5220286 5353692 5703579 5477948 4561536 5037290 5063317 5035146 4886168 4638528 6315037
15411 6315037 6168425 5781936 4911881 4020895 4510608 4760422 5276731 5178974 5090055 5373062
15401 5373062 5066956 3815572 3941362 4618832 4302671 5040666 4847250 6264498 6976759
15392 6976759 6323235 6132618 5649751 5541592 4810522 4948572 5280339 5068257 4925929
15383D925929K78433L40761l91197l91396m2247K03815M37192k00151k34736J33111
15373E059514M79360m00301o13956M8358m23929L11244M10746j85701M26999M34970
15363E547304Q31867p91436p69757P28178j57823n18045j031454O35056M76947
15354D950837m31931n7849L60831j51109k04457K28214j48293O53605l66675O7265
15344D900438j4487l81206J93256j32176k25773J7598K97897j55383o71553J012293
15334D840904J370005N0458p60145n71853J32820R8765N1132N1274J01599J50714
15324E515673M20801P263q91784k42761L45049J17593J75808L35296k5748j63675
15314E593515m53772l47892k068l56071l2748J94255M25036O3892p65116N54885
$$ plain form
15383 4925929 5204362 5545123 5153926 4762530 4720283 4924098 5361290 5161139 4926403 5059514
15373 5059514 5538874 5138573 4524617 4572975 4149046 4460290 4871036 4685335 5112334 5547304
15363 5547304 6379171 5587735 4817978 5546156 5388333 4870288 3838834 4473890 4950837
15354 4950837 4518906 4461057 4821888 4670779 4466322 4694536 4546243 5199848 4833173 4900438
15344 4900438 4885951 4504745 4698001 4565825 4340052 4357650 4655547 4500164 3828611 4840904
15334 4840904 6210909 6261367 5501222 4929369 5062189 5160954 5212086 5263360 5364959 5515673
15324 5515673 5936474 5943737 5051953 4809192 5154241 5271834 5447642 5782938 5757190 5593515
15314 5593515 5139743 4791851 4789783 4433712 4400964 4595219 5020255 5084147 4319031 4873916
15304D873916j07731n48623N0606J43438K28729K82796q4186K19208P51377p90143
15294E019387o60561o57864L55407O38497N10241J6287K50499M92377m07353k4829
15284E532088M02260n42746j9036o0355l88755L43697r00578o5700J09643K37479
15274D647997L25976K16062P2661O56784k27407r05594J58194j88927o75445J119242
15264E199543K94585p21299K25900r199k85763n30297O31586N43281L37303o68733
15254E016907n3304J044883p35352r73840L25697Q2283j41882K40812L09904M44206
15244E560314m03945n10337J07498j11655L271N34007M45177m31364K94394k71011
15234E216349l40759K70386Q7716j34943K06318N5648L38102L31526K97819o95944
$$ plain form
15304 4873916 4766185 4217562 4268168 4411606 4640335 4923131 4838945 5058153 5809530 5019387
15294 5019387 4358826 3700962 4056369 4694866 5205107 5221394 5471893 5964270 5556917 5532088
15284 5532088 5934348 5391602 5372566 5312211 4923456 5267153 4366575 4300875 4410518 4647997
15274 4647997 4973973 5190035 5262696 5919480 5692073 4786479 4944673 4755746 4080301 5199543
15264 5199543 5494128 4772829 4998729 4989530 4703767 4173470 4805056 5348337 5685640 5016907
15254 5016907 4963603 6008486 5273134 4299294 4624991 4707274 4565392 4806204 5116108 5560314
15244 5560314 5156369 4646032 4753530 4641875 4645146 5179153 5624330 5192966 5487360 5216349
15234 5216349 4875590 5145976 5233692 5098749 5305067 5360715 5698817 6030343 6328162 5632218
15224E632218r94680k08442Q52044N92171j88394j56228Q3186n99112j87433k73135
15214D552195m55252O25431O83545M37084J54901p02469l31601j51058j38600
15205D674176o3679K2679K88759M41633n7226r40625R9596M36158l87005n33514
15195C980952L66035M59397R41175n57677N42064M17192n19486r42531K44291
15186D931412L92764K8047j31876L9057J98388j01872K35703k23013l91610M21347
15176E398347M86846L26654j292572l17925P02514m31859n39044n37130R89134
15167D784965L91417K41010l30023k69099L1529P93138l80472q06636P76201k17368
15157E014662N70206m54118q1439Q3872o69837k01475r1944L43334M90904O13026
$$ plain form
15224 5632218 4637538 4429096 5281140 5873311 5684917 5528689 5611875 5012763 4825330 4552195
15214 4552195 4096943 4722374 5405919 5843003 5997904 5295435 4963834 4812776 4674176
15205 4674176 4610497 4633176 4921935 5363568 5306342 4365717 4465313 4901471 4514466 3980952
15195 3980952 4346987 4806384 5747559 5189882 5731946 6149138 5629652 4687121 4931412
15186 4931412 5324176 5352223 5220347 5259404 5457792 5355920 5591623 5368610 4977000 5398347
15176 5398347 5885193 6211847 4919275 4601350 5303864 4872005 4332961 3795831 4784965
15167 4784965 5176382 5417392 5087369 4818270 4849799 5642937 5262465 4455829 5232030 5014662
15157 5014662 5584868 5130750 5049311 5133183 4463346 4261871 4169927 4513261 5004165 5617191
15147E617191J92789o34082j30231q12395j70300N96847M34573Q9475L66211N03863
15137F053941J47959r608o50803k18450q08049O83626K54713p52455M64191J123377
15127F288442k06898r80861o0063m47353K92811N98431k0942J68565l10356n36334
15117D785442Q9153k30649p43779K04835M55709M46050L04726j90891K22446J7213
15107E360255p4517K32491k82677o61056k53893P01461n32539m72730j86024M05461
15097D236232N55949N85883k74350L67728N02080j41803P8056m41996l63093L90450
15087E495136O778N3631l73434p8826O43366K82959M59772n02088n07337N38654
15077F018611k50749N04714l05025k71531q77m85115k67705l84191J24473N45534
$$ plain form
15147 5617191 5809980 5175898 5045667 4233272 4062972 4659819 5094392 5183867 5550078 6053941
15137 6053941 6201900 6192292 5541489 5323039 4514990 5198616 5453329 4700874 5165065 6288442
15127 6288442 6081544 5100683 5040620 4593267 4886078 5484509 5463567 5632132 5321776 4785442
15117 4785442 4874595 4643946 3900167 4105002 4560711 5006761 5311487 5120596 5343042 5360255
15107 5360255 5285738 5518229 5235552 4574496 4320603 5022064 4489525 4016795 3830771 4236232
15097 4236232 4792181 5378064 5103714 5471442 5973522 5831719 5909775 5467779 5104686 5495136
15087 5495136 5501914 5555545 5182111 5103285 5746651 6029610 6489382 5987294 5479957 6018611
15077 6018611 5767862 6272576 5967551 5696020 5695143 5210028 4942323 4558132 4682605 5228139
15067E228139Q1289j9487p1604j39866k00700k67794L59348M44372j73718L92292
15057E632271r8419p11787M19989o19284l96196J80642M33406M04182j37176J482
15047E109110L11749J30694p82316n64523j1644J40145Q93861J95659K37993q873
15037E651855p08624l63057K4800J52469L44622L99758J12160j75986M45922r09768
15027D974151r5304j74405O80240J01274m64976N60538R0571l39336m51763r96996
15017C883994J20298O47982M07202M0566J24091K66575K39209k77999j86170O22161
15007E887909o40797M20769N48559M94604l02208j68993q7389n87922J71481j88687
14997E547326l89833J0595O14288O27369q56892j086025O81242P21177o83052
$$ plain form
15067 5228139 5309428 5289941 5218337 5078471 4877771 4609977 4969325 5413697 5239979 5632271
15057 5632271 5533852 4822065 5242054 4622770 4226574 4407216 4840622 5244804 5107628 5109110
15047 5109110 5420859 5551553 4769237 4204714 4193070 4333215 5227076 5422735 5660728 5651855
15037 5651855 4943231 4580174 4604974 4757443 5102065 5501823 5613983 5437997 5883919 4974151
15027 4974151 4878847 4704442 5384682 5485956 5020980 5581518 5672089 5332753 4880990 3883994
15017 3883994 4004292 4652274 5059476 5100042 5224133 5490708 5729917 5451918 5265748 5887909
15007 5887909 5247112 5667881 6216440 6711044 6408836 6239843 6152454 5564532 5736013 5547326
14997 5547326 5157493 5168088 5782376 6409745 5552853 4466828 5148070 5869247 5186195
14988E186195P3738L73865l39124r5187r91645K99552L83422n67174N30158P05766
14978E559566n67170M01941L14657n54148J58630r947p18096K9760L55490N82727
14968E553410K92427j89268o10344L13564R415j91777k41821o52180R88857J027442
14958F299725o44349q64431K14319l23469k3633k30360J95251J61311J2351n08895
14948D287820J47518Q8445k82677P58226K1829n75415K19198L80642R6519p63636
14938D378469M98287L74138N90452O95063l82833k95664l17631k67411k86407
14929D986463j65413N85794O64081m2432J86275J21997m47091q89496n36949K71017
14919D734246k14257L86489K75595K03696o5303n1331m47997l17664K21412o4308
$$ plain form
14988 5186195 5259933 5633798 5294674 5199487 4207842 4507394 4890816 4323642 4853800 5559566
14978 5559566 4992396 5394337 5708994 5154846 5313476 5303529 4585433 4615193 4970683 5553410
14968 5553410 5845837 5656569 5046225 5359789 5369204 5177427 4935606 4283426 5272283 6299725
14958 6299725 5655376 4790945 5005264 4681795 4658162 4427802 4623053 4784364 4796715 4287820
14948 4287820 4435338 4523783 4241106 4999332 5021161 4445746 4664944 5045586 5142105 4378469
14938 4378469 4876756 5250894 5841346 6536409 6153576 5857912 5540281 5272870 4986463
14929 4986463 4821050 5406844 6070925 6028493 6214768 6336765 5889674 5000178 4463229 4734246
14919 4734246 4519989 4906478 5182073 5385769 5320466 5269135 4821138 4503474 4724886 4660578
14909D660578R1376P55573N0324K74633q188p66703l16360K39018o3029l49752
14899D567470L18858O68183P51887o32161K7209k97725K16559L7541j70976m21042
14889E065803l08837M34368o90416k60800K29219l40433n1379J339338P46815
14880F163678m71177n95297O57628K77517q48656l37769m55315k69693O29298
14871D750214P36248J71614r52458J31545M75249j35621p7090l71773P33032K133
14861E463093J58294k54815q08785l42772o26784O68614O85749l50347O49195
14852E241442Q39008L47537K98885r54992j213460M92988N59364K36807q44489
14843E003090K90250N49810l00985O8314r27740P28291L7215M01923p6869n28665
$$ plain form
14909 4660578 4751954 5507527 5557851 5832484 5824296 5057593 4741233 4980251 4917222 4567470
14899 4567470 4886328 5554511 6306398 5674237 5701446 5403721 5620280 5657821 5486845 5065803
14889 5065803 4756966 5191334 4500918 4240118 4469337 4128904 4077525 5416863 6163678
14880 6163678 5692501 5097204 5754832 6032349 5183693 4845924 4390609 4120916 4750214
14871 4750214 5486462 5658076 4705618 4837163 5312412 5176791 5099701 4727928 5460960 5463093
14861 5463093 5621387 5366572 4557787 4215015 3588231 4256845 4942594 4592247 5241442
14852 5241442 6080450 6427987 6726872 5771880 4558420 5051408 5610772 5847579 5003090
14843 5003090 5293340 5843150 5542165 5610479 4682739 5411030 5448245 5850168 5773299 5244634
14833E244634M69424n8327r786j172784M70422J7264L2521M34493j19805j81488
14823E126568J09167k62090j63316L90398l29977N6095l45694M48025k52686q47871
14813C928619M05198K19553N67100j177642n2184J260536l73921N5812k42923
14804D590148P46074K42052n84977J22677M14017L98423r80690J10875R714P231
14794E075544O12282k19747l87050j30091R14601J6440l45303p68570L97234P84372
14784E949712n30866p537j59821N97810l25865k94295m05293J84488P68541p55209
14774E021665L23282P18236k15899O22488k05976K0033q24748o68893O044p2958
14764D723274Q55141q91886O3022J218216M59704o29747j58587J3729L65225k8127
$$ plain form
14833 5244634 5714058 5655731 5645945 4473161 4943583 4960847 4993368 5427861 5308056 5126568
14823 5126568 5235735 4973645 4810329 5200727 4870750 4926845 4581151 5029176 4776490 3928619
14813 3928619 4333817 4553370 5120470 3942828 3890644 5151180 4777259 4833071 4590148
14804 4590148 5336222 5578274 4993297 5115974 5529991 5928414 4947724 5058599 5068313 5075544
14794 5075544 5687826 5468079 5081029 4950938 5865539 5881979 5536676 4768106 5165340 5949712
14784 5949712 5418846 5411309 5251488 5849298 5523433 5229138 4823845 5008333 5776874 5021665
14774 5021665 5344947 6063183 5847284 6469772 6263796 6283829 5459081 4790188 4796232 4723274
14764 4723274 5578415 4686529 4749551 5967767 6427471 5797724 5639137 5652866 6018091 5989964
14754E989964l26096J40714n33333Q41045p9458p68911l08796j81116J59491O99918
14744E633422K91856p5832L81386k124k90201j075100p17219k58414K31054L91371
14734D510199Q316N32685r2727J11512R51987m82703o00659Q23664o6697j91369
14724E504208r9390j078651O90525k33954r12873Q71133P18886j6258J29032K50515
14714E823173K72395l08135K13426j65983n85134k14953L75553l5196q80363n40716
14704C954067N80852N99243N95306Q61253J47354l59689q0142p10827K07286p82437
14694E012266k72855j1140j92860k19586J05048N54787K90048R52671p67310P1984
14684E523053K08533j5590Q051k93193K53684L571j43804o01692k33685P69324
$$ plain form
14754 5989964 5663868 5804582 5271249 6112294 6032836 5263925 4955129 4774013 4933504 5633422
14744 5633422 5925278 5849446 6230832 6228708 5938507 4863407 4146188 3887774 4118828 4510199
14734 4510199 4518515 5051200 4958473 5069985 6021972 5539269 4938610 5762274 5695577 5504208
14724 5504208 5404818 4326167 5016692 4782738 3869865 4740998 5459884 5443626 5572658 5823173
14714 5823173 6095568 5787433 6000859 5834876 5249742 5034789 5410342 5375146 4494783 3954067
14704 3954067 4534919 5134162 5729468 6590721 6738075 6378386 6298244 5587417 5794703 5012266
14694 5012266 4739411 4728271 4535411 4315825 4420873 4975660 5265708 6218379 5451069 5523053
14684 5523053 5731586 5715996 5724047 5430854 5684538 5688109 5544305 4942613 4708928 5478252
14674E478252J68034j68723J77238L50098J38666K87402m84980P38142K01191
14665F885320j494548l50303l98263M89948k14269J52392J67697k78275J168735
14656F128434k40122r61242j005142P55447M77730K44153o84439L59505J028500
14647F102824l27636L36955q30717m77547O19671j29830J1023l41341k51289J072882
14637E784995J92441l16469m35123k38624L06277Q8753n67114k33318K79542O81565
14627E542925N71606n53767n40126k50147O92272k72975p52695N85320O3922l37559
14617D748776L69004O26413n41135r43791N60106J43031j21564J67446m18910
14608D589376M1819L24699P45641l84274r5290k19520M29900Q11016o34653P01982
$$ plain form
14674 5478252 5646286 5477563 5654801 6004899 6143565 6430967 5945987 6684129 6885320
14665 6885320 5390772 5040469 4642206 5132154 4917885 5070277 5237974 4959699 6128434
14656 6128434 5888312 4927070 3921928 4677375 5155105 5399258 4714819 5074324 6102824
14647 6102824 5775188 6112143 5281426 4803879 5423550 5293720 5304743 4963402 4712113 5784995
14637 5784995 5977436 5660967 5225844 4987220 5293497 5382250 4815136 4581818 4861360 5542925
14627 5542925 6114531 5560764 5020638 4770491 5462763 5189788 4437093 5022413 5086335 4748776
14617 4748776 5117780 5744193 5203058 4259267 4819373 4962404 4840840 5008286 4589376
14608 4589376 4631195 4955894 5701535 5317261 5221971 5002451 5432351 6243367 5608714 6310696
14598F310696R4245j19666k18904m03139k05995o0125p0937O2235M29153k14004
14588E603559J57517J94381j82269K16553p97669j47977j31097N31866K06026
14579E650890p44294l00417J9115K92404K82898m6289l40072O66809m06784Q0059
14569E154319l02075o02049N41210m9575K78986k38892m42072J330076n86839
14560E083089l87206Q66282k69663L71485l2632m31110P38040l63657k51517N62913
14550E886024n25030M39757K82871P4330Q5176j024021J021134n71768n53285
14541E115188M49936J20127k3665m67668k39341k60446J33419k31744M30330j49090
14531D877046l9891j78233R5622K05106o28429Q75465L35204m53340m00408N80650
$$ plain form
14598 6310696 6404941 6285275 6066371 5663232 5457237 5397112 5326175 5388410 5817563 5603559
14588 5603559 5761076 5955457 5773188 5989741 5192072 5044095 4912998 5444864 5650890
14579 5650890 4906596 4606179 4625294 4917698 5200596 5154307 4814235 5481044 5074260 5154319
14569 5154319 4852244 4250195 4791405 4741830 5020816 4781924 4339852 5669928 5083089
14560 5083089 4695883 5562165 5292502 5663987 5631355 5200245 5938285 5574628 5323111 5886024
14550 5886024 5360994 5800751 6083622 6157952 6243128 5219107 6240241 5668473 5115188
14541 5115188 5565124 5685251 5661586 5193918 4954577 4694131 4827550 4595806 5026136 4877046
14531 4877046 4837155 4658922 4754544 4959650 4331221 5206686 5541890 5088550 4688142 5268792
14521E268792P93499l84155P1720l27960R4697l33801N67052k9792n34927K61029
14511E446154J33310P88734q67251J50011J44654R2565O6257p75664L66357R3474
14501E638601p68353O41833l1604k19228M95465n78653k13760m54015l79642J5191
14491D145835L87171L61997O17094n9568m0399n70349L29278m64225k03172R13803
14481E417465p3604P94415K74953o72305L41495m25680p58000O20872j96238j67405
14471E155968P61804M61627M43274J68407j209612l98622l03302l22890j72202
14462D584452l01039L34753N40331P66809n46596r35208j079j82015Q1818j4987
14452D327239L35568J316255L66759j35075k43407p77066l32554M01287l99526
$$ plain form
14521 5268792 6062291 5678136 5749856 5421896 5516593 5182792 5749844 5720052 5185125 5446154
14511 5446154 5579464 6368198 5500947 5650958 5795612 5888177 5954434 5178770 5545127 5638601
14501 5638601 4870248 5512081 5480477 5261249 5756714 5178061 4964301 4510286 4130644 4145835
14491 4145835 4533006 4895003 5512097 5452529 5412130 4841781 5171059 4706834 4503662 5417465
14481 5417465 5343861 6138276 6413229 5740924 6082419 5656739 4898739 5519611 5323373 5155968
14471 5155968 5917772 6379399 6822673 6991080 5781468 5382846 5079544 4756654 4584452
14462 4584452 4283413 4618166 5158497 5925306 5378710 4443502 4442423 4260408 4342226 4327239
14452 4327239 4662807 5979062 6345821 6210746 5967339 5190273 4857719 5259006 4859480
14443D859480o1675J58672m0209J029602j039667K47862N38508m43615k95265
14434D953693j2068J569463n02887p53305J938N61250K91715r03897n63311P8094
14424D720685R45647j52726M14923J39394o10407N58226J3642M861o79169K42306
14414E597382k5975K9772K21560o59218K95307l68376l49686m3794N99875k22553
14404E074294L14736R42308j247891K85004o9640L20091l58447o51726J04704
14395D713433o1877M16346k55670k04531r25118M64959O90157o01768k32948P59587
14385D762570R03217K00386l44039J24845l0971j94274o14308J89408J66616L69408
14375E532858M06994l49009j77266R24318P1436l15370K84051m31533N1207K3602
$$ plain form
14443 4859480 4797805 4956477 4916268 5945870 4906203 5154065 5692573 5248958 4953693
14434 4953693 4941625 6511088 6008201 5254896 5256834 5818084 6109799 5205902 4642591 4720685
14424 4720685 5666332 5513606 5928529 6067923 5457516 6015742 6029384 6034245 5355076 5597382
14414 5597382 5571407 5601179 5822739 5163521 5458828 5090452 4740766 4696972 5296847 5074294
14404 5074294 5389030 6331338 5083447 5368451 5298811 5618902 5260455 4608729 4713433
14395 4713433 4651556 5067902 4812232 4607701 3682583 4147542 4837699 4235931 4002983 4762570
14385 4762570 5665787 5866173 5522134 5646979 5616008 5421734 4807426 4996834 5163450 5532858
14375 5532858 5939852 5590843 5413577 6337895 6409331 6093961 6378012 5946479 5997686 6021288
14365F021288n39804l92998O1070q64194p4647M31118p0998L62936m39689L77483
14355D871565J049075o49016j77944J019854J01987n29084L10177j09690j02006
14346E784918R1521K64132K32176k59035O87894j79287n05826k66808M51910L37116
14336F638711j197179J83056K40578J82012p28804q02984J70585L15730r6928
14327D904777l42858L42037m2222O52244p23371o5150N08487r07206P71614l69249
14317D729103j75719M86543M0594M77993k77858m94113N73719J15706O6184M07682
14307E949834k41359k11399r55281q8589O88789k96868L9954P01838K10616n99816
14297E197719M7192M88989l69408M76520l71975m92494l08795R48715K47529o15905
$$ plain form
14365 6021288 5481484 5088486 5149556 4285362 4210715 4641833 4570835 4933771 4494082 4871565
14355 4871565 5920640 5271624 5093680 6113534 6215521 5686437 5996614 5886924 5784918
14346 5784918 5876439 6140571 6372747 6113712 6801606 6622319 6116493 5849685 6301595 6638711
14336 6638711 5441532 5624588 5865166 6047178 5318374 4515390 4685975 5001705 4904777
14327 4904777 4561919 4903956 4861734 5513978 4790607 4725457 5233944 4326738 5098352 4729103
14317 4729103 4553384 5039927 5080521 5558514 5280656 4786543 5360262 5475968 5542152 5949834
14307 5949834 5708475 5497076 4541795 4453206 5141995 4845127 4885081 5586919 5797535 5197719
14297 5197719 5244911 5733900 5364492 5841012 5469037 4976543 4667748 5616463 5863992 5248087
14287E248087M20432J46519K5449j296806O00471O96684M52252O4722l21311o5288
14277E971211j95915k15673n19786L32695L4613N07731K63294j76526O75584p30785
14267E946443N9148k08388m67011N32356L94864N53290l36317K52255o34948o90281
14257E401411o93099K06715J070620K3359j41327K67903L88132q18984l65235
14248E339495n16462j32679l75353m34226J155735L56703l60454M50688J59224
14239E642671k97418l62641M52190L4974K35294N4946O3248L25914j155750J51603
14229E145031K13649j060990l11488P70256k6266L54147o491J98936M42096j196489
14219D522391J99753M75789o40624M92741M34440j12095p13293k2892L97981L73775
$$ plain form
14287 5248087 5668519 5815038 5840487 4543681 5144152 5840836 6293088 6357810 6036499 5971211
14277 5971211 5775296 5559623 5039837 5372532 5407145 5914876 6178170 6001644 6677228 5946443
14267 5946443 6005591 5797203 5330192 5862548 6257412 6810702 6474385 6726640 6091692 5401411
14257 5401411 4708312 4915027 5985647 6009006 5867679 6135582 6523714 5704730 5339495
14248 5339495 4823033 4690354 4315001 3880775 5036510 5393213 5032759 5483447 5642671
14239 5642671 5345253 4982612 5434802 5469776 5705070 5760016 5823264 6149178 4993428 5145031
14229 5145031 5358680 4297690 3986202 4756458 4730192 5084339 5077848 5276784 5718880 4522391
14219 4522391 4722144 5197933 4557309 5050050 5484490 5372395 4659102 4636210 5034191 5407966
14209E407966L27670m53217K76897L90095K79607L00661m28902q08893K75272
14200E567156M92381k94853k98711n1843N39281k75423p53709K8566O58267K90086
14190E901198M75937M25814j98540k40720L18926k29249q59049k57669N67355
14181E904003p15997l37783M93427Q68185P9113j336429R76097k07882m08690
14172E314044r3494j56752J002778m28268K15732K64070j53119j88237m57137
14163E319617K19844l47104m37714J49711O21971L63791n8604k28710K70633l14455
14153E558980j018759K24174j24253M77849l03963N35081N70150j268833N99584
14144E250010K55756n25426p9411R06730j90943n56079J83629Q64637j52842j089421
$$ plain form
14209 5407966 5735636 5282419 5559316 5949411 6229018 6529679 6100777 5291884 5567156
14200 5567156 6059537 5764684 5465973 5414130 5953411 5677988 4924279 4952845 5611112 5901198
14190 5901198 6377135 6802949 6604409 6363689 6682615 6453366 5594317 5336648 5904003
14181 5904003 5188006 4850223 5343650 6211835 6290948 4954519 5930616 5722734 5314044
14172 5314044 5220550 5063798 6066576 5638308 5854040 6118110 5964991 5776754 5319617
14163 5319617 5539461 5192357 4754643 4904354 5526325 5890116 5831512 5602802 5873435 5558980
14153 5558980 4540221 4764395 4640142 5117991 4814028 5349109 5919259 4650426 5250010
14144 5250010 5505766 4980340 4900929 5807659 5616716 5060637 5244266 6108903 5956061 4866640
14134D866640M27130P67917l18393M2619r3152P0046r10217M0111p4323K53250
14124E071628R45467l51441l67923P02404L17441r10306L12106l47061L70779
14115E743094M56361k91524j53614m13663P48194k62707r91578M27038P57322
14106F018923O86459m61364k34471k19342l82916M17452j32037p39068J84226
14097E137862P28018J83024n81032n03543O25319j17497p13764O01522k61396
14088E098513O58245k09896N76643m1453j053190j60650J55663J048787n1620
14079F021042n95196Q02761M66937p03411j346539o06941N63017K96423N33993
14070E432086k8176K44553l4433J02303l00668l73238p722O07303j86356n55229
$$ plain form
14134 4866640 5293770 6061687 5743294 5785913 5692761 5762807 4852590 4892701 4818378 5071628
14124 5071628 6017095 5665654 5297731 6000135 6317576 5407270 5719376 5372315 5743094
14115 5743094 6199455 5907931 5754317 5340654 6088848 5826141 4834563 5261601 6018923
14106 6018923 6705382 6244018 6009547 5790205 5407289 5824741 5692704 4953636 5137862
14097 5137862 5865880 6048904 5467872 4964329 5589648 5472151 4758387 5359909 5098513
14088 5098513 5756758 5546862 6123505 6082052 5028862 4868212 5023875 6072662 6021042
14079 6021042 5425846 6228607 6695544 5992133 4645594 4038653 4601670 4898093 5432086
14070 5432086 5403910 5648463 5614030 5716333 5415665 5042427 5034705 5642008 5455652 4900423
14060D900423J47128R80082O98342j180403q97887N19098N17388k51258J0078
14051E442991O19007N92846k90446p63918l45278k27236J66664k32981q437K02516
14041E155728Q2210j82849l78784L56199M75765Q51572j089024M73201n0226n82343
14031E111449Q46877j133141N54585J85762K68593M87455k30810r2668J81575
14022F179677n55807q1590j08077K58059K37613l09763N35611j96801j097157
14013D861765k0538n0801K63894J08166k47931O66328N98624M55707m15756p84901
14003E434557k27714J34980o09984O8420O84580O64477K07573k97452M9885J56143
13993F265465m3840J21940o49035K75637M00963k50629K3102o60386M6961L87299
$$ plain form
14060 4900423 5047551 6027633 6725975 5545572 4647685 5166783 5684171 5432913 5442991
14051 5442991 6061998 6654844 6364398 5600480 5255202 5027966 5194630 4961649 4953212 5155728
14041 5155728 5237938 5055089 4676305 5032504 5508269 6359841 5270817 5744018 5693792 5111449
14031 5111449 5958326 4825185 5379770 5565532 5834125 6321580 6090770 5998102 6179677
14022 6179677 5623870 5542280 5434203 5692262 5929875 5620112 6155723 5958922 4861765
14013 4861765 4841227 4790426 5054320 5162486 4914555 5580883 6179507 6635214 6219458 5434557
14003 5434557 5206843 5341823 4731839 4800259 5484839 6149316 6356889 6059437 6109322 6265465
13993 6265465 6221625 6343565 5694530 5970167 6371130 6120501 6143603 5483217 5530178 5917477
13983E917477n95239L36339J77782J42542n789l35738l47951N49730J62803M69111
13973F471067K05620m6802q1441p60208l11163k91967k18194M59118P30483N28249
13963F684762j68660j86228j61973r42317l65181l24939M74954j11197J091953
13954E991174K89440l91920n97133j69424L82124o13152J62948J48154O20266
13945E822477P41016n20042q96057p30855K72930O66693l11682M24698N52772
13936F021950Q7108j6605k09678p00650n79881k01234k5017O87584M88348K17675
13926E769600K05885n91395m47400J01519l22717K88984J361982o18160p3521
13917E674777J31970j629877Q1470M78142K1746J95274N72234Q51885P01370o41963
$$ plain form
13983 5917477 5322238 5658577 5836359 5978901 5973112 5637374 5289423 5839153 6001956 6471067
13973 6471067 6676687 6629885 6548444 5788236 5477073 5185106 4966912 5426030 6156513 6684762
13963 6684762 6516102 6329874 6167901 5225584 4860403 4535464 5010418 4899221 5991174
13954 5991174 6280614 5888694 5291561 5122137 5504261 4891109 5054057 5202211 5822477
13945 5822477 6563493 6043451 5147394 4416539 4689469 5356162 5044480 5469178 6021950
13936 6021950 6109058 6092453 5882775 5182125 4602244 4401010 4375993 5063577 5551925 5769600
13926 5769600 5975485 5384090 4936690 5038209 4715492 5004476 6366458 5748298 5674777
13917 5674777 5806747 4176870 4258340 4736482 4758228 4953502 5525736 6377621 7078991 6437028
13907F437028p36747O3418n08001N73172L12405l32691n19032k9697M39079n66926
13897E132008k94622j25049R28984M21016l49630K51937M07724j73028n84503
13888E614837l41514n32708P44707O98139n74468q19684J59530Q13283m04784
13879E357338k32131N83029K86188M64226m45634L66424j06456p70251J19165
13870E621898P09663j039646R9409N64782n18182M15938n52811J23230R7141l58465
13860E162957Q07957L07240l12594P96861K69710r00847q88960J81911K96712
13851E720947J12326N3152J269437L8897j98492q88069m06823l4357l80615Q99288
13841F185691r78571P5655J231243k6072r36175j50650l7271p8468l34982k94376
$$ plain form
13907 6437028 5700281 5763699 5255698 5828870 6141275 5808584 5289552 5259855 5698934 5132008
13897 5132008 4837386 4712337 5641321 6062337 5712707 5964644 6372368 6199340 5614837
13888 5614837 5273323 4740615 5485322 6183461 5608993 4789309 4948839 5762122 5357338
13879 5357338 5125207 5708236 5994424 6458650 6013016 6379440 6272984 5502733 5621898
13870 5621898 6331561 5291915 5391324 5956106 5437924 5853862 5301051 5424281 5521422 5162957
13860 5162957 5970914 6278154 5965560 6762421 7032131 6131284 5242324 5424235 5720947
13851 5720947 5833273 5886425 7155862 7194759 6996267 6108198 5701375 5667018 5286403 6185691
13841 6185691 5207120 5282775 6514018 6487946 5551771 5401121 5363850 5285382 4950400 4656024
13831D656024J163546j11071K70990K4399l59088n9273n6268O83495j004719k60735
13821D947300K84150P62625K64089q62299L44179N0325J04180m50425P6628O09551
13811F130303l97457M49323m75660r27287k42952Q11603M95517m67466l64871
13802E011053m8605Q70136n35978j98072L67998N66242Q81412q5798j221706n23062
13792E083620P7756L60188K72525J87941L2064O70691l92226k60551J63372p31297
13782E464083m25908Q96920M90715p07746K27866j77050m33040m02025j74622
13773D759193K63021l66789N37735P85229J8673q4516L05110J79442n63932o41860
13763E191306M8870j93335M73513N82236o76396K86970O6288o39510l23870j79055
$$ plain form
13831 4656024 5819570 5708499 5979489 6003888 5644800 5585527 5529259 6212754 5208035 4947300
13821 4947300 5231450 5994075 6258164 5395865 5740044 5790369 5894549 5444124 5520752 6130303
13811 6130303 5732846 6182169 5706509 4779222 4536270 5347873 5843390 5375924 5011053
13802 5011053 4962448 5832584 5296606 5098534 5466532 6032774 6914186 6828388 5606682 5083620
13792 5083620 5161376 5521564 5794089 5982030 6014094 6684785 6292559 6032008 6195380 5464083
13782 5464083 5038175 5935095 6425810 5718064 5945930 5768880 5335840 4933815 4759193
13773 4759193 5022214 4655425 5193160 5978389 5997062 5912546 6217656 6397098 5833166 5191306
13763 5191306 5240176 5046841 5520354 6102590 5426194 5713164 5779452 5139942 4816072 4637017
13753D637017P18664n9392O18437M43640m85352J21343p53604k67971L53716K14952
13743E541450J81587M87040l8587J92876m07929m43799K27961q57784J86691P17958
13733E787464L76937M7348j01152M56119j142612j32688j8872o5310J73942Q30056
13723F211232J11326r9403Q1372j59639j63486n65269k69099L17679N81443Q62508
13713F908664p50486P5027l5900q2784q93808n54094R51425L25273M81418k37714
13703F187021n38541N09762P2642n90080k46727P1763K77319Q14759l47395k92300
13693E918223K72655l25054K02046m36049M94102M57672l84173K42747o33216
13684E808953m67383j886M27644M12222n79119m9241P22584J29619n8119k70135
$$ plain form
13753 4637017 5355681 5296289 5914726 6358366 5873014 5994357 5240753 4972782 5326498 5541450
13743 5541450 5723037 6210077 6171490 6364366 5956437 5512638 5740599 4882815 5069506 5787464
13733 5787464 6164401 6211749 6110597 6566716 5424104 5291416 5272544 5207234 5381176 6211232
13723 6211232 6322558 6223155 6304527 6144888 5981402 5416133 5147034 5464713 6046156 6908664
13713 6908664 6158178 6233205 6197305 6114521 5220713 4666619 5618044 5943317 6424735 6187021
13703 6187021 5648480 6158242 6230884 5640804 5394077 5465840 5743159 6557918 6210523 5918223
13693 5918223 6190878 5865824 6067870 5631821 6125923 6583595 6199422 6442169 5808953
13684 5808953 5341570 5339684 5767328 6179550 5600431 5551190 6273774 6403393 6345274 6075139
13674F075139j58989J41346m09174K22881n10587K42521l22903p38622k0761J64557
13664D685408P37846P7393l3332Q67189k31791P6000k93258k52313k38868K23507
13654E617781j12814k61969K37497K24865N3449k28336L29021m53439O73397q5647
13644E993805p10617N43396P421p0928l05338l4871j70343l42722K87238P24034
13634E921075O82411J09058N79367K7987j148659j50432n43010K02185l0638j51614
$$ plain form
13674 6075139 5916150 6057496 5648322 5871203 5360616 5603137 5280234 4541612 4520851 4685408
13664 4685408 5423254 5500647 5467315 6334504 6102713 6178713 5885455 5633142 5394274 5617781
13654 5617781 5504967 5242998 5480495 5705360 5758809 5530473 5859494 5406055 6079452 5993805
13644 5993805 5283188 5826584 5834005 5763077 5457739 5422868 5252525 4909803 5197041 5921075
13634 5921075 6603486 6712544 7291911 7319898 6171239 6020807 5477797 5679982 5649344 5497730
$$ [...]
##END NTUPLES=NMR SPECTRUM
##END=
