##TITLE=1H_DE-80H_X3
 200.13MHz, d2o
 8 sc
 
 19ns.26.2.2025
##JCAMPDX= 6.0         $$ Bruker NMR JCAMP-DX V2.0
##DATA TYPE= NMR SPECTRUM
##DATA CLASS= NTUPLES
##ORIGIN= UXNMR, Bruker Analytische Messtechnik GmbH
##OWNER= pz
$$ XWIN-NMR		Version 3.5
$$ Tue May  5 10:17:34 2026 Russian Standard Time (UT+4h)  Yarkov@DPX200
##.OBSERVE FREQUENCY= 200.1313
##.OBSERVE NUCLEUS= ^1H
##.ACQUISITION MODE= SIMULTANEOUS
##.ACQUISITION SCHEME= undefined
##.AVERAGES= 8
##.DIGITISER RES= 18
##SPECTROMETER/DATA SYSTEM= spect
##.PULSE SEQUENCE= zg30
##.SOLVENT NAME= CDCl3
##.SHIFT REFERENCE= (INTERNAL, CDCl3, 0, 18.0191)
##AUDIT TRAIL= $$ (NUMBER, WHEN, WHO, WHERE, WHAT)
$$ ##TITLE= Audit trail, XWIN-NMR		Version 3.5
$$ ##JCAMPDX= 5.01
$$ ##ORIGIN= Bruker BioSpin GmbH
$$ ##OWNER= Yarkov
$$ C:/Bruker/XWIN-NMR/data/yarkov2/nmr/H-C/1/pdata/1/auditp.txt
$$ ##AUDIT TRAIL=  $$ (NUMBER, WHEN, WHO, WHERE, WHAT)
(   1,<2026-05-05 10:16:26.70 +0400>,<Yarkov>,<DPX200>,
      <created by zg, POWCHK disabled, PULCHK disabled
       configuration hash MD5:
       00 E9 B6 7A A2 85 ED C7 34 08 36 98 17 FE 4E 26
       data hash MD5: 16K
       B7 F9 91 C5 8B 6A 96 DE 2E 98 F7 53 49 65 3C F4>)
(   2,<2026-05-05 10:16:34.03 +0400>,<Yarkov>,<DPX200>,
      <Start of raw data processing
       efp BC_mod = 2 LB = 0.25 FT_mod = 6 PKNL = 1 PHC0 = -5303.516 PHC1 = 11.42193 SI = 16K 
       data hash MD5: 16K
       F8 E2 F0 59 87 E3 70 34 7E 97 20 B7 46 24 EA 08>)
(   3,<2026-05-05 10:17:05.85 +0400>,<Yarkov>,<DPX200>,
      <abs ABSG = 5 
       data hash MD5: 16K
       4A AC 63 76 A6 84 99 19 3A 3E 36 C0 4B 3A 1D 25>)
$$ ##END=
$$ 
$$ hash MD5
$$ E8 39 5F EC 03 BE 34 6E 5E 39 DC AB C6 6A 61 93
##$RELAX= 
##$RELAX= 
##$RELAX= 
##$RELAX= 
##$RELAX= 
##$RELAX= 
$$ Bruker specific parameters
$$ --------------------------
##$DU= <C:/Bruker/XWIN-NMR>
##$EXPNO= 1
##$NAME= <H-C>
##$PROCNO= 1
##$TYPE= <nmr>
##$USER= <yarkov2>
##$AMP= (0..31)
100 100 100 100 100 100 100 100 100 100 100 100 100 100 100 100 100 100 
100 100 100 100 100 100 100 100 100 100 100 100 100 100 
##$AQSEQ= 0
##$AQ_mod= 1
##$AUNM= <au_zg>
##$AUTOPOS= <>
##$BF1= 200.13
##$BF2= 200.13
##$BF3= 200.13
##$BF4= 200.13
##$BF5= 200.13
##$BF6= 200.13
##$BF7= 200.13
##$BF8= 200.13
##$BYTORDA= 1
##$CFDGTYP= 0
##$CFRGTYP= 5
##$CHEMSTR= <none>
##$CNST= (0..31)
1 1 145 1 1 1 1 1 1 1 1 1 1 1 1 1 1 1 1 1 1 1 1 1 1 1 1 1 1 1 1 1 
##$CPDPRG= <>
##$CPDPRG1= <>
##$CPDPRG2= <>
##$CPDPRG3= <>
##$CPDPRG4= <mlev>
##$CPDPRG5= <mlev>
##$CPDPRG6= <mlev>
##$CPDPRG7= <mlev>
##$CPDPRG8= <mlev>
##$CPDPRGB= <>
##$CPDPRGT= <>
##$D= (0..31)
0 0.7 0 0 0 0 0 0 0 0 0 0.03 0 0 0 0 0 0 0 0 0 0 0 0 0 0 0 0 0 0 0 0 
##$DATE= 1777961786
##$DBL= (0..7)
120 120 120 120 120 120 120 120 
##$DBP= (0..7)
150 150 150 150 150 150 150 150 
##$DBP07= 0
##$DBPNAM0= <>
##$DBPNAM1= <>
##$DBPNAM2= <>
##$DBPNAM3= <>
##$DBPNAM4= <>
##$DBPNAM5= <>
##$DBPNAM6= <>
##$DBPNAM7= <>
##$DBPOAL= (0..7)
0.5 0.5 0.5 0.5 0.5 0.5 0.5 0.5 
##$DBPOFFS= (0..7)
0 0 0 0 0 0 0 0 
##$DE= 6
$$ [...]
##$SUBNAM3= <"">
##$SUBNAM4= <"">
##$SUBNAM5= <"">
##$SUBNAM6= <"">
##$SUBNAM7= <"">
##$SUBNAM8= <"">
##$SUBNAM9= <"">
##$SW= 18.0517328524113
##$SWIBOX= (0..15)
0 0 2 0 0 0 0 0 0 0 0 0 0 0 0 0 
##$SW_h= 3612.71676300578
##$TD= 16384
##$TD0= 1
##$TE= 0
##$TE2= 300
##$TE3= 300
##$TEG= 300
##$TL= (0..7)
0 120 120 120 120 120 120 120 
##$TP= (0..7)
150 150 150 150 150 150 150 150 
##$TP07= 0
##$TPNAME0= <>
##$TPNAME1= <>
##$TPNAME2= <>
##$TPNAME3= <>
##$TPNAME4= <>
##$TPNAME5= <>
##$TPNAME6= <>
##$TPNAME7= <>
##$TPOAL= (0..7)
0.5 0.5 0.5 0.5 0.5 0.5 0.5 0.5 
##$TPOFFS= (0..7)
0 0 0 0 0 0 0 0 
##$TUNHIN= 0
##$TUNHOUT= 0
##$TUNXOUT= 0
##$USERA1= <user>
##$USERA2= <user>
##$USERA3= <user>
##$USERA4= <user>
##$USERA5= <user>
##$V9= 5
##$VALIST= <valist>
##$VCLIST= <CCCCCCCCCCCCCCC>
##$VD= 0
##$VDLIST= <DDDDDDDDDDDDDDD>
##$VPLIST= <PPPPPPPPPPPPPPP>
##$VTLIST= <TTTTTTTTTTTTTTT>
##$WBST= 1024
##$WBSW= 4
##$XGAIN= (0..3)
0 0 0 0 
##$XL= 0
##$YL= 0
##$YMAX_a= 205024
##$YMIN_a= -171707
##$ZGOPTNS= <>
##$ZL1= 120
##$ZL2= 120
##$ZL3= 120
##$ZL4= 120
##$ABSF1= 18.01908
##$ABSF2= -0.03281593
##$ABSG= 5
##$ABSL= 3
##$ALPHA= 0
##$AQORDER= 0
##$ASSFAC= 0
##$ASSFACI= 0
##$ASSFACX= 0
##$ASSWID= 0
##$AUNMP= <proc_1d>
##$AZFE= 0.1
##$AZFW= 0.1
##$BCFW= 0
##$BC_mod= 2
##$BYTORDP= 0
##$COROFFS= 0
##$CY= -3
##$DATMOD= 1
##$DC= 0
##$DFILT= <>
##$DTYPP= 0
##$F1P= 0
##$F2P= 0
##$FCOR= 1
##$FTSIZE= 16384
##$FT_mod= 6
##$GAMMA= 0
##$GB= 0
##$INTBC= 1
##$INTSCL= 3.241238e-09
##$ISEN= 128
##$LB= 0.25
##$LEV0= 0
##$LPBIN= 0
##$MAXI= 10000
##$MC2= 0
##$MEAN= 0
##$ME_mod= 0
##$MI= 1.114404
##$NCOEF= 0
##$NC_proc= -8
##$NLEV= 6
##$NOISF1= 3.799351
##$NOISF2= 2.8
##$NSP= 0
##$NTH_PI= 0
##$NZP= 0
##$OFFSET= 18.01908
##$PC= 1
##$PHC0= -5303.516
##$PHC1= 11.42193
##$PH_mod= 1
##$PKNL= yes
##$PPARMOD= 0
##$PSCAL= 0
##$PSIGN= 0
##$REVERSE= no
##$SF= 200.129500208224
##$SI= 16384
##$SIGF1= 3
##$SIGF2= 2
##$SINO= 0.751879
##$SIOLD= 32768
##$SREGLST= <19F.Aceton>
##$SSB= 0
##$STSI= 16384
##$STSR= 0
##$SW_p= 3612.71676300578
##$SYMM= 0
##$S_DEV= 0
##$TDeff= 16384
##$TDoff= 0
##$TI= <>
##$TILT= no
##$TM1= 0
##$TM2= 0
##$TOPLEV= 0
##$USERP1= <user>
##$USERP2= <user>
##$USERP3= <user>
##$USERP4= <user>
##$USERP5= <user>
##$WDW= 1
##$XDIM= 16384
##$YMAX_p= 456949508
##$YMIN_p= -5221726
$$ End of Bruker specific parameters
$$ ---------------------------------
##NTUPLES= NMR SPECTRUM
##VAR_NAME=  FREQUENCY,     SPECTRUM/REAL,   SPECTRUM/IMAG
##SYMBOL=    X,             R,               I
##VAR_TYPE=  INDEPENDENT,   DEPENDENT,       DEPENDENT
##VAR_FORM=  AFFN,          ASDF,            ASDF
##VAR_DIM=   16384,         16384,           16384
##UNITS=     HZ,            ARBITRARY UNITS, ARBITRARY UNITS
##FACTOR=    0.220516191357247, 1,           1
##FIRST=     3606.14931618429, 0,            0
##LAST=      -6.56744682148656, 0,           0
##MIN=       -6.56744682148656, -5221726,    0
##MAX=       3606.14931618429, 456949508,    0
$$ Real data points
##PAGE= N=1
##DATA TABLE= (X++(R..R)), XYDATA
$$ [...]
$$ plain form
3536 42667736 43864872 44779383 44361194 44326010 42169097 40568728 39721286 38806209 38711571
3527 38711571 39151989 41055534 41149878 40599859 40678215 40515144 39748117 38992742 40290030
3518 40290030 42210457 43346827 42837745 40169983 35873223 35035686 33441565 30830774
3510 30830774 30746524 31471859 31363889 28733907 26715497 26731417 25778805 24725111 25859019
3501 25859019 26885905 27191223 28676655 28631897 27108503 26527558 25668190 24609464 23902080
3492 23902080 23148618 23479708 20724788 18623542 19842147 19588966 18279821 17516480 16741206
3483 16741206 15742790 16148720 14687840 14686480 13954007 13484402 14279629 12787969 13236962
3474 13236962 14042451 13069044 12917466 12816409 11642737 11972948 11165633 9390832 9218465
$$ packed form
3536D2667736J197136R14511m18189l5184k156913j600369q47442r15077r4638
3527C8711571M40418J903545R4344n50019P8356j63071p67027p55375J297288
3518D0290030J920427J136370n09082k667762m296760q37537j594121k610791
3510C0830774q4250P25335j07970k629982k018410J5920r52612j053694J133908
3501B5859019J026886L05318J485432m4758j523394n80945q59368j058726p07384
3492B3902080p53462L31090k754920k101246J218605k53181j309145p63341p75274
3483A6741206r98416M05930j460880j360p32473m69605P95227j491660M48993
3474A3236962Q05489r73407j51578j01057j173672L30211q07315j774801j72367
$$ plain form
3465 9218465 8903664 9337728 9924910 9150793 9168532 9441538 8109948 9718883 9994107
3456 9994107 9115330 8983441 8075850 6960603 7555342 8173523 7123959 7818342 7075959
3447 7075959 7947633 7473915 6473613 7688226 7418827 7337374 8227836 8067821 7053235
3438 7053235 7647173 7487981 7513390 7082982 7045906 6879556 6252574 6735540 5397237 4572357
3428 4572357 4774568 5587082 7582867 6959648 5348324 5425176 4517684 5797833 7756577
3419 7756577 7996745 9218453 7104189 6773960 7405628 6504456 7808851 7716008 7186660
3410 7186660 7951670 7895690 6206805 7291558 6865754 7513130 8415028 7628764 8867962
3401 8867962 6668193 5201058 5247550 5657561 6223340 6806371 6088377 7482572 8605863
$$ packed form
3465I218465l14801M34064N87182p74117J7739K73006j331590J608935K75224
3456I994107q78777j31889r07591j115247N94739O18181j049564O94383p42383
3447G075959Q71674m73718j000302J214613k69399q1453Q90462j60015j014586
3438G053235N93938j59192K5409m30408l7076j66350o26982M82966j338303q24880
3428D572357K02211Q12514J995785o23219j611324P6852r07492J280149J958744
3419G756577K40168J221708k114264l30229O31668r01172J304395r2843n29348
3410G186660P65010n5980j688885J084753m25804O47376R01898p86264J239198
3401H867962k199769j467135M6492M10011N65779N83031p17994J394195J123291
$$ plain form
3392 8605863 7017166 5916113 5353589 6600629 6881596 8687638 9574100 9160110 7893847
3383 7893847 8051932 7315397 5482426 6439434 6505258 6362602 7607655 7271154 5642544
3374 5642544 5006347 4995234 6061516 5470708 4131766 5909343 5582438 5603464 7837887
3365 7837887 7911124 6928174 6283299 6099902 6952179 6106013 5597933 7035665 7796315 7347274
3355 7347274 7384381 7258482 6199781 5506166 6755491 6491843 7522467 8679752 6423840
3346 6423840 4791609 5676184 6135879 5803530 5803889 5962825 7444174 5506820 4741464 4789321
3336 4789321 5079299 6587546 6203738 5922421 6079304 5159478 5469227 5467965 6006166 6822020
3326 6822020 6041137 5264074 6141660 7118331 7206866 5743052 5070820 6230951 7049891
$$ packed form
3392H605863j588697j101053n62524J247040K80967J806042Q86462m13990j266263
3383G893847J58085p36535j832971R57008O5824j42656J245053l36501j628610
3374E642544o36197j1113J066282n90808j338942J777577l26905K1026K234423
3365G837887P3237r82950o44875j83397Q52277q46166n08080J437732P60650m49041
3355G347274L7107j25899j058701o93615J249325k63648J030624J157285k255912
3346F423840j632231Q84575M59695l32349L59J58936J481349j937354p65356M7857
3336D789321K89978J508247l83808k81317J56883r19826L09749j262N38201Q15854
3326F822020p80883p77063Q77586R76671Q8535j463814o72232J160131Q18940
$$ plain form
3317 7049891 6217656 6970110 5729314 4200613 5081725 5377786 6303144 6850812 6599886
3308 6599886 5309856 3951348 4843715 5640752 6838025 6702589 6079613 6653354 6441196
3299 6441196 7301032 7904734 7013303 7127559 7115945 5686410 6788241 6664251 6067648
3290 6067648 5122405 4450910 5918698 7105635 5780218 5067868 6056466 6034564 7229646
3281 7229646 7378360 6066837 6330939 5794990 5805373 5334000 6523017 8043349 7307931
3272 7307931 5211841 5330914 5463034 4212232 4024791 5616975 6252306 6350512 6398732
3263 6398732 4547170 4835139 5424660 5754341 5782893 5002239 5569317 6751150 7265750
3254 7265750 7749711 7723268 6106634 5920637 7067498 6392026 5563127 5387541 5462153 5948038
$$ packed form
3317G049891q32235P52454j240796j528701Q81112K96061R25358N47668k50926
3308F599886j290030j358508Q92367P97037J197273j35436o22976N73741k12158
3299F441196Q59836O03702q91431J14256j1614j429535J101831j23990n96603
3290F067648r45243o71495J467788J186937j325417p12350R88598k1902J195082
3281G229646J48714j311523K64102n35949J0383m71373J189017J520332p35418
3272G307931k096090J19073J32120j250802j87441J592184O35331R8206M8220
3263F398732j851562K87969N89521L29681K8552p80654N67078J181833N14600
3254G265750M83961k6443j616634j85997J146861o75472q28899j75586P4612M85885
$$ plain form
3244 5948038 6453883 6059821 5632435 4690218 4314607 4273796 5439276 5299680 5130666 5200904
3234 5200904 4797635 6554332 7457419 5630711 5190695 4555018 4185323 3561760 4042810
3225 4042810 5476521 5627526 4897675 4806798 5232133 5957114 6198606 4890077 4768596
3216 4768596 6055192 7742828 6813589 5398146 5423172 5680222 4679511 4085644 4609043
3207 4609043 5043588 5398880 3922259 3126677 3615972 4860702 4951626 4043539 4887697
3198 4887697 5740421 6225334 6287133 6341078 7387944 5658699 3770977 4462922 4116863
3189 4116863 4867783 5506403 5902683 6573674 5974017 2862456 2587858 2629941 3443493 5400806
3179 5400806 5463967 6088343 7159514 5666395 5054721 4550765 4049345 4973134 4620535
$$ packed form
3244E948038N05845l94062m27386r42217l75611m0811J165480j39596j69014P0238
3234E200904m03269J756697R03087j826708m40016o35677l69695o23563M81050
3225D042810J433711J51005p29851r0877M25335P24981K41492j308529j21481
3216D768596J286596J687636r29239j415443K5026K57050j000711n93867N23399
3207D609043M34545L55292j476621p95582M89295J244730R0924r08087Q44158
3198D887697Q52724M84913O1799N3945J046866j729245j887722O91945l46059
3189D116863P50920O38620L96280O70991n99657l111561k74598M2083Q13552J957313
3179E400806O3161O24376J071171j493119o11674n03956n01420R23789l52599
$$ plain form
3170 4620535 5316926 5465457 4741918 3755429 4330709 4707552 4026749 3565365 3016935 3106587
3160 3106587 3085385 3601948 4268495 5461846 5436758 4437305 4977480 5571886 3168800 1317128
3150 1317128 2430795 4403039 4669752 4275052 3776133 3322040 3202818 3122298 3546696
3141 3546696 3403588 5008454 4160858 3100862 4456027 4949767 3872904 3033268 3692711
3132 3692711 5134416 4817841 3929351 3268999 3019440 3198194 3397982 5291770 5413029
3123 5413029 4119206 3101922 2072310 2447001 3884338 4580525 4481544 4109814 4222915
3114 4222915 3803477 3261405 4186880 4722946 4163999 2844317 3705175 3398382 2261329
3105 2261329 3662181 4328334 4089112 4562376 3674435 3635851 3599150 3976498 4797969 3872501
$$ packed form
3170D620535O96391J48531p23539r86489N75280L76843o80803m61384n48430Q9652
3160C106587k1202N16563O66547J193351k5088r99453N40175N94406k403086j851672
3150A317128J113667J972244K66713l94700m98919m54093j19222q0520M24398
3141C546696j43108J604866q47596j059996J355165M93740j076863q39636O59443
3132C692711J441705l16575q88490o60352k49559J78754J99788J893788J21259
3123E413029j293823j017284j029612L74691J437337O96187r8981l71730J13101
3114D222915m19438n42072R25475N36066n58947j319682Q60858l06793j137053
3105B261329J400852O66153k39222M73264q87941l8584l6701L77348Q21471r25468
$$ plain form
3095 3872501 3568054 3556087 3001614 1382687 1637723 1691816 1934722 2682735 2854227 2166350
3085 2166350 1753774 2538700 2005109 2113664 3902772 5227658 6231885 5505687 4183194
3076 4183194 4764674 4032728 4852780 4880998 3970015 4695026 4202538 3263194 3072199 2503199
3066 2503199 1626599 2328342 1977178 3431098 4062229 2803189 1909743 1465564 2510713
3057 2510713 3347372 3631973 3102568 2407549 2538196 2264229 2176720 2607336 3636285 5404685
3047 5404685 5358480 5339202 5410261 4512995 3432132 2346750 2666531 5363669 5911031 3559433
3037 3559433 2179258 1431642 1568436 1589099 1483860 2046839 2321073 2914069 2595900 1628515
3027 1628515 2746563 3893219 3600770 3926518 4694237 5038817 4256789 3993755 5289126
$$ packed form
3095C872501l04447j1967n54473j618927K55036N4093K42906P48013J71492o87877
3085B166350m12576P84926n33591J08555J789108J324886J004227p26198j322493
3076D183194N81480p31946Q20052K8218r10983P25011m92488r39344j90995n69000
3066B503199q76600P01743l51164J453920O31131j259040q93446m44179J045149
3057B510713Q36659K84601n29405o95019J30647k73967q7509M30616J028949J768400
3047E404685m6205j9278P1059q97266j080863j085382L19781K697138N47362k351598
3037C559433j380175p47616J36794K0663j05239N62979K74234N92996l18169r67385
3027A628515J118048J146656k92449L25748P67719L44580p82028k63034J295371
$$ plain form
3018 5289126 5507521 4536469 4559621 3340114 3017649 4207311 5360116 5078722 4539997
3009 4539997 5300368 4903288 4305379 4419033 5350025 5841601 5307721 6659281 5929685
3000 5929685 3434328 2836332 1869645 2475066 3701078 4454499 4661102 4574935 4555063 4122663
2990 4122663 4071120 2926433 3724647 4442639 4514296 5910017 5987882 6444600 5650837 5694250
2980 5694250 6097968 6389516 6202422 6361680 5991091 5631579 6091682 6052939 7034678 7542080
2970 7542080 7305301 6989245 8558964 8388935 5846878 6007252 7694406 8633455 8991929
2961 8991929 8718413 7311601 7478066 9674391 10755869 10666002 11837549 12654474 12100403
2952 12100403 11700211 11837515 11774623 10035812 10226982 11396377 10765443 10830165 10926687 10756867
$$ packed form
3018E289126K18395r71052K3152j219507l22465J189662J152805k81394n38725
3009D539997P60371l97080n97909J13654R30992M91576n33880J351560p29596
3000E929685k495357n97996r66687O05421J226012P53421K06603q6167j9872m32400
2990D122663n1543j144687P98214P17992P1657J395721P7865M56718p93763M3413
2980E694250M03718K91548j87094J59258l70589l59512M60103l8743R81739N07402
2970G542080k36779l16056J569719j70029k542057J60374J687154R39049L58474
2961H991929k73516j406812J66465K196325J081478q9867J171547Q16925n54071
2952A2100403m00192J37304o2892j738811J91170J169395o30934O4722R6522j69820
$$ plain form
2942 10756867 11521310 11409241 12630285 13851740 13758004 14236649 14850114 14360094 13656615
2933 13656615 13033572 13033580 12943989 13029433 12576753 10745709 10688972 11446316 11502139 11939380 11586214
2922 11586214 10125505 9559224 7825746 8376348 10177947 10436641 10145735 8717649 7584391
2913 7584391 8144476 6591988 5089261 6076919 5923924 6417363 6589675 5296752 4767563
2904 4767563 6145787 6487878 7251575 6558625 5833115 5925245 2887548 3555179 4453865
2895 4453865 3500618 2854296 3224863 4567610 4621479 2689468 1953539 1214157 1691551
2886 1691551 3391083 3807431 2801114 3831685 2933989 424378 609837 1045381 3233988
2877 3233988 2459133 2160133 3186100 2819325 3058517 3633274 2997318 4303083 4533476
$$ packed form
2942A0756867P64443j12069J221044J221455r3736M78645O13465m90020p03479
2933A3656615o23043Qq9591Q5444m52680j831044n6737P57344N5823M37241l53166
2922A1586214j460709n66281j733478N50602J801599K58694k90906j428086j133258
2913G584391N60085j552488j502727R87658j52995M93439J72312j292923n29189
2904D767563J378224L42091P63697o92950p25510R2130l037697O67631Q98686
2895D453865r53247o46322L70567J342747N3869j932011p35929p39382M77394
2886A691551J699532M16348j006317J030571q97696k509611J85459M35544K188607
2877C233988p74855k99000J025967l66775K39192N74757o35956J305765K30393
$$ plain form
2868 4533476 3509307 3532323 2085900 3081391 3517066 3177286 3767600 2525791 1324677
2859 1324677 2317475 2029080 2836843 3515859 2616057 3183083 2014976 2045567 1687985 956089
2849 956089 1370590 2217569 2065980 2221392 2069924 2983520 3567193 2738481 1446545 1318783
2839 1318783 2365590 3839215 3603082 4726557 5647508 4569332 3600157 1424518 2627103
2830 2627103 4648989 5510198 4262597 2525856 1498990 1681565 1431141 2331000 4373005
2821 4373005 4179640 3364373 2445413 3535883 4640735 3887271 4183743 5540710 3872802
2812 3872802 3493768 4419470 4461609 4024703 3100175 4161771 4005295 4839987 5166854 4079801
2802 4079801 3275037 4666278 5402791 5515258 6280886 6745548 6348116 6481676 8077573
$$ packed form
2868D533476j024169K3016j446423R95491M35675l39780N90314j241809j201114
2859A324677R92798k88395Q07763O79016q99802N67026j168107L0591l57582p31896
2849I56089M14501Q46979j51589J55412j51468R13596N83673q28712j291936j27762
2839A318783J046807J473625k36133J123475R20951j078176r69175k175639J202585
2830B627103K021886Q61209j247601j736741j026866J82575k50424Q99859K042005
2821D373005j93365q15267r18960J090470J104852p53464K96472J356967j667908
2812C872802l79034R25702M2139m36906r24528J061596j56476Q34692L26867j087053
2802D079801q04764J391241P36513J12467P65628M64662l97432J33560J595897
$$ plain form
2793 8077573 9042091 8674901 7112221 6742167 6487294 6810115 7390106 6274611 6391064
2784 6391064 6152283 5093373 5745795 5576518 6081162 6192369 5873454 6950349 7322105
2775 7322105 7503192 8045890 8362862 7862200 7117323 8152205 8785172 8037678 9114528
2766 9114528 10145511 9455144 8436408 8198486 9199674 10023072 9653872 9713456 9352775
2757 9352775 8394749 8881928 8030408 7610914 8099659 8017878 7237564 6176949 7847350
2748 7847350 8985625 7845944 8337952 9388513 9725751 8801129 7505563 8629616 8616574
2739 8616574 7882352 8698688 8504091 7471456 7921586 7415378 6760100 6485344 4716962
2730 4716962 5598113 4551483 3450489 5624091 6330104 6191141 6238136 5994780 5846646
$$ packed form
2793H077573R64518l67190j562680l70054k54873L22821N79991j115495J16453
2784F391064k38781j058910O52422j69277N04644J11207l18915J076895L71756
2775G322105J81087N42698L16972n00662p44877J034882O32967p47494J076850
2766I114528J030983o90367j018736k37922J001188Q23398l69200N9584l60681
2757I352775r58026M87179q51520m19494M88745q1781p80314j060615J670401
2748G847350J138275j139681M92008J050561L37238r24622j295566J124053j3042
2739H616574p34222Q16336j94597j032635M50130n06208o55278k74756j768382
2730D716962Q81151j046630j100994K173602P06013j38963M6995k43356j48134
$$ plain form
2721 5846646 6045056 6518426 6327355 5736011 6441945 8952224 8384524 6209985 6068528
2712 6068528 6146071 7181471 7536536 7976475 8914017 8308647 7142477 8344082 10262547
2703 10262547 11274264 11608003 11830676 13061633 15252291 18323839 21329464 22783751
2695 22783751 23088539 21418236 18716087 16584085 15056507 15585685 16082355 14471565 13499298
2686 13499298 12220377 13769345 13869997 14746384 18187171 18881246 19610572 20763475 20782233
2677 20782233 21802370 22976515 20611845 18253409 15601466 16246423 16403234 12319628
2669 12319628 12712964 14036680 14363062 15693221 14736670 15174138 15907735 14163667 14370204
2660 14370204 13696456 12764948 12577668 11577747 11953828 13737225 14166200 13362596 13218898
$$ packed form
2721E846646J98410M73370j91071n91344P05934K510279n67700k174539j41457
2712F068528P7543J035400L55065M39939R37542o05370j166170J201605J918465
2703A0262547J011717L33739K22673J230957K190658L071548L005625J454287
2695B2783751L04788j670303k702149k132002j527578N29178M96670j610790r72267
2686A3499298j278921J548968J00652Q76387L440787O94075P29326J152903J8758
2677B0782233J020137J174145k364670k358436k651943O44957J56811m083606
2669A2319628L93336J323716L26382J330159r56551M37468P33597j744068K06537
2660A4370204o73748r31508j87280r99921L76081J783397M28975q03604j43698
$$ plain form
2651 13218898 13294361 15579173 16511375 18817409 22292969 23082744 24995696 27142746 28959517
2642 28959517 32028663 33547091 34593454 34174933 31482236 28839104 26303154 24138417
2634 24138417 24162838 22948133 21203051 21352449 21578120 21868243 24048507 26662290 28532347
2625 28532347 30451643 30644695 33001233 34322442 34061065 32620457 30084497 28457839
2617 28457839 27585434 26224505 24520806 24689014 23526543 23940570 22357717 22028093 22715995
2608 22715995 22906982 23270966 22233933 21952426 20285605 18537193 17418579 18350113 18858932
2599 18858932 19383046 20181355 21637080 20908768 20860353 21920596 22227146 23828614 24436326
2590 24436326 24978651 26060603 26109684 25983431 25690992 24965198 26487171 27537221 27351975
$$ packed form
2651A3218898P5463K284812R32202K306034L475560P89775J912952K147050J816771
2642B8959517L069146J518428J046363m18521k692697k643132k535950k164737
2634B4138417K4421j214705j745082J49398K25671K90123K180264K613783J870057
2625B8532347J919296J93052K356538J321209k61377j440608k535960j626658
2617B8457839q72405j360929j703699J68208j162471M14027j582853l29624O87902
2608B2715995J90987L63984j037033k81507j666821j748412j118614R31534N08819
2599A8858932N24114P98309J455725p28312m8415J060243L06550J601468O07712
2590B4436326N42325J081952M9081j26253k92439p25794J521973J050050j85246
$$ plain form
2581 27351975 27822262 30214920 33387952 33659830 34336264 36696457 38944842 39985337 41274619
2572 41274619 44808101 48920784 53915880 57555739 60815109 64194563 67801678 71158028
2564 71158028 73381032 75309786 75217966 75640889 77063907 79608503 80773854 81312730 82415114
2555 82415114 81124199 83771511 86847955 88713089 91817528 95457752 100696279 105075543
2547 105075543 107464124 111059027 113170999 114948571 118480450 121881343 125725513 128850064
2539 128850064 131448315 133060584 134526011 136524484 141001726 142671435 144238660 146422176
2531 146422176 147749344 148127984 146937030 146252198 144843743 142017888 139859233 135997614
2523 135997614 130783311 128162909 125399918 122442400 119512495 115920538 113390402 113546455
$$ packed form
2581B7351975M70287K392658L173032K71878O76434K360193K248385J040495J289282
2572D1274619L533482M112683M995096L639859L259370L379454L607115L356350
2564G1158028K223004J928754r1820M22923J423018K544596J165351N38876J102384
2555H2415114j290915K647312L076444J865134L104439L640224N238527M379264
2547A05075543K388581L594903K111972J777572L531879L400893L844170L124551
2539A28850064K598251J612269J465427J998473M477242J669709J567225K183516
2531A46422176J327168L78640j190954o84832j408455k825855k158655l861619
2523A35997614n214303k620402k762991k957518k929905l591957k530136J56053
$$ plain form
2515 113546455 113806614 114768135 114414379 112640222 112825423 112958951 113216979 114486062 115856269
2506 115856269 116138011 117536632 118440645 120784927 121773670 120378846 120656682 120273199 119349177
2497 119349177 118508077 117957906 118228192 120082781 120497073 121594300 121617245 121649302 122000484
2488 122000484 122714047 123518515 124828852 126672227 126996892 126515919 126558836 128987422 131411707
2479 131411707 133756045 137460616 140152570 140904906 141364102 140900914 140072542 141225135 142221901
2470 142221901 142730352 144889877 148580980 154210061 160711754 167545472 175621416 184190723
2462 184190723 192339867 201572820 209515363 214889210 216968831 214330997 208862668 203673801
2454 203673801 197871989 189456581 181414272 172627612 164331420 157109126 148754194 142712880
$$ packed form
2515A13546455K60159R61521l53756j774157J85201J33528K58028J269083J370207
2506A15856269K81742J398621R04013K344282R88743j394824K77836l83483r24022
2497A19349177q41100n50171K70286J854589M14292J097227K2945L2057L51182
2488A22000484P13563Q04468J310337J843375L24665m80973M2917K428586K424285
2479A31411707K344338L704571K691954P52336M59196m63188q28372J152593R96766
2470A42221901N08451K159525L691103N629081O501693O833718Q075944Q569307
2462A84190723Q149144R232953P942543N373847K079621k637834n468329n188867
2454B03673801n801812q415408q042309q786660q296192p222294q354932o041314
$$ plain form
2446 142712880 139632055 136461705 134154397 132303335 128840776 127872666 126780618 126702168
2438 126702168 126730644 126738859 126466119 126341694 125559990 124073650 123133644 118705922 115053909
2429 115053909 110635247 105278904 102077719 98738510 94268919 89683622 87230230 84392635
2421 84392635 81062281 79769274 78781246 77330198 74864837 71769083 68510687 63473349
2413 63473349 60401067 56596035 52518392 51208824 48742119 47667080 46003747 45449691
2405 45449691 45727519 44060045 40982535 39234857 38085763 36886598 35682298 33701380
2397 33701380 33229511 31813109 31040196 32649962 32648104 31771714 31555067 31772608 32677151
2388 32677151 33454154 34859058 37751927 40095699 41900574 44021018 45094967 44072100
$$ packed form
2446A42712880l080825l170350k307308j851062l462559r68110j092048p8450
2438A26702168K8476Q215k72740j24425p81704j486340r40006m427722l652013
2429A15053909m418662n356343l201185l339209m469591m585297k453392k837595
2421H4392635l330354j293007r88028j451048k465361l095754l258396n037338
2413F3473349l072282l805032m077643j309568k466705j075039j663333n54056
2405D5449691K77828j667474l077510j747678j149094j199165j204300j980918
2397C3701380m71869j416402p72913J609766j858q76390k16647K17541R04543
2388C2677151P77003J404904K892869K343772J804875K120444J073949j022867
$$ plain form
2380 44072100 42803200 41566826 40970681 40449102 39587009 39205219 38258501 38022397 38040555
2371 38040555 35691883 33456706 34018326 34619638 33197879 33560748 33852013 31729738 29167192
2362 29167192 28888935 30670913 30640663 28966140 28104092 27408408 26281246 26910922 27059569
2353 27059569 27015723 27095536 27825327 29764898 31492580 35535055 38192585 37603810 38354288
2344 38354288 38247164 36800438 33538044 30769374 31036917 30621818 29171819 28270123 26353254
2335 26353254 25280442 24487915 22479040 21840709 21325236 21862814 22729209 23092962 24363770
2326 24363770 24732300 24718291 24763373 25117856 24572159 24623706 25233996 24870526 24977232 26937081
2316 26937081 29126676 29448443 31198771 31226081 32833401 33744264 32917648 31980383 29233539
$$ packed form
2380D4072100j268900j236374n96145n21579q62093l81790r46718k36104J8158
2371C8040555k348672k235177N61620O01312j421759L62869K91265k122275k562546
2362B9167192k78257J781978l0250j674523q62048o95684j127162O29676J48647
2353B7059569m3846P9813P29791J939571J727682M042475K657530n88775P50478
2344C8354288j07124j446726l262394k768670K67543m15099j449999r01696j916869
2335B6353254j072812p92527k008875o38331n15473N37578Q66395L63753J270808
2326B4363770L68530j4009M5082L54483n45697N1547O10290l63470J06706J959849
2316B6937081K189595L21767J750328K7310J607320R10863q26616r37265k746844
$$ plain form
2307 29233539 27902572 26568417 24181440 22018312 20972317 18546761 17757894 17350738
2299 17350738 18804253 19765565 18776433 18204314 17813959 20253828 22177006 23608617 25331618
2290 25331618 25141166 24874568 24351621 21702174 21082664 21224877 19190670 17180304 16667473
2281 16667473 17131915 17265920 17234025 15638057 14642404 14360341 13843851 13034452 13515446
2272 13515446 13854713 14088416 15170745 13678891 15883368 18419321 19056128 21621464 20606798
2263 20606798 21542735 23154373 22461477 22813054 23847448 23523567 25293916 27639589 27913405
2254 27913405 30605155 31386961 30267072 28941310 26049001 23028124 21822766 19891743
2246 19891743 18153184 19438329 20208461 18647852 18188284 17846477 16816574 16490961 14328733
$$ packed form
2307B9233539j330967j334155k386977k163128j045995k425556p88867m07156
2299A7350738J453515R61312r89132n72119l90355K439869J923178J431611J723001
2290B5331618j90452k66598n22947k649447o19510J42213k034207k010366n12831
2281A6667473M64442J34005l1895j595968r95653k82063n16490q09399M80994
2272A3515446L39267K33703J082329j491854K204477K535953O36807K565336j014666
2263B0606798R35937J611638o92896L51577J034394l23881J770349K345673K73816
2254B7913405K691750P81806j119889j325762k892309l020877j205358j931023
2246A9891743j738559J285145P70132j560609m59568l41807j029903l25613k162228
$$ plain form
2237 14328733 13365110 13060506 12393266 12717003 12759522 13671650 15409035 16626783 15659229
2228 15659229 15141237 13088417 10377654 9532166 8970693 8053177 8635151 8446821 7357948
2219 7357948 7778422 6900263 5952945 5512016 4582421 5073542 6147265 5540104 4741381
2210 4741381 3598940 2670097 3589139 5878220 5967859 5245238 5073641 4586958 4684553 4330555
2200 4330555 6043885 6244568 3660202 2221793 2933501 3314354 3250506 3669394 2694705
2191 2694705 3267161 4047674 3116173 1424022 1066241 4247379 4831402 3898707 4300898
2182 4300898 3663401 2480962 2536363 4024330 5727609 4264448 3396295 4581666 3696051
2173 3696051 3474210 4392957 4046973 3158503 2522333 2436034 4491887 4931990 3524766
$$ packed form
2237A4328733r63623l04604o67240L23737M2519R12128J737385J217748r67554
2228A5659229n17992k052820k710763q45488n61473r17516N81974j88330j088873
2219G357948M20474q78159r47318m40929r29595M91121J073723o07161p98723
2210D741381j142441r28843R19042K289081Q9639p22621j71597m86683R7595l53998
2200D330555J713330K00683k584366j438409P11708L80853o3848M18888r74689
2191B694705N72456P80513r31501j692151l57781L181138N84023r32695M02191
2182D300898o37497j182439N5401J487967J703279j463161q68153J185371q85615
2173C696051k21841R18747l45984q88470o36170q6299K055853M40103j407224
$$ plain form
2164 3524766 2987691 1468545 3076799 5214738 4576156 3697787 2534115 3244656 2464634
2155 2464634 1350991 3694078 4943317 4043579 3660906 3982869 4926609 2082363 1004652
2146 1004652 3152743 3014156 3534961 2450175 1464769 2732964 2880076 2036351 1248160
2137 1248160 1094289 1890839 2677165 2175356 3432995 4525318 3383436 2443674 2910714
2128 2910714 4013328 4254153 3400297 3087733 2680643 3066929 3650152 3721623 3758723 3058435
2118 3058435 5294532 4220832 1369544 2079363 372061 2112914 3277965 3163873 3083675
2109 3083675 1771136 2948652 2791286 2641806 3152761 3252803 2821477 3035245 5821145
2100 5821145 7871124 6413111 6185582 7703756 9737386 12043585 12903929 13465272 12288448
$$ packed form
2164C524766n37075j519146J608254K137939o38582q78369j163672P10541p80022
2155B464634j113643K343087J249239q99738l82673L21963R43740k844246j077711
2146A004652K148091j38587N20805j084786r85406J268195J47112q43725p88191
2137A248160j53871P96550P86326n01809J257639J092323j141882r39762M67040
2128B910714J102614K40825q53856l12564m07090L86286N83223P1471L7100p00288
2118C058435K236097j073700k851288P09819j707302J740853J165051j14092q0198
2109C083675j312539J177516j57366j49480N10955J00042m31326K13768K785900
2100E821145K049979j458013k27529J518174K033630K306199Q60344N61343j176824
$$ plain form
2091 12288448 10957519 9088213 6433003 5053338 4632564 3327618 3282906 4749473 4500589
2082 4500589 4284858 3256681 4447120 5347035 4120130 4518903 5014551 4760872 4475470
2073 4475470 4329080 5313758 4210686 2846228 4131114 5033468 4568302 3507437 4011695
2064 4011695 4752000 2349140 2975951 3403950 3810552 5218582 4210012 2949080 3412830
2055 3412830 3610343 3280069 2769270 3179582 6275521 6372818 4187868 3714546 4696548
2046 4696548 4823409 2848598 2535180 5510560 6084231 4563027 4745043 4311656 3692769
2037 3692769 4019308 4691901 5153503 5469787 6405598 6112334 5747344 6226940 6042572 4320091
2027 4320091 5115050 5734733 6102875 5051477 5471056 5586963 4420184 3948503 4035668
$$ packed form
2091A2288448j330929j869306k655210j379665m20774j304946m4712J466567k48884
2082D500589k15731j028177J190439Q99915j226905L98773M95648k53679k85402
2073D475470j46390R84678j103072j364458J284886R02354m65166j060865N04258
2064D011695P40305k402860O26811M27999M06602J408030j008570j260932M63750
2055C412830J97513l30274n10799M10312L095939R7297k184950m73322R82002
2046D696548J26861j974811l13418K975380N73671j521204J82016m33387o18887
2037C692769L26539O72593M61602L16284R35811k93264l64990M79596j84368j722481
2027D320091P94959O19683L68142j051398M19579J15907j166779m71681Q7165
$$ plain form
2018 4035668 5042293 5242798 5491107 5739954 5852660 6170546 6962872 7785678 7088942
2009 7088942 6808101 7921211 8018399 7258803 6660184 6161649 5888385 6530968 6447604 5158828
1999 5158828 5027041 5623573 5957383 6661787 6786546 6808273 7279135 8192173 8858759 8553147
1989 8553147 7904651 8702167 8439691 8201506 9585533 9859190 10857282 12254586 11655338
1980 11655338 11481184 11594490 11219762 10421854 11123869 11280657 12742905 13265657 12927403
1971 12927403 11903993 10993550 9365218 8424105 8967343 9417815 9264574 8383265 9613386
1962 9613386 9829570 7803330 7332207 9450082 10550600 9846704 9653384 10726012 11530942
1953 11530942 13439408 13709207 12640755 13988037 15005374 16168397 16205381 16755605 18772978
$$ packed form
2018D035668J006625K00505K48309K48847J12706L17886P92326Q22806o96736
2009G088942k80841J113110R7188p59596n98619m98535k73264O42583q3364j288776
1999E158828j31787N96532L33810P04404J24759K1727M70862R13038O66586l05612
1989H553147o48496P97516k62476k38185J384027K73657R98092J397304n99248
1980A1655338j74154J13306l74728p97908P02015J56788J462248N22752l38254
1971A2927403j023410r10443j628332r41113N43238M50472j53241q81309J230121
1962I613386K16184k026240m71123K117875J100518p03896j93320J072628Q04930
1953A1530942J908466K69799j068452J347282J017337J163023L6984N50224K017373
$$ plain form
1944 18772978 19087668 19132191 20679602 22906608 25638549 28853338 31230372 35542061 39125681
1935 39125681 42724262 49251305 54699387 59271075 65144553 69650675 74294687 79127657
1927 79127657 83616387 87133109 90263983 93298874 93914162 90316123 86334728 84125690
1919 84125690 79538632 76233389 73811791 68127847 62838177 56949542 50700229 45463541
1911 45463541 41119735 37937432 33878582 30639392 27406369 23956179 22229592 19717304
1903 19717304 18635058 17584743 16482751 16163483 14502206 13008337 13673849 12818658 12494309
1894 12494309 13573954 12633673 12882001 13329613 12580138 13872275 14419265 13425361 14610499
1885 14610499 13694946 11647974 12268994 11973556 10344080 10562657 10984046 11765582 10709023
$$ packed form
1944A8772978L14690M4523J547411K227006K731941L214789K377034M311689L583620
1935C9125681L598581O527043N448082M571688N873478M506122M644012M832970
1927G9127657M488730L516722L130874L034891O15288l598039l981395k209038
1919H4125690m587058l305243k421598n683944n289670n888635o249313n236688
1911D5463541m343806l182303m058850l239190l233023l450190j726587k512288
1903A9717304j082246j050315j101992l19268j661277j493869O65512q55191l24349
1894A2494309J079645r40281K48328M47612p49475J292137N46990r93904J185138
1885A4610499r15553k046972O21020k95438j629476K18577M21389P81536j056559
$$ plain form
1876 10709023 9583979 10460920 9476083 9376516 10820783 11801864 11474673 12131787 12692317
1867 12692317 11342115 11304781 12235917 14033772 14100096 13898739 14867231 14813896 13777881
1858 13777881 14265863 14844341 15684232 17373439 19046023 19757994 19996137 20581321 20023379
1849 20023379 21066948 22373330 23591889 25372290 25995387 27714647 30015988 29831027
1841 29831027 29325761 29333897 29969102 33176696 34934226 34765592 35040946 36169300 37816989
1832 37816989 39031190 40275328 41567488 43946079 45547947 45035915 46707686 48575240
1824 48575240 49929377 52113083 53122913 53698739 55579729 56587535 57148979 58901879
1816 58901879 59289492 61093744 61875916 62914859 66479852 69578750 70985171 72508383
$$ packed form
1876A0709023j125044Q76941r84837r9567J444267R81081l27191O57114N60530
1867A2692317j350202l7334R31136J797855O6324k01357R68492n3335j036015
1858A3777881M87982N78478Q39891J689207J672584P11971K38143N85184n57942
1849B0023379J043569J306382J218559J780401O23097J719260K301341j84961
1841B9831027n05266Q136O35205L207594J757530j68634K75354J128354J647689
1832C7816989J214201J244138J292160K378591J601868n12032J671771J867554
1824D8575240J354137K183706J009830N75826J880990J007806N61444J752900
1816E8901879L87613J804252P82172J038943L564993L098898J406421J523212
$$ plain form
1808 72508383 72887281 74496861 78016899 80459907 84139022 88590178 91549876 93684926
1800 93684926 94945336 94757611 95198781 95342534 95674064 96349702 97364184 97340738 96598998
1791 96598998 96552582 97758911 98952194 99251220 101353964 102678709 103006686 104351523 106086437
1782 106086437 107558484 109909189 113605476 117075127 120767183 124834879 129948532 134952107
1774 134952107 139296758 143361713 146675760 149379415 152118749 155693529 158256832 159078120
1766 159078120 159799105 160782575 160828264 161604399 163787491 165094722 164018108 162567227 164995639
1757 164995639 165898566 164840975 166516775 167983879 169349825 170222665 168711637 168441892
1749 168441892 168943636 167979536 165341761 162978871 162685628 163823270 163353851 164324375 166500713
$$ packed form
1808G2508383L78898J609580L520038K443008L679115M451156K959698K135050
1800I3684926J260410j87725M41170J43753L31530O75638J014482k3446p41740
1791I6598998m6416J206329J193283K99026K102744J324745L27977J344837J734914
1782A06086437J472047K350705L696287L469651L692056M067696N113653N003575
1774A34952107M344651M064955L314047K703655K739334L574780K563303Q21288
1766A59078120P20985R83470M5689P76135K183092J307231j076614j450881K428412
1757A64995639R02927j057591J675800J467104J365946Q72840j511028k69745
1749A68441892N01744r64100k637775k362890k93243J137642m69419R70524K176338
$$ plain form
1740 166500713 168559639 170606077 171781979 172814425 174214866 174234315 172291572 169600761
1732 169600761 166843998 164310294 161852248 160255113 157321739 153605043 148561781 141912484
1724 141912484 136302712 131338548 126555323 122740352 122263346 123143183 122742453 122797905 123435144
1715 123435144 124392000 124899051 125865683 127176323 127412704 126644827 126642622 123532455 120251854
1706 120251854 118363061 116477067 117653242 117754164 116317459 116014631 115935949 114135279 109754937
1697 109754937 105048479 100961173 97279306 93593032 90543598 86607335 86991591 88067952
1689 88067952 87058788 84991186 83066665 82055233 79489397 78159306 76925253 75967227
1681 75967227 75023939 73274119 70635890 67969433 66083504 63545354 62690268 61054337
$$ packed form
1740A66500713K058926K046438J175902J032446J400441J9449j942743k690811
1732A69600761k756763k533704k458046j597135k933374l716696n043262o649297
1724A41912484n609772m964164m783225l814971m77006Q79837m00730N5452O37239
1715A23435144R56856N07051R66632J310640K36381p67877k205l110167l280601
1706A20251854j888793j885994J176175J00922j436705l02828p8682j800670m380342
1697A09754937m706458m087306l681867l686274l049434l936263L84256J076361
1689H8067952j009164k067602j924521j011432k565836j330091j234053r58026
1681G5967227r43288j749820k638229k666457j885929k538150q55086j635931
$$ plain form
1673 61054337 58352771 55516675 52343621 49104762 46580553 44822368 43134744 41160517
1665 41160517 41329702 40757156 38120160 37963510 36711164 35566995 33957948 34292563 34305289
1656 34305289 32630897 31262100 29267971 27695737 27380932 27761642 27244729 25365477 24332677
1647 24332677 22853638 22110422 21593893 19979239 19911643 20233337 18741186 18385306 18279874
1638 18279874 17280865 17458239 18032719 18957208 18125700 16690649 16863050 16545301 15607656
1629 15607656 16275391 16665493 17317330 16919951 15031700 14887637 13384597 14111618 14493125
1620 14493125 14548004 15376082 13859279 12340516 11946722 10135806 10551082 12230237 10395026
1611 10395026 11855752 13037005 13503375 12207935 9841485 9651158 10284632 11138479 11859756
$$ packed form
1673F1054337k701566k836096l173054l238859k524209j758185j687624j974227
1665D1160517J69185n72546k636996j56650j252346j144169j609047L34615J2726
1656C4305289j674392j368797j994129j572234l14805L80710n16913j879252j032800
1647B4332677j479039p43216n16529j614654o7596L21694j492151l55880j05432
1638A8279874r99009J77374N74480R24489q31508j435051J72401l17749r37645
1629A5607656O67735L90102O51837l97379j888251j44063j503040P27021L81507
1620A4493125N4879Q28078j516803j518763l93794j810916M15276J679155j835211
1611A0395026J460726J181253M66370j295440k366450j90327O33474Q53847P21277
$$ plain form
1602 11859756 11094109 10251845 9827807 9424633 9433133 9095610 9190895 9547407 9208643 11057561
1592 11057561 10662304 9777118 11011182 9519080 10340095 11772111 11610786 10610735 10251950
1583 10251950 9337090 9625067 10154645 9996369 10979799 9583656 9181795 9448913 9565262
1574 9565262 9623748 10039757 10944983 11837025 11721502 11460752 11360401 10516480 10165887 10901533
1564 10901533 12775048 12476415 12173196 11123442 11055542 10521649 10018429 11098245 11813487
1555 11813487 14710340 14811736 11938427 11592658 13331537 14527493 14552923 13677662 14615908
1546 14615908 16705540 16609178 15400345 15353290 16606513 18195768 18227640 17773357 18818593
1537 18818593 19436094 19911497 20273222 21133273 23145253 24236515 25307482 26011582 26983768
$$ packed form
1602A1859756p65647q42264m24038m03174Q500l37523R5285L56512l38764J848918
1592A1057561l95257q85186J234064j492102Q21015J432016j61325j000051l58785
1583A0251950r14860K87977N29578j58276R83430j396143m01861K67118J16349
1574I565262N8486M16009R05226Q92042j15523k60750j00351q43921l50593P35646
1564A0901533J873515k98633l03219j049754o7900n33893n03220J079816P15242
1555A1813487K896853J01396k873309l45769J738879J195956K5430q75261R38246
1546A4615908K089632r6362j208833m7055J253223J589255L1872m54283J045236
1537A8818593O17501M75403L61725Q60051K011980J091262J070967P04100R72186
$$ plain form
1528 26983768 28704876 28127076 30674759 33659183 36066238 38369507 39320279 40005140 42433041
1519 42433041 45397135 48831024 52904162 54964159 56870094 59821702 62590976 64280446
1511 64280446 67277155 68495387 70455335 73407672 77945273 83151086 84418711 84656344
1503 84656344 85992046 89250513 91159389 91366828 92254107 92630632 92972543 92821389 89280304
1494 89280304 86459492 85683315 83121673 82494167 80643899 77913136 77404805 74224183 71179101
1485 71179101 69891142 67137544 63918270 60360963 57769179 56792778 54978221 51919728
1477 51919728 50225137 46687007 44739738 44710972 44458092 43576651 41822847 40629055 41042381
1468 41042381 41784143 43508371 45657502 46137346 48305513 49225777 50873081 53288081 54826326
$$ packed form
1528B6983768J721108n77800K547683K984424K407055K303269R50772O84861K427901
1519D2433041K964094L433889M073138K059997J905935K951608K769274J689470
1511F4280446K996709J218232J959948K952337M537601N205813J267625K37633
1503H4656344J335702L258467J908876K07439Q87279L76525L41911j51154l541085
1494H9280304k820812p76177k561642o27506j850268k730763n08331l180622l045082
1485G1179101j287959k753598l219274l557307k591784r76401j814557l058493
1477E1919728j694591l538130j947269k8766k52880q81441j753804j193792M13326
1468D1042381P41762J724228K149131M79844K168167R20264J647304K415000J538245
$$ plain form
1459 54826326 58210549 61019744 61670908 61988599 62479974 62785791 65700513 67403829 68496021
1450 68496021 70144728 70160961 71363443 70223799 68749629 68748432 68358534 68463183 69331060
1441 69331060 67639662 65484837 63735028 61769907 60501491 58611991 58014103 57188296
1433 57188296 55563016 52639794 50150604 48144491 46705804 45491239 43249579 42392074
1425 42392074 41589302 41670038 39223656 37884698 38461795 36923484 36943501 37276418 37821366
1416 37821366 39642669 38754791 38592987 40451405 39987253 41507805 42722548 43950614 46009420
1407 46009420 46927797 46744353 47315540 48729757 47643668 47599478 48520045 50175473 50628829
1398 50628829 50112979 51643641 53585688 55088256 55810001 57206143 58820427 58886282 58247448
$$ packed form
1459E4826326L384223K809195O51164L17691M91375L05817K914722J703316J092192
1450F8496021J648707J6233J202482j139644j474170j197l89898J04649Q67877
1441F9331060j691398k154825j749809j965121j268416j889500n97888q25807
1433E7188296j625280k923222k489190k006113j438687j214565k241660q57505
1425D2392074q02772Q0736k446382j338958N77097j538311K0017L32917N44948
1416C7821366J821303q87878j61804J858418m64152J520552J214743J228066K058806
1407D6009420R18377j83444N71187J414217j086089m4190R20567J655428M53356
1398E0628829n15850J530662J942047J502568P21745J396142J614284O5855o38834
$$ plain form
1389 58247448 56780909 56724085 57354695 56728581 54498244 53274361 51467756 49615846 48011887
1380 48011887 47015512 47056100 45163441 44269978 42074172 39825733 38584379 37560427 36695031
1371 36695031 36506065 35241239 34905196 33189020 31378112 31726838 30912371 30802300 32504573
1362 32504573 33340993 32511845 33418193 34069226 35224426 36770039 38062683 39945626 40449691
1353 40449691 40766973 44148677 47381692 49657063 53704534 56940819 58901878 59803778
1345 59803778 61184856 62036794 63384804 65724374 67976253 68446726 68239934 68772295 68247725
1336 68247725 67119522 65483644 64657353 63396279 64158920 65249092 65268058 64221801 64547555
1327 64547555 65837357 64018525 62147909 61643283 60078401 60164193 60169397 60165293 59760403 58455569
$$ packed form
1389E8247448j466539n6824O30610o26114k230337j223883j806605j851910j603959
1380D8011887r96375M0588j892659q93463k195806k248439j241354j023952q65396
1371C6695031j88966j264826l36043j716176j810908L48726q14467j10071J702273
1362C2504573Q36420q29148R06348O51033J155200J545613J292644J882943N04065
1353D0449691L17282L381704L233015K275371M047471L236285J961059R01900
1345E9803778J381078Q51938J348010K339570K251879M70473k06792N32361n24570
1336F8247725j128203j635878q26291j261074P62641J090172J8966j046257L25754
1327F4547555J289802j818832j870616n04626j564882Q5792N204m104m04890j304834
$$ plain form
1317 58455569 57988595 57124613 55225964 54669201 53266753 50146968 49359349 49524035 48702153
1308 48702153 46439732 45823545 45266173 45064402 46151118 47764440 49562437 50974930 52456349
1299 52456349 53554112 54418456 55743476 57828589 58174843 60128004 63327145 66272876
1291 66272876 67256482 67515399 68011469 69379837 70296852 69005813 68392445 66674301 66673207
1282 66673207 66615241 63809587 60324593 59120397 56934724 56385231 56749101 57124574 58469866
1273 58469866 59578822 61057492 64449942 67091319 68143341 70482862 71266067 71866029
1265 71866029 72692887 74017624 76668100 78258908 77093380 75564372 73778890 69970877
1257 69970877 68042464 65861747 62448113 61095373 59507686 57753129 56586119 57055893
$$ packed form
1317E8455569m66974q63982j898649n56763j402448l119785p87619J64686q21882
1308D8702153k262421o16187n57372k01771J086716J613322J797997J412493J481419
1299E2456349J097763Q64344J325020K085113L46254J953161L199141K945731
1291F6272876R83606K58917M96070J368368R17015j291039o13368j718144j094
1282F6673207n7966k805654l484994j204196k185673n49493L63870L75473J345292
1273E8469866J108956J478670L392450K641377J052022K339521P83205N99962
1265G1866029Q26858J324737K650476J590808j165528j529008j785482l808013
1257F9970877j928413k180717l413634j352740j587687j754557j167010M69774
$$ plain form
1249 57055893 59435105 61567618 64266896 66360446 67041210 65431715 64074147 64356744
1241 64356744 62524605 59026289 57862037 55543549 53450146 52167866 51240217 52348302
1233 52348302 51737495 51334198 51263556 50237244 49958280 50172368 47621726 47319190 47432528
1224 47432528 48255301 47895391 47138976 48945074 49824902 49600059 50288855 53329097 55252905
1215 55252905 58935215 62693108 65199536 67036320 68634160 70581616 72945858 76461592
1207 76461592 79557016 81876645 82939801 84074895 86290811 88245570 90255701 95168355
1199 95168355 101290528 108860558 117078804 123428110 132063059 141539516 148677986 155433236
1191 155433236 160407819 161463996 161635251 158768488 153169062 147559236 139800431 131799393
$$ packed form
1249E7055893K379212K132513K699278K093550O80764j609495j357568K82597
1241F4356744j832139l498316j164252k318488k093403j282280r27649J108085
1233E2348302o10807m03297p0642j026312k78964K14088k550642l02536J13338
1224D7432528Q22773l59910p56415J806098Q79828k24843O88796L040242J923808
1215E5252905L682310L757893K506428J836784J597840J947456K364242L515734
1207G6461592L095424K319629J063156J135094K215916J954759K010131M912654
1199I5168355O122173P570030Q218246O349306Q634949R476457P138470O755250
1191A55433236M974583J056177J71255k866763n599426n609826p758805q001038
$$ plain form
1183 131799393 125371460 119898734 115874783 110456744 103947911 98251052 94983006 90174670
1175 90174670 84025203 79098965 75614608 73138026 69039997 65152830 62908840 60393694
1167 60393694 57520631 55194879 52842818 51647843 48993838 47050573 45362941 44235037
1159 44235037 43111585 41870797 41843657 42334385 42142737 41439258 41146827 40377891 40050898
1150 40050898 39483256 39915520 40163126 39943010 39370375 37594343 36762331 37483631 37053151
1141 37053151 36714515 37259767 37247842 38092495 38163076 38462266 38458539 38304257 39301782 40964833
1131 40964833 40783661 40294131 41209090 41936949 42810115 44354189 43418318 44422473 45134796
1122 45134796 44430564 44264017 42509378 42690141 42124779 40363425 41323944 43139283 43369707
$$ packed form
1183A31799393o427933n472726m023951n418039o508833n696859l268046m808336
1175I0174670o149467m926238l484357k476582m098029l887167k243990k515146
1167F0393694k873063k325752k352061j194975k654005j943265j687632j127904
1159D4235037j123452j240788k7140M90728j91648p03479k92431p68936l26993
1150D0050898n67642M32264K47606k20116n72635j776032q32012P21300m30480
1141C7053151l38636N45252j1925Q44653P0581K99190l727j54282R97525J663051
1131D0964833j81172m89530R14959P27859Q73166J544074r35871J004155P12323
1122D5134796p04232j66547j754639J80763n65362j761354R60519J815339K30424
$$ plain form
1113 43369707 43700104 44279524 43777580 43413261 42624504 42788814 44048187 43134202 43288260
1104 43288260 42618224 40894931 42085154 43883460 44420731 45678240 46807588 47393438 47807844
1095 47807844 47737584 49612249 50834684 51052852 52101555 52856758 52604625 52553284 52811065
1086 52811065 51653291 51567911 51759849 52486172 53604366 54442775 55285992 58086428 61424055
1077 61424055 63567738 64244816 61881258 59208750 56424062 51063706 47850225 44556590
1069 44556590 43255406 43684859 42370134 43018918 43082133 42151053 42110060 41787691 43099402
1060 43099402 45552172 46094643 47292008 47146267 47367277 47745048 47831107 48724511 48756297
1051 48756297 48726388 48648435 49530694 51004542 52025167 53416365 54616097 55821886 59423308
$$ packed form
1113D3369707L30397N79420n01944l64319p88757J64310J259373r13985J54058
1104D3288260o70036j723293J190223J798306N37271J257509J129348N85850M14406
1095D7807844p0260J874665J222435K18168J048703P55203k52133n1341K57781
1086E2811065j157774q5380J91938P26323J118194Q38409Q43217K800436L337627
1077F1424055K143683O77078k363558k672508k784688n360356l213481l293635
1069D4556590j301184M29453j314725O48784O3215r31080m0993l22369J311711
1060D3099402K452770N42471J197365j45741K21010L77771Q6059Q93404L1786
1051D8756297k9909p7953Q82259J473848J020625J391198J199732J205789L601422
$$ plain form
1042 59423308 63431135 67254149 72540868 75814265 77769720 78886147 79279569 81824778
1034 81824778 84965202 88383588 93034942 94718773 93954286 92152833 89037867 87993313
1026 87993313 86550019 84344677 82676681 79729904 76482946 74604464 73429661 70312027
1018 70312027 67091107 65401526 64894488 64596572 64846491 66492798 67658396 70240648 74164361
1009 74164361 78931786 79849829 82798880 87488924 91758473 94869537 99371505 105949416
1001 105949416 114061359 126126536 144294364 170529251 201815122 241616219 282946525
994 282946525 314578187 330923001 330439850 314455598 288993210 263503006 243585817
987 243585817 227290447 211632398 199547210 187687505 178892478 175122653 177058130 182374201
$$ packed form
1042E9423308M007827L823014N286719L273397J955455J116427L93422K545209
1034H1824778L140424L418386M651354J683831p64487j801453l114966j044554
1026H7993313j443294k205342j667996k946777l246958j878482j174803l117634
1018G0312027l220920j689581n07038k97916K49919J646307J165598K582252L923713
1009G4164361M767425R18043K949051M690044M269549L111064M501968O577911
1001A05949416Q111943J2065177J8167828K6234887L1285871L9801097M1330306
994B82946525L1631662J6344814m83151j5984252k5462388k5490204j9917189
987B43585817j6295370j5658049j2085188j1859705q795027l769825J935477N316071
$$ plain form
979 182374201 188959088 198041740 202093623 199674735 195393104 193743988 196265741 205401984
971 205401984 221974824 247320854 277613328 307441855 329498958 336537709 325956698
964 325956698 305414963 280036338 258017168 243451137 234572241 227237487 224051335 222876359
956 222876359 222305871 221130923 220255145 221544919 223107438 223099888 222414441 222079735 222311779
947 222311779 224113542 225299974 224599357 220940610 214490758 203978638 193003039 183987119
939 183987119 178996429 176401127 174371210 176842993 181374822 192289163 206588139 221958895
931 221958895 238142015 254914027 274819520 298371272 324866115 355668146 389051990
924 389051990 416788371 438864736 450504480 455399895 456949508 454776346 446081822 427899109
$$ packed form
979A82374201O584887R082652M051883k418888m281631j649116K521753R136243
971B05401984J6572840K5346030L0292474K9828527K2057103P038751j0581011
964C25956698k0541735k5378625k2019170j4566031q878896p334754l186152j174976
956B22876359n70488j174948q75778J289774J562519p550o85447l34706K32044
947B22311779J801763J186432p00617l658747o449852j0512120j0975599r015920
939A83987119m990690k595302k029917K471783M531829J0914341J4298976J5370756
931B21958895J6183120J6772012J9905493K3551752K6494843L0802031L3383844
924C89051990K7736381K2076365J1639744M895415J549613k173162q694524j8182713
$$ plain form
916 427899109 396454716 359198802 318690629 279481434 246058995 216748939 190920378
909 190920378 168831258 150015287 136707814 125810257 116986551 110494409 102976332 96036501
901 96036501 90046063 86733986 85986993 82868223 80989900 79546275 76141451 76228937 77403304
892 77403304 77407739 77806239 78239898 80419514 82230662 82590167 84035255 85447378 84997729
883 84997729 85381990 84207536 82911428 82831832 82704103 84911602 87168194 90454481 92962034
874 92962034 94819117 96035510 98481492 97728436 96565030 96111051 94343128 93972484 92236151
865 92236151 88218244 86042434 82547264 80650813 79668071 79177819 80331065 79281570 77937985
856 77937985 76760291 76738856 77637559 77114375 77033041 76828161 78675001 82605770 87217145
$$ packed form
916D27899109l1444393l7255914m0508173l9209195l3422439k9310056k5828561
909A90920378k2089120j8815971j3307473j0897557q823706o492142p518077o939831
901I6036501n990438l312077p46993l118770j878323j443625l404824Q7486J174367
892G7403304M435L98500M33659K179616J811148L59505J445088J412123m49649
883H4997729L84261j174454j296108p9596j27729K207499K256592L286287K507553
874I2962034J857083J216393K445982p53056j163406m53979j767923l70644j736333
865I2236151m017907k175810l495170j896451r82742m90252J153246j049495j343585
856G7937985j177694k1435Q98703n23184q1334k04880J846840L930769M611375
$$ plain form
847 87217145 93519445 103423382 116357002 126572933 131811089 130790405 123265598 113993185
839 113993185 104790997 97117764 89954582 83429236 79748847 76111268 73074380 73265587
831 73265587 73482642 72182901 73894270 74729137 77270040 80136072 84349420 93709562 105180887
822 105180887 118615183 138179214 159224532 178262778 193488753 198572928 197921014 189351094
814 189351094 174730314 160373166 143947131 128706825 114608937 101073411 88900453
807 88900453 80930382 73503192 65786633 60024893 54925891 50871799 48364234 45497008
799 45497008 43647856 42392983 39873638 38583902 37359131 37364955 35549625 34397594 35675764
790 35675764 36712237 36523459 35346939 36003446 35612755 35864562 36758424 35504976 34449538
$$ packed form
847H7217145O302300R903937J2933620J0215931N238156j020684p524807r272413
839A13993185r202188p673233p163182o525346l680389l637579l036888J91207
831G3265587K17055j299741J711369Q34867K540903K866032M213348R360142J1471325
822A05180887J3434296J9564031K1045318J9038246J5225975N084175o51914q569920
814A89351094j4620780j4357148j6426035j5240306j4097888j3535526j2172958
807H8900453p970071p427190p716559n761740n099002m054092k507565k867226
799D5497008j849152j254873k519345j289736j224771N824j815330j152031J278170
790C5675764J036473j88778j176520O56507l90691K51807Q93862j253448j055438
$$ plain form
781 34449538 34127689 35786939 36942133 38431602 39540025 39649571 39539703 41105340 42390279
772 42390279 44228363 48132148 51144556 53550784 54644300 58197400 62067504 66367117
764 66367117 71877216 80040955 91799912 104498584 118939405 139733807 165859604 194009031
756 194009031 224806132 248818275 265541267 271610041 266477606 255324026 242720248
749 242720248 235319054 233431675 237821511 245656969 256933544 263966382 263680886 256311617
741 256311617 238066980 213680886 187761757 163903532 141875266 123172923 106216983
734 106216983 92645165 82476878 73841855 66270457 59511828 53724563 49696312 48259469
726 48259469 47489485 48369061 47937203 46617558 47621874 48241178 48304123 46890939 42745373
$$ packed form
781C4449538l21849J659250J155194J489469J108423J09546j09868J565637J284939
772D2390279J838084L903785L012408K406228J093516L553100L870104M299613
764F6367117N510099Q163739J1758957J2698672J4440821K0794402K6125797K8149427
756A94009031L0797101K4012143J6722992O068774n132435j1153580j2603778
749B42720248p401194j887379M389836P835458J1276575P032838k85496p369269
741B56311617j8244637k4386094k5919129k3858225k2028266j8702343j6955940
734A06216983j3571818j0168287q635023p571398o758629n787265m028251j436843
726D8259469p69984Q79576m31858j319645J004316O19304O2945j413184m145566
$$ plain form
717 42745373 40114904 38397177 35363680 33520932 31220075 27713147 26003110 25143069
709 25143069 24695925 22584000 21187724 20142461 18175440 17210020 17155893 15863775 14990972
700 14990972 16768071 16013767 15723825 15219204 14450538 15074605 14580582 15182020 14371920
691 14371920 12918224 13004308 13597460 12161101 12507911 11639884 11373860 11820439 10733515
682 10733515 12147237 12166222 9351021 8630961 10222396 9906012 9990862 9891464 9189555 8889056
672 8889056 8360731 9215745 9352078 9366266 9460718 8506766 7656554 8641713 9298731 7026352
662 7026352 6731736 7451832 6915494 5076069 4773401 5769832 7627284 7660761 5884790
653 5884790 6761610 6315439 6975507 7867000 7174330 6268600 6274484 6725801 6194771 6545239
$$ packed form
717D2745373k630469j717727l033497j842748k300857l506928j710037q60041
709B5143069m47144k111925j396276j045263j967021r65420n4127j292118q72803
700A4990972J777099p54304k89942n04621p68666O24067m94023O01438q10100
691A4371920j453696Q6084N93152j436359L46810q68027k66024M46579j086924
682A0733515J413722J8985k815201p20060J591435l16384Q4850r9398p01909l00499
672H889056n28325Q55014J36333J4188R4452r53952q50212R85159O57018k272379
662G026352k94616P20096n36338j839425l02668R96431J857452L3477j775971
653E884790Q76820m46171O60068Q91493o92670r05730N884M51317n31030L50468
$$ plain form
643 6545239 4740980 5116946 4249008 5072948 5931532 4865700 5013957 6001871 5540889
634 5540889 4996542 5550428 5469130 5289423 4693075 6454770 7666859 6430369 4372982
625 4372982 5581190 6000842 4104337 3967586 2710689 2964124 3025336 2934648 2912032 2568277
615 2568277 4201040 3896474 3201774 3298520 4298990 3030328 1177234 1808495 3431837
606 3431837 4727023 3812519 2424519 1054293 702794 1785026 2123733 1734504 2573245
597 2573245 3951839 4330265 3677497 1630473 1810988 1390597 2254570 2791085 2704835 2146300
587 2146300 3185051 3425831 2797719 2282445 1576693 189805 -916314 1165549 1602250
578 1602250 1426970 133918 1024441 1997660 1480207 1620779 1519754 1666194 1765056 2571713
$$ packed form
643F545239j804259L75966q67938Q23940Q58584j065832J48257R87914m60982
634E540889n44347N53886q1298j79707n96348J761695J212089j236490k057387
625D372982J208208M19652j896505j36751j256897K53435O1212r0688k2616l43755
615B568277J632763l04566o94700R6746J000470j268662j853094O31261J623342
606C431837J295186r14504j388000j370226l51499J082232L38707l89229Q38741
597B573245J378594L78426o52768k047024J80515m20391Q63973N36515q6250n58535
587B146300J038751K40780o28112n15274p05752j386888j106119K081863M36701
578A602250j75280j293052Q90523R73219n17453J40572j01025J46440R8862Q06657
$$ plain form
568 2571713 3217068 4453456 3908660 2273075 1101781 1025419 2489535 2539142 2939609
559 2939609 2301948 992456 1350178 1179657 -160741 -336600 -59379 460627 498808 35447
549 35447 128073 1032385 1086419 2209745 1834160 1697808 2550734 2509313 2034654 2105016 2063763
538 2063763 1243836 1277070 520318 1517743 1666844 -266924 27517 948043 694547 612412
528 612412 483725 399544 -369285 -543418 852020 945794 286604 611241 460988 1868753
518 1868753 2364569 1151465 215259 -164991 1214444 1863103 1335208 518918 518190 -93418
508 -93418 -215990 937990 1735752 1647978 203047 554794 1654026 1084674 575886 1363855
498 1363855 504728 -59538 330021 846499 -503296 -1755342 -1263460 -1083507 -263335
$$ packed form
568B571713O45355J236388n44796j635585j171294p6362J464116M9607M00467
559B939609o37661j309492L57722j70521j340398j75859K77221N20006L8181m63361
549C5447R2626R04312N4034J123326l75585j36352Q52926m1421m74659P0362m1253
538B063763q19927L3234p56752R97425J49101j933768K94441R20526k53496q2135
528F12412j28687q4181p68829j74133J395438R3774o59190L24637j50253J407765
518A868753M95816j213104r36206l80250J379435O48659n27895q16290p28o11608
508i3418j22572J153980P97762q7774j444931L51747J099232n69352n08788P87969
498A363855q59127n64266L89559N16478j349795j252046M91882J79953Q20172
$$ plain form
489 -263335 -1089817 -792533 -1255056 -1001039 -76976 -5347 334 564295 800176 206520
479 206520 805585 1063792 1841938 1559719 1241582 2181490 2058382 981905 872091 757979
469 757979 236776 662230 780032 1124226 1396318 906987 743391 1329022 1433819 836244
459 836244 828607 791415 1607679 934490 444424 946642 305511 -8949 140993 122635 470601
448 470601 790331 460507 809835 -75681 -80595 819820 795968 1053673 599242 18968
438 18968 -679784 -698035 -1798577 -1347020 -1240463 -1087675 -660685 -2078779 -1732850 -1313602
428 -1313602 -679424 -650494 -258707 -750807 -202038 2610 -515005 -422807 305 1021123
418 1021123 914866 301271 -640022 -1436560 -1861581 -924658 97796 682256 567795 -178662
$$ packed form
489b63335q26482K97284m62523K54017R24063P1629N681N63961K35881n93656
479B06520N99065K58207P78146k82219l18137R39908j23108j076477j09814j14112
469G57979n21203M25454J17802L44194K72092m89331j63596N85631J04797n97575
459H36244p637l7192Q16264o73189m90066N02218o41131l14460J49942j8358L47966
448D70601L19730l29824L49328q85516m914R00415k3852K57705m54431n80274
438A8968o98752j8251j100542M51557J06557J52788M26990j418094L45929M19248
428a313602O34178K8930L91787m92100N48769K04648n17615R2198M23112J020818
418A021123j06257o13595r41293p96538m25021R36923J022454N84460j14461p46457
$$ plain form
408 -178662 656426 145019 170270 -138171 -113467 294107 960498 1475119 9546 -509749
398 -509749 -305367 266940 -288484 -249728 1102249 334428 -144089 -64428 -117305 511125
388 511125 731894 1184912 1679203 2265212 2183002 302395 -92481 1391695 1917036 980851
378 980851 -810083 -353384 -757196 -1131387 293374 1195108 -62504 -915073 188474
369 188474 1069286 967157 708286 384372 -438751 182416 2974296 3118953 2655805 1509085
359 1509085 1018033 216846 -459378 819279 1528013 1086335 1692952 2283481 1766671 88722
349 88722 -698217 24192 263967 -375580 319328 1151526 878387 1580096 1081930 1041175
339 1041175 -42384 -771704 -1503626 -1367831 -311822 392536 417818 95749 599382 412575
$$ packed form
408a78662Q35088n11407K5251l08441K4704M07574O66391N14621j465573n19295
398e09749K04382N72307n55424L8756J351977p67821m78517P9661n2877O28430
388E11125K20769M53018M94291N86009q2210j880607l94876J484176N25341r36185
378I80851j790934M56699m03812l74191J424761R01734j257612q52569J103547
369A88474Q80812j02129k58871l23914q23123O21167K791880J44657m63148j146720
359A509085m91052q01187o76224J278657P08734m41678O06617N90529n16810j677949
349H8722p86939P22409K39775o39547O94908Q32198k73139P01709m98166m0755
339A041175j083559p29320p31922J35795J056009P04358K5282l22069N03633j86807
$$ plain form
329 412575 400368 487025 12258 587496 486736 1119284 63836 241897 1318528 544868
319 544868 -87677 -299324 -1421193 -1878142 -1920022 -1379423 -62324 520190 -757235 -49639
309 -49639 464680 655542 1393640 585804 2508657 3097108 2210747 1979868 974132 725517
299 725517 1722880 164453 -725068 589838 521410 71303 -319468 163278 28797 -1707746
289 -1707746 -578900 -389960 88288 1053491 -336722 -835450 -724904 -374769 -375693 -819881
279 -819881 477023 575895 -455023 -224036 -409900 8020 169333 -652764 -480487 -709068
269 -709068 -765804 267250 870839 -774229 -9047 -499418 -63311 146891 -295152 1029958
259 1029958 -1091643 -1078118 942394 1694734 1652898 1558399 -225441 -1624367 -707708 695015
$$ packed form
329D12575j2207Q6657m74767N75238j00760O32548j055448J78061J076631p73660
319E44868o32545k11647j121869m56949m1880N40599J317099N82514j277425P07596
309d9639N14319J90862P38098q07836J922853N88451q86361k30879j005736k48615
299G25517R97363j558427q89521J314906o8428m50107l90771M82746j34481j736543
289a707746J128846J88940M78248R65203j390213m98728J10546L50135r24m44188
279h19881J296904R8872j030918K30987j85864M17920J61313q22097J72277k28581
269g09068n6736J033054O03589j645068P65182m90371M36107K10202m42043J325110
259A029958k121601J3525K020512P52340m1836r4499j783840j398926R16659J402723
$$ plain form
249 695015 1210531 1085727 1941404 1549164 -1382921 -1837687 -409116 191192 1502375
240 1502375 1953033 992533 1498026 2372197 1416102 585806 943292 3159586 3484966 1525429
230 1525429 781243 142228 -636751 -330398 285345 1288582 1232376 -904033 -1008198 -1152590
220 -1152590 -753368 226304 417080 309555 -38850 1039841 1016698 1222777 2955361 2711339
210 2711339 1580952 1470033 2223409 2852362 1581664 324190 1731546 2005906 1863012
201 1863012 2398757 1106124 485450 197126 146830 1897429 2390103 1680920 2280318 1895649
191 1895649 490335 669032 64692 -134088 387812 1392156 822200 1417662 1649281
182 1649281 1439978 2287436 1106158 1395244 2617252 1225998 1501337 1613290 782293
$$ packed form
249F95015N15516j24804Q55677l92240k932085m54766J428571O00308J311183
240A502375M50658r60500N05493Q74171r56095q30296L57486K216294L25380j959537
230A525429p44186o39015p78979L06353O15743J003237n6206k136409j04165j44392
220a152590L99222R79672J90776j07525l48405J078691k3143K06079J732584k44022
210B711339j130387j10919P53376O28953j270698j257474J407356K74360j42894
201A863012N35745j292633o20674k88324n0296J750599M92674p09183N99398l84669
191A895649j405314J78697o04340j98780N21900J004344n69956N95462K31619
182A649281k09303Q47458j181278K89086J222008j391254K75339J11953q30997
$$ plain form
173 782293 1865490 1678929 1445882 1425442 818199 966801 1462213 460900 -197282 1160242
163 1160242 -260440 252084 1824256 1054497 1331233 732836 475130 907179 2766716
154 2766716 2720469 2538333 1817198 731165 -385855 -896653 -459349 427710 1064509 865807
144 865807 460802 620910 147232 -352441 -550760 146911 913239 1288252 864905 526241
134 526241 33864 -539719 73562 307457 678593 726379 -80518 -269252 606729 -7300
124 -7300 -68763 464107 591604 372276 6462 -878060 -1659040 -1111305 -468173 409168
114 409168 219142 -318632 -132179 -1289762 -1584921 -1720163 -1762653 -393399 -19052 -402944
104 -402944 -244516 -443462 -808921 -1240380 -987020 4650 339808 -379178 -1390185 -2364993
$$ packed form
173G82293J083197j86561k33047k0440o07243J48602M95412j001313o58182J357524
163A160242j420682N12524J572172p69759K76736n98397k57706M32049J859537
154B766716m6247j82136p21135j086033j117020n10798M37304Q87059O36799j98702
144H65807m05005J60108m73678m99673j98319O97671P66328L75013m23347l38664
134E26241m92377n73583O13281K33895L71136M7786q06897j88734Q75981o14029
124g300o1463N32870J27497k19328l65814q84522p80980N47735O43132Q77341
114D09168j90026n37774J86453j157583k95159j35242m2490J369254L74347l83892
104d02944J58428j98946l65459m31459K53360R91670L35158p18986j011007r74808
$$ plain form
94 -2364993 -1669720 -1724268 -2233371 -2451656 -1649974 -1377803 -2784412 -2041733 -1032550 -1099556
84 -1099556 -1304964 -1918201 -1256807 -935799 -1764434 -1184176 -1311606 -1350129 -985064 184277
74 184277 328975 -549663 -1253620 -1378437 -1251053 -1035252 -13104 -317122 -746640 -28859
64 -28859 411533 -65637 606552 3125582 3972848 4859408 6202300 8275362 9099089 8943775
54 8943775 9965678 10995087 11067230 12342258 15456103 18714011 24027629 33466511 49488381
45 49488381 77637900 108598555 134615409 144611136 132033644 109758936 84857302 64353317
37 64353317 49678454 39125565 30186005 21969557 16624862 13289402 9385713 6949992
29 6949992 5230016 4785984 4303672 4510331 4152934 2882365 944452 265269 96483
$$ packed form
94b364993O95273n4548n09103k18285Q01682K72171j406609P42679J009183o7006
84a099556k05408o13237O61394L21008q28635N80258j27430l8523L65065J169341
74A84277J44698q78638p03957j24817J27384K15801J022148l04018m29518P17781
64b8859M40392m77170O72189K519030Q47266Q86560J342892K073062Q23727j55314
54H943775J021903J029409P2143J275028L113845L257908N313618R438882J6021870
45D9488381K8149519L0960655K6016854R995727j2577492k2274708k4901634k0503985
37F4353317j4674863j0552889q939560q216448n344695l335460l903689k435721
29F949992j719976m44032m82312K06659l57397j270569j937913o79183j68786
$$ plain form
20 96483 -859252 -771575 -481116 -251227 -837752 -1260086 -1345930 -1913896 -2143545 -2143187 -1889082
9 -1889082 -1989245 -1942970 -989302 -759928 -1491428 -791938 -901643 -1836493 -1820099
0 -1820099
$$ packed form
20I6483r55735Q7677K90459K29889n86525m22334q5844n67966k29649L58K54105
9a889082j00163M6275R53668K29374p31500O99490j09705r34850J6394
0a820099
$$ Imaginary data points
##PAGE= N=2
##DATA TABLE= (X++(I..I)), XYDATA
$$ plain form
16383 -25817035 -26390790 -26092605 -26103444 -24472150 -24130386 -23473156 -23434752 -23593507 -22914208
16374 -22914208 -22305171 -22637048 -22523302 -21471025 -21675893 -21296744 -20399961 -20592182 -20020480
16365 -20020480 -20088008 -19979565 -18929124 -18340671 -18551806 -19189390 -18741695 -17960439 -17562393
16356 -17562393 -17406111 -17040584 -16762373 -17169877 -17075877 -16233602 -15272231 -14997831 -15726169
16347 -15726169 -15392527 -15028800 -14564238 -14299458 -14425878 -13878093 -13545938 -13722277 -13346950
16338 -13346950 -12751496 -11523491 -11581542 -12443236 -12975960 -13054041 -13331320 -13132332 -12521754
16329 -12521754 -11645705 -12159922 -12669215 -12484629 -11604073 -11000643 -10340369 -9761193 -9690868
16320 -9690868 -9572827 -10766228 -11502681 -9541210 -8903334 -9351833 -8720569 -8682850 -7479319
$$ packed form
16383b5817035n73755K98185j0839J631294L41764O57230L8404j58755O79299
16374b2914208O09037l31877J13746J052277k04868L79149Q96783j92221N71702
16365b0020480o7528J08443J050441N88453k11135o37584M47695P81256L98046
16356a7562393J56282L65527K78211m07504R4000Q42275R61371K74400p28338
16347a5726169L33642L63727M64562K64780j26420N47785L32155j76339L75327
16338a3346950N95454J228005n8051q61694n32724p8081k77279J98988O10578
16329a2521754Q76049n14217n09293J84586Q80556O03430O60274N79176P0325
16320i690868J18041j193401p36453J961471O37876m48499O31264L7719J203531
$$ plain form
16311 -7479319 -8350842 -9013312 -9023555 -8991439 -8170490 -7713516 -7962077 -7458423 -6515741 -7722094
16301 -7722094 -8000256 -7823609 -8255242 -6600416 -5344143 -5420532 -6177181 -5827738 -5728173
16292 -5728173 -6398003 -6566567 -6197608 -5945446 -5530040 -5685278 -6020521 -6624467 -5257276
16283 -5257276 -4318242 -4870547 -4902150 -4194776 -3324109 -4617192 -5513201 -5759894 -5235901
16274 -5235901 -4417254 -3422954 -2380800 -2970122 -3611934 -4106056 -3763814 -3524186 -3573076
16265 -3573076 -4001322 -4295247 -3145367 -3013295 -3450776 -4454580 -3263053 -2244229 -2857678
16256 -2857678 -2199910 -2394380 -2003229 -1344869 -1108658 -1163048 -1442557 -524032 -1857213
16247 -1857213 -2310399 -2748408 -1300058 330969 -1099109 -1356092 -779982 -1142149 -913595
$$ packed form
16311g479319q71523o62470j0243L2116Q20949M56974k48561N03654R42682j206353
16301g722094k78162J76647m31633J654826J256273p6389p56649L49443R9565
16292e728173o69830j68564L68959K52162M15406j55238l35243o03946J367191
16283e257276R39034n52305l1603P07374Q70667j293083q96009k46693N23993
16274e235901Q18647R94300J042154n89322o41812m94122L42242K39628m8890
16265c573076m28246k93925J149880J32072m37481j003804J191527J018824o13449
16256b857678O57768j94470L91151O58360K36211n4390k79509R18525j333181
16247a857213m53186m38009J448350J631027j430078k56983N76110l62167K28554
$$ plain form
16238 -913595 -1415439 -967139 -1208266 -655409 -1114028 -1692394 -1412825 -1612403 -981648 -349457
16228 -349457 563188 -407181 -775893 -1472898 38428 790287 26260 785312 -17067
16219 -17067 176527 459486 -449516 168648 1343903 1925143 883664 568843 1112229
16210 1112229 779427 1157689 346728 -28460 -139677 128556 1620198 1977181 1489796
16201 1489796 390216 749452 341494 1661259 1437953 1338455 1781465 1066592 1022767
16192 1022767 571810 1275310 2795759 2552477 2805872 3260396 3382751 2476512 2033707
16183 2033707 2944804 2133024 1969011 1641048 2132277 2237507 1290326 860914 460438
16174 460438 1466967 1937206 2138982 1759804 1399304 2320334 2378183 2220315 3195474 3825695
$$ packed form
16238i13595n01844M48300k41127N52857m58619n78366K79569j99578O30755O32191
16228c49457R12645r70369l68712o97005J511326P51859p64027P59052q02379
16219a7067J93594K82959r09002O18164J175255N81240j041479l14821N43386
16210A112229l32802L78262q10961l75188j11217K68233J491642L56983m87385
16201A489796j099580L59236m07958J319765k23306r9498M43010p14873m3825
16192A022767m50957P03500J520449k43282K53395M54524J22355r06239m42805
16183B033707R11097q11780j64013l27963M91229J05230r47181m29412m00476
16174D60438J006529M70239K01776l79178l60500R21030N7849j57868R75159O30221
$$ plain form
16164 3825695 3331897 2718365 3125476 4175116 3972079 2204452 2673085 3209872 2166051
16155 2166051 2846933 1973882 1247340 1460172 2004602 3034207 3779514 2594587 3729657
16146 3729657 3076846 3163675 5932015 5357888 4486789 4153862 3500290 3343748 1504046
16137 1504046 2138086 2473138 981354 1162163 2159390 2778266 2201950 2122151 2304025
16128 2304025 1918384 2108103 3150728 3261126 3033958 6116115 6923274 5428608 4903426
16119 4903426 4702112 4194918 2453867 4269975 4866047 3270846 2492419 1734557 1435469
16110 1435469 917043 1553265 2680723 1837284 2729943 2927015 3763444 4237381 4990151
16101 4990151 5505168 4155143 3579184 4379477 4661360 4560722 3853800 4238956 4617435
$$ packed form
16164C825695m93798o13532M07111J049640k03037j767627M68633N36787j043821
16155B166051O80882q73051p26542K12832N44430J029605P45307j184927J135070
16146C729657o52811Q6829K768340n74127q71099l32927o53572j56542j839702
16137A504046O34040L35052j491784J80809R97227O18876n76316p9799J81874
16128B304025l85641J89719J042625J10398k27168L082157Q07159j494666n25182
16119D903426k01314n07194j741051J816108N96072j595201p78427p57862k99088
16110A435469n18426O36222J127458q43439Q92659J97072Q36429M73937P52770
16101D990151N15017j350025n75959Q00293K81883j00638p06922L85156L78479
$$ plain form
16092 4617435 4266149 4064817 4230969 3882148 3988184 3706771 2505240 1829720 3610369
16083 3610369 4620615 4458548 4396898 3145448 2792041 3020215 2953926 3155814 3689420
16074 3689420 3242544 3396932 3651576 4562284 4695813 3063983 3000889 3465785 4360668
16065 4360668 5490004 5661185 5161441 4574706 4566852 4220996 3672392 3873685 4295654 1928099
16055 1928099 1881822 2800465 2990930 3020388 2570034 2369394 2936830 3361377 3385333 4027667
16045 4027667 2895769 3370475 4950422 4388038 5206927 4638357 5354396 4794552 3125933
16036 3125933 3603107 4567078 4610961 5551944 5748560 4665617 3340536 2432800 3486936
16027 3486936 2696629 3006331 4629230 3989302 3847470 4044524 2596051 1164460 1430714
$$ packed form
16092D617435l51286k01332J66152l48821J06036k81413j201531o75520J780649
16083C610369J010246j62067o1650j251450l53407K28174o6289K01888N33606
16074C689420m46876J54388K54644R10708J33529j631830o3094M64896Q94883
16065D360668J129336J71181m99744n86735p854l45856n48604K01293M21969k367555
16055A928099m6277R18643J90465K9458m50354k00640N67436M24547K3956O42334
16045D027667j131898M74706J579947n62384Q18889n68570P16039n59844j668619
16036C125933M77174R63971M3883R40983J96616j082943j325081r07736J054136
16027C486936p90307L09702J622899o39928j41832J97054j448473j431591K66254
$$ plain form
16018 1430714 3572059 4627931 4104371 3882107 3681991 3488185 3295365 4577022 4664286
16009 4664286 4523074 5171555 4228634 4970789 5739854 6311094 4385197 2674913 3164183
16000 3164183 3929727 3562338 2651436 2719292 4440952 4835272 4277943 3516895 2295487
15991 2295487 3217290 4801695 3565726 4245661 4476549 4459523 4602031 3436822 4161042
15982 4161042 4888510 3148341 2882730 3277209 2349772 4879748 4690146 2672722 3578641
15973 3578641 3698323 3452747 3624189 2905599 5206044 5448479 3721816 4382825 3962347
15964 3962347 5103000 5459946 4243217 3143866 3435467 4439246 3681118 3964332 5303136
15955 5303136 5289436 2679561 2339890 4141343 6387706 4989717 3321417 2842138 3968274
$$ packed form
16018A430714K141345J055872n23560k22264k00116j93806j92820J281657Q7264
16009D664286j41212O48481r42921P42155P69065N71240j925897j710284M89270
16000C164183P65544l67389r10902O7856J721660L94320n57329p61048j221408
15991B295487R21803J584405j235969O79935K30888j7026J42508j165209P24220
15982D161042P27468j740169k65611L94479r27437K529976j89602k017424R05919
15973C578641J19682k45576J71442p18590K300445K42435j726663O61009m20478
15964C962347J140653L56946j216729j099351K91601J003779p58128K83214J338804
15955E303136j3700k609875l39671J801453K246363j397989j668300m79279J126136
$$ plain form
15946 3968274 4439581 3966140 3549808 2862371 3225226 3344728 3002813 3127696 3801497
15937 3801497 4671067 4159834 3500269 3721916 3375331 3390827 4107474 5977288 5870939
15928 5870939 4963122 4657862 4309930 3886738 3271435 2837484 3579894 3467811 3465408 3421101
15918 3421101 3528046 2637442 1686772 2753592 2463102 3343578 4893116 5074728 4727535
15909 4727535 4270007 5412423 5459805 4925711 4569475 3746171 3912762 4761182 4668835 4708354
15899 4708354 3447137 4142153 3842676 3029881 3592891 3721769 3261258 3369844 3128555
15890 3128555 2535985 3565524 3658681 4224082 4226078 3086883 2161515 2814972 3182594 3946693
15880 3946693 3946981 3843392 3206272 2604733 2912232 3153541 4666390 5437293 4734150 5190390
$$ packed form
15946C968274M71307m73441m16332o87437L62855J19502l41915J24883O73801
15937C801497Q69570n11233o59565K21647l46585J5496P16647J869814j06349
15928E870939r07817l05260l47932m23192o15303m33951P42410j12083k403m4307
15918C421101J06945q90604r50670J066820k90490Q80476J549538J81612l47193
15909D727535m57528J142416M7382n34094l56236q23304J66591Q48420r2347L9519
15899D708354j261217O95016k99477q12795N63010J28878m60511J08586k41289
15890C128555n92570J029539R3157N65401J996j139195r25368O53457L67622P64099
15880C946693K88j03589o37120o01539L07499K41309J512849P70903p03143M56240
$$ plain form
15870 5190390 4780120 3842469 3891565 3201622 5269857 6610590 5091286 4149632 3475088
15861 3475088 2297133 2645197 3201110 4883700 7303734 5618204 3450751 2520694 3076947
15852 3076947 4311522 3402821 3110494 4286252 4032326 2371792 1345237 2662144 3985887
15843 3985887 4545938 4677536 4501426 4343814 3708021 2722517 2948657 4921390 5821040
15834 5821040 6099111 4215567 2921934 4108538 5137940 4510723 4032935 3025179 3012648
15825 3012648 3025867 3131976 4237914 3156356 3067312 2922745 2626405 1434510 2000089
15816 2000089 3695010 5182990 5605976 5762540 4251317 2801301 2017769 1637483 4314457
15807 4314457 5237134 5443364 5488323 4117507 3223310 5793610 5552116 4437390 4355435
$$ packed form
15870E190390m10270r37651M9096o89943K068235J340733j519304r41654o74544
15861C475088j177955L48064N55913J682590K420034j685530k167453r30057N56253
15852C076947J234575r08701k92327J175758k53926j660534j026555J316907J323743
15843C985887N60051J31598j76110j57612o35793r85504K26140J972733Q99650
15834E821040K78071j883544j293633J186604J029402o27217m77788j007756j2531
15825C012648J3219J06109J105938j081558q9044j44567k96340j191895N65579
15816B000089J694921J487980M22986J56564j511223j450016p83532l80286K676974
15807D314457R22677K06230M4959j370816q94197K570300k41494j114726q1955
$$ plain form
15798 4355435 3507495 5070248 4790761 3501792 4413096 3526213 2658970 3900532 3002715
15789 3002715 2656921 2838400 3146342 3990005 4458415 3004100 1794912 1316171 2910624
15780 2910624 4146782 2757540 3132659 4141170 5045962 5396235 3970356 4075673 4419344
15771 4419344 4194586 4699911 4938854 4875157 4963150 4371004 3484356 4224332 3924970 4510179
15761 4510179 3890922 3156289 4778784 4334972 3813046 3803161 3315639 3445939 4092757 4310704
15751 4310704 2042826 900686 2679467 4209613 5708483 5707654 3640688 3092426 2835649
15742 2835649 3730991 4240119 4489733 4041990 3867447 4330896 5051073 4901554 3825965
15733 3825965 3915110 3709144 3891657 4821178 3666024 3595241 4589539 2902067 2525941
$$ packed form
15798D355435q47940J562753k79487j288969R11304q86883q67243J241562q97817
15789C002715l45794J81479L07942Q43663M68410j454315j209188m78741J594453
15780B910624J236158j389242L75119J008511R04792L50273j425879J05317L43671
15771D419344k24758N05325K38943o3697Q7993n92146q86648P39976k99362N85209
15761D510179o19257p34633J622495m43812n21926r885m87522J30300O46818K17947
15751D310704k267878j142140J778781J530146J498870q29k066966n48262k56777
15742B835649Q95342N09128K49614m47743j74543M63449P20177j49519j075589
15733C825965Q9145k05966J82513R29521j155154p0783R94298j687472l76126
$$ plain form
15724 2525941 3068943 4194731 4387085 4680862 5682623 4571560 3155116 2984660 4321823
15715 4321823 4873798 5205263 4987636 2247504 2435537 2990692 3919565 4982958 3718799
15706 3718799 2960602 2982422 2984352 3775855 3963315 4100105 4329726 4277701 3688930 2978701
15696 2978701 3174782 4108760 5523725 5351264 4940310 4712838 2229745 2313920 4030625
15687 4030625 4824614 5836926 5170929 3368177 2527083 3009270 3617919 3719300 4837474
15678 4837474 4868810 4385449 4815767 5005857 4497275 2576361 3005989 4041549 3376101
15669 3376101 3628615 4579594 3768538 4375622 5811316 4490057 3080223 3404168 3497813
15660 3497813 4158058 3081529 3128237 3598425 3088143 4292563 4444428 3319884 2701120
$$ packed form
15724B525941N43002J125788J92354K93777J001761j111063j416444j70456J337163
15715D321823N51975L31465k17627k740132J88033N55155R28873J063393j264159
15706C718799p58197K1820J930P91503J87460J36790K29621n2025n88771p10229
15696B978701J96081R33978J414965j72461m10954k27472k483093Q4175J716705
15687D030625P93989J012312o65997j802752q41094M82187O08649J01381J118174
15678D837474L1336m83361M30318J90090n08582j920914M29628J035560o65448
15669C376101K52514R50979q11056O07084J435694j321259j409834L23945R3645
15660C497813O60245j076529M6708M70188n10282J204420J51865j124544o18764
$$ plain form
15651 2701120 3073759 4192576 4806508 4868671 4841937 3512586 3180953 4413186 4002709
15642 4002709 3630330 3435660 3662983 4326649 4065019 4415265 4830058 3644675 4528796
15633 4528796 5355743 4059805 3747937 4646585 4688918 5263719 5740225 5822386 5442123 4387902
15623 4387902 3814377 3651255 3515865 4605304 5894830 3808311 2907036 2900585 3128818
15614 3128818 2491588 2321875 3277818 4327398 4135246 3943062 4729768 4528836 4995459
15605 4995459 4570614 3162856 3230442 4440339 4644065 4809077 4870555 4807884 3993234 3081824
15595 3081824 3236651 2741721 3423595 2862176 3026552 3718459 3862559 3348538 2011790
15586 2011790 2498303 4260019 4337293 5036332 5327393 5009146 5161366 4697890 4806512
$$ packed form
15651B701120L72639J118817O13932O2163k6734j329351l31633J232233m10477
15642D002709l72379j94670K27323O63666k61630L50246M14793j185383Q84121
15633D528796Q26947j295938l11868Q98648M2333N74801M76506Q2161l80263j054221
15623D387902n73525j63122j35390J089439J289526k086519r01275o451K28233
15614C128818o37230j69713R55943J049580j92152j92184P86706k00932M66623
15605D995459m24845j407758O7586J209897K03726J65012O1478o2671q14650r11410
15595C081824J54827m94930O81874n61419J64376O91907J44100n14021j336748
15586B011790M86513J761716P7274O99039K91061l18247J52220m63476J08622
$$ plain form
15577 4806512 5343604 4710783 4058824 4882151 4352319 4326821 4496835 3041948 3180068
15568 3180068 4419104 5528020 5987823 3070106 3060796 3485747 2518321 4939510 5047581
15559 5047581 3123211 3176581 3339537 3210897 3074592 3674954 3870162 3152432 3277980
15550 3277980 3874979 4587728 4311214 4065944 4156690 4165701 4578469 4350782 5008416 4096901
15540 4096901 3710171 4327617 4735374 3616535 2093286 2946279 3543602 3318077 3446795
15531 3446795 3710975 3352229 3724925 5941742 6044321 5347223 5180628 4091135 4843103
15522 4843103 5089137 5899478 5857784 3624318 3696770 5225960 4846718 3557144 2827159
15513 2827159 3249490 4122119 3903752 4097718 4585880 4904213 4976817 3909311 3634179
$$ packed form
15577D806512N37092o32821o51959Q23327n29832k5498J70014j454887J38120
15568C180068J239036J108916M59803k917717r310M24951r67426K421189J08071
15559E047581j924370N3370J62956j28640j36305O00362J95208p17730J25548
15550C277980N96999P12749k76514k45270R0746R011M12768k27687O57634r11515
15540D096901l86730O17446M07757j118839j523249Q52993N97323k25525J28718
15531C446795K64180l58746L72696K216817J02579o97098j66595j089493P51968
15522D843103K46034Q10341m1694k233466P2452J529190l79242j289574p29985
15513B827159M22331Q72629k18367J93966M88162L18333P2604j067506k75132
$$ plain form
15504 3634179 3220286 3466537 2961994 2223660 5133415 5725190 3608824 3638167 2127008
15495 2127008 2395007 3057328 3220684 4353503 4291155 4870778 5141309 3478880 4062910
15486 4062910 5150868 3497350 3742876 5315169 5019165 4544801 3484302 4450108 4251472
15477 4251472 2867667 4333873 3110413 2356607 3337675 3292264 3448292 3116170 4048618
15468 4048618 4614073 3756543 3788779 3747136 4443469 4742209 6719351 6736302 5283342 5172567
15458 5172567 5708831 5194896 3969997 4427440 4805864 3445351 4118700 4191675 2801148
15449 2801148 3404651 3626148 2157631 1526282 2304536 3777631 4700118 5667872 5929887
15440 5929887 4345858 1997308 2986325 3666017 4066649 5788997 5133824 3964540 4616504
$$ packed form
15504C634179m13893K46251n04543p38334K909755N91775k116366K9343j511159
15495B127008K67999O62321J63356J132819o2348N79623K70531j662429N84030
15486D062910J087958j653518K45526J572293k96004m74364j060499R65806j98636
15477D251472j383805J466206j223460p53806R81068m5411J56028l32122R32448
15468D048618N65455q57530L2236m1643O96333K98740J977142J6951j452960j10775
15458E172567N36264n13935j224899M57443L78424j360513O73349P2975j390527
15449B801148O03503K21497j468517o31349P78254J473095R22487R67754K62015
15440E929887j584029k348550R89017O79692M00632J722348o55173j169284O51964
$$ plain form
15431 4616504 4080877 3955112 3139624 2667039 4436443 2773630 3667635 4710736 4385345
15422 4385345 4976896 4125930 4912269 5461551 3360376 4947159 5037406 3582532 4866689
15413 4866689 5273484 4650977 5029915 4449995 4168785 3581364 4181896 5272852 4552972
15404 4552972 3613327 4659986 5826046 3852880 2593972 2814989 2667312 2589703 2971192
15395 2971192 3478233 4181353 3614900 2383834 2920788 3759323 4771278 4932065 3699150
15386 3699150 2652899 4695327 4638764 4671852 4444345 3912582 4208794 3374709 4188428
15377 4188428 4919677 4927649 3499359 3258682 3987789 2965006 2460444 4171188 5126167
15368 5126167 5594680 3992346 3791556 3918606 3717465 4631062 4617559 4050896 4251114
$$ packed form
15431D616504n35627j25765q15488m72585J769404j662813Q94005J043101l25391
15422D385345N91551q50966P86339N49282k101175J586783R0247j454874J284157
15413D866689M06795o22507L78938n79920k81210n87421O00532J090956p19880
15404D552972r39645J046659J166060j973166j258908K21017j47677p7609L81489
15395B971192N07041P03120n66453j231066N36954Q38535J011955J60787j232915
15386C699150j046251K042428n6563L3088k27507n31763K96212q34085Q13719
15377D188428P31249P972j428290k40677P29107j022783n04562J710744R54979
15368E126167M68513j602334k00790J27050k01141R13597j3503n66663K00218
$$ plain form
15359 4251114 4205621 3457136 4820876 5623233 5547136 3498161 1755906 3899049 4421566
15350 4421566 4297109 4148403 5031167 5283086 3020466 2116748 3267618 3472306 3547943
15341 3547943 3835391 5788476 5464794 4405558 4030920 2716295 3421744 4282836 3244199
15332 3244199 3088183 4979441 6177108 5062099 2388046 2200457 3149781 3969977 4835818
15323 4835818 5120619 5248115 4818687 3989776 4538857 2608688 2513727 4315465 4894849
15314 4894849 5581801 5038408 4327189 4597205 4203411 3566340 4423094 4589839 4793840
15305 4793840 4926286 4349178 4229407 5752870 4959396 2289674 2719182 4663850 5581559
15296 5581559 4891599 4191920 4093266 3795237 3292756 3968622 3731839 3598402 2770391 2935510
$$ packed form
15359D251114m5493p48485J363740Q02357p6097k048975j742255K143143N22517
15350D421566j24457j48706Q82764K51919k262620r03718J150870K04688P5637
15341C547943K87448J953085l23682j059236l74638j314625P05449Q61092j038637
15332C244199j56016J891258J197667j115009k674053j87589R49324Q20196Q65841
15323D835818K84801J27496m29428q28911N49081j930169r4961J801738N79384
15314D894849O86952n43393p11219K70016l93794o37071Q56754J66745K04001
15305D793840J32446n77108j19771J523463p93474k669722M29508J944668R17709
15296E581559o89960o99679r8654k98029n02481O75866k36783j33437q28011J65119
$$ plain form
15286 2935510 4561107 4708139 5175374 4177633 3866917 3824144 2519503 1816619 2102742
15277 2102742 2858482 4536712 5439455 3813880 4689499 4322214 3032231 3618151 4035715
15268 4035715 5379357 5189589 4804602 4735663 4370038 4761599 4609585 4431540 4598684
15259 4598684 4457183 4093186 4096725 4077170 4422769 5086470 4922435 4336902 3748237 3887317
15249 3887317 4196960 3479097 3387469 3022789 3855984 4869629 4295008 5173656 4427216
15240 4427216 3829252 4146031 3523617 4400999 4330242 3235556 3767487 4229188 3735482
15231 3735482 4210590 3727926 1961926 3484363 3039447 2342311 3193105 2980331 3493796
15222 3493796 3689539 4231008 4523084 5023474 4822398 5792025 5925981 5319758 6386830
$$ packed form
15286B935510J625597J47032M67235r97741l10716m2773j304641p02884K86123
15277B102742P55740J678230R02743j625575Q75619l67285j289983N85920M17564
15268D035715J343642j89768l84987o8939l65625L91561j52014j78045J67144
15259D598684j41501l63997L539j9555L45599O63701j64035n85533n88665J39080
15249C887317L09643p17863r1628l64680Q33195J013645n74621Q78648p46440
15240D427216n97964L16779o22414Q77382p0757j094686N31931M61701m93706
15231C735482M75108m82664j766000J522437m44916o97136Q50794k12774N13465
15222C493796J95743N41469K92076N00390k01076R69627J33956o06223J067072
$$ plain form
15213 6386830 5217908 4417318 5281096 5177129 5222440 4586211 4489934 4658385 3650142
15204 3650142 3317214 4346077 3786240 3462160 4262656 3110218 3943161 4758506 5896283
15195 5896283 6046689 3202582 2550590 3617264 3914331 4337569 5109716 5605276 5002394
15186 5002394 4330157 3591226 3515081 4287344 4192988 3449321 2896641 3998213 4750983 4792693
15176 4792693 4640697 4013449 4191388 2449660 2321530 3103058 3604323 3922193 4412814
15167 4412814 4043883 4453053 4979798 3901299 4660449 4313915 3696028 4050434 4600596
15158 4600596 5512045 6731216 6037970 4898090 4224312 3355519 3609620 4375133 5074523
15149 5074523 6243675 5806240 5542014 4074901 2020374 2639361 3709860 4890365 4118895
$$ packed form
15213F386830j168922q00590Q63778j03967M5311o36229r6277J68451j008243
15204C650142l32928J028863n59837l24080Q00496j152438Q32943Q15345J137777
15195E896283J50406k844107o51992J066674K97067M23238P72147M95560o02882
15186E002394o72237p38931p6145P72263r4356p43667n52680J101572P52770M1710
15176D792693j51996o27248J77939j741728j28130P81528N01265L17870M90621
15167D412814l68931M09170N26745j078499P59150l46534o17887L54406N50162
15158D600596R11449J219171o93246j139880o73778q68793K54101P65513O99390
15149E074523J169152m37435k64226j467113k054527O18987J070499J180505p71470
$$ plain form
15140 4118895 2959912 3966570 3957752 3846748 4007447 3942377 4715989 4102162 3463849 4327437
15130 4327437 6188119 6608609 4409164 3542671 3652813 4027416 3684277 3066039 2475192
15121 2475192 4297244 3807920 2870802 3266946 3112598 4215512 3431537 2677330 3664458
15112 3664458 5505213 6563545 5856532 5294651 5232422 3616358 3747169 6138798 7178311
15103 7178311 5903150 5449955 4226075 3608653 3289705 4126323 5605355 4343307 4733616
15094 4733616 3764551 1749052 2729012 3409156 3427250 3826699 4488895 4514514 3979536 2941132
15084 2941132 2182035 3720322 4063166 4593227 5445136 4039997 4161748 4206965 5467712
15075 5467712 5325931 4027713 3520211 3387912 4341831 5906969 6415761 5419988 4611165
$$ packed form
15140D118895j158983J006658q818j11004J60699o5070P73612o13827o38313Q63588
15130D327437J860682M20490k199445q66493J10142L74603l43139o18238n90847
15121B475192J822052m89324r37118L96144j54348J102914p83975p54207R87128
15112C664458J840755J058332p07013n61881o2229j616064J30811K391629J039513
15103G178311j275161m53195j223880o17422l18948Q36618J479032j262048L90309
15094D733616r69065k015499R79960O80144J8094L99449O62196K5619n34978j038404
15084B941132p59097J538287L42844N30061Q51909j405139J21751M5217J260747
15075E467712j41781j298218n07502j32299R53919J565138N08792r95773q08823
$$ plain form
15066 4611165 4046469 2306461 1237778 3117086 4548741 5054857 4388011 4124022 4360540
15057 4360540 4445437 3865335 3964516 3726429 4189468 5346051 5414120 5630364 5043043 4390119
15047 4390119 5117039 5600807 4379277 4351319 4198022 3135803 4436571 3850999 3810097
15038 3810097 3860097 3658861 3166860 2528505 3948683 4751955 4593399 3670455 5222252
15029 5222252 6674810 5986917 5324934 3920798 5087984 5522571 4867320 4743409 3886745
15020 3886745 4290431 3481847 2507669 2770245 3018502 3795153 3803997 2686113 3124933 4028129
15010 4028129 3833671 4179978 4081058 3835666 5272933 5577779 6528029 5874653 5528401
15001 5528401 4835823 1998654 3114029 3790366 4618428 5591667 4375419 4490007 4131231
$$ packed form
15066D611165n64696j740008j068683J879308J431655N06116o66846k63989K36518
15057D360540Q4897n80102R9181k38087M63039J156583O8069K16244n87321o52924
15047D390119P26920M83768j221530k7958j53297j062219J300768n85572m0902
15038C810097N0000k01236m92001o38355J420178Q03272j58556r22944J551797
15029E222252J452558o87893o61983j404136J167186M34587o55251j23911q56664
15020C886745M03686q08584r74178K62576K48257P76651Q844j117884M38820R03196
15010D028129j94458L46307r8920k45392J437267L04846R50250o53376l46252
15001E528401o92578k837169J115375O76337Q28062R73239j216248J14588l58776
$$ plain form
14992 4131231 4328271 4430235 4719755 4346777 3392120 3516945 5419038 6524096 5278911
14983 5278911 4509731 3889149 4241786 4215855 4048016 4483820 4257489 5120334 5259474 4430593
14973 4430593 4854670 3795311 3013785 3061815 3771780 5382286 5416046 5291430 4143677
14964 4143677 4765889 4209640 1939328 3950845 4915961 4091812 4115090 4353860 5155252
14955 5155252 5385543 4616456 4503070 4279471 3593848 4019121 4060994 4544179 5869280
14946 5869280 4934477 4594947 4359071 3895854 4362642 3425064 3642286 4386889 4539324
14937 4539324 4884183 4450025 4295039 4110304 3310366 4535818 4584451 4006783 4755413
14928 4755413 4287571 3713496 4357902 5090835 6146233 5145362 4174499 3639814 2427840
$$ packed form
14992D131231J97040J01964K89520l72978r54657J24825J902093J105058j245185
14983E278911p69180o20582L52637k5931j67839M35804k26331Q62845J39140q28881
14973D430593M24077j059359p81526M8030P09965J610506L3760j24616j147753
14964D143677O22212n56249k270312K011517R65116q24149K3278K38770Q01392
14955E155252K30291p69087j13386k23599o85623M25273M1873M83185J325101
14946E869280r34803l39530k35876m63217M66788r37578K17222P44603J52435
14937D539324L44859m34158j54986j84735p99938J225452M8633n77668P48630
14928D755413m67842n74075O44406P32933J055398j000871r70863n34685j211974
$$ plain form
14919 2427840 4719807 4915892 5233098 5577569 4495732 4402476 4029123 3981529 3957498 4445227
14909 4445227 4673335 4479240 5118992 5080914 5575828 5612572 4903984 3917654 2923583 3349089
14899 3349089 5160899 4884171 4774655 4136458 2968606 2383211 1809561 2354220 4023234
14890 4023234 4614200 5069613 4887186 4377214 4871230 4162222 4622419 5989078 5703335
14881 5703335 7050955 7438250 6322840 5410773 4630620 5352967 5557846 4728678 4345911
14872 4345911 4486040 3962722 3597408 2226537 3241552 3477064 3691962 3881102 3424699
14863 3424699 3235824 3966127 4200024 4188896 5009653 5557173 6085939 4624907 4485441
14854 4485441 6754190 5580876 3926969 3531663 3758578 5709214 6863678 5959672 5767064
$$ packed form
14919B427840K291967J96085L17206L44471j081837r3256l73353m7594k4031M87729
14909D445227K28108j94095O39752l8078M94914L6744p08588r86330r94071M25506
14899C349089J811810k76728j09516o38197j167852n85395n73650N44659J669014
14890D023234N90966M55413j82427n09972M94016p09008M60197J366659k85743
14881E703335J347620L87295j115410r12067p80153P22347K04879q29168l82767
14872D345911J40129n23318l65314j370871J015015K35512K14898J89140m56403
14863C424699j88875P30303K33897j1128Q20757N47520N28766j461032j39466
14854D485441K268749j173314j653907l95306K26915J950636J154464r04006j92608
$$ plain form
14845 5767064 4041609 2885468 1195433 1776600 3596301 5019542 6091827 5243418
14837 5243418 4359841 3201958 2338761 2475913 4891985 6599974 7170046 6968815 5541339
14828 5541339 4120700 3942531 4202797 5607803 5845420 4827951 4219622 3537720 4093868
14819 4093868 4960073 3909122 3808875 4461691 4105551 3124997 3749710 3488738 4415253
14810 4415253 4544171 4862645 4861904 3888032 4375443 4271479 5758396 5311491 3982854 5029762
14800 5029762 5017967 5793268 5403358 5983399 6296815 5599632 4748965 4640305 5496582 6090775
14790 6090775 4894718 3468755 3540640 3250809 2074090 2345472 2805862 2420065 3564843
14781 3564843 3194427 4093235 4259519 4968100 3921538 3155708 5633268 7014553 5885627
$$ packed form
14845E767064j725455j156141j690035N81167J819701J423241J072285q48409
14837E243418q83577j157883q63197J37152K416072J707989N70072k01231j427476
14828E541339j420639j78169K60266J405006K37617j017469o08329o81902N56148
14819D093868Q66205j050951j00247O52816l56140r80554O24713k60972R26515
14810D415253J28918L18474p41r73872M87411j03964J486917m46905j328637J046908
14800E029762j1795P75301l89910N80041L13416o97183q50667j08660Q56277N94193
14790F090775j196057j425963P1885k89831j176719K71382M60390l85797J144778
14781C564843l70416Q98808J66284P08581j046562p65830K477560J381285j128926
$$ plain form
14772 5885627 5147898 6603911 7249666 6139477 2912326 2171459 4246152 5082239 5090276
14763 5090276 3589000 3633437 3957173 4492169 3971731 2868306 3991053 6126919 5303251
14754 5303251 4042060 6041944 7572255 5830986 4220726 4186516 4694294 4076212 3598773
14745 3598773 3332691 3401269 4942777 4747037 2760026 2773475 4507165 5154670 4693071
14736 4693071 4634128 4916314 5099720 3917297 3018776 4014099 4996804 6367245 5102781
14727 5102781 4450049 3951101 3029839 3280907 2573965 2484084 5283847 6151550 5088899
14718 5088899 4438879 3673479 3652852 4277854 3981156 5491603 5234849 5833272 6077545
14709 6077545 3873413 3892756 4855393 5062562 5892605 5719154 5273849 4470762 3271965
$$ packed form
14772E885627p37729J456013O45755j110189l227151p40867K074693Q36087Q037
14763E090276j501276M4437L23736N34996n20438j103425J122747K135866q23668
14754E303251j261191J999884J530311j741269j610260l4210N07778o18082m77439
14745C598773k66082O8578J541508j95740j987011J3449J733690O47505m61599
14736D693071n8943K82186J83406j182423q98521R95323R82705J370441j264464
14727E102781o52732m98948r21262K51068p06942q9881K799763Q67703j062651
14718E088899o50020p65400k0627O25002k96698J510447k56754N98423K44273
14709F077545k204132J9343R62637K07169Q30043j73451m45305q03087j198797
$$ plain form
14700 3271965 3009431 4319159 5545250 6209870 5379835 4662604 5236206 3261828 2124110
14691 2124110 3438369 4581105 4519999 4540325 3760796 4552209 5712803 5941620 5595627
14682 5595627 3885283 2994513 4174063 4840315 4943614 4735964 5878377 5665969 4196809
14673 4196809 3980620 4523647 4219149 3938044 4485179 4015447 1911347 3151444 4219992
14664 4219992 4822210 4995643 5250291 4993065 4121844 5572303 5771283 5196631 5166069
14655 5166069 6182517 6095869 5223928 5813036 5237582 4694414 4002445 2840484 3963560
14646 3963560 4120186 3876690 4716366 4182723 4731469 4842948 4502676 4148393 3555488
14637 3555488 5097637 5518765 4613178 5117088 4652636 3794895 4784309 5641675 5126718
$$ packed form
14700C271965k62534J309728J226091O64620q30035p17231N73602j974378j137718
14691B124110J314259J142736o1106K0326p79529P91413J160594K28817l45993
14682E595627j710344q90770J179550O66252J03299k07650J142413k12408j469160
14673D196809k16189N43027l04498k81105N47135m69732k104100J240097J068548
14664D219992O02218J73433K54648k57226q71221J450459J98980n74652l0562
14655E166069J016448q6648q71941N89108n75454n43168o91969j161961J123076
14646C963560J56626k43496Q39676n33643N48746J11479l40272l54283n92905
14637C555488J542149M21128r05587N03910m64452q57741R89414Q57366n14957
$$ plain form
14628 5126718 4070545 4356734 4774752 4109199 4079877 4169731 3519715 3948469 4691808 5418251
14618 5418251 5347636 5017210 3812753 4338014 4445264 4377446 2863581 2970865 4594189
14609 4594189 4653745 5121094 5200617 4638968 4281120 4453905 4684422 5479741 5970580 6284631
14599 6284631 6589442 6165351 5537265 5625715 4601874 4264086 5043656 3991858 3440239
$$ packed form
14628E126718j056173K86189M18018o65553k9322Q9854o50016M28754P43339P26443
14618E418251p0615l30426j204457N25261J07250o7818j513865J07284J623324
14609D594189N9556M67349P9523n61649l57848J72785K30517P95319M90839L14051
14599F284631L04811m24091o28086Q8450j023841l37788P79570j051798n51619
$$ [...]
##END NTUPLES=NMR SPECTRUM
##END=
