##TITLE=1H_DE-80H_X3
 200.13MHz, d2o
 8 sc
 
 19ns.26.2.2025
##JCAMPDX= 6.0         $$ Bruker NMR JCAMP-DX V2.0
##DATA TYPE= NMR SPECTRUM
##DATA CLASS= NTUPLES
##ORIGIN= UXNMR, Bruker Analytische Messtechnik GmbH
##OWNER= pz
$$ XWIN-NMR		Version 3.5
$$ Tue May  5 10:11:43 2026 Russian Standard Time (UT+4h)  Yarkov@DPX200
##.OBSERVE FREQUENCY= 200.1313
##.OBSERVE NUCLEUS= ^1H
##.ACQUISITION MODE= SIMULTANEOUS
##.ACQUISITION SCHEME= undefined
##.AVERAGES= 8
##.DIGITISER RES= 18
##SPECTROMETER/DATA SYSTEM= spect
##.PULSE SEQUENCE= zg30
##.SOLVENT NAME= CDCl3
##.SHIFT REFERENCE= (INTERNAL, CDCl3, 0, 18.072)
##AUDIT TRAIL= $$ (NUMBER, WHEN, WHO, WHERE, WHAT)
$$ ##TITLE= Audit trail, XWIN-NMR		Version 3.5
$$ ##JCAMPDX= 5.01
$$ ##ORIGIN= Bruker BioSpin GmbH
$$ ##OWNER= Yarkov
$$ C:/Bruker/XWIN-NMR/data/yarkov2/nmr/H-C/1/pdata/1/auditp.txt
$$ ##AUDIT TRAIL=  $$ (NUMBER, WHEN, WHO, WHERE, WHAT)
(   1,<2026-05-05 10:10:43.64 +0400>,<Yarkov>,<DPX200>,
      <created by zg, POWCHK disabled, PULCHK disabled
       configuration hash MD5:
       00 E9 B6 7A A2 85 ED C7 34 08 36 98 17 FE 4E 26
       data hash MD5: 16K
       3C 69 CE 42 6C 28 1A 96 A5 73 0C 3A CE 2F D1 61>)
(   2,<2026-05-05 10:10:47.48 +0400>,<Yarkov>,<DPX200>,
      <Start of raw data processing
       efp BC_mod = 2 LB = 0.25 FT_mod = 6 PKNL = 1 PHC0 = -5303.516 PHC1 = 11.42193 SI = 16K 
       data hash MD5: 16K
       DA 01 39 EE 30 92 1F FC 92 6B 4C 4C 9C B1 58 04>)
(   3,<2026-05-05 10:11:18.00 +0400>,<Yarkov>,<DPX200>,
      <abs ABSG = 5 
       data hash MD5: 16K
       32 6C 75 17 16 18 75 B1 01 A6 DC 3E 43 02 05 84>)
$$ ##END=
$$ 
$$ hash MD5
$$ F9 5D 05 EC E4 A4 DF 50 39 A9 48 33 26 F9 C2 97
##$RELAX= 
##$RELAX= 
##$RELAX= 
##$RELAX= 
##$RELAX= 
##$RELAX= 
$$ Bruker specific parameters
$$ --------------------------
##$DU= <C:/Bruker/XWIN-NMR>
##$EXPNO= 1
##$NAME= <H-C>
##$PROCNO= 1
##$TYPE= <nmr>
##$USER= <yarkov2>
##$AMP= (0..31)
100 100 100 100 100 100 100 100 100 100 100 100 100 100 100 100 100 100 
100 100 100 100 100 100 100 100 100 100 100 100 100 100 
##$AQSEQ= 0
##$AQ_mod= 1
##$AUNM= <au_zg>
##$AUTOPOS= <>
##$BF1= 200.13
##$BF2= 200.13
##$BF3= 200.13
##$BF4= 200.13
##$BF5= 200.13
##$BF6= 200.13
##$BF7= 200.13
##$BF8= 200.13
##$BYTORDA= 1
##$CFDGTYP= 0
##$CFRGTYP= 5
##$CHEMSTR= <none>
##$CNST= (0..31)
1 1 145 1 1 1 1 1 1 1 1 1 1 1 1 1 1 1 1 1 1 1 1 1 1 1 1 1 1 1 1 1 
##$CPDPRG= <>
##$CPDPRG1= <>
##$CPDPRG2= <>
##$CPDPRG3= <>
##$CPDPRG4= <mlev>
##$CPDPRG5= <mlev>
##$CPDPRG6= <mlev>
##$CPDPRG7= <mlev>
##$CPDPRG8= <mlev>
##$CPDPRGB= <>
##$CPDPRGT= <>
##$D= (0..31)
0 0.7 0 0 0 0 0 0 0 0 0 0.03 0 0 0 0 0 0 0 0 0 0 0 0 0 0 0 0 0 0 0 0 
##$DATE= 1777961443
##$DBL= (0..7)
120 120 120 120 120 120 120 120 
##$DBP= (0..7)
150 150 150 150 150 150 150 150 
##$DBP07= 0
##$DBPNAM0= <>
##$DBPNAM1= <>
##$DBPNAM2= <>
##$DBPNAM3= <>
##$DBPNAM4= <>
##$DBPNAM5= <>
##$DBPNAM6= <>
##$DBPNAM7= <>
##$DBPOAL= (0..7)
0.5 0.5 0.5 0.5 0.5 0.5 0.5 0.5 
##$DBPOFFS= (0..7)
0 0 0 0 0 0 0 0 
##$DE= 6
$$ [...]
##$SUBNAM3= <"">
##$SUBNAM4= <"">
##$SUBNAM5= <"">
##$SUBNAM6= <"">
##$SUBNAM7= <"">
##$SUBNAM8= <"">
##$SUBNAM9= <"">
##$SW= 18.0517328524113
##$SWIBOX= (0..15)
0 0 2 0 0 0 0 0 0 0 0 0 0 0 0 0 
##$SW_h= 3612.71676300578
##$TD= 16384
##$TD0= 1
##$TE= 0
##$TE2= 300
##$TE3= 300
##$TEG= 300
##$TL= (0..7)
0 120 120 120 120 120 120 120 
##$TP= (0..7)
150 150 150 150 150 150 150 150 
##$TP07= 0
##$TPNAME0= <>
##$TPNAME1= <>
##$TPNAME2= <>
##$TPNAME3= <>
##$TPNAME4= <>
##$TPNAME5= <>
##$TPNAME6= <>
##$TPNAME7= <>
##$TPOAL= (0..7)
0.5 0.5 0.5 0.5 0.5 0.5 0.5 0.5 
##$TPOFFS= (0..7)
0 0 0 0 0 0 0 0 
##$TUNHIN= 0
##$TUNHOUT= 0
##$TUNXOUT= 0
##$USERA1= <user>
##$USERA2= <user>
##$USERA3= <user>
##$USERA4= <user>
##$USERA5= <user>
##$V9= 5
##$VALIST= <valist>
##$VCLIST= <CCCCCCCCCCCCCCC>
##$VD= 0
##$VDLIST= <DDDDDDDDDDDDDDD>
##$VPLIST= <PPPPPPPPPPPPPPP>
##$VTLIST= <TTTTTTTTTTTTTTT>
##$WBST= 1024
##$WBSW= 4
##$XGAIN= (0..3)
0 0 0 0 
##$XL= 0
##$YL= 0
##$YMAX_a= 446777
##$YMIN_a= -331760
##$ZGOPTNS= <>
##$ZL1= 120
##$ZL2= 120
##$ZL3= 120
##$ZL4= 120
##$ABSF1= 18.07197
##$ABSF2= 0.02007294
##$ABSG= 5
##$ABSL= 3
##$ALPHA= 0
##$AQORDER= 0
##$ASSFAC= 0
##$ASSFACI= 0
##$ASSFACX= 0
##$ASSWID= 0
##$AUNMP= <proc_1d>
##$AZFE= 0.1
##$AZFW= 0.1
##$BCFW= 0
##$BC_mod= 2
##$BYTORDP= 0
##$COROFFS= 0
##$CY= -3
##$DATMOD= 1
##$DC= 0
##$DFILT= <>
##$DTYPP= 0
##$F1P= 0
##$F2P= 0
##$FCOR= 1
##$FTSIZE= 16384
##$FT_mod= 6
##$GAMMA= 0
##$GB= 0
##$INTBC= 1
##$INTSCL= 3.241238e-09
##$ISEN= 128
##$LB= 0.25
##$LEV0= 0
##$LPBIN= 0
##$MAXI= 10000
##$MC2= 0
##$MEAN= 0
##$ME_mod= 0
##$MI= 1.114404
##$NCOEF= 0
##$NC_proc= -7
##$NLEV= 6
##$NOISF1= 3.799351
##$NOISF2= 2.8
##$NSP= 0
##$NTH_PI= 0
##$NZP= 0
##$OFFSET= 18.07197
##$PC= 1
##$PHC0= -5303.516
##$PHC1= 11.42193
##$PH_mod= 1
##$PKNL= yes
##$PPARMOD= 0
##$PSCAL= 0
##$PSIGN= 0
##$REVERSE= no
##$SF= 200.129489625353
##$SI= 16384
##$SIGF1= 3
##$SIGF2= 2
##$SINO= 0.751879
##$SIOLD= 32768
##$SREGLST= <19F.Aceton>
##$SSB= 0
##$STSI= 16384
##$STSR= 0
##$SW_p= 3612.71676300578
##$SYMM= 0
##$S_DEV= 0
##$TDeff= 16384
##$TDoff= 0
##$TI= <>
##$TILT= no
##$TM1= 0
##$TM2= 0
##$TOPLEV= 0
##$USERP1= <user>
##$USERP2= <user>
##$USERP3= <user>
##$USERP4= <user>
##$USERP5= <user>
##$WDW= 1
##$XDIM= 16384
##$YMAX_p= 337997619
##$YMIN_p= -13014329
$$ End of Bruker specific parameters
$$ ---------------------------------
##NTUPLES= NMR SPECTRUM
##VAR_NAME=  FREQUENCY,     SPECTRUM/REAL,   SPECTRUM/IMAG
##SYMBOL=    X,             R,               I
##VAR_TYPE=  INDEPENDENT,   DEPENDENT,       DEPENDENT
##VAR_FORM=  AFFN,          ASDF,            ASDF
##VAR_DIM=   16384,         16384,           16384
##UNITS=     HZ,            ARBITRARY UNITS, ARBITRARY UNITS
##FACTOR=    0.220516191357247, 1,           1
##FIRST=     3616.73412981526, 0,            0
##LAST=      4.01736680947533, 0,            0
##MIN=       4.01736680947533, -13014329,    0
##MAX=       3616.73412981526, 337997619,    0
$$ Real data points
##PAGE= N=1
##DATA TABLE= (X++(R..R)), XYDATA
$$ [...]
3531B4753890R68138P56534M439l27728J45943J936930J507743n21153j088038
3522B8136698N45734J171659J175928N75979M23254J27920L85493O91704K00380
3513C3434749K02196l82064o2140J8788M60062o44206m19125o5973l70602q76908
3503C1294777N7866M01329m8597k99737o92732n02400p86304o86601q14427j29758
3493B7793416j4765j08699L15712L60212j92548n93231J09377L38611m21525p44300
3483B6842260K87648o75148j310970j756539j308335j540531p08284o10392o66867
3474A8552842m49023q86550q55069o44974P11099K14946K38282K37095L45720
3465A7464368K75002Q89668J46697q63442q92187l6210m29035r78904q49252r93002
$$ plain form
3531 24753890 25722028 26478562 26483001 26155273 26301216 28238146 29745889 29224736 28136698
3522 28136698 28682432 29854091 31030019 31605998 32029252 32157172 32542665 33234369 33434749
3513 33434749 33636945 33254881 33192741 33211529 33671591 33027385 32608260 32542287 32171685 31294777
3503 31294777 31352643 31753972 31705375 31405638 30712906 30210506 29424202 28737601 27923174 27793416
3493 27793416 27778651 27669952 27985664 28345876 28153328 27560097 27669474 28008085 27586560 26842260
3483 26842260 27129908 26454760 25143790 23387251 22078916 20538385 19830101 19219709 18552842
3474 18552842 18103819 17217269 16362200 15717226 16428325 16643271 16881553 17118648 17464368
3465 17464368 17739370 18629038 18775735 17912293 17020106 16983896 16554861 15575957 14726705 13733703
3455A3733703j148930j066871p80743r20123l79572p80795K43502L40028M88430
3446I728629o15040k45233P77158N6748j27899o31758o83712M7609P3232n09279
3436G870455p56871O6586M17318l00654m50834l25221k96392j13013R9989k64541
3426E946822k35131n90998m03640j53003N58313N86423m1123k15016l28504L93785
3416E517928L84920K21763j313q05745N1921M47983K69909o26233j03350P96298
3406F154081J89285l72495k35831k66361q39208L50909M57176J17914n08156m74495
3396D572819j89962Q17687J074800k6163j009827m41372J54474J01512L69695
3387E423663J35925n54190r10573N28895K81933K72916k28275L99908K491j21214
$$ plain form
3455 13733703 12584773 11517902 10737159 9817036 9437464 8656669 8900171 9240199 9728629
3446 9728629 9113589 8868356 9645514 9702262 9574363 8942605 8258893 8306502 8379734 7870455
3436 7870455 7113584 7180170 7597488 7296834 6846000 6520779 6224387 6111374 6211363 5946822
3426 5946822 5711691 5120693 4717053 4564050 5122363 5708786 5667663 5452647 5124143 5517928
3416 5517928 5902848 6124611 6123298 5317553 5369474 5817457 6087366 5461133 5357783 6154081
3406 6154081 6343366 5970871 5735040 5468679 4629471 4980380 5437556 5555470 5047314 4572819
3396 4572819 4382857 5200544 6275344 6249181 5239354 4797982 4952456 5053968 5423663
3387 5423663 5559588 5005398 4094825 4623720 4905653 5178569 4950294 5350202 5352693 5231479
3377E231479N530o5222K02634L35762m01758l00993N3323K76631n27266Q9660
3367D899780r7350m3658J58423J15860j9346j2642K7532k59485j46520O98249
3357E320843K36867m47099n34995k75968m5827M64385L61688o09940J79714K17664
3347D867332M36918o3942O47954N4201p3049l18560j66907J84926K04834J71939
3337E945646n18092k67809K29099o4409j5243l86994Q6486M52376P4259l51134
3327E184185q21624Q2964L24514K71389r0227j61842k19936j38614J17646M03723
3317D952178L6930l51886j04270L2998M1777q3175l10522J78216k09294L50740
3307D533692J20730k83108j83361m41277J91914L3388J95572k81194j50687m18494
$$ plain form
3377 5231479 5237009 5171787 5374421 5710183 5308425 5007432 5060755 5337386 4810120 4899780
3367 4899780 4802430 4758772 4917195 5033055 5013709 5001067 5028599 4769114 4622594 5320843
3357 5320843 5557710 5110611 4575616 4299648 4253821 4718206 5079894 4469954 4649668 4867332
3347 4867332 5304250 5240308 5888262 5942463 5869414 5550854 5383947 5568873 5773707 5945646
3337 5945646 5427554 5159745 5388844 5324435 5309192 4922198 5008684 5461060 5535319 5184185
3327 5184185 4362561 4445525 4770039 5041428 4951201 4789359 4569423 4430809 4548455 4952178
3317 4952178 4989108 4637222 4532952 4565950 4607727 4524552 4214030 4392246 4182952 4533692
3307 4533692 4654422 4371314 4187953 3746676 3938590 3971978 4167550 3886356 3735669 3317175
3297C317175J42890K4482M87966o7804l1083J29626K05476j34961L4031N05253
3287D613051K29478o20520o77074j46819M65249O52444l81334k77728l01749M02509
3277C957507M49468j75869J52820k43643m47629k54107J68968L20969p5580j36365
3267C716539K39896K21239L16416J47907k33054K92114K12695k98606J63185J52457
3257D930788l44322o63599J04471O34093Q9937k53434o89856m0753K00235K23658
3247D191218L7918j025739j16540j75808O52302R3866J37343m2580K3298P527
3237C782805j99615k644l70510M28049m71850o07496N14201K06096j94666J05584
3227C189954O14400l30967j04858P90723o71325l44191l04577O7401k38313M72651
$$ plain form
3297 3317175 3460065 3484547 3972513 3904709 3873626 4003252 4208728 4073767 4107798 4613051
3287 4613051 4842529 4222009 3544935 3398116 3863365 4515809 4134475 3856747 3554998 3957507
3277 3957507 4406975 4231106 4383926 4140283 3692654 3438547 3607515 3928484 3852904 3716539
3267 3716539 3956435 4177674 4494090 4641997 4408943 4701057 4913752 4615146 4778331 4930788
3257 4930788 4586466 3922867 4027338 4661431 4751368 4497934 3808078 3767325 3967560 4191218
3247 4191218 4229136 3203397 3086857 2911049 3563351 3657217 3794560 3751980 3775278 3782805
3237 3782805 3583190 3580546 3210036 3638085 3166235 2558739 3072940 3279036 3084370 3189954
3227 3189954 3804354 3473387 3368529 4159252 3487927 3143736 2839159 2906560 2668247 3140898
3217C140898J15971o56121l1299j8563M24539K21110M60589n62603m65186J49685
3207B779020j65983N78113k24771m9719k23986M2605j14626L31303L81883j25292
3197C208547m60399r513j94005j26278O72830O32931l84889J45632j69636J61224
3187C476444K88947N90719n54248j008491L06990k14969R46m15560P41384k65598
3177B946564k48240O06707J32478o87847l68045M55397P09792O6790k77074q44114
3167B492408l87304O99901Q64449j63946o27343j75771j98918J69121P24743J00937
3157C498277j006233J51141O00049J93430k7395M19502J52158o84975M0484l0385
3147C306053n14004J76305L7183j92961n98638P04651L44309n71880M0755K94618
$$ plain form
3217 3140898 3256869 2600748 2569449 2550886 2975425 3196535 3657124 3094521 2629335 2779020
3207 2779020 2613037 3191150 2966379 2916660 2692674 2735279 2620653 2951956 3333839 3208547
3197 3208547 2748148 2738635 2544630 2418352 3091182 3724113 3339224 3484856 3315220 3476444
3187 3476444 3765391 4356110 3801862 2793371 3100361 2885392 2886338 2470778 3212162 2946564
3177 2946564 2698324 3305031 3437509 2749662 2381617 2837014 3546806 3613596 3336522 2492408
3167 2492408 2105104 2805005 3669454 3505508 2878165 2702394 2503476 2672597 3397340 3498277
3157 3498277 2492044 2643185 3243234 3436664 3409269 3828771 3980929 3295954 3336438 3306053
3147 3306053 2792049 2968354 3005537 2812576 2213938 2918589 3262898 2691018 2731773 3026391
3137C026391m02056M22697K33172p35787r57614N98568N71984k77022K09864j39059
3127B551138o09456N94512N83504l94092l18226J06213j81545k37264P73534M92587
3117C360905r89945o0548K74045M56460n8068J12483o98998r06911R1319O94322
3107B275064J84027k34061n34966m74907N28473M57745L60299n9902m07004l29754
3097A765014J68337j94777M89818l00562l15037k06891P61554K05866q83210J36438
3087A626550P65679J14544p2626j27518l24397j25888Q58411l1860o72872m79886
3077A530137M94419k47217J38037l68343k02117j31905J71250O83185l12832k30234
3067A524380M98955m30209R7214L25050P73508m42016o69264K56045J5525J23735
$$ plain form
3137 3026391 2624335 3047032 3280204 2544417 1586803 2185371 2757355 2480333 2690197 2551138
3127 2551138 1941682 2536194 3119698 2725606 2407380 2513593 2332048 2094784 2868318 3360905
3117 3360905 2370960 2310412 2584457 3040917 2982849 3095332 2396334 1489423 1580742 2275064
3107 2275064 2459091 2225030 1690064 1215157 1743630 2201375 2561674 2501772 2094768 1765014
3097 1765014 1933351 1738574 2228392 1927830 1612793 1405902 2167456 2373322 1490112 1626550
3087 1626550 2392229 2506773 2434147 2306629 1982232 1856344 2714755 2682895 2010023 1530137
3077 1530137 2024556 1777339 1915376 1547033 1344916 1213011 1384261 2067446 1754614 1524380
3067 1524380 2023335 1593126 1690340 2015390 2788898 2346882 1677618 1933663 1949188 2072923
3057B072923O61838J74830n43665o7890J66989q8536R0789L11380n0887j183748
3047A544023K41246L17799J87129m80266L7805L79666m31501N23927p60343j85237
3037A374248O17620L51755o00271k52710P40623k87137l01867O55318L22119l1656
3027B588042m48133K4017j80103M49938m8881m27010n43494q1001N06966M57209
3017B297550j66914p43014j31651K99596M09579q3153j58990L11114j89950k00109
3007A644058J04153J049332P91638j057146m69151Q0122P49759n01090K26744
2998B618419K32822k62774J80928j75124J94788K98608N55926k39141m99036j57231
2988B748185j5609k64493K02485L91526j05865r8473J43044k11001P58M7196L61909
$$ plain form
3057 2072923 2734761 2909591 2365926 2298036 2465025 2376489 2467278 2778658 2727771 1544023
3047 1544023 1785269 2103068 2290197 1809931 1847736 2227402 1795901 2319828 1559485 1374248
3037 1374248 1991868 2343623 1743352 1490642 2231265 1944128 1642261 2297579 2619698 2588042
3027 2588042 2139909 2163926 1983823 2433761 2384880 1957870 1414376 1333375 1840341 2297550
3017 2297550 2130636 1387622 1255971 1555567 1965146 1881993 1723003 2034117 1844167 1644058
3007 1644058 1748211 2797543 3589181 2532035 2062884 2143006 2892765 2391675 2618419
2998 2618419 2851241 2588467 2769395 2594271 2789059 3087667 3643593 3404452 2905416 2748185
2988 2748185 2732576 2468083 2670568 3062094 2956229 2857756 3000800 2789799 2790557 2837753 3199662
2977C199662l22403J5194k89034J30656J24379j00005J67022Q5384P80861r6813
2967C694903n03700O33075j33775M47867j99001K6010k00953k34673m1976L87452
2957C875229R45418N9686m94119K98412P61179o8025K06141k37204j30952J35076
2947E350841M20337J06622o84574L83053l13219M48450M81582Q4858k51382l1862
2937E994706J36254N16558m4590P81774m17599J61886Q27723R44057O60777J012279
2927A0573825J835400K777694L110039K316985J018882n27550j09311k83383L4069
2918B0746650o59701J76805Q75228K252622M082831L972574M103802L024459K273325
2909D0848595K488305J441923J473992J27505K3261k11707M57751M00910K38432
$$ plain form
2977 3199662 2877259 2892453 2603419 2734075 2858454 2758449 2925471 3010855 3791716 3694903
2967 3694903 3191203 3824278 3690503 4138370 3939369 3965379 3764426 3529753 3487777 3875229
2957 3875229 4820647 4880333 4386214 4684626 5445805 5377780 5583921 5346717 5215765 5350841
2947 5350841 5771178 5877800 5193226 5576279 5263060 5711510 6193092 6277950 6026568 5994706
2937 5994706 6130960 6647518 6602928 7384702 6967103 7128989 7956712 8900769 9561546 10573825
2927 10573825 12409225 15186919 18296958 20613943 21632825 21105275 20995964 20712581 20746650
2918 20746650 20086949 20263754 21138982 23391604 27474435 31447009 35550811 38575270 40848595
2909 40848595 43336900 44778823 46252815 46380320 46403581 46191874 46649625 47050535 47288967
2900D7288967k52029J134085J358357J690764J282558J264362K439299K753510
2892E8959873K924396J716821O75865j007636j966976j454152j798581j665021
2884E6384589o96026j052761j621935j726086r02819q67327j678228j153189m76626
2875D6209592M87314L16800L96884j02080k3807j560623k676227l585077m021183
2866C5441593m689821m028710k755373j308388o83089j181498N5565J130316J254718
2857B3235313O14008r35125k338519k940914k211990j415113j084485j686714
2849A1236461j917721p83254n07371n12447m44162l85398k9541j80931m35532
2840F040104K86746l08806l03174p37950l31245Q42514p78253l81500j27947Q70680
$$ plain form
2900 47288967 47036938 48171023 49529380 51220144 52502702 53767064 56206363 58959873
2892 58959873 61884269 63601090 64276955 63269319 61302343 59848191 58049610 56384589
2884 56384589 55688563 54635802 53013867 51287781 50384962 49517635 47839407 46686218 46209592
2875 46209592 46696906 47013706 47410590 47308510 47284703 45724080 43047853 39462776 35441593
2866 35441593 30751772 26723062 23967689 22659301 21976212 20794714 20850279 21980595 23235313
2857 23235313 23849321 22914196 20575677 17634763 15422773 14007660 12923175 11236461
2849 11236461 9318740 8535486 8028115 7515668 7071506 6686108 6656567 6475636 6040104
2840 6040104 6326850 6018044 5714870 4976920 4645675 5488189 4709936 4328436 4200489 5071169
2830E071169K63039l11996n46935j44903k84643M99325k00999J64821n87864n76893
2820C344121J56711J90384K95747K54773k42980j43702k47448j92866J94075j17235
2810C491580N28496j584885O4555K61508p1734l3035L04649L92344m69566J95453
2800C079365O71171l34895k24873M64493L25363l66249j90695j35852q8858j88738
2790C010232M52463N6077K05753O28353n16687j66163M21721N42903K8578p27369
2780C935861J41639m62144m20356J95162O40181l00L74805O22153N51067N07488
2770F085556J100025J076365M32377k79288P1253j576879J25381L87743N58637
2761G981170j69533Q38108M82335q45082J29731J114358Q07019K55173K85060
$$ plain form
2830 5071169 5334208 5022212 4475277 4330374 4045731 4545056 4344057 4508878 3921014 3344121
2820 3344121 3500832 3691216 3986963 4241736 3998756 3855054 3607606 3414740 3608815 3491580
2810 3491580 4020076 2435191 2499746 2761254 2689520 2656485 2961134 3353478 2883912 3079365
2800 3079365 3750536 3415641 3190768 3655261 3980624 3614375 3423680 3287828 3198970 3010232
2790 3010232 3462695 3518772 3724525 4352878 3836191 3670028 4091749 4634652 4663230 3935861
2780 3935861 4077500 3615356 3195000 3390162 4030343 4030043 4404848 5027001 5578068 6085556
2770 6085556 7185581 8261946 8694323 8415035 8486288 6909409 7034790 7422533 7981170
2761 7981170 7811637 8649745 9132080 8286998 8416729 9531087 10338106 10593279 10878339
2752A0878339j000490j092891p09806M20372j46428k87648p09999q71936M82814
2743F962327P61510k88322k98435R4848p4951l11194j95860M87970R6900j06202
2733G128591m91488P08176P02824m01733k84342J90443N57112O89033P61578n35683
2723I024511o16849M76080J926866R79553O06693K45376M64293J099187M75551
2714A4681261q24729j464072j252085p40615J97736J32322m80448l73467M75090
2705A0350993J425096J296220N71345K37879R32312l7490r71161j117329j226348
2696A1461517j562830r15984K3825l56597j387317l39069p8225l11390o043K65558
2686F793445k70962j36002m00680l08296L81328M50267j27183o77349M9118J13032
$$ plain form
2752 10878339 9877849 8784958 8075152 8495524 8349096 8061448 7351449 6479513 6962327
2743 6962327 7723837 7435515 7137080 7231928 7156977 6845783 6649923 7137893 7234793 7128591
2733 7128591 6637103 7345279 8048103 7646370 7362028 7552471 8109583 8798616 9560194 9024511
2723 9024511 8407662 8883742 10810608 11790161 12396854 12642230 13106523 14205710 14681261
2714 14681261 13856532 12392460 11140375 10399760 10597496 10729818 10249370 9875903 10350993
2705 10350993 11776089 13072309 13643654 13881533 14813845 14776355 13805194 12687865 11461517
2696 11461517 9898687 8982703 9006528 8649931 7262614 6923545 6845320 6533930 6527887 6793445
2686 6793445 6522483 6386481 5985801 5677505 6058833 6509100 6381917 5704568 5753686 5866718
2676E866718K37698N04776k07626J86905K99874J007733O32210O70730R51700
2667A0150718J572695K035649P74383O53260O89907l94753j139726j83648n50451
2658A3608034j321634n32050k41099o5730m74443M28222q8252N52254J428332
2649A3293634N43865O20931J244389R14721j79447n64965q05022j468630p55803
2640A2843673l05230j245530p48192k02854l96843p80377k26111N10491J82129
2631I631156p50894o91011l43690R29608P94196n32231j28388n2873N98116P77694
2621A0231683L28201K56061L25308M69658L83735J173253J476643J063479P11148
2612A6419169J811973K065546K448998J659662Q91260L87420P59347O6412r04536
$$ plain form
2676 5866718 6104416 6609192 6401566 6588471 6888345 7896078 8528288 9199018 10150718
2667 10150718 11723413 13759062 14533445 15186705 15876612 15481859 14342133 14158485 13608034
2658 13608034 12286400 11754350 11513251 11447521 10973078 11401300 11313048 11865302 13293634
2649 13293634 13837499 14458430 15702819 16617540 16438093 15873128 15068106 13599476 12843673
2640 12843673 12538443 11292913 10544721 10341867 9945024 9164647 8938536 9449027 9631156
2631 9631156 8880262 8189251 7845561 8775169 9569365 9037134 8908746 8855873 9453989 10231683
2621 10231683 10559884 10815945 11141253 11610911 11994646 13167899 14644542 15708021 16419169
2612 16419169 18231142 20296688 22745686 24405348 25296608 25684028 26443375 26509787 25605251
2603B5605251m5363k40448j077305j085097n09202j181288p18521j75413L08483
2594B0881097J259470J685090J479588N23449J97845m41869j158227n46727j52938
2585B3726778j233715j522573r46189n51089M79980J449044J115267L84036k04143
2576B2697396L4517O43358J06040j198376k102738j028794o23975j30649m6972
2567A8349807r9662k53993l23790K49693J54755N91240J03746K07039N31865J388875
2557B0899575m07364K57780R81170J304691J581073J752463J903000J008473P72979
2548C0053840J531569J360337N95682J225267P72654J362000J341715K158689
2540D0401753J813147K037805K016680K128383K292864L067619K532444J723240
$$ plain form
2603 25605251 25559888 25319440 24242135 23157038 22647836 21466548 20748027 20572614 20881097
2594 20881097 22140567 23825657 25305245 25828694 26026539 25584670 24426443 23879716 23726778
2585 23726778 22493063 20970490 20024301 19473212 19953192 21402236 22517503 22901539 22697396
2576 22697396 22731913 23375271 23481311 22282935 20180197 19151403 18527428 18396779 18349807
2567 18349807 18250145 17996152 17672362 17922055 18076810 18668050 18771796 18978835 19510700 20899575
2557 20899575 20492211 20749991 21731161 23035852 24616925 26369388 28272388 29280861 30053840
2548 30053840 31585409 32945746 33541428 34766695 35539349 36901349 38243064 40401753
2540 40401753 42214900 44252705 46269385 48397768 50690632 53758251 56290695 58013935
2532E8013935K200439L116622L370132M130257O112456P133138J0783898J3311331
2524A08172208J2654614Q124939J511509m386561o329115o074349m487969l318962
2516A05866314k006233m14322O04446K101648L491904M543718O332169R339920
2508A29859564J1971405J4760555J5979543J3730952J1515862R828933P113648
2501B14760462J679922o731400j1785973j2556091j0761492q453379o601902n309977
2493A54240170l619042j914819J220856L666744M464373N960458Q490859J1936921
2485A84446520J3524852J2100656O215127j444959p140465r632909q954366p589822
2477A81524634p059310n917954n078495l226953k939971p49350R12755J751324
$$ plain form
2532 58013935 60214374 63330996 66701128 70831385 76943841 84076979 94860877 108172208
2524 108172208 120826822 128951761 130463270 126076709 119747594 113673245 109185276 105866314
2516 105866314 103860081 103445759 104050205 106151853 109643757 114187475 120519644 129859564
2508 129859564 141830969 156591524 172571067 186302019 197817881 207646814 214760462
2501 214760462 216440384 209708984 197923011 185366920 174605428 166152049 159550147 154240170
2493 154240170 150621128 148706309 149927165 153593909 158058282 164018740 172509599 184446520
2485 184446520 197971372 210072028 216287155 214842196 207701731 198068822 189114456 181524634
2477 181524634 174465324 168547370 163468875 160241922 157301951 156552601 157465356 159216680
2469A59216680K782079M070781M520913N776618P104992P833079R323058J0272037
2461B10900237R976903Q571377Q120232O557503M771816L582758K791517J211125
2453B56483468j146611k965347m724392n494701l598312k892160j776589j613445
2445B32271911j811075j602867q50587m42516M00265R80192J279545J589549L099668
2436B34914085M895590N779710O545869Q188076R068978J0136105J1101485J1515800
2428C02145698J0830686Q470720M685514M47591k418449m572453m886497n315864
2420C09386946o493047j0022805j2694147j2488723j1735536j1151891j0343223
2413B34457574r170183q806643p925888p083286n983514m468391l962433l472595
$$ plain form
2469 159216680 161998759 166069540 170590453 176367071 183472063 191305142 200628200 210900237
2461 210900237 220877140 229448517 237568749 244126252 248898068 252480826 255272343 256483468
2453 256483468 255336857 252371510 247647118 242152417 238554105 235661945 233885356 232271911
2445 232271911 230460836 228857969 228007382 227564866 227965131 228945323 230224868 231814417 234914085
2436 234914085 239809675 245589385 252135254 260323330 269392308 279528413 290629898 302145698
2428 302145698 312976384 321447104 326132618 326580209 324161760 319589307 314702810 309386946
2420 309386946 302893899 292871094 280176947 267688224 255952688 244800797 234457574
2413 234457574 225287391 216480748 208554860 201471574 195488060 191019669 187057236 183584641
2405A83584641k255150j283094o52639m39322k45473r45120j708393k446417k361389
2396A71247644k825274k787939l177339l965070n097880o772338p195373o351631
2388A33074800n372611m751049m764413m667888n515094n470591n908246o077581
2380I0547327n586627m911386m196713m491930l820682l481867k437913k101289
2372E9518920j425406j836020j821596j707397j239444l23523j451969j089497
2364D8624068o38071m88074o88450o72873n50322l44952J52871j29675l77739
2355D4886783M90295P09118R17683R86085J591029J133347P22793N48828j097543
2346E0888418j885466j843108j129286j568860j567562k023288j627546o36832
$$ plain form
2405 183584641 181329491 180046397 179393758 178954436 178708963 177763843 176055450 173609033 171247644
2396 171247644 168422370 165634431 162457092 158492022 153394142 146621804 139426431 133074800
2388 133074800 127702189 122951140 118186727 113518839 108003745 102533154 96624908 90547327
2380 90547327 84960700 80049314 75852601 71360671 67539989 64058122 61620209 59518920
2372 59518920 58093514 56257494 54435898 52728501 51489057 51165534 49713565 48624068
2364 48624068 47985997 47497923 46809473 46136600 45586278 45241326 45394197 45264522 44886783
2355 44886783 45377078 46086196 47003879 47989964 49580993 50714340 51437133 51985961 50888418
2346 50888418 49002952 47159844 46030558 44461698 42894136 40870848 39243302 38606470
2338C8606470o81965l06479l97707M62000l7672J57041O17125O77930K88096J83792
2328C9568631q0990q53913n13262j467298r28191r00055n84634j004320j65841
2319C3070127P54519R32157P12320J359737O04101J93946m71621j195317j649378
2310C4310591j598540j457167j368697l32562l93830j081713j266290m54634k63314
2301B6093844m9336q50171r84646l44485j14965J222737N71486P53907k73381
2292B6024990j21627L16330P65294o850j068837r02786o11093M53892K07951L71118
2282B5428382L62810P24389R31623P42818K12268j215402j266105j074617q33259
2273B4012907j562532j501740p76519q30050r35057M9017K50492L58841o09355
$$ plain form
2338 38606470 37924505 37618026 37220319 37682319 37644647 37801688 38418813 39096743 39384839 39568631
2328 39568631 39487641 38633728 38120466 36653168 35724977 34824922 34240288 33235968 33070127
2319 33070127 33824646 34756803 35469123 36828860 37432961 37626907 37155286 35959969 34310591
2310 34310591 32712051 31254884 29886187 29553625 29159795 28078082 26811792 26357158 26093844
2301 26093844 26044508 25194337 24209691 23865206 23750241 24972978 25544464 26298371 26024990
2292 26024990 25903363 26219693 26984987 26978137 25909300 25006514 24395421 24849313 25057264 25428382
2282 25428382 25791192 26515581 27447204 28190022 28402290 27186888 25920783 24846166 24012907
2273 24012907 22450375 20948635 20172116 19342066 18407009 18456026 18706518 19065359 18456004
2264A8456004L7444J038706J501924J239903N51112J147346N16423J058427N71960
2255B6119249N95240k00813p16229j777575j751663j271189q86409o61542o89980
2246A8759089l84499j135506q54309L85661M8919K42796R76511J143428P09932
2237A9892022J808258K183013J742961J995160K141112J986363N78605O50738
2229C2978232J566293J620319L974216N448772P685043J1142971J2266916R102862
2221H5785624L682002j895640o640790p271543o731793m048939j434197K080341
2213F3525065N024710P166450Q463585N482090R34976m596548o507158p322597
2205G2170573n097714k118461P11483N271281O891837M132413q9051n512519p296897
$$ plain form
2264 18456004 18493448 19532154 21034078 22273981 22825093 23972439 24488862 25547289 26119249
2255 26119249 26714489 26513676 25797447 24019872 22268209 20997020 20110611 19449069 18759089
2246 18759089 18374590 17239084 16384775 16770436 16819355 17062151 18038662 19182090 19892022
2237 19892022 21700280 23883293 25626254 27621414 29762526 31748889 32327494 32978232
2229 32978232 34544525 36164844 40139060 45587832 53272875 64415846 76682762 85785624
2221 85785624 89467626 87571986 80931196 73659653 66927860 62878921 61444724 63525065
2213 63525065 68549775 75716225 84179810 89661900 90596876 86000328 79493170 72170573
2205 72170573 67072859 64954398 65665881 70937162 77828999 81961412 81872361 76359842 69062945
2196F9062945p337451n604430m173206j902987J336626M469628O029151N565608
2188F7445884M024707j236175n479396p929345p815265p082203o222747m833067
2180C0872393l422643k856916l576461j965792k003968j460571q20673q89198
2172A3876171k13654o40134l77916j110217o96592L52555j67939q68690q06903
2163I346681r4785p62971n4004N55306p32382n79211K17365M7353l47543l21397
2153G274412o1729J51713m8602O8469P4424l15887N92921m0200n76408K60009
2143G379122L12072j8305p75933K2710N30116M24632l89038L9359N79459J96316
2133H300510q1669k50512m74272N07710m58287p03921p19040K6473K13600K78782
$$ plain form
2196 69062945 61725494 56121064 51947858 50044871 51381497 55851125 61880276 67445884
2188 67445884 71470591 70234416 64755020 56825675 49010410 41928207 35705460 30872393
2180 30872393 27449750 24592834 21016373 19050581 17046613 15586042 14765369 13876171
2172 13876171 13662517 13022383 12644467 11534250 10837658 11190213 11022274 10153584 9346681
2163 9346681 9251896 8488925 8434921 8990227 8257845 7678634 7895999 7943352 7595809 7274412
2153 7274412 7212683 7364396 7315794 7384263 7458687 7142800 7735721 7695521 7119113 7379122
2143 7379122 7691194 7672889 6896956 6919666 7449782 7874414 7485376 7524735 8104194 8300510
2133 8300510 8218841 7968329 7494057 8001767 7543480 6839559 6120519 6146992 6360592 6639374
2123F639374N6737L70011n02850j52836M72455L99351m06451l13320p44046l01224
2113E517201j94566L39492N96537l48438m87665K24648M22602J99405M08812o21618
2103F056410l92781m27366M87809L68109J23128m93616p95243j45689P43921O49590
2093F174272k89256j030447j32069k25931Q0391R10k38734k92125m06728L70831
2083D011114J72605M29216l7573L442k33364K4005o033l2750n2939K67051q731
2072D536043j2244P36686M81663J6793J080478J415580J477420O99007O03826
2063A1035252O38294j245041j082647j357146j80472o9114l17657q54573j58493
2054F408403n58285k87141J75511L85312o92286q80932j01142M89361J05991n43938
$$ plain form
2123 6639374 6696111 7066122 6563272 6410436 6882891 7282242 6875791 6562471 5818425 5517201
2113 5517201 5322635 5662127 6258664 5910226 5422561 5647209 6069811 6269216 6678028 6056410
2103 6056410 5663629 5236263 5724072 6092181 6215309 5721693 4926450 4780761 5524682 6174272
2093 6174272 5885016 4854569 4722500 4496569 4576960 4577870 4339136 4047011 3640283 4011114
2083 4011114 4183719 4612935 4575362 4578804 4345440 4369445 4363412 4330662 4277723 4544774 4536043
2072 4536043 4523799 5260485 5742148 5758941 6839419 8254999 9732419 10431426 11035252
2063 11035252 11673546 10428505 9345858 7988712 7808240 7739126 7421469 6566896 6408403
2054 6408403 5850118 5562977 5738488 6123800 5431514 4550582 4449440 4938801 5044792 4500854
2044D500854k48946l27786L91007R6862k46360m36145Q5605k85733Q44317K99308
2034D672983l27101m95791M99888M59018K82714L33083m20732J20152n73642O26351
2024E176923M31794L27069l54544p23591J8452N64575l7625O6911Q925k81307
2014E197582J8800J99077M1441m29210j84963p5005k74150L46323p4895l76562
2004D388438j02945O8018J038238K0584L26026K34177n79322M49270M23072L05392
1994F570948j29841p78923o2416m4568L79948O93487j62616q61063l00695N75915
1984E880176R07875m03567m96568j96529K58466P28118r6086L76056o2473K63459
1974G158927J30192N05374J411944J06228L85785J067286J478931J145021R78647
$$ plain form
2044 4500854 4251908 3924122 4315129 4411991 4165631 3729486 3815091 3529358 4373675 4672983
2034 4672983 4345882 3850091 4349979 4808997 5091711 5424794 5004062 5124214 4550572 5176923
2024 5176923 5608717 5935786 5581242 4857651 4876103 5440678 5403053 5469964 5478889 5197582
2014 5197582 5216382 5415459 5456900 5027690 4842727 4767722 4493572 4839895 4765000 4388438
2004 4388438 4285493 4353511 5391749 5412333 5738359 5972536 5393214 5842484 6265556 6570948
1994 6570948 6441107 5662184 5599768 5555200 5935148 6628635 6466019 5604956 5304261 5880176
1984 5880176 6788051 6384484 5887916 5691387 5949853 6677971 6581885 6957941 6895468 7158927
1974 7158927 7289119 7794493 9206437 9312665 9698450 10765736 12244667 13389688 14368335
1965A4368335N66794m38866p31159K44962L25525K3039k57700K31622P98198J411423
1955A6542173J231073P92437j76871l43226p51446l75120J6521n01336K00537
1946A6634742N88522J019519K14506p6703o94025q06095l45913o62415n89112
1937A5283026m17398J15555P74304L79058M94173L24916M61557o43255j162551
1928A5609385n78751K35544m76203m45148p4284l33662L96633L05391L63597j98440
1918A4804062M64608O69459J099578J116777O79663J683073K990690K858892K626648
1909B8993450K931151M494202N031816N095076M963903L096658L058066L550723
1901F1215045L892165M127320M032958J917890J268813o61078k120908k904638
$$ plain form
1965 14368335 14935129 14496263 13765104 14010066 14335591 14358630 14100930 14332552 15130750 16542173
1955 16542173 17773246 18565683 18388812 18045586 17294140 16919020 16935541 16434205 16634742
1946 16634742 17223264 18242783 18457289 18380586 17686561 16880466 16534553 15872138 15283026
1937 15283026 14865628 14981183 15755487 16134545 16628718 16953634 17415191 16771936 15609385
1928 15609385 15030634 15266178 14789975 14344827 14270543 13936881 14333514 14638905 15002502 14804062
1918 14804062 15268670 15938129 17037707 18154484 18834147 20517220 23507910 26366802 28993450
1909 28993450 31924601 36418803 41450619 46545695 51509598 54606256 57664322 61215045
1901 61215045 65107210 69234530 73267488 75185378 76454191 75793113 73672205 70767567
1893G0767567k520029l454012l347819k632057l820983m873940n075901m004971
1885D1037855l912442l446616l125179l910434l087763j500572j478134j207678
1877A9369037j420497j569705o40021l92804q38778p97229K13726k80013j029164
1868A2614552n85153j76247J59066J96417j36717j49744p84088N4590O1890J19870
1858A1374436M63268r73537m38708N01793M54083q4283k77156j96686P40572L54654
1848A1918436K37925l68938l24762K56941O3648L45052k32002j4204N60336k4461
1838A2417971L64648N99230J062432L50812J57855N44800K33557P45415J349263
1829A7825983M32892L60096J425203J548295J411507K197627K223754J517782
$$ plain form
1893 70767567 68247538 64793526 61445707 58813650 54992667 50118727 45042826 41037855
1885 41037855 37125413 33678797 30553618 26643184 23555421 22054849 20576715 19369037
1877 19369037 17948540 16378835 15738814 15346010 14507232 13710003 13923729 13643716 12614552
1868 12614552 12029399 11853152 12012218 12208635 12071918 11922174 11138086 11192676 11254566 11374436
1858 11374436 11837704 10864167 10425459 10927252 11381335 11297052 11019896 10823210 11563782 11918436
1848 11918436 12156361 11787423 11462661 11719602 11783250 12128302 11896300 11882096 12442432 12417971
1838 12417971 12782619 13381849 14444281 14795093 14952948 15497748 15731305 16476720 17825983
1829 17825983 18258875 18618971 20044174 21592469 23003976 25201603 27425357 28943139
1821B8943139O53463J484712J105271J405972J093925M56397J43805O52305J002592
1812C6941581J193350J148055J226187J364074K031893K480675K750527K093667
1804E1230009K373454K893018K012587J235744K045163K620905J385589J910676
1796F7707145K080732J622668J115109J560523J826294J813228K277764K344247
1788H2347710R55256J245556J377459J205759J755669K195284K545027L946567
1780I7574287M981125N859618N261964M460903K808326J811752K223169J631619
1772A26612763J901350J208846J470858J812112J863077P98154O96353O33372
1764A36996885R49248J381980J578323L41295j265703j61211K25697N53581Q44814
$$ plain form
1821 28943139 29596602 31081314 32186585 33592557 34686482 35142879 35286684 35938989 36941581
1812 36941581 38134931 39282986 40509173 41873247 43905140 46385815 49136342 51230009
1804 51230009 53603463 56496481 58509068 59744812 61789975 64410880 65796469 67707145
1796 67707145 69787877 71410545 72525654 74086177 75912471 77725699 80003463 82347710
1788 82347710 83302966 84548522 85925981 87131740 88887409 91082693 93627720 97574287
1780 97574287 102555412 108415030 113676994 118137897 120946223 122757975 124981144 126612763
1772 126612763 128514113 129722959 131193817 133005929 134869006 135667160 136363513 136996885
1764 136996885 137946133 139328113 140906436 141247731 139982028 139820817 140046514 140600095 141444909
1755A41444909J256975K304738L302509N627117O942851O394671N618406M186128
1747A77078304N616476O075350O486065N383194M264244L979565L695283L799766
1739B16378247L344755K604888J071196M10654O0390m76370j206982j300099k75209
1730B20611470m14776J131569K079850L193850L258732M116762L880593J540484
1722B39398534L00106j537767j982108k446552j762276j262520q83230L35565
1714B30159752R25426K308944K625149K738714J395922j15127K07655q18863j060454
1705B38367118p33404j271396k514766l653785l266682k918364k427888m196204
1697B17384629n209965p067379p437417p785787p109501n386528m437377k617494
$$ plain form
1755 141444909 142701884 145006622 148309131 153936248 160879099 167273770 172892176 177078304
1747 177078304 182694780 188770130 195256195 200639389 204903633 208883198 212578481 216378247
1739 216378247 219723002 222327890 223399086 223809740 223870130 223393760 222186778 220886679 220611470
1730 220611470 220196694 221328263 223408113 226601963 229860695 233977457 237858050 239398534
1722 239398534 239698640 238160873 236178765 233732213 231969937 230707417 229824187 230159752
1714 230159752 231085178 233394122 236019271 238757985 240153907 240038780 240246435 239427572 238367118
1705 238367118 237633714 236362318 233847552 230193767 226927085 224008721 221580833 217384629
1697 217384629 212174664 205107285 197669868 189884081 182774580 177388052 172950675 170333181
1689A70333181j991617j093094q70499K72063O11565l53316Q70954o5516j625681
1680A66088040j921541k139858k109713k577592k290715k606662k074945K87851
1672A50654865Q51434l20434n87868k732359m544658n067275m769534n449628
1664A28034543n486652l994739k671904k571981j933887k395169k636210k956774
1656A03387227k080590j648160k284894j899001k862094k046026j352731j928226
1648H7285505k423658j447999j336652j427552j814630j789298k412186k960429
1640G1673101k596118k514604k404372l393930k385045k051561r80167j630840
1632E3716464k369600j183550l09784r40500j122456o94546l42411o23745j460386
$$ plain form
1689 170333181 168341564 167248470 166377971 166650034 167261599 166908283 167779237 167713721 166088040
1680 166088040 164166499 162026641 159916928 157339336 155048621 152441959 150367014 150654865
1672 150654865 151506299 151185865 150597997 147865638 143320980 138253705 133484171 128034543
1664 128034543 122547891 118553152 115881248 113309267 111375380 108980211 106344001 103387227
1656 103387227 101306637 99658477 97373583 95474582 92612488 90566462 89213731 87285505
1648 87285505 84861847 83413848 82077196 80649644 78835014 77045716 74633530 71673101
1640 71673101 69076983 66562379 64158007 60764077 58379032 56327471 55347304 53716464
1632 53716464 51346864 50163314 49853530 48913030 47790574 47096028 46753617 46129872 44669486
1623D4669486j191725j623369j550769q83518j302267j754422j628530q79448
1615C3855438o60533n40927p30834j578517r41192m13303l89442n89911q40032
1606B7170747J68921l13067q38096j216435j294489j082691k10813N7235n99344
1597B1841968j229776o30816J0616p7732K47385q9700r10131n57293k05584K83436
1587A8682373j95114K04765k44189m91197o20159j3794J87708q221k83590j032979
1577A6185603j605191n15876K88433J01068m73861l32654n58723K57312M91707
1568A3837818p4754o8137k53979J51029l0835l39514j72899j98221k33133M42271
1558A3059646L44864K86249l44539o01863K18056O54963k65182o07686o11901
$$ plain form
1623 44669486 43477761 41854392 40303623 39420105 38117838 36363416 34734886 33855438
1615 33855438 33194905 32653978 31923144 30344627 29403435 28990132 28600690 28010779 27170747
1606 27170747 27339668 27026601 26188505 24972070 23677581 22594890 22384077 22441312 21841968
1597 21841968 20612192 19981376 19991992 19914260 20161645 20071945 19161814 18604521 18398937 18682373
1587 18682373 18487259 18692024 18447835 17956638 17336479 17322685 17510393 17502172 17218582 16185603
1577 16185603 14580412 14064536 14352969 14454037 13980176 13647522 13088799 13346111 13837818
1568 13837818 13763064 13694927 13440948 13591977 13561142 13221628 13048729 12850508 12617375 13059646
1558 13059646 13404510 13690759 13346220 12744357 12962413 13617376 13352194 12744508 12132607
1549A2132607m02405j60336O21636N6537k97699k72197J98238M28243O27869L06032
1539A3238525m8380j023537k2020K88472k27751k94412n25400J3240P19862N65811
1529A2684410K56281n89465r3539p1199L32077M72631K02204o65868p51939K5085
1519A1800678P87233K73826Q9840J26565J07488N59501Q31221M05085L0228n82514
1509A4429151L24469k59084N15732J292374Q10646L49873L26620O71465J847678
1500B0308924K011453J011289P57255J211910J575134J619022J764691K335255
1492C2594933J892795J831632K083239K439714J942975J695214J432257J839412
1484D7752171K354848J773435J438953K461929J687481J982619J858756K091263
$$ plain form
1549 12132607 11730202 11569866 12191502 12248039 11950340 11678143 11876381 12304624 12932493 13238525
1539 13238525 13190145 12166608 12144588 12433060 12205309 11910897 11385497 11398737 12118599 12684410
1529 12684410 12940691 12351226 12257687 12186488 12518565 12991196 13193400 12527532 11775593 11800678
1519 11800678 12587911 12861737 12951577 13078142 13185630 13745131 14576352 14981437 15011665 14429151
1509 14429151 14753620 14494536 15010268 16302642 17113288 17463161 17789781 18461246 20308924
1500 20308924 22320377 23331666 24088921 25300831 26875965 28494987 30259678 32594933
1492 32594933 34487728 36319360 38402599 40842313 42785288 44480502 45912759 47752171
1484 47752171 50107019 51880454 53319407 55781336 57468817 59451436 61310192 63401455
1476F3401455J861554Q95532J346113J273145L01148j55148m62057j589566l63718
1467F6508458m40882n52093j220628j426102j382562j041697q51417o60905j928610
1458E7003562j510527j250498j074382j890180j674530k160726j961233j531477
1450D3950009j070924k108101k041744k027419j249757j011060j23530l25997
1442C3991477j179316l60402P88257J06037N53612O71910N439J92903K9552P63317
1432C5562786M72305O21778J262479Q48973O48636O17158J010928R54788J323899
1423D3323730M63585L03695r56447K77952K60503M98633l509j48830q29245q91469
1413D2298598M4317J76917j036359q12103j249154j424119n01465q23172o93349
$$ plain form
1476 63401455 65263009 66158541 67504654 68777799 69078947 68923799 68461742 66872176 66508458
1467 66508458 66067576 65515483 64294855 62868753 61486191 60444494 59593077 58932172 57003562
1458 57003562 55493035 54242537 53168155 51277975 49603445 47442719 45481486 43950009
1450 43950009 42879085 40770984 38729240 36701821 35452064 34441004 34317474 33991477
1442 33991477 32812161 32451759 33240016 33346053 33899665 34571575 34577014 34769917 34799469 35562786
1432 35562786 36035091 36656869 37919348 38768321 39416957 40034115 41045043 41999831 43323730
1423 43323730 43787315 44091010 43134563 43412515 43673018 44171651 44168142 44019312 43190067 42298598
1413 42298598 42342915 42519832 41483473 40671370 39422216 37998097 37496632 36673460 35980111
1404C5980111j629653k86727k17302m67790p44691j28088n78108m59452p68950
1395C0699350o79142k934p14460l40415j79230P90992R69927j47803l26786J0675
1385C0080174J321694J620631J001768K96993N29686M33754J422735J855318J272442
1376C9835195m08871N35637R34779O20645M79732R29274L0497Q28670J392772
1367D5178330J570237L8560j02355M65470k16135N70456K67854r18378q17191
1358D6036848o79366j330048r27197p30687j115826j645027k269262j435078m21824
1349C5482533l55515r94141j347887j213811j466186j108447n01001o28338r38434
1340B6928773k90526j05284j130889O7992P85279O12636J17303L29215k2061J12079
$$ plain form
1404 35980111 34350458 34063731 33846429 33378639 32633948 32505860 31927752 31468300 30699350
1395 30699350 30020208 30017274 29302814 28962399 28783169 29574161 30544088 30396285 30069499 30080174
1385 30080174 31401868 33022499 34024267 34321260 34850946 35284700 36707435 38562753 39835195
1376 39835195 39426324 39961961 40896740 41517385 41997117 42926391 42956888 43785558 45178330
1367 45178330 46748567 46787127 46684772 47150242 46934107 47504563 47772417 46854039 46036848
1358 46036848 45357482 44027434 43100237 42369550 41253724 39608697 37339435 35904357 35482533
1349 35482533 35127018 34132877 32784990 31571179 30104993 28996546 28495545 27867207 26928773
1340 26928773 26638247 26532963 25402074 25470066 26255345 26867981 26985284 27314499 27292438 27404517
1330B7404517J59509P48483R88418K154674J935231O63182R82913K572783J901018
1321C9510728J854616J521768J139134R20406Q71831J244719J539615J120900
1313D9723717L66787J72631l45520k60607p37815p26324o19693j167844j97563
1304D6207769M96948L8553o29196n79608P8880K8619j80913j462344o88672q35761
1294D2474275o54349k27500L4318n88229o55694j364941j135144r35755j216017
1285C5730964j421870j453248j463554o94274o53703k94413O8155K85512N90981
1276C0694550Q67249O34946N28082P40736l6023m88053K70576O78095M29661n93761
1266C3726058K57751L44598J276192J336118O28353j00493M24496N76757L87667
$$ plain form
1330 27404517 27564026 28312509 29300927 31455601 33390832 34054014 35036927 37609710 39510728
1321 39510728 41365344 42887112 44026246 44946652 45818483 47063202 48602817 49723717
1313 49723717 50090504 50263135 49917615 49657008 48919193 48192869 47573176 46405332 46207769
1304 46207769 46704717 46743270 46114074 45534466 45613346 45641965 45461052 43998708 43310036 42474275
1294 42474275 41819926 41592426 41626744 41038515 40382821 39017880 37882736 36946981 35730964
1285 35730964 34309094 32855846 31392292 30698018 30044315 29749902 29818057 30103569 30694550
1276 30694550 31561799 32196745 32724827 33465563 33429540 32941487 33212063 33890158 34319819 33726058
1266 33726058 33983809 34328407 35604599 36940717 37569070 37468577 37893073 38469830 38857497
1257C8857497m31116m76412j054762p89090n02517M52653j1728k73959k86311
1248C5484255L03453O45536J485540R93930M85159J406160R85671J144127M88031
1239D3421862N81065Q46054R37093N02237L67984j77837j99937j213108j079261
1230D3986152j137393j128280j295180q98597p02644J91752P85635J008936J254400
1221D2064781J810966J699009J052154J490618Q90253J18188q06376j182164j326945
1212D5810484j044119r08990q03834j184643m91159J34708m48840o73564n57866
1203C9832177L60453L23909m4228l24652K69590M89913J231841N62913O10474
1194D3312390R28235J296729J219979J485331J276854P00783J071067K394146
$$ plain form
1257 38857497 38426381 37949969 36895207 36106117 35603600 36056253 36044525 35770566 35484255
1248 35484255 35787708 36433244 37918784 38912714 39397873 40804033 41789704 42933831 43421862
1239 43421862 44002927 44848981 45786074 46288311 46656295 46478458 46278521 45065413 43986152
1230 43986152 42848759 41720479 40425299 39526702 38824058 39015810 39801445 40810381 42064781
1221 42064781 43875747 45574756 46626910 48117528 49007781 49125969 48319593 47137429 45810484
1212 45810484 44766365 43857375 43053541 41868898 41377739 41512447 41063607 40390043 39832177
1203 39832177 40192630 40516539 40472311 40147659 40417249 40907162 42139003 42701916 43312390
1194 43312390 44240625 45537354 46757333 48242664 49519518 50220301 51291368 53685514
1186E3685514J668678J803554J663690K316951K945780L717564L793557L699744
1178G5295032L728749M259171M164371M901904M844132L953174M574903M086705
1170A09808141K639600J966112J389510M49423n24950p96339l96619o83801j151158
1161A12699919j816411k251296l277533m899177o148487o402714m994791m044740
1153G8864770l392990m175531m901403l861979k867578k856894l007715k698579
1145E1102101l035739k082625k117003j945217j723310j376092j648079j620286
1137C5553750n06017k60976j043684j093168j03490J92807L68369m583m55479
1128C2647529j94829M18311P09945j26807l26953r75681p82906N8846J79799j173666
$$ plain form
1186 53685514 55354192 57157746 58821436 61138387 64084167 67801731 71595288 75295032
1178 75295032 79023781 83282952 87447323 92349227 97193359 101146533 105721436 109808141
1170 109808141 112447741 114413853 115803363 116252786 115727836 114931497 114534878 113851077 112699919
1161 112699919 110883508 108632212 105354679 100455502 94307015 87904301 82909510 78864770
1153 78864770 75471780 71296249 66394846 62532867 59665289 56808395 53800680 51102101
1145 51102101 48066362 45983737 43866734 41921517 40198207 38822115 37174036 35553750
1137 35553750 35047733 34786757 33743073 32649905 32546415 32739222 33107591 33103008 32647529
1128 32647529 32452700 32871011 33580956 33454149 33127196 32151515 31368609 31427455 31607254 30433588
1118C0433588j188410o69389P75118Q91346M01282l51775j48974L76801N69534
1109C1089121O77196P98468l21079K52013P94237M46519N14953O15048N39796
1100C5406272k04401j68987M30110N17493N68517K42063n92434K71181M69515
1091C6939329j76888l21234o13j70469n92536q68003j631980j410797O9529J91506
1081C2027844l3313m976j53618p5773l3717J559995O56138M06059K15441P54885
1071C5318965J598045K211125J306051l9290k63426J80573k8185k56704N1176
1062D0078330n48639k47359p8708K75497O97770J510444K777390M000635N353334
1053E3818694O430958N523128L236117j099431m392062n737360n875706m515765
$$ plain form
1118 30433588 29245178 28575789 29350907 30242253 30643535 30291760 30142786 30519587 31089121
1109 31089121 31766317 32564785 32243706 32495719 33289956 33736475 34251428 34866476 35406272
1100 35406272 35201871 35032884 35462994 35980487 36549004 36791067 36198633 36469814 36939329
1091 36939329 36762441 36441207 36440594 36270125 35677589 34809586 33177606 31766809 31836338 32027844
1081 32027844 31994531 31989555 31835937 31760164 31726447 33286442 33942580 34348639 34564080 35318965
1071 35318965 36917010 39128135 40434186 40394896 40131470 40312043 40283858 40027154 40078330
1062 40078330 39529691 39282332 39203624 39479121 40176891 41687335 44464725 48465360 53818694
1053 53818694 60249652 65772780 69008897 67909466 63517404 57780044 51904338 47388573
1045D7388573l592842k706583k405346j500877q38127j233990o31781l72752m49981
1036C3656294o68455K32457j70482n4521k18054R8404K13556J014450M58375L89507
1026C4951531N18709R3941J02223p2688L78963J31201N80941Q32499J037384J461622
1016D0016326K158233K414989K955321K876111J947829J772518J053976J903302
1008E7098605J860236L685219L061133L116192J884576O82005o86731r59170j257056
999F8485009q39954r77875p96677j004975j758361j767228k964142k325714k287754
990E3762329o89530j977L23081j98795P85876J551103K603973K096345J642356
981F1874761K410158K513298L661445M774723P258632Q934287J2671335J8817560
$$ plain form
1045 47388573 43795731 41089148 38683802 37182925 36344798 35110808 34479027 34106275 33656294
1036 33656294 32987839 33220296 33049814 32995293 32777239 32875643 33089199 34103649 34562024 34951531
1026 34951531 35470240 35564181 35666404 35593716 35972679 36103880 36684821 37517320 38554704 40016326
1016 40016326 42174559 44589548 47544869 50420980 52368809 54141327 55195303 57098605
1008 57098605 58958841 62644060 65705193 68821385 70705961 71387966 70701235 69742065 68485009
999 68485009 67645055 66667180 65870503 64865528 63107167 61339939 58375797 56050083 53762329
990 53762329 53072799 53070822 53393903 53195108 53980984 55532087 58136060 60232405 61874761
981 61874761 64284919 66798217 70459662 75234385 82493017 91427304 104098639 122916199
973A22916199K3728838K6360216K4065181J5326717M031194o443838j3314153
966A96670354j5118497j4154109j1094652q945691n639262l386828k434839j509866
958A34386610p36390k45941J508870M761618R929074J5736114J8540759J5280661
950A99161375P023861m01117k325297J178314Q999735J5863584K1063243J9643942
942B70207640J1103581k302511j4400493k1968635k4959039k3523214j9803305
935A74354024j6818736j3595726j0346979q476972o932148m663060k672679k194746
927A08652978j815047j879384k142994j858636j370133j437218R4266J730887
919I9974719J643904J136376K68838l35175q28054J213N66718J098204K117586
$$ plain form
973 122916199 146645037 173005253 197070434 212397151 216428345 209984507 196670354
966 196670354 181551857 167397748 156303096 147357405 141718143 138331315 135896476 134386610
958 134386610 133650220 133404279 134913149 139674767 149603841 165339955 183880714 199161375
950 199161375 206185236 205784119 203458822 204637136 213636871 229500455 250563698 270207640
942 270207640 281311221 279008710 264608217 242639582 217680543 194157329 174354024
935 174354024 157535288 143939562 133592583 125115611 118183463 113520403 110847724 108652978
927 108652978 106837931 104958547 102815553 100956917 99586784 98149566 98243832 99974719
919 99974719 101618623 102754999 103023837 102688662 101860608 101861821 102428539 103526743 105644329
910A05644329L173265N086707P063818Q873128J1287915J6208025K1206889K6496053
902B05040129L1627041L2491581K8170462K0563648J2334882N968332J801544
895C37997619o37784n950163j4273847k0857239k6042556k7570316k6159422k4195359
887A92310933k1946905j7807770j4171774j2319313j1463923j0026993p985394
880I6588861o600919m635246m881745m744011l844813k258062k522317k626271
872F4475477k466759j913327j295568r47917j269320p73391l65295J147344R84999
863E7576243M68377R82680M28849L63836M65611R18071J155730Q40222O94007
854F3893626J367565J674701J581619P90728L19207M49283J044269O97814L06496
$$ plain form
910 105644329 108817594 113904301 120968119 129841247 141129162 157337187 178544076 205040129
902 205040129 236667170 269158751 297329213 317892861 330227743 336196075 337997619
895 337997619 337359835 331409672 317135825 296278586 270236030 242665714 216506292 192310933
887 192310933 170364028 152556258 138384484 126065171 114601248 104574255 96588861
880 96588861 89987942 85352696 80470951 75726940 71882127 69624065 67101748 64475477
872 64475477 62008718 60095391 58799823 57851906 56582586 55809195 55443900 56591244 57576243
863 57576243 58044620 59027300 59456149 59819985 60285596 61203667 62359397 63199619 63893626
854 63893626 65261191 66935892 68517511 69308239 69627446 70076729 71120998 71818812 72125308
845G2125308k80087r85435j706422j061900j712129j225089n37883o07138n78964
836F3430261j370160j53666j03834j28898J56733R05088Q92447J470970K583033
827F7681974M911989O961001Q140774O642013L261522j510065n213835o326229
819H4549144o107008n394696n539847m870305l944195l022327k675263j742363
811E1253140j623879j942777j445246o81935n0998n47438o17017K86430M91523
802D5121803Q10769M97566J320767J471946J521511J669824L574192M623391M738326
793F5350095M506865L333163K828038J149679j513844m232534n653986n461780
785F0305696m754810m987493l745912l921558k921595k624250j868053k117005
$$ plain form
845 72125308 71845221 70859786 69153364 68091464 66379335 65154246 64616363 64009225 63430261
836 63430261 62060101 61906435 61802601 61673703 61830436 62735524 63627971 65098941 67681974
827 67681974 72593963 79554964 87695738 94337751 97599273 96089208 90875373 84549144
819 84549144 78442136 73047440 67507593 62637288 58693093 55670766 52995503 51253140
811 51253140 49629261 47686484 46241238 45559303 45508305 44960867 44343850 44630280 45121803
802 45121803 45932572 46430138 47750905 49222851 50744362 52414186 55988378 60611769 65350095
793 65350095 69856960 73190123 76018161 77167840 75653996 71421462 65767476 60305696
785 60305696 55550886 50563393 46817481 42895923 39974328 37350078 35482025 33365020
777C3365020j437884j169104r98759k17309n00941r17453k342351N5014m5265
768B5790968K02957q16664l13733p86594o47607O64422O43609J72464l85259k29158
758B4295405M46188J1973M82871O56918K29163P6055l34489P95180J334670J219072
748B9213006r7225J018215J088765K187985J719481J781138K581577K118854L321774
739D4933570L885374M965755M713118O021179Q479405J1279908J3676283J6574887
731A14529479J9636108J9588631J7315975J2014895N260623j271202n088472n335914
723A76650123l843887K8580M225561R075127J2889901J3009490P512904j130548
715B18417251p875704j4122740j8104992j9525744j8642396j7523063j5113323
$$ plain form
777 33365020 31927136 30758032 29759273 29541964 29041023 28123570 25781219 25836233 25790968
768 25790968 25993925 25177261 24863528 24076934 23429327 24093749 24737358 24909822 24524563 24295405
758 24295405 24741593 24753566 25236437 25893355 26122518 26198573 25864084 26659264 27993934 29213006
748 29213006 29115781 30133996 31222761 33410746 35130227 36911365 39492942 41611796 44933570
739 44933570 48818944 53784699 58497817 64518996 72998401 84278309 97954592 114529479
731 114529479 134165587 153754218 171070193 183085088 188345711 187074509 181986037 176650123
723 176650123 172806236 172834816 177060377 186135504 199025405 212034895 219547799 218417251
715 218417251 210541547 196418807 178313815 158788071 140145675 122622612 107509289
708A07509289j3289687j1401628r374200p648628o417227n142267l910241k965170
700D7360241k880500q69365k74888n05410O3920l28841q63329j186385q17854
691C9697589k263308j875317k398679k568151k587316p45160r75064j801157j381161
682B3102276j067936j304519j112413j85848q00452j049850m13827p56315q41242
673A5569874j32065m21731p0018k94934o91111p43161k14632J75877p8031n5619
663A3044449j07620n13323m76958J98951M30944L75481l08411j296676l87906
654A0958931M81962k54957q67696k52742q07121l67180m2171L2632l93738J32817
644H620737K96330l71681k88743N58582j0121r14440n04123m00062R159L64392
$$ plain form
708 107509289 94219602 82817974 73443774 65795146 59377919 54235652 50325411 47360241
700 47360241 44479741 43610376 43335488 42830078 42893998 42565157 41701828 40515443 39697589
691 39697589 37434281 35558964 33160285 30592134 28004818 27259658 26284594 24483437 23102276
682 23102276 22034340 20729821 19617408 19431560 18631108 17581258 17167431 16411116 15569874
673 15569874 15437809 15016078 14946060 14651126 13960015 13216854 13002222 13178099 13100068 13044449
663 13044449 12936829 12423506 11946548 12145499 12576443 12951924 12643513 11346837 10958931
654 10958931 11440893 11185936 10318240 10065498 9258377 8891197 8849026 8881658 8487920 8620737
644 8620737 8917067 8545386 8256643 8815225 8805104 7890664 7386541 6986479 6995638 7360030
634G360030J50050o51266k39848M0673K61500N07144L31575m13672r66948K75277
624F654515Q4k86301r6848j56537j37251L61199k83034m7033M86432J156174L60052
613H011452n89068o18169p72225K97129K83186o71186n38385M77193n28040p99365
603D552522K54422O11702R5837j6846o54802n59745K0076P06811k83751p7833
593D648393m8095q4482p66998K27840L04946J12275M51588l18160m17283j91501
583C918523o4871r6185P4176L86992k95261k02648m35827L1952M0960J26845Q1224
572C565880l17338j16389o14340j52889K73101L67117r0518j02927m54641l91158
562A965898O69599O6219R9755j61845M63713M16264p32050K35015j25676L37335
$$ plain form
634 7360030 7510080 6858814 6618966 6659639 6921139 7428283 7759858 7346186 6379238 6654515
624 6654515 6654599 6368298 6271450 6114913 5977662 6338861 6055827 6008794 6495226 7651400 8011452
613 8011452 7422384 6804215 6031990 6329119 6612305 5941119 5402734 5879927 5351887 4552522
603 4552522 4806944 5418646 5514483 5497637 4842835 4283090 4303166 5009977 4726226 4648393
593 4648393 4600298 4515816 3748818 3976658 4281604 4393879 4845467 4527307 4110024 3918523
583 3918523 3853652 3757467 3831643 4218635 3923374 3720726 3284899 3316851 3357811 3484656 3565880
572 3565880 3248542 3132153 2517813 2364924 2638025 3005142 2914624 2811697 2357056 1965898
562 1965898 2635497 2701716 2801471 2639626 3103339 3519603 2787553 3022568 2896892 3234227
552C234227j2909o09604m40869K34595M19891p56916M7293L12501O62072K97127
542C387408m95210m11448M704N56054J86129n0552j006001l46812l0126M36002
532B230148M80623m14131M01417Q5636m14114K30092J54023J20980j57433j45778
522B571463p06708K81205j5903l6487J82638M97944N06582m15655k07560J9894
512B677413k22347J68767J77801k93207o71213j73042K5594N60779J38897k84990
502B104452K2277L80890j11753n69410j8447L42471R7796n90904k27928q66833
492E62611m45150J278794Q20968k05157n41611k46043M28959L34022r9140k20381
482A667872m97787P9498k91481k66999N55155L09749j62668K66339K65052l13545
$$ plain form
552 3234227 3221318 2611714 2170845 2405440 2825331 2068415 2115708 2428209 3090281 3387408
542 3387408 2892198 2480750 2485454 3041508 3227637 3177085 2171084 1824272 1794146 2230148
532 2230148 2710771 2296640 2698057 2783693 2369579 2599671 2753694 2874674 2717241 2571463
522 2571463 1864755 2145960 2130057 2093570 2276208 2774152 3280734 2865079 2657519 2677413
512 2677413 2455066 2623833 2801634 2508427 1837214 1664172 1689766 2250545 2389442 2104452
502 2104452 2126729 2507619 2395866 1826456 1808009 2150480 2248276 1657372 1429444 562611
492 562611 117461 1396255 2217223 2012066 1470455 1224412 1653371 1987393 1888253 1667872
482 1667872 1170085 1249583 958102 691103 1246258 1556007 1393339 1659678 1924730 1611185
472A611185m11953M41251L29560k08247n53440K74584n5688n27840r61P73019
462A671470J90659Q1605l01186o31820Q2071Q68069K32399p74727o34462K00129
452I84207j26070K33349P01048n39281j09958O59953L78193l89503K65577k63702
442A793813K43121M50132L06167q83513K0198P2357l34252L5420J200462L37752
432C241657q80092p17278L77789L37220M88306m92905o80965j82537l50341p35376
422D05478K40387Q64393j00152q73680k10587J11703K37300M05945k46731o6154
412G67902L16937k97707m77035K34155O65620l3602r3173Q4299p72643k67184
402A27569O62740O86994J26678m13679q04344l10273Q53411N11874j82896m83751
$$ plain form
472 1611185 1199232 1640483 1970043 1761796 1208356 1482940 1427252 899412 898451 1671470
462 1671470 1862129 1943734 1642548 1010728 1092799 1960868 2193267 1418540 784078 984207
452 984207 858137 1091486 1792534 1253253 1143295 1803248 2181441 1791938 2057515 1793813
442 1793813 2036934 2487066 2793233 1909720 1929918 2002275 1668023 1703443 2903905 3241657
432 3241657 2361565 1644287 2022076 2359296 2847602 2354697 1673732 1491195 1140854 405478
422 405478 645865 1510258 1410106 536426 325839 437542 674842 1080787 834056 767902
412 767902 1084839 787132 310097 544252 1209872 1176270 1083097 1167396 394753 127569
402 127569 790309 1477303 1603981 1190302 385958 75685 929096 1440970 1258074 774323
392G74323r0192n4877L88230L2226n34539n77895R54839O73817q68491q10525
382a13084k2Q54993Q45235l57192q23394m55858N77867O42070l29951m15475l12628
371A12561M96831J41699r1425n58693J35075K42087J95292l46700L22015K08202
361H56944M36229l20202l27834J92739Q6237M95815L28369p97998p43915K65018
351D71402R36147N06129p03415l26892k19161K76178J72955J04955k65908l81085
341E71305j64420l85400K77560N66198m70823k73496M27492l2647k1390p0327
331D24052O54492k80410j2803j26364m70733l7124O60461p0362n08424K83907
321E16692O06174J93210n85874p07637l12837J64024P57436J04947p71637q99262
$$ plain form
392 774323 684131 629254 1017484 1049710 515171 -62724 892115 1565932 697441 -113084
382 -113084 -113106 741887 1587122 1229930 406536 -49322 528545 1170615 840664 425189 112561
371 112561 609392 751091 659666 100973 236048 478135 673427 326727 648742 856944
361 856944 1293173 972971 645137 837876 924113 1419928 1748297 950299 206384 471402
351 471402 1407549 1913678 1210263 883371 664210 940388 1113343 1218298 952390 571305
341 571305 406885 21485 299045 865243 394420 120924 548416 515769 494379 424052
331 424052 1078544 798134 785331 658967 188234 151110 811571 741209 232785 516692
321 516692 1122866 1316076 730202 22565 -290272 -126248 631188 736135 -35502 -934764
311i34764J74682M12211J158850M9846n46725j068023M28478Q11841R5992k92419
301B89969l86399l84209l0146K58354K14477N7117M77768O36818m70889N10271
291A173131Q1868J52648m603l52664l81644l70250l62538j86540k65431N18959
281B936J200979l41083l82204n19077j0287M43994M25521L02199m49868k77863
271C95247q15523R909N37026K0724M3866K42387m74672L00669k21825N53924K3360
260F15092P3484j50785o03972l94947L87281N0195J7198J99163j07701Q9786M9241
249B24035K59775j62574K99114P3474o89547j57520J46590k06743M8646M90424
239C25674K21073n28856m26323L51940P12143N75038J3366p13691l74459j75288
$$ plain form
311 -934764 -760082 -347871 810979 860825 314100 -753923 -325445 486396 582388 289969
301 289969 -96430 -480639 -510785 -252431 -37954 19163 496931 1133749 662860 1173131
291 1173131 1254999 1407647 1403044 1050380 668736 298486 -64052 -250592 -516023 2936
281 2936 1203915 862832 480628 -38449 -48736 395258 820779 1122978 673110 395247
271 395247 -420276 -410367 126659 147383 191249 433636 -41036 259633 37808 591732 615092
260 615092 688576 537791 -66181 -461128 -73847 -23652 -6454 192709 85008 174794 224035
249 224035 483810 321236 620350 693824 4277 -153243 -6653 -213396 -164750 325674
239 325674 546747 17891 -408432 -56492 655651 1230689 1244055 530364 155905 -19383
229a9383k44318q2310n6473O84526q956q1130L5155K39545j592L36025J10871
218I11960k28963m32781K56850l34699l87809K84781M6892n39494k0374Q77618
208D33981l4937n85424L52786N7538p32333L67317k24578k19704K37878K13596
198a33880m37662l32269N49834L48338J56168M89364K49143p15153L49218j92563
188C30538k14621l87247K33118L04343j46382L34073j37610k45356o03855J50021
178c82978O85838o8969l98461j80485o0361Q3409q1198k25287K8246L92067J67106
167d1073k90548m72627O31195Q12K7753K86369J86817m28201l07133M91517N87965
156F72846k48387n99286r38477L80302Q86691L38023p27300m44253K0243O83259
$$ plain form
229 -19383 -263701 -346011 -402484 282042 273086 191956 227111 466656 465064 801089 911960
218 911960 682997 250216 507066 172367 -215442 69339 116231 -423263 -443637 433981
208 433981 399044 -186380 166406 223944 -508389 -141072 -365650 -585354 -347476 -133880
198 -133880 -571542 -903811 -353977 -5639 150529 639893 889036 173883 523101 330538
188 330538 115917 -271330 -38212 266131 119749 453822 316212 70856 -532999 -382978
178 -382978 302860 233891 -164570 -345055 -405416 -322007 -403205 -628492 -600246 -208179 -41073
167 -41073 -331621 -804248 -173053 -172241 -144488 141881 328698 -99503 -406636 84881 672846
156 672846 424459 -174827 -1113304 -733002 153689 491712 -235588 -679841 -659598 23661
146B3661L03892L9778q3262m97677J55976k18851K74861m24073l02679K12604
136e15770J38956M78767m03873l11051l62226K69761J31154J35107m58401K04899
126f92677l60042k08529j4912L00506K59010m732K7282M4765j1437N12380R6090
115e2296p91014K569J03520P50694r0055j84753j53029J58835N11175K5097j20939
104A59804n3154n01303j47290M11609K1043k10771m29906J40973j77522J74882
94f11635M95828Q7696j93089q01409j05319O29237N47886m96188J16808j15641
84d45826j03439m57818N86678N36212k93954l4025l7276n8884K40756M46057l22232
73E6249k14997M41706O7093L4903j732p3678l25350M41197k06792m19899m36630
$$ plain form
146 23661 327553 367331 284069 -213608 -57632 -276483 -1622 -425695 -728374 -515770
136 -515770 -376814 101953 -301920 -612971 -975197 -705436 -574282 -439175 -897576 -692677
126 -692677 -1052719 -1261248 -1276160 -975654 -716644 -721376 -694094 -649329 -660766 -148386 -52296
115 -52296 -843310 -840741 -737221 13473 -76582 -261335 -414364 -255529 255646 280743 159804
104 159804 106650 -394653 -541943 -130334 -109291 -320062 -749968 -608995 -786517 -611635
94 -611635 -115807 -28111 -221200 -1022609 -1127928 -498691 49195 -446993 -330185 -445826
84 -445826 -549265 -1007083 -420405 115807 -178147 -212172 -249448 -308332 -67576 378481 56249
73 56249 -158748 282958 350051 384954 383222 309544 -15806 425391 218599 -201300 -637930
62f37930J93880M62586J01892k07386j83387O3287N72550r4288q7484K82759Q3723
51E50202j62035q2428J02062N41528O51828m07473L14554M7493N56662J61671
41B274064Q37557J032598K82368O508q5371O44550K12612M66671K95347J217485
31G184389J616105J279880K646642N519878R213639J3506434J2397118O490320
23E9854405l440747r424650q603618p356651n768156m530618l984210l716677
15A3029078k515746k799962j672584o10958k77099j032968l32415n30390n91550
6B665406j77894k1557n30866n45547m14875j64912
0H09755
$$ plain form
62 -637930 -444050 18536 120428 -86958 -270345 -207058 365492 271204 183720 466479 550202
51 550202 388167 305739 407801 949329 1601157 1193684 1508238 1555731 2112393 2274064
41 2274064 3111621 4144219 4426587 4433095 4347724 4992274 5204886 5671557 5966904 7184389
31 7184389 8800494 10080374 12727016 18246894 27460533 40966967 53364085 59854405
23 59854405 56413658 46989008 38385390 31028739 25260583 20729965 16745755 13029078
15 13029078 10513332 7713370 6040786 5429828 5152729 4119761 3787346 3256956 2665406
6 2665406 2487512 2465955 1935089 1389542 974667 809755
0 809755
$$ Imaginary data points
##PAGE= N=2
##DATA TABLE= (X++(I..I)), XYDATA
16383b2673448O13069J28932P67015Q73030J22840J35779N71653O33588O26906
16374a8200636J68296l24Q7444L82645L31843M90994M10359J46606k2304J20492
16364a6084585J65743P65709M46645K2199J8005N5771O32872n321O41932M62435
16354a2878595m70447p2123L16492M58558J65646L60006K34689l51209m6040L50732
16344a1932291K42086p0475L98636J57798m1154L42481J77330O2308K64801Q85057
16334i513423k80053j871l04808K02218L31859M88552J65249k06411j40049N93649
16324h665088K83807M3478M92327R1571k86589k25501L83741P33290k28558k70252
16314g647774N24179k43742N7874K79788M52193j06045J98858J90291K29084J19734
$$ plain form
16383 -22673448 -22060379 -21931447 -21164432 -20291402 -20168562 -20032783 -19461130 -18827542 -18200636
16374 -18200636 -18032340 -18032664 -17945220 -17562575 -17230732 -16739738 -16329379 -16182773 -16205077 -16084585
16364 -16084585 -15918842 -15153133 -14706488 -14684289 -14666284 -14610513 -13977641 -13982962 -13341030 -12878595
16354 -12878595 -13349042 -13421165 -13104673 -12646115 -12480469 -12120463 -11885774 -12236983 -12283023 -11932291
16344 -11932291 -11690205 -11760680 -11362044 -11204246 -11245400 -10902919 -10725589 -10663281 -10398480 -9513423
16334 -9513423 -9793476 -9795347 -10100155 -9897937 -9566078 -9077526 -8912277 -9118688 -9258737 -8665088
16324 -8665088 -8381281 -8337803 -7845476 -7753905 -8040494 -8265995 -7882254 -7148964 -7377522 -7647774
16314 -7647774 -7123595 -7367337 -7309463 -7029675 -6577482 -6683527 -6484669 -6294378 -6065294 -5945560
16304e945560r187j33270J87970M82164R4925l74032l89674P71895J89758K87192
16294d837819j02897l25727K69741N04366L16030k19485n73233M02789K69413
16285d296822l31357L31044M1846l38530M5727N91705R00456j61635l33325K72557
16275c278334J78954O71360j12791P645l21682j246J23489J29431K08050m68266
16265b863390j7094P31673J92709k15611j16824J975O27231J70002l50312J83817
16255a655824p6096J33259k5339M83530N71951k53507P2713K25415J73932n00
16245c50466K18324L13211m6668J2708l84772P4105L58759M36950j26390j28434
16235C77327J89515N67913j80300j68848K26277l17061m45845M19779J14968K35931
$$ plain form
16304 -5945560 -5954747 -6088017 -5900047 -5417883 -5322958 -5696990 -6086664 -5314769 -5125011 -4837819
16294 -4837819 -4940716 -5266443 -4996702 -4492336 -4176306 -4395791 -4969024 -4566235 -4296822
16285 -4296822 -4628179 -4297135 -4255289 -4593819 -4548092 -3956387 -3055931 -3217566 -3550891 -3278334
16275 -3278334 -3099380 -2428020 -2540811 -2533166 -2854848 -2856094 -2732605 -2603174 -2395124 -2863390
16265 -2863390 -2880484 -2148811 -1956102 -2171713 -2288537 -2286562 -1659331 -1489329 -1839641 -1655824
16255 -1655824 -1731920 -1598661 -1624000 -1140470 -568519 -822026 -749313 -523898 -349966 -350466
16245 -350466 -132142 181069 134401 147109 -237663 -163558 195201 632151 505761 377327
16235 377327 566842 1134755 954455 785607 1011884 694823 248978 668757 783725 1019656
16225A019656m61306J45901j25159M67911L33993j30964k18983J70204l931k65073
16215I32249L28989l6076j30059N933L39205l4776r7708k09699M33141L39153
16205A870352J1050l59974J05951K1170J80932k11033L6017J5681J29630M26912
16195B226688r7247J4896L17162M41212p9376m18145k40720K77071J42877J91350
16185B775768j57134k39925M38838j66512J38293j08914Q1529J90230K06834p4962
16175C084045k82611m17640N67360O5147P1182k3415j38942r7762k40419l1532
16165B555413O53289K83021n5551n39846K926L10032K17179J82414K09430j52777
16155C665530l37042k50552M91040P6397o1788n37208j21677N84783N2245l6664
$$ plain form
16225 1019656 558350 704251 579092 1047003 1380996 1250032 1031049 1201253 1197322 932249
16215 932249 1261238 1225162 1095103 1101036 1440241 1405465 1307757 1098058 1531199 1870352
16205 1870352 1881402 1521428 1627379 1648549 1829481 1618448 1654465 1670146 1799776 2226688
16195 2226688 2129441 2144337 2461499 2902711 2823335 2405190 2164470 2441541 2584418 2775768
16185 2775768 2618634 2378709 2817547 2651035 2789328 2680414 2761943 2952173 3159007 3084045
16175 3084045 2801434 2383794 2951154 3016301 3087483 3064068 2925126 2827364 2586945 2555413
16165 2555413 3208702 3491723 3436172 2896326 2899252 3209284 3426463 3608877 3818307 3665530
16155 3665530 3328488 3077936 3568976 3645373 3583585 3046377 2924700 3509483 3561728 3525064
16145C525064J40081R5514M1400R3655n32531J43142n92438M56051N52243l60726
16135C561455j53423j31095N28596j84064k0631q5547M77706l22281k37295m26848
16125C006573Q41713J26876k81626n09626J08027N85280O2870J94640l04206k79370
16115C551151R4819M32108J04123K51415q75976Q3126p8378M63531J08769p3249
16105D061439l73871o5300K8884l4014n13786o58925J08226L48803O44589R1203
16095C637248j86128j85701K38564L4000l14612K65832J23803k3814k30569l34779
16085C023844K21533M83916M20603L28841m99317l61236R4113N17454P88175k29208
16075D788718j033554k28210k54524M08943P73150K83416r07025m53517O7340
$$ plain form
16145 3525064 3665145 3760659 3802059 3895714 3363183 3506325 2913887 3369938 3922181 3561455
16135 3561455 3408032 3276937 3805533 3621469 3600838 3515291 3992997 3670716 3433421 3006573
16125 3006573 3848286 3975162 3693536 3183910 3291937 3877217 3940087 4134727 3830521 3551151
16115 3551151 3645970 4078078 4182201 4433616 3557640 3640766 3562388 4025919 4134688 4061439
16105 4061439 3687568 3622268 3651152 3617138 3103352 2444427 2552653 2901456 3546045 3637248
16095 3637248 3451120 3265419 3503983 3537983 3223371 3489203 3613006 3589192 3358623 3023844
16085 3023844 3245377 3729293 4149896 4478737 3979420 3618184 3712297 4229751 5017926 4788718
16075 4788718 3755164 3526954 3272430 3681373 4454523 4737939 3830914 3377397 3444737
16066C444737O99992M51132K16329q06939j20035L43115L39121l18531L59469
16057D608390K1339k89831O86856N60055j166861k98828L20524K60046R8556j53381
16047D646865j36607l95155J95404J28403m22715O57835L02465p60609j63841
16038D052045K81059Q1623L99386J63798o34327p40375O77980Q15520k12244m56150
16028D428315p24519J95016R69488K81655n82222m49250J79643m04814N21101
16019D414413M26904p75189o85054O26065J63914J6989l94995o24983N69531N90686
16009D328281M73166n73941O3440k32594k31662M75121Q63594r60647l57072l97724
15999C449962P41687L43144Q06636p13451k8625l55157j018J76113M44053o6188
$$ plain form
16066 3444737 4144729 4595861 4812190 4005251 3885216 4228331 4567452 4248921 4608390
16057 4608390 4629729 4339898 5026754 5586809 4419948 4121120 4441644 4701690 4800246 4646865
16047 4646865 4510258 4115103 4310507 4438910 4016195 4674030 4976495 4215886 4052045
16038 4052045 4333104 4414727 4814113 4977911 4343584 3603209 4281189 5096709 4884465 4428315
16028 4428315 3703796 3898812 4868300 5149955 4567733 4118483 4298126 3893312 4414413
16019 4414413 4841317 4066128 3381074 4007139 4171053 4188042 3793047 3168064 3737595 4328281
16009 4328281 4801447 4227506 4290946 4058352 3826690 4301811 5165405 4204758 3847686 3449962
15999 3449962 4191649 4534793 5341429 4627978 4599353 4244196 4243178 4419291 4863344 4797156
15989D797156o67173J88610m85903p8834J31897O73405p2227J17499L01749l89596
15979D516583P5114K94576n4389J82706P7122o29967k29920J79191K47021n3589
15969D604448L0974O8647j26919Q6313O28819r11994j09917L02257L83273J08834
15959E064735m85235p32941R057Q16282N66264p47834j27404J90607K86018L3000
15949D872549L46492j23877l01354k45297O7434q9958K48724k44760q30993M39696
15939D138656J32417M12116n05701o12672J31576O50526L98571j43308j066901
15930C535280l56940K18302R13569O14182n70919p69726K77230K91363O93758
15921D846099M18120m85780p76321O0008q811Q1148J01793K84L7295l38084j8099
$$ plain form
15989 4797156 4129983 4318593 3832690 3753856 3885753 4559158 4486931 4604430 4906179 4516583
15979 4516583 4591697 4886273 4831884 5014590 5091712 4461745 4231825 4411016 4658037 4604448
15969 4604448 4635422 4704069 4577150 4663463 5292282 4380288 4270371 4572628 4955901 5064735
15959 5064735 4579500 3846559 3855616 4671898 5238162 4490328 4362924 4553531 4839549 4872549
15949 4872549 5219041 5095164 4793810 4548513 4615947 4525989 4774713 4529953 3698960 4138656
15939 4138656 4271073 4683189 4177488 3564816 3696392 4346918 4745489 4602181 3535280
15930 3535280 3178340 3396642 4310211 4924393 4353474 3583748 3860978 4152341 4846099
15921 4846099 5264219 4778439 4002118 4062126 4053315 4134463 4236256 4236540 4273835 3935751 3917652
15910C917652K13967L19255O69923j87653j174723k33559P1355J86385J76503
15901C959105j35839l00287J22284j22347K73899R24204K37005N6998k41129k60441
15891D513452K85652M65625n03114l10172n32683J005845m20265k19090J17993
15882D403243P00403L9411k62459p66379J67324N36205L8883o58289m24855n875
15872C767612N21967L48619l148n5027O2027K17426L37219k95729m29217L8712
15862D510461K49515K69845o57346o20682N99440j07553P8957J41769j89673K1950
15852D296683K89497J01990q2346j0734m5093n3119l13644L28438J14403J85937
15842D812012K29383q1760o11364l3501J48250J23368j21368m5644n0419K0964
$$ plain form
15910 3917652 4131619 4450874 5120797 4933144 3758421 3524862 3596217 3782602 3959105
15901 3959105 3823266 3522979 3645263 3522916 3796815 4721019 4958024 5015022 4773893 4513452
15891 4513452 4799104 5264729 4761615 4451443 3918760 4924605 4504340 4285250 4403243
15882 4403243 5103646 5143057 4880598 4114219 4281543 4817748 4856631 4198342 3773487 3767612
15872 3767612 4289579 4638198 4635050 4580023 4642050 4859476 5196695 4900966 4471749 4510461
15862 4510461 4759976 5029821 4372475 3751793 4351233 4243680 4322637 4464406 4274733 4296683
15852 4296683 4586180 4688170 4605824 4595090 4549997 4496878 4183234 4511672 4626075 4812012
15842 4812012 5041395 4959635 4348271 4314770 4463020 4586388 4465020 4419376 4368957 4389921
15832D389921J55535N1562j74495M52457J15458k34159m62582M19480J74431k62218
15822D625390m01124l6993L57726M32641m08437l84440L1286O32356P43890L05317
15812E897612p7896k40614l78005K33215o2144L70287j84744j001830m51433K47851
15802D352299P48789O13879q06763q42772l31362R17643P02880p4332p34386r10325
15792C635550O9651O70964L93335j79771m41597n44592K75409Q45823P02160p29591
15782D697341p78700J96159O852R28283k38791m58123m45481M011L42502O87327
15772D941380L42812j58814p84130J61092L00202l10476O105j5603l1239j83549
15762D267780J677k28885J73269j59833L56819K6609k9705m45565O4660O06800
$$ plain form
15832 4389921 4545456 4597018 4422523 4874980 4990438 4756279 4293697 4713177 4887608 4625390
15822 4625390 4224266 4187273 4544999 4977640 4569203 4184763 4216049 4848405 5592295 5897612
15812 5897612 5819716 5579102 5201097 5434312 5372168 5742455 5557711 4555881 4104448 4352299
15802 4352299 5101088 5714967 4908204 4065432 3734070 4651713 5354593 5280261 4545875 3635550
15792 3635550 3705201 4376165 4769500 4589729 4148132 3603540 3878949 4724772 5426932 4697341
15782 4697341 3918641 4114800 4121652 5049935 4811144 4353021 3907540 3911551 4254053 4941380
15772 4941380 5284192 5125378 4341248 4502340 4802542 4492066 4498171 4482568 4451329 4267780
15762 4267780 4269457 4040572 4213841 4054008 4410827 4437436 4407731 3962166 4026826 4633626
15752D633626k490l23627m41216K22890m00814M05888R87105n811m49984p51020
15742C874547J09414J012601N65199o43900p65990n4510M46564M49654L78944
15733E372523k61481k42602j16963O12106N4568M2311Q394n13168l60854l30179
15723D264655j85909J65013J44115k86076p1226m51962K5454P55423J36110J38100
15713D633697l45188N09736k46746k49555m87252L14039p352M29132K43895q0067
15703D714339m69183j00709M05729O50534R7987l97460K26506k44464l7541j82760
15693D662978K23797O12913k50954j043206J44184M82259j32435m05971K05272
15684D498837Q9621p03527J39991K32398k29102j14201K87235j19554o97382N73951
$$ plain form
15752 4633626 4631136 4307509 3866293 4089183 3688369 4094257 5081362 5075551 4625567 3874547
15742 3874547 3983961 4996562 5561761 4917861 4151871 4097361 4543925 4993579 5372523
15733 5372523 5111042 4868440 4751477 5363583 5418151 5460462 5468856 4955688 4594834 4264655
15723 4264655 4078746 4243759 4387874 4101798 4030572 3578610 3604064 4359487 4495597 4633697
15713 4633697 4288509 4798245 4551499 4301944 3814692 4128731 4121379 4550511 4794406 4714339
15703 4714339 4245156 4144447 4550176 5200710 5298697 4901237 5127743 4883279 4845738 4662978
15693 4662978 4886775 5499688 5248734 4205528 4349712 4831971 4699536 4293565 4498837
15684 4498837 4588458 3884931 4024922 4257320 4028218 3914017 4201252 4081698 3384316 3958267
15674C958267K51744n7592k28391n51969n49494P65166L03647K5854k07747P71085
15664D480570m2235n42397N57256M01606m6883k04119L54775k61114j05741j47456
15654D444262P33567k7455p93314l40097P03230M11532l70121n23442K08017K65868
15644D712047r9687n08330r5390N84723L83437n29797l27526N17761m37398k03422
15634C996418P54054M93116r46367k27342N51036L38494m5485M65463K94803k41758
15624E432432n82729J99624J22857L35099q21317p13898O32951N35316l99071
15615D741264k67200O1673K56449n3391l75775P36928m1065k96747r02434O70401
15605D530103O66507m37151p52985q0269K95659M708O26247K21516n66819m26062
$$ plain form
15674 3958267 4210011 4152419 3924028 3372059 2822565 3587731 3891378 3917232 3709485 4480570
15664 4480570 4438335 3895938 4453194 4854800 4807917 4603798 4958573 4697459 4591718 4444262
15654 4444262 5177829 5150374 4357060 4016963 4720193 5131725 4761604 4238162 4446179 4712047
15644 4712047 4612360 4104030 4008640 4593363 4976800 4447003 4119477 4637238 4199840 3996418
15634 3996418 4750472 5243588 4297221 4069879 4620915 4959409 4913924 5379387 5674190 5432432
15624 5432432 4849703 5049327 5172184 5507283 4685966 3972068 4605019 5140335 4741264
15615 4741264 4474064 4535737 4792186 4738795 4363020 5099948 5058883 4762136 3859702 4530103
15605 4530103 5196610 4759459 4006474 3926205 4221864 4226572 4852819 5074335 4507516 4081454
15595D081454k2732l75334J074974L57523l08747p30430J82861O63866K29838
15586E153273O5886k28047r02824J29004R73270j61933o48729l43702O97049J033102
15576E766349P7576q38919o67472K71799O33029K5997m08012k65690m30504o41065
15566C523088J51974Q91245L10698p31235o16493M9516R85177L02895N00992m26001
15556D941856p81529j39896M97059k12461P01098K5309J33365m49401l98755L60218
15546D676863J60654K72409O8788k60765l3630R1560o48599L40349L81138K72009
15536E320776m67008n49484K05257j53891j3454J18748M14130j67563p11383r1282
15526C904846m5708Q51054L70896k55730k60798k89423M46057L79266Q90K01075
$$ plain form
15595 4081454 4058722 3683388 4758362 5115885 4807138 4076708 4259569 4923435 5153273
15586 5153273 5219159 4991112 4088288 4217292 5190562 5028629 4379900 4036198 4733247 5766349
15576 5766349 5843925 5005006 4337534 4609333 5242362 5268359 4860347 4594657 4164153 3523088
15566 3523088 3675062 4566307 4877005 4145770 3529277 3578793 4563970 4866865 5367857 4941856
15556 4941856 4160327 4020431 4517490 4305029 5006127 5031436 5164801 4715400 4316645 4676863
15546 4676863 4837517 5109926 5178714 4917949 4884319 4975879 4327280 4667629 5048767 5320776
15536 5320776 4853768 4304284 4509541 4355650 4342196 4460944 4875074 4707511 3996128 3904846
15526 3904846 3859138 4710192 5081088 4825358 4564560 4275137 4721194 5100460 5101350 5302425
15516E302425l86205l5721k3180L8031l60941L11056N78752M8090m98260l11892
15506D662155M6274J27809O07143k8730L20513p77818l94004n6226L63134N73528
15496E443778q06831p31195l81581L50364K67832N52650K92585r4587m91848k25014
15486D176153L80529j4292n31549L30315J98798l91486k21276L39443L42050N58277
15476E166962J01529j51595m36069m9643O42948K79265K72146r35265r20236K70468
15466D240510Q09920L50047m53573j82365l07678J49148N36955K19316m20851
15457D941429q49745N9654O19445K96245m53637R7249M38442m3016L0938K44755
15447E381759j20585k92417K47591k66658L5474K27195j99200r15657K49978R90036
$$ plain form
15516 5302425 4916220 4880499 4857319 4895350 4534409 4845465 5424217 5472307 4974047 4662155
15506 4662155 4708429 4836238 5443381 5414651 5735164 4957346 4563342 4507116 4870250 5443778
15496 5443778 4636947 3905752 3524171 3874535 4142367 4695017 4987602 4893015 4401167 4176153
15486 4176153 4556682 4542390 4010841 4341156 4539954 4148468 3927192 4266635 4608685 5166962
15476 5166962 5268491 5116896 4680827 4631184 5274132 5553397 5825543 4890278 3970042 4240510
15466 4240510 5050430 5400477 4946904 4764539 4456861 4606009 5142964 5362280 4941429
15457 4941429 4091684 4151338 4770783 5067028 4613391 4710640 5149082 5106066 5137004 5381759
15447 5381759 5261174 4968757 5216348 4949690 4985164 5212359 5013159 4097502 4347480 5337516
15437E337516k60700L66751j14780o14028j67979M60218Q26025l93712q86805
15428D552506q72076n42052Q23417J261790r1017o66880m79415J34057M67254
15419D587584Q78592k2678n84949j90240m69203j41257M30177j54740P83839j66083
15409D951042j158278L14618k14317J063902R0427J47990l27382m82377J03608
15400D489233K98508k05095N64377m13130l88397J16727J67144M41376m48077
15391D622666L05857k23367k70758O4893J37585M14133O8705m33047P5012k08932
15381D552747M87446q9208m95894Q5038l04858M4601J77474Q6957j52494J77593
15371D569402j94592O25281j25749L89493N39546n79391l12671L42467M97932
$$ plain form
15437 5337516 5076816 5443567 5328787 4714759 4546780 5006998 5833023 5439311 4552506
15428 4552506 3680430 3138378 3961795 5223585 5132568 4465688 3986273 4120330 4587584
15419 4587584 5466176 5443498 4858549 4668309 4199106 4057849 4488026 4333286 5117125 4951042
15409 4951042 3792764 4107382 3893065 4956967 5047394 5195384 4868002 4385625 4489233
15400 4489233 4787741 4582646 5147023 4733893 4345496 4462223 4629367 5070743 4622666
15391 4622666 4928523 4705156 4434398 4499291 4636876 5051009 5119714 4686667 4761679 4552747
15381 4552747 5040193 4950985 4455091 4540129 4235271 4279872 4457346 4544303 4391809 4569402
15371 4569402 4374810 5000091 4874342 5263835 5803381 5223990 4911319 5253786 5751718
15362E751718l7010k00050j42791n76920l13189J51557K91100K54370N4656r8659
15352E134782k63059L27678q4352k55608M67500J16503p34677j17390O8359j94390
15342D465346k30111L50214Q5276k0120n26496L06796O10225N46866O2480m92192
15332E158284j69393l06040K34460N03087J12169k18679l11150l68917O01414
15323E235235J03527R4750o6948k21480m40107j03631J04083J95289J21158L38516
15313E360392k46088j47378J27569o4636j31485k86674K72153j46658k45782m47365
15303D044048j74330N51746J59056l16299L52745J64747J03429o9670K87130j01429
15293E001173k65682l65430O48127p7061k16730o44237L36821N64972K9751O2764
$$ plain form
15362 5751718 5714708 5514658 5371867 4794947 4481758 4633315 4924415 5178785 5233441 5134782
15352 5134782 4871723 5199401 5115049 4859441 5326941 5443444 4708767 4591377 4659736 4465346
15342 4465346 4235235 4585449 4670725 4650605 4124109 4430905 5041130 5587996 5650476 5158284
15332 5158284 4988891 4682851 4917311 5420398 5532567 5313888 5002738 4633821 5235235
15323 5235235 5338762 5433512 5366564 5145084 4704977 4601346 4705429 4900718 5021876 5360392
15313 5360392 5114304 4966926 5094495 5029859 4898374 4611700 4883853 4737195 4491413 4044048
15303 4044048 3869718 4421464 4580520 4264221 4616966 4781713 4885142 4815472 5102602 5001173
15293 5001173 4735491 4370061 5018188 4941127 4724397 4080160 4416981 4981953 5011704 5074468
15283E074468j2513m71232n59772K98696P11056k55349q08615k41922K32853O37837
15273D605507l82820m2672l14813L04593J04246l96653L66453n63510k09409P46128
15263D217050L53061o28437o50299L7867Q72084Q10019L26599m90054n01183k52375
15253D094332K34640M23044M510n83065k63993k14405l3410j17652J000749R72063
15243E516813r84440o57118J95078K96479P46301k38221j49957k12373k75768
15234D236794R529R5099M36363l19417m94012K30466N44255l33537M29854R5401
15224D930795K35226q40512l94554P316L65346K75942k23913j55808k84938M46965
15214D361865Q37868M08263m80191o56176J12369N89871l83910m89372K31001
$$ plain form
15283 5074468 5061955 4590723 4030951 4329647 5040703 4785354 3976739 3734817 3967670 4605507
15273 4605507 4222687 4180015 3865202 4169795 4274041 3877388 4243841 3680331 3470922 4217050
15263 4217050 4570111 3941674 3291375 3329242 4201326 5011345 5337944 4847890 4346707 4094332
15253 4094332 4328972 4752016 4756526 4173461 3909468 3695063 3661653 3544001 4544750 5516813
15243 5516813 4532373 3875255 4070333 4366812 5113113 4874892 4724935 4512562 4236794
15234 4236794 4246323 4341422 4777785 4458368 3964356 4194822 4739077 4405540 4835394 4930795
15224 4930795 5166021 4325509 3930955 3938271 4303617 4579559 4355646 4199838 3914900 4361865
15214 4361865 5199733 5607996 5127805 4471629 4583998 5173869 4789959 4300587 4531588
15205D531588M6956l00542J3317J87417K27523j45917n34763J91236l41956K54347
15195D129206l19566j64135O9576K147L437R5010n2528Q81641R68725M30198o21549
15184E422162p33499K94664K69959L41947l23613r14611k52464J10625L67663
15175D582833O34642q8355n07137n58158J13369L40830j89316K91969n01751p61005
15165C357921K67910K04441K22737j63664J96130N64051l26898L63607N2944L10406
15155E049585L17557o74111J26016k0498l05685p1534J10495M60145j95547k22650
15145D573773J92319l73777k05840o1331J8393n9874j76570K40131L2777O631
15135D186632J5116q019N45629j11502j9679O21113m6456l09007n66920N66648
$$ plain form
15205 4531588 4578544 4278002 4291319 4478736 4706259 4560342 4025579 4216815 3874859 4129206
15195 4129206 3809640 3645505 3715081 3717228 3720665 3815675 3763147 4644788 5613513 6043711 5422162
15184 5422162 4688663 4983327 5253286 5595233 5271620 4357009 4104545 4215170 4582833
15175 4582833 5217475 5129120 4621983 4063825 4177194 4518024 4328708 4620677 4118926 3357921
15165 3357921 3625831 3830272 4053009 3889345 4085475 4649526 4322628 4686235 4739179 5049585
15155 5049585 5367142 4693031 4819047 4798549 4492864 4421330 4531825 4991970 4796423 4573773
15145 4573773 4766092 4392315 4186475 4125144 4143537 4083663 3907093 4147224 4180001 4186632
15135 4186632 4201748 4193729 4739358 4627856 4608177 5229290 5182834 4873827 4306907 4873555
15125D873555N35405p02809q57154q6546P04730M88511r5236m74257J45687m04112
15115D127774O2173L24641K27204n64790j15627R6254l47761j05842P00026M67536
15105D871588j31830o45237L7618N65041K52579k92988k0914L65473m98319j61742
15095D341269K10748J93580l86776k68898R6243J09385K06587l21014J55065J51810
15085D487999n31243o98058P13270P26998k11168m41534K31319l81709J9241O78837
15075D593952L98908l15247k49854m00990k72651L19654O77431k20268m64956
15066D065979O0040J7577J16317J39155M41949l61353k9983M13630k36936j34815
15056D491560J15019L3428k35345l36918P8712n7751J10345N09528M13616j79018
$$ plain form
15125 4873555 5408960 4706151 3848997 3762451 4467181 4955692 4860456 4386199 4531886 4127774
15115 4127774 4189947 4514588 4741792 4177002 4061375 4157629 3809868 3704026 4404052 4871588
15105 4871588 4739758 4094521 4132139 4697180 4949759 4656771 4635857 5001330 4503011 4341269
15095 4341269 4552017 4745597 4358821 4089923 4186166 4295551 4502138 4181124 4336189 4487999
15085 4487999 3956756 3258698 3971968 4698966 4487798 4046264 4277583 3895874 3915115 4593952
15075 4593952 4992860 4677613 4427759 4026769 3754118 4073772 4751203 4530935 4065979
15066 4065979 4126019 4143596 4259913 4399068 4841017 4479664 4449681 4863311 4626375 4491560
15056 4491560 4606579 4640007 4404662 4067744 4146456 4088705 4199050 4708578 5122194 4943176
15046D943176R3502j78014l94541O8637N40283R8093n91993k65812l09608j00088
15036C903635M13735K90777N32474l33905m32114J9818K51029M93155l54796j19044
15026D664764l13781M3917K24188r0308N580O9787j52229K92044L4005j16046
15016D661921m51485j16760M33810m09105m20934M39168k2438l13741N48256L37471
15006D686163J99922l89475l62608k32357O01507J92992l23365k66859J93079
14997D298999L4804J47825J94912p1232o909M85424J48333q96622j95091J6715
14987D157158M4845J28109n50197K60515L64671k82390K64356K48741j73377K22373
14977D684804k37664O26703j26668m08388k96101L85120N49930q1658o53517K99972
$$ plain form
15046 4943176 5036678 4858664 4464123 4532760 5073043 5171136 4579143 4313331 4003723 3903635
15036 3903635 4317370 4608147 5140621 4806716 4374602 4394420 4645449 5138604 4783808 4664764
15026 4664764 4350983 4394900 4619088 4528780 4534360 4604147 4451918 4743962 4777967 4661921
15016 4661921 4210436 4093676 4527486 4118381 3697447 4136615 4114177 3800436 4348692 4686163
15006 4686163 4886085 4496610 4134002 3901645 4503152 4696144 4372779 4105920 4298999
14997 4298999 4333803 4481628 4676540 4605308 4598399 5083823 5232156 4335534 4140443 4157158
14987 4157158 4202003 4330112 3779915 4040430 4405101 4122711 4387067 4635808 4462431 4684804
14977 4684804 4447140 5073843 4947175 4538787 4242686 4627806 5177736 5096078 4442561 4742533
14967D742533P61293k03487j33265r7162m48900R3086M68238J08636n62861k39746
14957D488365K72533K72451L4975k73186J1231m006J55779Q1181l08473R6658
14947D827508j98098j33280K37761K75302K73551k81753l75507K1073j11415j74433
14937D360709O07302j06722m32161J22328J30850O6555K98969O90265o42790n71346
14927D523959J75346L67365j53485m72589L41499k79539l03364M43516L40105
14918D982813J90115K30985m13929l64965J12911J39424j13369m51397J00386
14909D412974k81302m06824J032596M00348m10171l77543Q48715K29279m96451
14900D951621j84410J97313j00918j58693J07248O7872j75532M37609k32084L40812
$$ plain form
14967 4742533 5503826 5300339 5167074 5069912 4621012 4714098 5182336 5290972 4728111 4488365
14957 4488365 4760898 5033349 5068324 4795138 4806369 4802363 4958142 5039323 4730850 4827508
14947 4827508 4629410 4496130 4733891 5009193 5282744 5000991 4625484 4646557 4535142 4360709
14937 4360709 4968011 4861289 4429128 4551456 4682306 4748861 5047830 5738095 5095305 4523959
14927 4523959 4699305 5066670 4913185 4440596 4782095 4502556 4199192 4642708 4982813
14918 4982813 5172928 5403913 4989984 4625019 4737930 4877354 4763985 4312588 4412974
14909 4412974 4131672 3724848 4757444 5157792 4747621 4370078 5218793 5448072 4951621
14900 4951621 4767211 4964524 4863606 4704913 4812161 4880033 4704501 5142110 4910026 5250838
14890E250838J85302j04643n77218m0644M7276J03464K27482k60062j73853m57074
14880D200868L75710N15988m4862N6085q3317k95760j46419J7088N28072j08097
14870E015356k49081k47814J50633L25292j88828J93052L436Q9570k94289L83188
14860E180515m31749p1168k75429M75972j11681K06004j21156R6849N67891k65587
14850E250461K68871M08466Q603p39718J56198N5186K0923J71334K67797l71797
14840E496324n22177j63271k14778p6196P49908k69915k58284k8740k73586L56102
14830D795387J61930J73340l11551K0118l3412J75737J78624J23936K65156k33079
14820E316186j4732p345M05312q0922j94996J11319k62547j274400J95721P46007
$$ plain form
14890 5250838 5436140 5331497 4754279 4713635 4760911 4864375 5091857 4831795 4657942 4200868
14880 4200868 4576578 5092566 5047704 5103789 5020472 4724712 4578293 4595381 5123453 5015356
14870 5015356 4766275 4518461 4669094 4994386 4805558 4998610 5002046 5091616 4797327 5180515
14860 5180515 4748766 4677598 4402169 4878141 4766460 4972464 4851308 4948157 5516048 5250461
14850 5250461 5519332 5927798 5936401 5196683 5352881 5408067 5428990 5600324 5868121 5496324
14840 5496324 4974147 4810876 4596098 4519902 5269810 4999895 4741611 4712871 4439285 4795387
14830 4795387 4957317 5130657 4819106 4839224 4805812 4981549 5160173 5284109 5549265 5316186
14820 5316186 5301454 5294109 5699421 5618499 5423503 5534822 5272275 3997875 4193596 4939603
14810D939603n9087l05725p2734p12842k37674O94276J260980o2525q34705n74147
14800D035420k0941N07359L08213l76525n18496L64283K37731J59908M52341L75053
14790E524346r7646l75071O83823J71081j91272l06833L07716o42207m66894L65223
14780D972266n2105m83996l56276M89275M67364o1582J56753J6027k55937k9558
14770D862231J78503J7506K6403k48134n80663L03062L23730l2130K49694J45277
14760E245479N1815o46939L9931k17582O47155n02633J18076j07715M75446K89887
14750E392920k67456k65836K22878J15588K55277M81038q46294n3352q248R0151
14740E116666n4416N73826K27627n13684j000953L51124Q41944P43577p61018
$$ plain form
14810 4939603 4880516 4574791 4502057 3789215 3551541 4245817 5506797 5444272 4609567 4035420
14800 4035420 4014479 4521838 4830051 4453526 3935030 4299313 4537044 4696952 5149293 5524346
14790 5524346 5426700 5051629 5735452 5906533 5715261 5408428 5716144 5073937 4607043 4972266
14780 4972266 4920161 4436165 4079889 4569164 5036528 4974946 5131699 5147726 4891789 4862231
14770 4862231 5040734 5058240 5084643 4836509 4255846 4558908 4882638 4850508 5100202 5245479
14760 5245479 5297294 4650355 4690286 4472704 5119859 4617226 4735302 4627587 5103033 5392920
14750 5392920 5125464 4859628 5082506 5198094 5453371 5934409 5088115 5034763 5026515 5116666
14740 5116666 5062250 5636076 5863703 5350019 4349066 4700190 5542134 6285711 5524693
14731E524693n64733r93317L92142O19961L77752m97733r28521n12332J99365
14722C617277L91883R31388n1474n11383m49140k81416O94420R78930j75945m90255
14712D654285k89614m2414K93331l91981J47226M50023M28636n22666n52031N55925
14702D730720K07062J6252K56696k4377r04055k02050L92408M88396k64603K24348
14692D920797l69057J39530M67748n8036k22114M21386L78766m28359o47445k55276
14682D347940L43967K74162K71126K00011k15475n93380J89911L30223K37574
14673E386059k23950N1158l75824m82191J07785L9980J67599K65735O64480n03533
14663E097298j11767J53090j42148l20109N59766P3725p77967p15417J00218Q65668
$$ plain form
14731 5524693 4959960 3966643 4358785 4978746 5356498 4858765 3930244 3417912 3617277
14722 3617277 4009160 4940548 4889074 4377691 3928551 3647135 4341555 5320485 5144540 4654285
14712 4654285 4364671 4322257 4615588 4223607 4370833 4820856 5249492 4726826 4174795 4730720
14702 4730720 4937782 4954034 5210730 5186353 4282298 4080248 4472656 4961052 4696449 4920797
14692 4920797 4551740 4691270 5159018 5100982 4878868 5300254 5679020 5250661 4603216 4347940
14682 4347940 4691907 4966069 5237195 5437206 5221731 4628351 4818262 5148485 5386059
14673 5386059 5162109 5213267 4837443 4355252 4463037 4503017 4670616 4936351 5600831 5097298
14663 5097298 4985531 5138621 4996473 4676364 5236130 5309855 4531888 3816471 3916689 4782357
14653D782357P206J97063k69800n69812j61787L51120M25525K31251l44071m04060
14643D244992j7593K32597L86176q4071J7969N79782l26068l01541l17315Q7449
14633D502377m59126J00315N77344J57071m75493m49600N7040Q95996K00353J54471
14623E260748n83166n94087J92030J95516l5689m8853k44628K64636j49057R9211
14613D356661Q04635K57559j70355O8917k09643Q2775L80479J84098l45132K78062
14603E688056l7663l03862o56692P67600J28023k30758l58367R0081m84223k41921
14593D360274Q00436m55713K35572L91443k39690l90752K59477K28587R7814j16720
14583E170728j60130m08972k64409J63403m5156n49656L33790j25110L28419K45627
$$ plain form
14653 4782357 4789563 4986626 4716826 4147014 3985227 4336347 4761872 4993123 4649052 4244992
14643 4244992 4227399 4459996 4846172 4762101 4780070 5359852 5033784 4732243 4414928 4502377
14633 4502377 4043251 4143566 4720910 4877981 4402488 3952888 4009928 4905924 5106277 5260748
14623 5260748 4677582 4083495 4275525 4471041 4435352 4386499 4141871 4406507 4257450 4356661
14613 4356661 5161296 5418855 5248500 5317417 5107774 5190549 5571028 5755126 5409994 5688056
14603 5688056 5650393 5346531 4689839 5457439 5585462 5354704 4996337 5086418 4602195 4360274
14593 4360274 5160710 4704997 4940569 5332012 5092322 4701570 4961047 5189634 5287448 5170728
14583 5170728 5010598 4601626 4337217 4500620 4455464 3905808 4239598 4114488 4442907 4688534
14573D688534l93217K1783M32495O04099j42499m79852m63585L08109J15793O6202
14563D757862o1494k10989j91128J27969O67855l14174p021K11236N30261n23636
14553D986741n39700l5713R7280K43687J13180p84253P3777j84105Q8086N4677
14543D113657R8104n14094J91469L75460M79332k57841m06026Q02783K54620L8465
14533E175929j36466K89514L4513m49591O459O40348Q0662j155664j13247L27441
14523D699898q2266L56230K57834j25839O5214n4893j53417J42107j0557j13931
14513D980380k31862k83285l27873k64427R07563Q41252n37105l77404K96891
14504E004130L77070J89318O2444l25374j51585l56266j27218K77885m13051j76490
$$ plain form
14573 4688534 4295317 4317100 4749595 5353694 5211195 4731343 4267758 4575867 4691660 4757862
14563 4757862 4696368 4485379 4294251 4422220 5090075 4775901 4768880 4980116 5510377 4986741
14553 4986741 4447041 4411328 4508608 4752295 4865475 4081222 4154999 3970894 4058980 4113657
14543 4113657 4211761 3697667 3889136 4264596 4743928 4486087 4080061 4882844 5137464 5175929
14533 5175929 5039463 5328977 5363490 4913899 4920358 5560706 5641368 4485704 4372457 4699898
14523 4699898 4617632 4973862 5231696 5105857 5171071 5116178 4962761 5104868 5094311 4980380
14513 4980380 4748518 4465233 4137360 3872933 4780496 5621748 5084643 4707239 5004130
14504 5004130 5381200 5570518 5632962 5307588 5156003 4799737 4672519 4950404 4537353 4360863
14494D360863J51212L45372l90397J6036L36495l29303j55718r6484j08345k15377
14484C914354L02592l12537M3858P10940L18057o33692J64612L91479m38675O18425
$$ plain form
14494 4360863 4512075 4857447 4467050 4483086 4819581 4490278 4334560 4238076 4129731 3914354
14484 3914354 4216946 3904409 3948267 4659207 4977264 4343572 4508184 4899663 4460988 5079413
$$ [...]
##END NTUPLES=NMR SPECTRUM
##END=
