##TITLE=1H_DE-80H_X3
 200.13MHz, d2o
 8 sc
 
 19ns.26.2.2025
##JCAMPDX= 6.0         $$ Bruker NMR JCAMP-DX V2.0
##DATA TYPE= NMR SPECTRUM
##DATA CLASS= NTUPLES
##ORIGIN= UXNMR, Bruker Analytische Messtechnik GmbH
##OWNER= pz
$$ XWIN-NMR		Version 3.5
$$ Mon May  4 10:28:54 2026 Russian Standard Time (UT+4h)  Yarkov@DPX200
##.OBSERVE FREQUENCY= 200.1313
##.OBSERVE NUCLEUS= ^1H
##.ACQUISITION MODE= SIMULTANEOUS
##.ACQUISITION SCHEME= undefined
##.AVERAGES= 8
##.DIGITISER RES= 18
##SPECTROMETER/DATA SYSTEM= spect
##.PULSE SEQUENCE= zg30
##.SOLVENT NAME= CDCl3
##.SHIFT REFERENCE= (INTERNAL, CDCl3, 0, 17.9935)
##AUDIT TRAIL= $$ (NUMBER, WHEN, WHO, WHERE, WHAT)
$$ ##TITLE= Audit trail, XWIN-NMR		Version 3.5
$$ ##JCAMPDX= 5.01
$$ ##ORIGIN= Bruker BioSpin GmbH
$$ ##OWNER= Yarkov
$$ C:/Bruker/XWIN-NMR/data/yarkov2/nmr/H-C/1/pdata/1/auditp.txt
$$ ##AUDIT TRAIL=  $$ (NUMBER, WHEN, WHO, WHERE, WHAT)
(   1,<2026-05-04 10:27:36.17 +0400>,<Yarkov>,<DPX200>,
      <created by zg, POWCHK disabled, PULCHK disabled
       configuration hash MD5:
       00 E9 B6 7A A2 85 ED C7 34 08 36 98 17 FE 4E 26
       data hash MD5: 16K
       C8 30 AF A4 36 BC BF 00 BE 61 88 06 47 02 CF 54>)
(   2,<2026-05-04 10:27:45.62 +0400>,<Yarkov>,<DPX200>,
      <Start of raw data processing
       efp BC_mod = 2 LB = 0.25 FT_mod = 6 PKNL = 1 PHC0 = -5303.516 PHC1 = 11.42193 SI = 16K 
       data hash MD5: 16K
       3B CD 43 0D EB EC 35 03 3A DF 1C 56 14 9D BE 36>)
(   3,<2026-05-04 10:27:54.85 +0400>,<Yarkov>,<DPX200>,
      <abs ABSG = 5 
       data hash MD5: 16K
       F2 2E C5 6B DF A7 B0 1C 48 E3 FD 5A 8D 4B 38 6C>)
$$ ##END=
$$ 
$$ hash MD5
$$ 65 29 CB 2B 96 7F EF 06 EB D0 0C 61 A5 2E 6F D9
##$RELAX= 
##$RELAX= 
##$RELAX= 
##$RELAX= 
##$RELAX= 
##$RELAX= 
$$ Bruker specific parameters
$$ --------------------------
##$DU= <C:/Bruker/XWIN-NMR>
##$EXPNO= 1
##$NAME= <H-C>
##$PROCNO= 1
##$TYPE= <nmr>
##$USER= <yarkov2>
##$AMP= (0..31)
100 100 100 100 100 100 100 100 100 100 100 100 100 100 100 100 100 100 
100 100 100 100 100 100 100 100 100 100 100 100 100 100 
##$AQSEQ= 0
##$AQ_mod= 1
##$AUNM= <au_zg>
##$AUTOPOS= <>
##$BF1= 200.13
##$BF2= 200.13
##$BF3= 200.13
##$BF4= 200.13
##$BF5= 200.13
##$BF6= 200.13
##$BF7= 200.13
##$BF8= 200.13
##$BYTORDA= 1
##$CFDGTYP= 0
##$CFRGTYP= 5
##$CHEMSTR= <none>
##$CNST= (0..31)
1 1 145 1 1 1 1 1 1 1 1 1 1 1 1 1 1 1 1 1 1 1 1 1 1 1 1 1 1 1 1 1 
##$CPDPRG= <>
##$CPDPRG1= <>
##$CPDPRG2= <>
##$CPDPRG3= <>
##$CPDPRG4= <mlev>
##$CPDPRG5= <mlev>
##$CPDPRG6= <mlev>
##$CPDPRG7= <mlev>
##$CPDPRG8= <mlev>
##$CPDPRGB= <>
##$CPDPRGT= <>
##$D= (0..31)
0 0.7 0 0 0 0 0 0 0 0 0 0.03 0 0 0 0 0 0 0 0 0 0 0 0 0 0 0 0 0 0 0 0 
##$DATE= 1777876055
##$DBL= (0..7)
120 120 120 120 120 120 120 120 
##$DBP= (0..7)
150 150 150 150 150 150 150 150 
##$DBP07= 0
##$DBPNAM0= <>
##$DBPNAM1= <>
##$DBPNAM2= <>
##$DBPNAM3= <>
##$DBPNAM4= <>
##$DBPNAM5= <>
##$DBPNAM6= <>
##$DBPNAM7= <>
##$DBPOAL= (0..7)
0.5 0.5 0.5 0.5 0.5 0.5 0.5 0.5 
##$DBPOFFS= (0..7)
0 0 0 0 0 0 0 0 
##$DE= 6
$$ [...]
##$SUBNAM3= <"">
##$SUBNAM4= <"">
##$SUBNAM5= <"">
##$SUBNAM6= <"">
##$SUBNAM7= <"">
##$SUBNAM8= <"">
##$SUBNAM9= <"">
##$SW= 18.0517328524113
##$SWIBOX= (0..15)
0 0 2 0 0 0 0 0 0 0 0 0 0 0 0 0 
##$SW_h= 3612.71676300578
##$TD= 16384
##$TD0= 1
##$TE= 0
##$TE2= 300
##$TE3= 300
##$TEG= 300
##$TL= (0..7)
0 120 120 120 120 120 120 120 
##$TP= (0..7)
150 150 150 150 150 150 150 150 
##$TP07= 0
##$TPNAME0= <>
##$TPNAME1= <>
##$TPNAME2= <>
##$TPNAME3= <>
##$TPNAME4= <>
##$TPNAME5= <>
##$TPNAME6= <>
##$TPNAME7= <>
##$TPOAL= (0..7)
0.5 0.5 0.5 0.5 0.5 0.5 0.5 0.5 
##$TPOFFS= (0..7)
0 0 0 0 0 0 0 0 
##$TUNHIN= 0
##$TUNHOUT= 0
##$TUNXOUT= 0
##$USERA1= <user>
##$USERA2= <user>
##$USERA3= <user>
##$USERA4= <user>
##$USERA5= <user>
##$V9= 5
##$VALIST= <valist>
##$VCLIST= <CCCCCCCCCCCCCCC>
##$VD= 0
##$VDLIST= <DDDDDDDDDDDDDDD>
##$VPLIST= <PPPPPPPPPPPPPPP>
##$VTLIST= <TTTTTTTTTTTTTTT>
##$WBST= 1024
##$WBSW= 4
##$XGAIN= (0..3)
0 0 0 0 
##$XL= 0
##$YL= 0
##$YMAX_a= 348845
##$YMIN_a= -288807
##$ZGOPTNS= <>
##$ZL1= 120
##$ZL2= 120
##$ZL3= 120
##$ZL4= 120
##$ABSF1= 15.89895
##$ABSF2= -2.152907
##$ABSG= 5
##$ABSL= 3
##$ALPHA= 0
##$AQORDER= 0
##$ASSFAC= 0
##$ASSFACI= 0
##$ASSFACX= 0
##$ASSWID= 0
##$AUNMP= <proc_1d>
##$AZFE= 0.1
##$AZFW= 0.1
##$BCFW= 0
##$BC_mod= 2
##$BYTORDP= 0
##$COROFFS= 0
##$CY= -3
##$DATMOD= 1
##$DC= 0
##$DFILT= <>
##$DTYPP= 0
##$F1P= 0
##$F2P= 0
##$FCOR= 1
##$FTSIZE= 16384
##$FT_mod= 6
##$GAMMA= 0
##$GB= 0
##$INTBC= 1
##$INTSCL= 3.241238e-09
##$ISEN= 128
##$LB= 0.25
##$LEV0= 0
##$LPBIN= 0
##$MAXI= 10000
##$MC2= 0
##$MEAN= 0
##$ME_mod= 0
##$MI= 1.114404
##$NCOEF= 0
##$NC_proc= -7
##$NLEV= 6
##$NOISF1= 3.799351
##$NOISF2= 2.8
##$NSP= 0
##$NTH_PI= 0
##$NZP= 0
##$OFFSET= 17.9935
##$PC= 1
##$PHC0= -5303.516
##$PHC1= 11.42193
##$PH_mod= 1
##$PKNL= yes
##$PPARMOD= 0
##$PSCAL= 0
##$PSIGN= 0
##$REVERSE= no
##$SF= 200.129505328555
##$SI= 16384
##$SIGF1= 3
##$SIGF2= 2
##$SINO= 0.751879
##$SIOLD= 32768
##$SREGLST= <19F.Aceton>
##$SSB= 0
##$STSI= 16384
##$STSR= 0
##$SW_p= 3612.71676300578
##$SYMM= 0
##$S_DEV= 0
##$TDeff= 16384
##$TDoff= 0
##$TI= <>
##$TILT= no
##$TM1= 0
##$TM2= 0
##$TOPLEV= 0
##$USERP1= <user>
##$USERP2= <user>
##$USERP3= <user>
##$USERP4= <user>
##$USERP5= <user>
##$WDW= 1
##$XDIM= 16384
##$YMAX_p= 350890394
##$YMIN_p= -2479931
$$ End of Bruker specific parameters
$$ ---------------------------------
##NTUPLES= NMR SPECTRUM
##VAR_NAME=  FREQUENCY,     SPECTRUM/REAL,   SPECTRUM/IMAG
##SYMBOL=    X,             R,               I
##VAR_TYPE=  INDEPENDENT,   DEPENDENT,       DEPENDENT
##VAR_FORM=  AFFN,          ASDF,            ASDF
##VAR_DIM=   16384,         16384,           16384
##UNITS=     HZ,            ARBITRARY UNITS, ARBITRARY UNITS
##FACTOR=    0.220516191357247, 1,           1
##FIRST=     3601.03020526961, 0,            0
##LAST=      -11.6865577361682, 0,           0
##MIN=       -11.6865577361682, -2479931,    0
##MAX=       3601.03020526961, 350890394,    0
$$ Real data points
##PAGE= N=1
##DATA TABLE= (X++(R..R)), XYDATA
$$ [...]
3590A4846168n92315J660388J008249R4451R75043J290050L45900R43319J322864
3581B1894117Q906Q89115K72591J14298o1353N066L6046n12440l27346L51112
3571B2670112K26150j43318J374004L01678Q7161N82483P26147R42585O57581
3562B7424583P67530O59329J43465P67852M67498n41139N02350J461840k32175
3553C1421133l74359L61151k94095R85564P49206j01065L4473j38892J003892
3544C3647008M31873J46732K08639p84199l99706R23898k41028n16377O0133k119344
3534C1357629j529428j68620P26500k07028j175885O64781k03922j18252J509052
3525C0854827L9848p93628P38012J0397n92347L28927n63325j237765j505314
$$ y = [14846168, 14253853, 15914241, 16922490, 17016941, 17991984, 19282034, 19627934, 20571253, 21894117, 21903023, 22792138, 23064729, 23179027, 23117674, 23122740, 23158786, 22646346, 22319000, 22670112, 22896262, 22752944, 24126948, 24428626, 24515787, 25098270, 25824417, 26767002, 27424583, 28192113, 28851442, 28994907, 29762759, 30230257, 29689118, 30191468, 31653308, 31421133, 31046774, 31407925, 31113830, 32099394, 32848600, 32747535, 32782008, 32643116, 33647008, 34078881, 34225613, 34434252, 33650053, 33250347, 34174245, 33933217, 33416840, 33476973, 31357629, 29828201, 29659581, 30386081, 30179053, 29003168, 29667949, 29464027, 29345775, 30854827, 30894675, 30101047, 30839059, 30849456, 30257109, 30586036, 30022711, 28784946, 27279632]
3516B7279632j237597o56224j543184o30563q73305j176515n11733q68502k32516
3507A9549493m62199j91379N835Q00212J091006M82492n12031r33065j7747k85271
3497A9527346p79767j105932j265758r69766r74266j45028n77371n47906j34568
3488A3026984q71454p36150O2445n5927r33773R5784j64378j203057K12616M16757
3478I849847K96393j319195m0254L68950j254784j1135K08713o39633m00840N44885
3468G602947j076924m13217L09543o33695j02295l87406M01914J86331p75950
3459E111248P29430q45487j4571N10987p59218l59506L94058K46586j14652j40284
3449D758591n67067N37520j30079J5008n0922o27738K37844l7383R00836p61437
$$ y = [27279632, 26042035, 25385811, 23842627, 23212064, 22338759, 21162244, 20650511, 19782009, 19549493, 19087294, 18895915, 18901750, 19701962, 20792968, 21275460, 20763429, 19830364, 19812617, 19527346, 18747579, 17641647, 16375889, 15406123, 14431857, 14286829, 13709458, 13161552, 13026984, 12155530, 11419380, 11481825, 11425898, 10492125, 10587909, 10423531, 9220474, 9433090, 9849847, 10146240, 8827045, 8786791, 9155741, 7900957, 7889822, 8098535, 7458902, 7058062, 7602947, 6526023, 6112806, 6422349, 5788654, 5686359, 5298953, 5700867, 5887198, 5111248, 5840678, 4995191, 4980620, 5491607, 4732389, 4372883, 4766941, 5013527, 4898875, 4758591, 4191524, 4729044, 4598965, 4613973, 4563051, 3935313, 4173157, 4135774, 5036610, 4275173]
3439D275173n22837L1146o92875N31510K66886R5449L6258L02923r1401J9016
3429D251248R7987n56735n16811j11854P2884O8982K41764M02976q43485n3009
3419C053947K27114j38229O43496r46038n03159N89771O32694J47860J06403M33537
3409D247396k41580N30350M44192k41833p37182N36112J2501m89024K3235q99841
3399C184326L03209J17427r7297O86556n5640J83889R3422m32875l79046P45004
3389D348975j35737l10225J7201j193061L58664P11458K68515l5362m18182j99005
3379C413241Q8015M53370J06473n35848j043322N24870K13187J68981K56819q60659
3369B785127J49567J575551n89569o15612R26443j136358l27340N84161O5943
$$ y = [4275173, 3752336, 3783482, 3090607, 3622117, 3889003, 3984452, 4020710, 4323633, 4232232, 4251248, 4349235, 3792500, 3275689, 3163835, 3236719, 3305701, 3547465, 3950441, 3106956, 3053947, 3281061, 3142832, 3786328, 2840290, 2337131, 2926902, 3559596, 3707456, 3813859, 4247396, 4005816, 4536166, 4980358, 4738525, 4001343, 4537455, 4549956, 4060932, 4084167, 3184326, 3487535, 3604962, 3507665, 4194221, 4138581, 4322470, 4415892, 3983017, 3603971, 4348975, 4213238, 3903013, 3920214, 2727153, 3085817, 3797275, 4065790, 4030428, 3612246, 3413241, 3501256, 3954626, 4061099, 3525251, 2481929, 3006799, 3219986, 3388967, 3645786, 2785127, 2934694, 4510245, 3920676, 3305064, 4231507, 3095149, 2767809, 3351970, 3417913]
3360C417913p30571k2791J20728k72024K97137M69488J46474q87236K26754J93730
3350B959602m8822M22989m73624o24089J90861Q89543o75650K42132M13778m75029
3340B821691J85625K2908R5367N6843k86712K76325l88760k85386M73885J54303
3330C126089n001O19604j60370l45561l6203l55250M2232M33458r40537n53027
3320A825434N76096N43327n85635r77601M16703P76553L8393J61689J87099j168585
3310A793473N62700Q47323m16300L16048L4620j050248j08788Q17170P55099l45170
3300C205927j75234o21103p20074N16152J207408m88459n19142M31839o27927
3291B209387M59576Q04885K2430m39423r3841L7981n7968M30654r4014K58946
$$ y = [3417913, 2687342, 2664551, 2785279, 2513255, 2810392, 3279880, 3426354, 2539118, 2765872, 2959602, 2910780, 3333769, 2860145, 2236056, 2426917, 3316460, 2640810, 2882942, 3296720, 2821691, 3007316, 3030224, 3125591, 3182434, 2895722, 3172047, 2783287, 2497901, 2971786, 3126089, 3121088, 3740692, 3580322, 3234761, 3198558, 2843308, 2885540, 3318998, 2378461, 1825434, 2401530, 2944857, 2359222, 1381621, 1798324, 2574877, 2613270, 2774959, 2962058, 1793473, 2356173, 3203496, 2787196, 3103244, 3137864, 2087616, 1978828, 2795998, 3551097, 3205927, 3030693, 2409590, 1689516, 2205668, 3413076, 2924617, 2405475, 2837314, 2209387, 2668963, 3473848, 3496278, 3056855, 2963014, 3000995, 2943027, 3373681, 3279667, 3538613]
3281C538613J94535r76017O8503N13498N21252n27996q42750Q94595k68669l75662
3271B739902m5692o53373J13430J144821J31989m76788o7382m81256P53227M90503
3261C649381N5127l02580p47569N48496m08140Q9374K72411J70713m39120L61241
3251C249334J93924m23476Q60817o14138n04904K28537L13138J07377m26529n99081
3241B384999M00001P25694j59204j37803l13520J6761J36197n72239P27134K66531
3231C474551j10993k69797k38058R07481K17582n57312l09841L93291J53057k42750
3221C417211o804o29837k80155p1656k01491K1968L51838M72400k64536m64829
3211B344109o07179R98127Q79111l38290o36435m77057N36675Q8050J40575M30123
$$ y = [3538613, 3733148, 2757131, 2825634, 3339132, 3860384, 3332388, 2489638, 3384233, 3115564, 2739902, 2694210, 2040837, 2154267, 3299088, 3431077, 2954289, 2886907, 2405651, 3158878, 3649381, 3704508, 3401928, 2654359, 3202855, 2794715, 2884089, 3156500, 3327213, 2888093, 3249334, 3443258, 3019782, 3880599, 3266461, 2761557, 2990094, 3303232, 3410609, 2984080, 2384999, 2785000, 3510694, 3351490, 3213687, 2900167, 2916928, 3053125, 2480886, 3208020, 3474551, 3363558, 3093761, 2855703, 3763184, 3980766, 3423454, 3113613, 3506904, 3659961, 3417211, 3410407, 2780570, 2500415, 2428759, 2227268, 2249236, 2601074, 3073474, 2808938, 2344109, 1736930, 2735057, 3614168, 3275878, 2639443, 2162386, 2699061, 2787111, 2927686, 3357809]
3201C357809j71459M03786n46424q3296j03143P65128k7599l46618j42827m28398
3191B676959O00807l42327k683k34149M96934j1630L25846K04497n96631J33269
3181C250892o73890J45501M99485l97567n50711j0748J30945o44475J74150J093822
3171C017404J61158m06088M6025o80515L93354J213486M4876q00243L22048l09211
3161C002294r60777O12914P28890l66473k30291O30258r18063q6316K36241k64465
3151B384212j45143j79764P14074j02334j77903L6116M65905l85332l77733O96957
3141B929055M9977l64471M76011l21392l12557Q20481N77041j347317j81231J61395
3131B486992O0774K38845Q8973l26322m87933J264811r2613j061913j92335M11140
$$ y = [3357809, 3186350, 3590136, 3043712, 2960416, 2857273, 3622401, 3594802, 3248184, 3105357, 2676959, 3277766, 2935439, 2932756, 2698607, 3195541, 3183911, 3509757, 3714254, 3117623, 3250892, 2577002, 2722503, 3221988, 2824421, 2273710, 2262962, 2393907, 1749432, 1923582, 3017404, 3178562, 2772474, 2818499, 2137984, 2531338, 3744824, 3789700, 2989457, 3311505, 3002294, 2041517, 2654431, 3383321, 3016848, 2786557, 3416815, 2498752, 2412436, 2648677, 2384212, 2239069, 2059305, 2773379, 2671045, 2493142, 2529258, 2995163, 2609831, 2232098, 2929055, 2979032, 2614561, 3090572, 2769180, 2456623, 3277104, 3854145, 2506828, 2325597, 2486992, 2547766, 2786611, 2875584, 2549262, 2061329, 3326140, 3233527, 2171614, 1979279, 2390419]
3121B390419J51658K89027k0358n80505J04789k21087j85324m7896J24657M19485
3111B424865m44441k87233R42946k0677J85630M02491n71277J98598j66142n12591
3101B152169k26581M71786K60659O2384p15422J004j99002n9189N84285p65612
3091A566481K91895j75646m68294R02970R064n41008M56116R8722n50834P13090
3081B302556N17302N691l50581j90472j72816R9366Q47789p36033o69014J022082
3071B675870m8226l23764L27496n8631q38919L69505K24382k0697k31705j86739
3061A888572o00371N9236J145771P0610k14891K65245n64421O00980N96109o96516
3051B550324m85306J45388J1108o59225K18406P36185l01431j52299O20311q72741
$$ y = [2390419, 2542077, 2831104, 2810746, 2230241, 2335030, 2113943, 1928619, 1880723, 2005380, 2424865, 1980424, 1693191, 2636137, 2615460, 2801090, 3203581, 2632304, 2830902, 2664760, 2152169, 1925588, 2397374, 2658033, 2720417, 2004995, 2005999, 1806997, 1747808, 2332093, 1566481, 1858376, 1682730, 1214436, 2117406, 2126470, 1585462, 2041578, 2140300, 1589466, 2302556, 2819858, 2825549, 2474968, 2284496, 2111680, 2211046, 3058835, 2322802, 1653788, 2675870, 2627644, 2303880, 2631376, 2572745, 1733826, 2103331, 2327713, 2307016, 2075311, 1888572, 1288201, 1347437, 2493208, 2563818, 2348927, 2614172, 2049751, 2650731, 3246840, 2550324, 2065018, 2210406, 2221514, 1562289, 1780695, 2516880, 2215449, 2063150, 2683461, 1810720]
3041A810720J17858J271215p30868m36755O59983n44733K49936j85078L60912
3032B573190J91610P54567k64688l02408j2449K54583Q54725p15008m6281m27981
3022B859860J96129L37924J8826R28726L97655j045317l2240Q90028n23728O76507
3012D704370L90366j002585N94078m17916k75249J77654o7910Q01641m73492n40642
3002C890315m0893K10385P4933n79542r1405M40639k35363l1093K79743L92415
2992D310134N46048m97561j18372O0273k92472L70373o55460k18024K10824p82835
2982B932928J159120M76535k93525K15454p73384Q16948R37119K78531j69134
2973E580592m93536M67629R61403L02807J14715O40169L21626J484425K85633
$$ y = [1810720, 1928578, 3199793, 2468925, 2032170, 2692153, 2147420, 2397356, 2212278, 2573190, 2764800, 3519367, 3254679, 2952271, 2939822, 3194405, 4049130, 3334122, 3287841, 2859860, 3055989, 3393913, 3412739, 4341465, 4739120, 3693803, 3661563, 4551591, 4027863, 4704370, 5094736, 4092151, 4686229, 4268313, 3993064, 4170718, 4102808, 4904449, 4430957, 3890315, 3849422, 4059807, 4134740, 3555198, 3463793, 3904432, 3669069, 3637976, 3917719, 4310134, 4856182, 4358621, 4240249, 4300522, 4008050, 4378423, 3722963, 3504939, 3715763, 2932928, 4092048, 4568583, 4275058, 4490512, 3717128, 4534076, 5471195, 5749726, 5580592, 5087056, 5554685, 6516088, 6818895, 6933610, 7573779, 7895405, 9379830, 9665463]
2964I665463k14132n504l2259l83427m14314Q51878L93538P2225P69311J440368
2954A2143147J399702J613088J264264M98594J01039M07832R60762j1039m60652
2945A7916737K56241J07118p0301J14352k03866l08690J105776Q28558K93281
2936B0039206O78871R22981K81568P79196L54843Q3788k88329m18828k06521q40922
2926B1385853p04975q99931o90825k45729k45374k93309p30178o99969M01338
2917A7276901L41716l22922p5350J45878p14564j571775k04670m25042j238921
2908A3211251r45138k253728k132239n38367M9036L00221M87196L55228N9626
2899H593086L13435K91598n8455j097428r40359q92721r42770o22369j12184Q5939
$$ y = [9665463, 9451331, 9445827, 9413568, 9030141, 8615827, 9467705, 9861243, 9933468, 10702779, 12143147, 13542849, 15155937, 16420201, 16918795, 17019834, 17427666, 18388428, 18377389, 17916737, 18172978, 18280096, 18209795, 18324147, 18120281, 17811591, 18917367, 19745925, 20039206, 20718077, 21641058, 21922626, 22701822, 23056665, 23140453, 22852124, 22433296, 22226775, 21385853, 20680878, 19780947, 19090122, 18844393, 18599019, 18305710, 17575532, 16875563, 17276901, 17618617, 17295695, 17220345, 17366223, 16651659, 15079884, 14875214, 14450172, 13211251, 12266113, 10012385, 7880146, 7341779, 7390815, 7691036, 8178232, 8533460, 8593086, 8906521, 9198119, 9139664, 8042236, 7101877, 6209156, 5266386, 4644017, 4531833, 4617772]
2889D617772k28042r387n58457j34454J68808k51477m17298k44627K12920O78732
2879C834490p7245n89932N7879N9296R0124K48132n47478o6612J94426l08503
2869B894577k04548N22954L26027l90591q15485j71379J8420N54873L94959K50208
2859C380015k11500q43135K02050K68685k30638m1961j000879R060J57769P96727
2849B486193O31251r42456n35684P96960n74556K87697O15730r67013M94078L33798
2839B625998K74894N07660N07889l75268l45311J2003K36805m09389J86683l85858
2829B836106l15533L46350o27431J68966J51738q9973n83369N40033R17522l81082
2819B963327k97365M98321O7027J45548O91475j379454l75185J032307k32996
$$ y = [4617772, 4389730, 4380343, 3821886, 3687432, 3856240, 3604763, 3187465, 2942838, 3155758, 3834490, 3757245, 3167313, 3225192, 3284488, 3374612, 3622744, 3075266, 3008654, 3203080, 2894577, 2690029, 3212983, 3539010, 3148419, 2332934, 2161555, 2179975, 2734848, 3129807, 3380015, 3168515, 2325380, 2527430, 2796115, 2565477, 2523516, 1522637, 1531697, 1689466, 2486193, 3117444, 2174988, 1639304, 2436264, 1861708, 2149405, 2765135, 1798122, 2292200, 2625998, 2900892, 3408552, 3916441, 3541173, 3195862, 3207865, 3444670, 3035281, 3221964, 2836106, 2520573, 2866923, 2239492, 2408458, 2560196, 2470223, 1886854, 2426887, 3344409, 2963327, 2665962, 3164283, 3231310, 3376858, 4068333, 2688879, 2313694, 3346001, 3113005]
2810C113005L89667N27132K44997J1626k54326J82644n45474J66593Q78037J84821
2800D898722J02521R05412M23157l4192R48634m9224j41690L76900l16291q59741
2790F254208N7129J07230p88000j97609l37195J26942o89303M94893J089857r7307
2780F020845J64232M07863m53902k8875P37819K82647o2132k76451M82731K0392
2770G295169L6563j4152j99445k40866Q9432J215280J51543L48110k3553J70293
2760H828374P02682J25088O0836K99749n05406o40125L1531K2367k74737j151020
2750G499339n26457K23791L8675J46826L24530l22912J429050L13536l05721j46327
2740H674330K00157R8253j440845m26226o68558j43375l5963K92648q68572l24237
$$ y = [3113005, 3502672, 4029804, 4274801, 4286427, 4032101, 4214745, 3669271, 3835864, 4713901, 4898722, 5001243, 5906655, 6329812, 6295620, 7244254, 7195030, 7053340, 7430240, 7113949, 6254208, 6311337, 6418567, 5630567, 5432958, 5095763, 5222705, 4533402, 5028295, 6118152, 6020845, 6185077, 6592940, 6139038, 6110163, 6847982, 7130629, 7068497, 6792046, 7274777, 7295169, 7331732, 7317580, 7118135, 6877269, 6966701, 8181981, 8333524, 8681634, 8658081, 8828374, 9531056, 9656144, 9716980, 10016729, 9511323, 8871198, 8902729, 8925096, 8650359, 7499339, 6972882, 7196673, 7235348, 7382174, 7706704, 7383792, 8812842, 9126378, 8820657, 8674330, 8874487, 8972740, 7531895, 7105669, 6437111, 6293736, 6257773, 6550421, 5681849, 5357612]
2730E357612O29612k44042r09537m25661M19390l5573r1506J86860j56606L28950
2720E059499m0374R5481R0425m81732J267222N5988k64456o0502J61703R08405
2710F791659k27410k58556R1174N15367L2161P96227M90893J13798P00106R9586
2700I145005J393613J087361J660657J234049M60305P90624m37112j205019r24280
2691A3205203l56760r79567j023973j64849j029088n53424J048521R96179k44681
2682A0897561R03343J516890J030419J164014O18587M35838j147714p11903o09089
2673A4097946k220616k65809j76341m62838l83104o69883k27069N69218O27167
2664A0888671P65540m00440n86488R57591n14323J82301n23366o51811N80451
$$ y = [5357612, 5987224, 5743182, 4833645, 4407984, 4827374, 4791801, 4700295, 4887155, 4730549, 5059499, 5019125, 5114606, 5205031, 4723299, 5990521, 6046509, 5782053, 5721551, 5883254, 6791659, 6564249, 6305693, 6396867, 6912234, 6944395, 7740622, 8231515, 8345313, 9045419, 9145005, 10538618, 11625979, 13286636, 14520685, 14980990, 15771614, 15334502, 14129483, 13205203, 12848443, 11868876, 10844903, 10680054, 9650966, 9097542, 10146063, 11142242, 10897561, 11800904, 13317794, 14348213, 15512227, 16130814, 16566652, 15418938, 14707035, 14097946, 11877330, 11611521, 11435180, 10972342, 10589238, 9919355, 9692286, 10261504, 10888671, 11654211, 11253771, 10667283, 11624874, 11110551, 11292852, 10769486, 10117675, 10698126]
2655A0698126m19774k75434O17870R06041J125607J140345k25734M05879K246735
2646A6219661L188090J951523J581062K503789J151009N97590J285012j246805
2638B7230931j736577j548450j638115j792686j921265q6348p72601J91863k62075
2629A7664677p11Q72530J678090J786687J094838J169470J688575J561395p19433
2620B6796118m21183q04142k201022r21086q45239o94532r83469q96039m18843
2611A8610563m56951J438816L59466J31537k25076k51809O91162j65857r94257
2602A9137594n91469j43478r59705L26909J597418o51955n69793N53537M43859
2593A9142917J41102K035412K399676m54997P61475Q99032k68554J150711J587140
$$ y = [10698126, 10278352, 10002918, 10620788, 11526829, 12652436, 13792781, 13567047, 13972926, 16219661, 19407751, 21359274, 22940336, 25444125, 26595134, 27192724, 28477736, 27230931, 25494354, 23945904, 22307789, 20515103, 18593838, 18507490, 17734889, 17926752, 17664677, 17663966, 18536496, 20214586, 22001273, 23096111, 24265581, 25954156, 27515551, 26796118, 26374935, 25570793, 23369771, 22448685, 21603446, 20908914, 19925445, 19029406, 18610563, 18153612, 19592428, 19951894, 20083431, 19858355, 19606546, 20297708, 20131851, 19137594, 18546125, 18402647, 17442942, 17769851, 19367269, 18715314, 18145521, 18699058, 19142917, 19284019, 21319431, 23719107, 23264110, 24025585, 24924617, 24656063, 25806774, 27393914]
2584B7393914k62752K43632J273104J001037J061725J574513J365098N73415J344809
2575C5568495K413476Q41941K166341K536391K199141L600279L093401L238010
2567E5657475L620069N087841M417534L449754L694637J569521j623072j697512
2559G4176247q53894j439658l28380K7138l67904N57049K763464K150059K821522
2550G9505643N611084N965617O080491P277905P536639O086815N222409L966793
2542A27253396K171077o7087j150246k624174l458684j217294k029675j923790
2534A16953523j176109j259117o36139q51700j84232N79291M22389K541148L223752
2525A19612806K565625J940125K46975k709178l196483l176395k632285j757223
$$ y = [27393914, 27131162, 27374794, 28647898, 29648935, 30710660, 32285173, 33650271, 34223686, 35568495, 37981971, 38823912, 40990253, 43526644, 45725785, 49326064, 52419465, 55657475, 59277544, 64365385, 68782919, 72232673, 75927310, 77496831, 75873759, 74176247, 73322353, 71882695, 71554315, 71581453, 71213549, 71770598, 74534062, 76684121, 79505643, 85116727, 91082344, 97162835, 104440740, 111977379, 118064194, 123286603, 127253396, 129424473, 129357386, 128207140, 125582966, 122124282, 120906988, 118877313, 116953523, 115777414, 114518297, 113882158, 113030458, 112846226, 113425517, 113847906, 116389054, 119612806, 122178431, 124118556, 124365531, 121656353, 118459870, 115283475, 112651190, 110893967]
2517A10893967k153682j749839k371626j014315j311847m55540M20361n75797
2509A01681682O50939J440932J689522J719452J837871J591276J361208K896696
2501A14869578K272616J994844J636391K744178J750001R67797J799063J405990
2493A29440458M65929k35617N8655l99270r73898j123892j526598j536028m60457
2484A23709282O21521m97698Q72416L716791K600063J588051K371746J734239
2476A36716411O32910J671548J818063K590170L502235M130672L787525L989934
2468A58839468P176901O691544O048797P423960O224675L425080L521517J907479
2460B01259421r54433k304916l865263o201208p341124n934611p259234q845717
$$ y = [110893967, 108740285, 106990446, 104618820, 103604505, 102292658, 101837118, 102257479, 101681682, 102332621, 103773553, 105463075, 107182527, 109020398, 110611674, 111972882, 114869578, 117142194, 119137038, 120773429, 123517607, 125267608, 126235405, 128034468, 129440458, 129906387, 129670770, 129729425, 129330155, 128356257, 127232365, 125705767, 124169739, 123709282, 124330803, 123833105, 124705521, 128422312, 131022375, 132610426, 134982172, 136716411, 137349321, 139020869, 140838932, 143429102, 146931337, 151062009, 154849534, 158839468, 166016369, 172707913, 178756710, 186180670, 192405345, 195830425, 199351942, 201259421, 200304988, 198000072, 194134809, 187933601, 180592477, 174657866, 167398632, 158552915]
2452A58552915o834061n602877o435466m871796l733517l437771k645044k270743
2444A22721640j132724j471212n43978o48383j191593m04882P1564k13176j488320
2435A15698936k485827k680721k323440l567159l162683l614642l301315k936523
2427I1626626l518428m060086j998080j994792k522880j991186k534460m317469
2419F8689245l936363m059170m029157k736925l377471k572955k563729r66108
2411D4447367l74961j810908k60588q76652j656717r42254r76689j401589r97471
2402C5149538j248279j318698j166066j235615r1399o73278L82485O89651o68174
2393B9820165L84943J202956J736202J647576J123054J391810P18458J309657
$$ y = [158552915, 151718854, 146115977, 139680511, 134808715, 131075198, 127637427, 124992383, 122721640, 121588916, 120117704, 119573726, 118925343, 117733750, 117328868, 117400432, 117187256, 115698936, 113213109, 110532388, 108208948, 104641789, 101479106, 97864464, 94563149, 91626626, 88108198, 84048112, 82050032, 80055240, 77532360, 75541174, 73006714, 68689245, 64752882, 60693712, 56664555, 53927630, 50550159, 47977204, 45413475, 44447367, 44072406, 42261498, 42000910, 41124258, 39467541, 38525287, 37548598, 36147009, 35149538, 33901259, 32582561, 31416495, 30180880, 30089481, 29416203, 29798688, 30488339, 29820165, 30205108, 31408064, 33144266, 34791842, 35914896, 37306706, 38025164, 39334821]
2385C9334821j62963j158475j103492r21483j800184j133892j06634L78060J72382
2376C3498140k58198K13296l79079m7376j74395o41914r92161j647564P78415
2367C0349164K2340j366695L11171k48551j497185o09032j153291n52264l22834
2358B4932823N94516J021186n75022J436670K320870J491929J209075J321989
2350C3754036k75790j087194j770718j322086j357039j647019q84715k33527m93566
2341B4682382o60911j3194n86787o82276j8370p65027m30610N3675K53457J33510
2331B1965849M16845N56544K81212j175731o30346L15124j59635j23101R76299
2322B2423060P7707J644139J589986J55150K398726K088903o31678n89825j219213
$$ y = [39334821, 39171858, 38013383, 36909891, 35988408, 34188224, 33054332, 32947698, 33325758, 33498140, 33239942, 33453238, 33074159, 33026783, 32852388, 32210474, 31218313, 29570749, 30349164, 30371504, 29004809, 29315980, 29067429, 27570244, 26961212, 25807921, 25255657, 24932823, 25527339, 26548525, 25973503, 27410173, 29731043, 31222972, 32432047, 33754036, 33478246, 32391052, 30620334, 29298248, 27941209, 26294190, 25409475, 25175948, 24682382, 24021471, 24008277, 23421490, 22739214, 22720844, 21955817, 21525207, 21578882, 21832339, 21965849, 22382694, 22939238, 23220450, 22044719, 21414373, 21729497, 21569862, 21446761, 22423060, 22500767, 24144906, 25734892, 25890042, 28288768, 30377671, 29745993, 29156168, 27936955]
2313B7936955j841014r65359k373458k552072j659686q34130j244627j330179
2305A5136430n6297P02905n11880L32988R30895J58203J764196J917987Q9758
2296B0465185J475771J195419j401279p12828p21415j083127p73066j277957j341129
2287A5825574q96591k30716M84908O78277o35295m99214q92432j048760O96508
2278A3482259K8971k44925M87219m52507J58089k59080J176980J320624M68861
2269A6166491m8448J428093J942054K660452L308550L997981M604597M184298
2261C8244068K150831m78285k009653k731069k273333j512170j789228j110231
2253B8490930Q25534J336998K417576J162425l45842j264482k651128j725074
$$ y = [27936955, 26095941, 25130582, 22757124, 20205052, 18545366, 17711236, 16466609, 15136430, 15080133, 15783038, 15271158, 15604146, 16535041, 16693244, 18457440, 20375427, 20465185, 21940956, 23136375, 21735096, 21022268, 20300853, 19217726, 18444660, 17166703, 15825574, 14928983, 14698267, 15183175, 15861452, 15226157, 14726943, 13834511, 12785751, 13482259, 13511230, 13266305, 13753524, 13301017, 13459106, 13200026, 14377006, 15697630, 16166491, 16118043, 17546136, 19488190, 22148642, 25457192, 29455173, 34059770, 38244068, 40394899, 39916614, 37906961, 35175892, 32902559, 31390389, 29601161, 28490930, 29316464, 30653462, 33071038, 34233463, 33887621, 32623139, 29972011, 28246937]
2245B8246937j395443j167947K75304J209248J579468Q34068M0832j462394j735817
2236B6424256l062467j700134j230904j147571J485123J381001K049309J353941
2228B5552554M40319q7640j436473j827482l075259k371775k786437j583003j225174
2219A1599630n76905o35614j458929k53539r34832n37696J21443k05602r4011
2210G023945l82769m02032r32928M51467Q8559j49258K32643r17077R26192m85467
2200E453275m18190L39003k3794l57900K04248Q77347j215947j06708O68775j58425
2190E261684q95616J93581O08625j412042L30667R38131j591832L62669J376849
2181E172716m27457j444993P69712M04766J35234N68558m24204L63058K31062
$$ y = [28246937, 26851494, 25683547, 25958851, 27168099, 28747567, 29581635, 29622467, 28160073, 26424256, 23361789, 21661655, 20430751, 19283180, 20768303, 22149304, 24198613, 25552554, 25992873, 25905233, 24468760, 22641278, 19566019, 17194244, 14407807, 12824804, 11599630, 11022725, 10387111, 8928182, 8674643, 7739811, 7202115, 7323558, 7117956, 7023945, 6641176, 6239144, 5306216, 5757683, 5846242, 5696984, 5929627, 5012550, 5938742, 5453275, 5035085, 5374088, 5350294, 4992394, 5196642, 6073989, 4858042, 4751334, 5420109, 5261684, 4366068, 4559649, 5168274, 3756232, 4086899, 5025030, 3433198, 3795867, 5172716, 4745259, 3300266, 4069978, 4474744, 4609978, 5178536, 4754332, 5117390, 5348452]
2172E348452J21176n42788m6780N5646n10685q70913K0937L61981k99966L27458
2162C964518m89912n67539L49871j29922K27348L82541J85736p90667k21556O62706
2152C573124n9792Q07736J78214j403338q97405Q44248O33147l46532L47255L12951
2142C989608r21058r51141O51752J63564m66630J060941l12105j162184J43009
2133B195756O49780M26257l90581O79084k43788p16957m66853J631130p88815
2124B975013p38130J687953p07632o72075K99783k142o87050N73918P02951l14365
2114C118224k27243P92083M07406j150301m9263N77418p82189Q2657M24014R2626
2104C285432j16519M67581Q96090O0648L42780N56036P27290k46781n19426l52912
$$ y = [5348452, 5469628, 4926840, 4880060, 4935706, 4425021, 3554108, 3575045, 3937026, 3637060, 3964518, 3474606, 2907067, 3256938, 3127016, 3354364, 3736905, 3922641, 3131974, 2910418, 3573124, 3513332, 4321068, 4499282, 3095944, 2198539, 3042787, 3675934, 3329402, 3676657, 3989608, 3068550, 2117409, 2769161, 2932725, 2466095, 3527036, 3214931, 2052747, 2195756, 2845536, 3271793, 2881212, 3560296, 3316508, 2599551, 2132698, 3763828, 2975013, 2236883, 3924836, 3217204, 2545129, 2844912, 2842770, 2155720, 2729638, 3432589, 3118224, 2890981, 3683064, 4090470, 2940169, 2890906, 3468324, 2686135, 2768792, 3192806, 3285432, 3168913, 3636494, 4532584, 4593232, 4936012, 5492048, 6219338, 5972557, 5453131, 5100219]
2094E100219k96500j7466K12355j07136q17434p55633j99565Q18235J29996j029362
2084C037709L16796q2379l48423P26748l98912p76898L97164N34038l44703l93433
2074B667707M72034p9153j62629L01575M87721p3257q5571P11225m66865j98207
2064C574580O28889L72899k74328k61148J96469m85053j57506J277830O78417
2055E551049l52376n03930N91519k34093l10880R9843j60089m32723J15361j94093
2045D169588k66250L78424L93227M5047k90548m95322L31753Q9395Q68920L14063
2035E538297m85235l53750j97554O03005O8145P40295m83483m09356n48365J5460
2025D487459L5680L45938r5831n89440k17345o81591R15935J052834k08990l88115
$$ y = [5100219, 4803719, 4786253, 4998608, 4891472, 4074038, 3318405, 3118840, 3937075, 4067071, 3037709, 3354505, 3272126, 2923703, 3650451, 3251539, 2474641, 2871805, 3405843, 3061140, 2667707, 3139741, 3060588, 2897959, 3199534, 3687255, 3613998, 3528427, 4239652, 3772787, 3574580, 4203469, 4576368, 4302040, 4040892, 4237361, 3752308, 3594802, 4872632, 5551049, 5198673, 4694743, 5286262, 5052169, 4741289, 4841132, 4681043, 4248320, 4363681, 4169588, 3903338, 4281762, 4674989, 4720036, 4429488, 3934166, 4265919, 4355314, 5224234, 5538297, 5053062, 4699312, 4501758, 5104763, 5172908, 5913203, 5429720, 5020364, 4471999, 4487459, 4523139, 4869077, 4773246, 4183806, 3966461, 3284870, 4200805, 5253639, 5044649, 4656534]
2015D656534q7542j67175L96702K52942j23935J72538m7628Q42276N41276q276
2005F427712M6015o86816O26861K52176J22636l97721J92207L94075Q9086J424465
1995H490696J74109J81707J41552Q01269P6878l96981K79179J2465l86290j4825
1985I359759R54404n88364m77847K76959o78116K61491j19293M55733k21758m07593
1975H815375k93161j62756Q96449P96628O2600j279443k03255P4830M52982j63918
1965H996331n64376k56501j82965P09099O65697M211m50085j31555O26943Q77180
1955A0293979k32148M40394J427649j14482M55957J550288J460323L54461J269533
1946A6905954R70945J046283K703762M116683L397571L038177N064161M295220
$$ y = [4656534, 4568992, 4401817, 4798519, 5051461, 4927526, 5100064, 5052436, 5894712, 6435988, 6427712, 6473727, 5786911, 6413772, 6665948, 6788584, 6390863, 6583070, 6977145, 7066231, 8490696, 8664805, 8846512, 8988064, 9789333, 9866211, 9469230, 9748409, 9760874, 9374584, 9359759, 10314163, 9725799, 9247952, 9524911, 8846795, 9108286, 8988993, 9444726, 9222968, 8815375, 8522214, 8359458, 9255907, 10052535, 10115135, 8835692, 8632437, 8707267, 9160249, 8996331, 8431955, 8175454, 7992489, 8701588, 9367285, 9371496, 8921411, 8789856, 9416799, 10293979, 10061831, 10502225, 11929874, 11815392, 12271349, 13821637, 15281960, 15636421, 16905954, 17876899, 18923182, 21626944, 25743627, 29141198, 32179375, 37243536, 41538756]
1938D1538756L565796M994759M719585L412288L379590L938554M158561K077932
1930G1785821j52053j043805k372012k394304k041994m234492l121660k495636
1922E3929865m376055n991233m882954l564760m486828l887070k763337k695006
1914B1282622j887722n56816j878591j307458m08397p53503l77151q73080o98060
1905A2541844J30529O2074p3288p13538o31069O607k91787j72329M7129q94696
1895A0011476k66739m7898n69012N23780K3500N89790j66048j099376k46526M84469
1885I237416M47941Q41300k58006r46405j7704J64044n12653L89758K15169n41679
1875I019181k09041J241878N23507n65440J218948P97220M1270q1437O80153L1721
$$ y = [41538756, 45104552, 50099311, 54818896, 58231184, 61610774, 65549328, 69707889, 71785821, 71633768, 70589963, 68217951, 65823647, 63781653, 59547161, 56425501, 53929865, 49553810, 43562577, 38679623, 35114863, 30628035, 26740965, 23977628, 21282622, 19394900, 18838084, 16959493, 15652035, 15243638, 14490135, 14112984, 13239904, 12541844, 12672373, 12734447, 12661159, 11947621, 11316552, 11323159, 11031372, 10859043, 10906172, 10011476, 9744737, 9696839, 9127827, 9651607, 9675107, 10264897, 10098849, 8999473, 8752947, 9237416, 9685357, 10526657, 10268651, 9322246, 9304542, 9468586, 8955933, 9345691, 9560860, 9019181, 8810140, 10052018, 10575525, 10010085, 11229033, 12026253, 12067523, 11986086, 12666239, 12697960]
1865A2697960N89203J328543Q41901O57592P31288J306318N16487P13718J728646
1856B1111656J458692P91575P12778J060369P85394J060936Q18112L07263L33222
1847B8439997J182274Q22295Q46167K638978J876968N06837J914143K188425J346887
1838D1762971R68891L12973L39144P83088J268634Q8573P7397R80905N30624Q22535
1828D7935735N31858L77369O72010J222085J540220Q02881R99593J183243N99047
1819E5864041K43494K253106K385331K288006K632129J823460K648353J275774
1811G1413694J864545K810051J857546J619433K612903J036531P46050J903477
1803H5864230K36859j75078O80009P09861N39215k66183N42078R99231N49894
$$ y = [12697960, 13287163, 14615706, 15457607, 16115199, 16846487, 18152805, 18669292, 19383010, 21111656, 22570348, 23361923, 24074701, 25135070, 25920464, 26981400, 27799512, 28106775, 28439997, 29622271, 30444566, 31290733, 33929711, 35806679, 36313516, 38227659, 40416084, 41762971, 42731862, 43044835, 43383979, 44167067, 45435701, 45524274, 45601671, 46582576, 47113200, 47935735, 48467593, 48844962, 49516972, 50739057, 52279277, 53082158, 54081751, 55264994, 55864041, 56107535, 58360641, 60745972, 63033978, 65666107, 67489567, 70137920, 71413694, 73278239, 76088290, 77945836, 79565269, 82178172, 83214703, 83960753, 85864230, 86101089, 85926011, 86606020, 87315881, 87855096, 87588913, 88130991, 89130222, 89680116]
1794H9680116Q48911J14321n04392J269342K548083P05550J603969K024469K159088
1785A00449457L007165L420468L867453L959282L205447M619419M299900L391172
1777A30219763M176442L419883J953475J837625K224034J076564J961546J557950
1769A48427282K03798o17895l60607M74647O19623j26405o64440J132401J047592
1760A50135996K042822J455271K01666J104088n20862j39960n18864j559677j236373
1751A50964107n69417q89781M78397J668478J091647K314192N04436O81998J751449
1742A57995506Q60425L32072K54476j521813k320047j610868k155156j613104
1734A50221491j967653k791069l827928m780379m855263m604913m783118m145575
$$ y = [89680116, 90529027, 90643348, 90138956, 91408298, 93956381, 94661931, 96265900, 98290369, 100449457, 103456622, 106877090, 110744543, 114703825, 117909272, 122528691, 126828591, 130219763, 134396205, 137816088, 139769563, 141607188, 143831222, 144907786, 146869332, 148427282, 148631080, 148013185, 147652578, 148127225, 148746848, 148620443, 147956003, 149088404, 150135996, 152178818, 153634089, 153835755, 154939843, 154418981, 154279021, 153760157, 152200480, 150964107, 150394690, 149504909, 149983306, 151651784, 152743431, 155057623, 155562059, 156244057, 157995506, 158855931, 159188003, 159442479, 157920666, 155600619, 153989751, 151834595, 150221491, 148253838, 145462769, 141634841, 136854462, 131999199, 127394286, 122611168, 118465593]
1726A18465593k622024k274119q61121M32447J88346J156394O98603k55133J499171
1717A16428157Q47183N48313J1446k189674j764477q81003j540831j248059p37000
1708A09474055j013665J23136l82375r44375k319227l243283l286984l702133
1700I4705149l766734k840572k151534p68591q21938m16811k30929m45354j680744
1691H1581942k062895j165691k469884j246107m26985j966287l158008r74305
1683F8111780j962767k213764j777915k027888j451755k352533j824737k790027
1675E1710394l060747j438194k331006k287368r46873j582199j855536j074147
1667C7134324p32666j11956j437175j632858j081007r90447l81883m94226l71897
$$ y = [118465593, 115843569, 113569450, 112708329, 113140776, 113329122, 114485516, 115184119, 114928986, 116428157, 117275340, 117823653, 117835099, 115645425, 113880948, 112999945, 111459114, 110211055, 109474055, 108460390, 108583526, 108201151, 107256776, 104937549, 101694266, 98407282, 94705149, 90938415, 88097843, 85946309, 85177718, 84355780, 83938969, 83708040, 83262686, 81581942, 79519047, 78353356, 75883472, 74637365, 74210380, 72244093, 69086085, 68111780, 66149013, 63935249, 62157334, 60129446, 58677691, 56325158, 54500421, 51710394, 48649647, 47211453, 44880447, 42593079, 41646206, 40064007, 38208471, 37134324, 36401658, 36289702, 34852527, 33219669, 32138662, 31148215, 30766332, 30272106, 29900209]
1658B9900209o47569j779235j549752n35704l63420N90368q14885j811648j284261
1649B1704103K57985K4390r66650p66090o03777k80255m32240M43974Q5500r71777
1639A8495163p69829K02824l34381j113211N7417M46125L628l01646J13557p01933
1629A6097714k00048J19254j31488n52372k4690O51835j192581j055238K58563
1620A3970949n45025l50974O09998p86329m64733K42090N96904P99959j151213
1611A2921626l61761Q33016j000309n40129k42316Q8586J079735K49204r84671
1602A2042981p01375K70501L19404Q5982m96233K27517K22117r5383M73373N50735
1592A2899619K69469k62027L3302R3522l9292j035517N28886P52590m21573O82938
$$ y = [29900209, 29252640, 27473405, 25923653, 25387949, 25024529, 25614897, 24800012, 22988364, 21704103, 21962088, 21986478, 21019828, 20253738, 19649961, 19369706, 18937466, 19381440, 19466940, 18495163, 17725334, 17928158, 17593777, 16480566, 16537983, 16984108, 16987736, 16686090, 16799647, 16097714, 15897666, 16016920, 15885432, 15333060, 15308370, 15960205, 14767624, 13712386, 13970949, 13425924, 13074950, 13684948, 12898619, 12433886, 12675976, 13272880, 14072839, 12921626, 12559865, 13392881, 12392572, 11852443, 11610127, 11698713, 12778448, 13027652, 12042981, 11341606, 11612107, 11931511, 12017493, 11521260, 11748777, 11970894, 11875511, 12348884, 12899619, 13169088, 12907061, 12940363, 13033885, 12994593, 11959076, 12487962, 13240552, 12818979, 13501917]
1582A3501917Q76939r13941J75316j03236o35138L06393J055123J96953q81542
1573A3578784K55640M59074k00756M1592J63830j48446j93875k49645N33259N89741
1563A4829198J41646M64181l33475k41378K75593P6213Q06278K83222m104K7478
1553A6324852M34494N51138J65022r68340N04885P17510p6868M85500j8320r4244
1543A8025629Q65066P69408j37560M12824J11938J48762J149868J031437P65667
1534B3143039J070892J992505J680923J869396K136662K171133J038228J932106
1526C7034884J475418J433934J715486K230230J672241J238313J941523J366440
1518E0108469J906632K509250K678335J913056K180772J216990J365851K301339
$$ y = [13501917, 14378856, 13464915, 13640231, 13536995, 12901857, 13208250, 14263373, 14460326, 13578784, 13834424, 14293498, 14092742, 14134334, 14298164, 14149718, 13955843, 13706198, 14239457, 14829198, 14970844, 15435025, 15101550, 14860172, 15135765, 15211978, 16018256, 16301478, 16297374, 16324852, 16759346, 17310484, 17475506, 16507166, 17012051, 17729561, 17652693, 18138193, 18119873, 18025629, 18890695, 19660103, 19522543, 19935367, 20047305, 20196067, 21345935, 22377372, 23143039, 24213931, 26206436, 27887359, 29756755, 31893417, 34064550, 35102778, 37034884, 38510302, 39944236, 41659722, 43889952, 45562193, 46800506, 48742029, 50108469, 52015101, 54524351, 57202686, 59115742, 61296514, 62513504, 63879355, 66180694]
1510F6180694J906847K199458J552968P47033J08701j46301J447111N61446k490566
1501G2067391k199478p68665j655203j519043j290688k098361j085629j262926
1493F0187398j361133j019467k088024j650110j705931k184131j390449k151679
1485D6636474k305931j328035k112853j381246p26378j271013m22669M5846r45288
1476C6188907O42279N5571L3275Q23881R03541M05082O05505Q63487J234876J071087
1466D2827491N52098J236206J124391J429327J705340P10016J126746J988250
1458E2699865J290495N10852L38487Q18644J127798N9935o46288N41594m36971
1449E6304411r67942o53968J7262j119787j043650j024616j018515L3408j114592
$$ y = [66180694, 68087541, 70286999, 71839967, 72587000, 72695701, 72549400, 73996511, 74557957, 72067391, 69867913, 69099248, 67444045, 65925002, 64634314, 62535953, 61450324, 60187398, 58826265, 57806798, 55718774, 54068664, 52362733, 50178602, 48788153, 46636474, 44330543, 43002508, 40889655, 39508409, 38782031, 37511018, 37088349, 37134195, 36188907, 36831186, 36886757, 36920032, 37743913, 38647454, 39052536, 39658041, 40521528, 41756404, 42827491, 43379589, 44615795, 45740186, 47169513, 48874853, 49584869, 50711615, 52699865, 53990360, 54501212, 54839699, 55658343, 56786141, 56846076, 56199788, 56741382, 56304411, 55336469, 54682501, 54699763, 53579976, 52536326, 51511710, 50493195, 50526603, 49412011]
1440D9412011j333720j625257j159257k095620j470787j508877j105808q01021
1432C8311664j924959n86530j063512p19585j246882p98077l71161L93058J12326
1423C2106342m35613j40375K83939P88413m16659L61204O25455K98222O99804
1414C4170732R10497J56172J220890J199201n86984M94273Q10785L63275O18453
1405C9357294R92779J218950J440814J495072L86747m36160J95159J373229n79861
1396D5444023j347138l67785j101750j95973l95706r61775n49190r10553j226632
1387C8387521j268462j195567O25811m78581j810929j151611q61648j194978j051075
1378C0000481o60090p18216j065105p07464J20334j490265J33839J103097j34863
$$ y = [49412011, 48078291, 46453034, 45293777, 43198157, 41727370, 40218493, 39112685, 38311664, 36386705, 35800175, 34736663, 34017078, 32770196, 31972119, 31600958, 31994016, 32106342, 31670729, 31530354, 31814293, 32602706, 32186047, 32547251, 33172706, 33470928, 34170732, 35081229, 35237401, 36458291, 37657492, 37070508, 37564781, 38375566, 38738841, 39357294, 40350073, 41569023, 43009837, 44504909, 44891656, 44455496, 44650655, 46023884, 45444023, 44096885, 43729100, 42627350, 42431377, 42035671, 41073896, 40524706, 39614153, 38387521, 37119059, 35923492, 36549303, 36070722, 34259793, 33108182, 32246534, 31051556, 30000481, 29340391, 28622175, 27557070, 26849606, 26969940, 25479675, 25613514, 26716611, 26581748]
1369B6581748m59630O47843K71238j65670Q74225Q03374P99652Q36710Q51151
1360C1040641J384597J356717K769164K212532J819254K125805J634886J930199
1352D6273795J620835J244139L84319J148013N33655J178983L10891n88602p970
1343E2098058j84547n63023n64798K16655q90019l95937l25736L17435N11359
1334E0219447N90311m35928q16702N31725j094700o35978K32739O75620l63764
1325D8902770L95175L39437r44240J99757o82865k304768k028828O43435p95596
1316D3724277k183557o95397n74360j02630n85571M25997O54250J252561J434679
1307D3350249M53391J374999P69642J776210J135622J067185R08403O34590Q82015
$$ y = [26581748, 26122118, 26769961, 27041199, 26875529, 27749754, 28553128, 29352780, 30189490, 31040641, 32425238, 33781955, 36551119, 38763651, 40582905, 42708710, 44343596, 46273795, 47894630, 49138769, 49523088, 50671101, 51204756, 52383739, 52694630, 52106028, 52098058, 51913511, 51350488, 50785690, 51002345, 50112326, 49716389, 49390653, 49708088, 50219447, 50809758, 50373830, 49557128, 50088853, 48994153, 48358175, 48590914, 49266534, 48902770, 49297945, 49637382, 48693142, 48892899, 48210034, 45905266, 43876438, 44519873, 43724277, 41540720, 40845323, 40270963, 40168333, 39582762, 40008759, 40663009, 41915570, 43350249, 43803640, 45178639, 45948281, 47724491, 48860113, 49927298, 50835701, 51470291, 52352306]
1298E2352306P21563J345539M56641k67589r1602M60490m79293j072056k7458
1289E3398541k63572r77648j584569j435589o95337n67766N27303j27736J83249
1280D8456876J083653K137137P20875P19736J905488Q34900Q18817J184712O84923
1271E8547117l7452M83830J574380p49684j715305J32520j260403j961457j781569
1262E3231977k064683k343410j368922j300143p01887K18134J006883J237496
1254D7915445K03912K185168R03834m53524k76364n62431j987394k311727j412659
1245D4204260j851720j403749j127582n07614o52980m24899j92479r05568L5803
1236C7173472n3670n93243o17135k26747m20779o67971N83178N0669R29353J74594
$$ y = [52352306, 53073869, 54419408, 54876049, 54608460, 54516858, 54977348, 54498055, 53425999, 53398541, 53134969, 52157321, 50572752, 49137163, 48441826, 47874060, 48401363, 48273627, 48456876, 49540529, 51677666, 52398541, 53118277, 55023765, 55858665, 56677482, 57862194, 58547117, 58509665, 58993495, 60567875, 59818191, 58102886, 58235406, 56975003, 55013546, 53231977, 51167294, 48823884, 47454962, 46154819, 45452932, 45671066, 46677949, 47915445, 48119357, 50304525, 51208359, 50754835, 50478471, 49916040, 47928646, 45616919, 44204260, 42352540, 40948791, 39821209, 39313595, 38660615, 38235716, 38043237, 37137669, 37173472, 37119802, 36526559, 35909424, 35682677, 35261898, 34593927, 35177105, 35227774, 36157127, 36331721]
1226C6331721j49885J233555K489204K051029O72533J099489J427795J825952
1218D6981393R56466Q83222J800998K249679J231386J344383K033105J804312
1210E9284944L722714K797909J906342L201345M626333M493518M364336M481568
1202H8879009L952366K946362L096503J914775j97453m02835j504071l156905
1194I5527751m227724m101562l186991l229235l446161l616111l066038l173013
1186F7480916k614615k436522l069023l462845k090933k570175l585662j298392
1178D6352749k872730k767355q25200o96208j836248j462933r75384j311290o40377
1169C2965024q94970l97646q69636l07756n37474k84812J106419N49690K1396
$$ y = [36331721, 36181836, 37415391, 39904595, 41955624, 42628157, 43727646, 45155441, 46981393, 47937859, 48821081, 50622079, 52871758, 54103144, 55447527, 57480632, 59284944, 63007658, 65805567, 67711909, 70913254, 75539587, 80033105, 84397441, 88879009, 92831375, 95777737, 98874240, 100789015, 100591562, 100188727, 98684656, 95527751, 91300027, 87198465, 84011474, 80782239, 77336078, 73719967, 70653929, 67480916, 64866301, 62429779, 59360756, 55897911, 53806978, 51236803, 47651141, 46352749, 43480019, 40712664, 39887464, 39191256, 37355008, 35892075, 34916691, 33605401, 32965024, 32070054, 31672408, 30802772, 30495016, 29957542, 29672730, 30779149, 31328839, 31350235]
1160C1350235K54149N93265l55279l02530o99338j029753N57514q4909j017194
1151B9266160n29351o1745J35396l42671M61778M11924P8529K02884L59749L29807
1141C0312460N08028P53837O84821j68960N04938O71295K20498L47036P1939m26640
1131C3479252O10314N35207l80726K84827j247925m60202j4983o79323M79568
1122C2606009j85427m69096K05166J152916J07344J074919j03667L14253Q13733
1113C5516150q97797P50534K82480L16387J179412O63616J597215J905871J561937
1104D2875805K993997M181675L952722M793855M056783K279301K190664Q68098
1096F8192900r76368j922326l267476l456346l155036k830701k765145j900087
$$ y = [31350235, 31604384, 32197649, 31842370, 31539840, 30840502, 29810749, 30368263, 30283354, 29266160, 28736809, 28675064, 28810460, 28467789, 28929567, 29341491, 29420020, 29622904, 29982653, 30312460, 30820488, 31574325, 32259146, 32090186, 32595124, 33266419, 33486917, 33833953, 33905892, 33479252, 34089566, 34624773, 34244047, 34528874, 33280949, 32820747, 32805764, 32126441, 32606009, 32420582, 31951486, 32156652, 33309568, 33416912, 34491831, 34388164, 34702417, 35516150, 34618353, 35368887, 35651367, 35967754, 37147166, 37810782, 39407997, 41313868, 42875805, 45869802, 50051477, 54004199, 58798054, 62854837, 65134138, 67324802, 68192900, 67216532, 65294206, 62026730, 58570384, 55415348, 52584647, 49819502, 47919415]
1088D7919415r91330j042231L56206L1656k1375n66046j111973j005159k060943
1079D1508220k427310j846141j230710j303731l79341N22930Q8813L43192q51467
1070C4424455J55520J1531K40244P47155l40798k46772M70701N81025R8816P75587
1060C6917464l0386k56621J211093j415392j96120J112328J444591J230102L63664
1051D0380723J493967J841757K178866K723098J929648K323683L126881K72968
1043E6271591O95126K108336K412888K938261K783851K316501O74202l82571j68050
1034F9650135j830147j104656j98071j823242j472316j263962j529632j465836
1026E8962273j793894j090267j262294n76853L83064J233552J011202J815576
$$ y = [47919415, 46928085, 45885854, 46242060, 46273716, 46252341, 45686295, 44574322, 43569163, 41508220, 39080910, 37234769, 36004059, 34700328, 34320987, 34843917, 34932730, 35275922, 34424455, 34579975, 34591506, 34831750, 35578905, 35238107, 34991335, 35462036, 36043061, 36141877, 36917464, 36887078, 36630457, 37841550, 36426158, 36230038, 37342366, 38786957, 40017059, 40380723, 41874690, 43716447, 45895313, 48618411, 50548059, 52871742, 55998623, 56271591, 56966717, 59075053, 61487941, 64426202, 67210053, 69526554, 70200756, 69818185, 69650135, 67819988, 66715332, 66517261, 64694019, 63221703, 61957741, 60428109, 58962273, 57168379, 56078112, 54815818, 54238965, 54622029, 55855581, 56866783, 58682359]
1018E8682359K262877K314468L481706M046452L476818M635924O244277O584215
1010I1729096Q421218J1437828J3043217J5612632J9812961K2402872K2792718
1003B05252542K0679947J3837290Q85197r250966j5338737j8619398j7472780
996A79973095j4782256j1688996q045844n892684m722106m138865j395478N96289
988A29903155K407577N935259P468469J0461287J0251404O595590N694885M907205
980A83624831L780613Q177717J3169407J5791739J7243366J1407028L075782o618677
972B49651806j3286795j5689603j6301778j1993239p828839m685393j661494M24115
964A78628780o41262j049327o23021k116231j048330j265186k017630j685493
$$ y = [58682359, 60945236, 63259704, 66741410, 70787862, 74264680, 78900604, 85144881, 91729096, 100150314, 111588142, 124631359, 140243991, 160056952, 182459824, 205252542, 225932489, 239769779, 240654976, 231404010, 216065273, 197445875, 179973095, 165190839, 153501843, 145455999, 139563315, 134841209, 130702344, 129306866, 129903155, 132310732, 138245991, 145714460, 156175747, 166427151, 173022741, 178717626, 183624831, 187405444, 195583161, 208752568, 224544307, 241787673, 253194701, 256270483, 249651806, 236365011, 220675408, 204373630, 192380391, 184551552, 179866159, 178204665, 178628780, 177987518, 176938191, 176315170, 174198939, 173150609, 171885423, 169867793, 168182300]
956A68182300j143999k040162p87195k04067q91854l236867n648145o008491o988643
947A41232877o053793l968182k590005Q1485M506286N809203P619267J1105436
939A57742574J3704554J5297996J6990547J8456875J9098360K1171380K3567675
932B86029961K1544206J8082357J2921062Q568978L743830r90247p289220j4452762
924C28158165k1692455k7054130k8905183k8713292k5870609k2358205j9066495
917A54497796j6415639j3859925j0079001q992392q102941o210829n288740n517854
909H0030475k740569j835326l913537k552509j419957j091457q96906m45591p34378
900F4400245j014114n59179J091758K0726J391595J900574L32088o22628K67234
$$ y = [168182300, 167038301, 164998139, 164210944, 164006877, 163115023, 159878156, 154230011, 148221520, 141232877, 135179084, 131210902, 128620897, 128702382, 133208668, 139017871, 146637138, 157742574, 171447128, 186745124, 203735671, 222192546, 241290906, 262462286, 286029961, 307574167, 325656524, 338577586, 347146564, 350890394, 349900147, 342610927, 328158165, 306465710, 279411580, 250506397, 221793105, 195922496, 173564291, 154497796, 138082157, 124222232, 114143231, 105150839, 97047898, 90837069, 85548329, 80030475, 77289906, 75454580, 71541043, 68988534, 67568577, 66477120, 65580214, 65134623, 64400245, 63386131, 62826952, 63918710, 63939436, 65331031, 67231605, 67563693, 66941065, 67208299]
891F7208299O67803L91600M32341L86434p68289p21297J537047R97117P91243
882G0922298J936787O97503j75291J00405K1568j246210j263666j134193k416132
873F7443069k537965j239695j503383k135734q33996j075512j485683n30699p74876
864E5325526j80080O77833k33935K58539J000103J508047K331597K834081M402489
855F7924200O040276O011993L848692P09251k475771m599501o156607n274511
847F6028022m482209m051709k623901l172194k575528j420411j56209l69644m11711
838D6764506j8089N97292J210702K947160L028048K845208N311346O276024P560609
829G6522806J1460172J2376927J4181532J4021681J2217693Q907897L410952j425962
$$ y = [67208299, 67876102, 68267702, 68700043, 69086477, 68318188, 67596891, 69133938, 70131055, 70922298, 72859085, 73556588, 73381297, 73481702, 73503270, 72257060, 70993394, 69859201, 67443069, 64905104, 63665409, 62162026, 60026292, 59192296, 58116784, 56631101, 56100402, 55325526, 55145446, 55823279, 55589344, 55847883, 56847986, 58356033, 60687630, 63521711, 67924200, 73964476, 79976469, 83825161, 84534412, 82058641, 77459140, 71302533, 66028022, 61545813, 57494104, 54870203, 51698009, 49122481, 47702070, 47545861, 47176217, 46764506, 46746417, 47343709, 48554411, 51501571, 54529619, 57374827, 62686173, 68962197, 76522806, 87982978, 100359905, 114541437, 128563118, 140780811, 149688708, 153099660, 151673698]
821A51673698p092255j1262675j3316582j3235926j2920593j0812887r652503
814G3380277r153620o620451n668679m422855k986195k629326l290770k446144
806C6162237j465086j638600m82171j002004j692608r76710J86219k60665m39497
797B8391115k81782L36053Q83089M19255J92278K36557k68828L8296m27187J27096
787B9645942J30158r74331O56535N39220L26305J650783J038414q4630J454414
778C4382810J581818R86067J931529J745191K056426L006448L871931N424667
770E4986887O915947P803524J0779277J3349657J6174907J9457322J9470047J6924354
762A65861922J2156501N002531o19829m830387p053286n705542m498552k02761
$$ y = [151673698, 144581443, 133318768, 120002186, 106766260, 93845667, 83032780, 73380277, 64226657, 57606206, 51937527, 47514672, 44528477, 41899151, 38608381, 36162237, 34697151, 33058551, 32576380, 31574376, 29881768, 28905058, 29091277, 28830612, 28391115, 28109333, 28445386, 29328475, 29747730, 29940008, 30176565, 29907737, 29946033, 29518846, 29645942, 29776100, 28801769, 29458304, 29997524, 30323829, 31974612, 33013026, 32928396, 34382810, 35964628, 36950695, 38882224, 40627415, 42683841, 45690289, 49562220, 54986887, 61902834, 69706358, 80485635, 93835292, 110010199, 129467521, 148937568, 165861922, 178018423, 183020954, 182401125, 177570738, 170517452, 164811910, 160313358, 160110597]
754A60110597N746098P621807P851123N671460P04479n904021j1485514j5552325
746A54763704j6842610j6524494j5459912j3812678j1811520q618688p775159
739F3918643p068423n330776m086976k713446k335298k218659j857773o79774
731C7627518J387397k42923K64826L54193n02165j091531j403607j425287k451757
722C2516664k220474j781698j635970k188445o53004j508245k068815n72618o75658
713A9211737L30153j223591q58214p92123j057264P33438q44098o99478j19430
704A4681130l71354j87009p7401m10791o22540P0840k19918K57872l63162m08607
694A2349060n80723j091572O66652Q6034l55419o91597r4652l33470J93894Q30540
$$ y = [160110597, 165856695, 173478502, 181329625, 187001085, 187705564, 181801543, 170316029, 154763704, 137921094, 121396600, 105936688, 92124010, 80312490, 71693802, 63918643, 56850220, 51519444, 47432468, 44719022, 42383724, 40165065, 38307292, 37627518, 39014915, 38771992, 39036818, 39391011, 38888846, 37797315, 36393708, 34968421, 32516664, 30296190, 28514492, 26878522, 24690077, 24037073, 22528828, 20460013, 19887395, 19211737, 19541890, 18318299, 17460085, 16667962, 15610698, 16344136, 15500038, 14800560, 14681130, 14309776, 14122767, 14045366, 13634575, 13012035, 13082875, 12862957, 13120829, 12757667, 12349060, 11768337, 10676765, 11343417, 11429451, 11074032, 10382435, 10287783, 9954313, 10148207, 10978747]
684A0978747k39365k42713m74632j84906r22815R5788K79903m97686p48122P4643
674H118842P63110j33375j28625m13479p88973K54850R30964m56545q41181n81490
664F724098M83781J079828J38581n59127n21332m54136N18147J032462p16463
655G725839o26359M6739j28280l34275R737L33993J00727L73952J14269j16052
645G500290k56827Q91207j147535q06428j50772j09348M32605r35421l35940m58760
635D623071M46944m3616j46583m67054q68308J41445J99730O80230M15002O7577
625E048438r33924k09930J381408k97294l04838K58143M94953j025395J63791
616D575352L12260j218639R69558m33862J29105q0397n98461K45243j000076R31442
$$ y = [10978747, 10739382, 10496669, 10022037, 9837131, 8914316, 9010104, 9290007, 8792321, 8044199, 8118842, 8881952, 8748577, 8619952, 8206473, 7417500, 7672350, 8603314, 8146769, 7305588, 6724098, 7207879, 8287707, 8426288, 7867161, 7345829, 6891693, 7409840, 8442302, 7725839, 7099480, 7146219, 7017939, 6683664, 6693401, 7027394, 7128121, 7502073, 7616342, 7500290, 7243463, 8134670, 6987135, 6180707, 6029935, 5920587, 6353192, 5417771, 5081831, 4623071, 5070015, 5026399, 4879816, 4412762, 3544454, 3685899, 3885629, 4565859, 4980861, 5048438, 4114514, 3904584, 5285992, 4988698, 4683860, 4942003, 5436956, 4411561, 4575352, 4887612, 3668973, 4638531, 4204669, 4333774, 4253377, 3654916, 3900159, 2900083, 3831525]
606C831525J206557m11416r49882K14839O1306n5049k70313l46652J504256n00016
596D285155n09772O2884n04200L07097k6755k8565L8964k8437M25040l49804O79080
585D350687M03256m65327j171843p2344K02834o20469M69574K81769N49155j020578
575B906714K28250L97978j4037K08201j000440J65574k58306L75426P74501L1148
565C815009n23257r15463k7809k33148J361467L3099l09977j099387m30151R06630
555B577013j20989M7543J46842J45916j077143J07255J071559M30081l58864p6739
545B892474M5593n86129J78058N85116m03687L31677M40295o05977L3014P98750
535C709184p14813p28974O61710J25042l88242k17683M41026J01370l59846K78609
$$ y = [3831525, 5038082, 4626666, 3676784, 3891623, 3952929, 3897880, 3627567, 3280915, 4785171, 4285155, 3775383, 3838267, 3334067, 3641164, 3614409, 3585844, 3624808, 3596371, 4021411, 3671607, 4350687, 4753943, 4288616, 3116773, 3044429, 3247263, 2626794, 3096368, 3378137, 3927292, 2906714, 3134964, 3532942, 3518905, 3727106, 2726666, 2892240, 2633934, 3009360, 3783861, 3815009, 3291752, 2376289, 2348480, 2115332, 3476799, 3509898, 3199921, 2100534, 1670383, 2577013, 2456024, 2503567, 2650409, 2796325, 1719182, 1826437, 2897996, 3328077, 2969213, 2892474, 2938067, 2351938, 2529996, 3115112, 2711425, 3043102, 3483397, 2877420, 2910434, 3709184, 2994371, 2265397, 2927107, 3052149, 2663907, 2446224, 2887250, 2988620, 2628774, 2907383]
525B907383l67296k94773P53163l24089l6567J28532l60360l37522P7145L05266
515B450882N30618j305955m46608J082338J06108M07386n6691r6606J297n63104
505B109665n21158K01545Q78652K45016n07929j417187P56332J184121o55433
496B273624k25369l88276l12294Q8537J058812l70880M85775o42254K76779l7270
486B207184q64926J223099o06219k77038J001076J50054k84961r9540q91940l4873
476A521916N26863p30951P54654n91930K50080N3530l02573K12614k536N48487
466B240154k09949l3311j80225K9748k64990P88178k60984k58291K46374j52058
456A944646q7500m24161L69758l90914J59247P06616j037501n56325Q34936J60871
$$ y = [2907383, 2540087, 2245314, 2998477, 2674388, 2637821, 2766353, 2405993, 2068471, 2145616, 2450882, 2981500, 1675545, 1228937, 2311275, 2417383, 2824769, 2768078, 2671472, 2672769, 2109665, 1588507, 1790052, 2668704, 2913720, 2405791, 988604, 1744936, 2929057, 2273624, 2048255, 1659979, 1347685, 1436222, 2495034, 2124154, 2609929, 1967675, 2244454, 2207184, 1342258, 2565357, 1959138, 1682100, 2683176, 2833230, 2548269, 2448729, 1556789, 1521916, 2048779, 1317828, 2072482, 1480552, 1730632, 1784162, 1481589, 1694203, 1691667, 2240154, 2030205, 1996894, 1816669, 1846417, 1581427, 2369605, 2108621, 1850330, 2096704, 1944646, 1857146, 1432985, 1802743, 1411829, 1571076, 2277692, 1240191, 683866, 1518802, 1679673]
446A679673o61979O49397K76827M6796J82921j26836L96212n73383L72691K32993
436B475312j005393o8460O89788o45668l63649Q71423m31276Q1226K05902l10276
426A498929n1899m45449O20984N2499p91633J002429L02642j451566k60176o2594
416D14166k76885J077776J46965o07111m56707m14933N02362N2527k58510R6563
406B76213l71125Q42972l04765l41926N83418L47422J19685M5871k40400k66188
396F91177J15525L93654J2708r18937O09303M82957n17342p8534l60538Q39209
386A269182K77520k39379J277j58060Q4184K91777j309720m50281J404982J79644
376A351126M08556m76717j002997j33466J90774J64602o59253L39676L69263j165891
$$ y = [1679673, 1017694, 1667091, 1943918, 1990714, 2173635, 2046799, 2443011, 1869628, 2242319, 2475312, 1469919, 1401459, 2091247, 1445579, 1081930, 1953353, 1522077, 1603303, 1809205, 1498929, 1447030, 1001581, 1622565, 1675064, 883431, 1885860, 2188502, 736936, 476760, 414166, 137281, 1215057, 1362022, 754911, 298204, -116729, 385633, 438160, 179650, 276213, -94912, 748060, 443295, 101369, 684787, 1032209, 1151894, 1197765, 957365, 691177, 806702, 1200356, 1213064, 294127, 903430, 1386387, 869045, 790511, 429973, 1269182, 1546702, 1307323, 1308600, 1150540, 1234724, 1526501, 216781, -233500, 1171482, 1351126, 1759682, 1282965, 279968, 146502, 337276, 501878, -157375, 182301, 551564, -614327]
366f14327l14315P56509J05252o6201M62288M47498r729N3465j6014m25165P97092
355A176353J83489p09043l1586n36063N9753L5000O9107J072788j67198j99346
345I53254L6920q10759l71169q507Q48854Q75288r53271j1019l37637j12456J524713
334A634211j12504o42152M75389J73723l98787j003806L8199J256999k31638n66588
324F23046l79132J10488J147912n72536m57361J038646J33572q50435l21506L64233
314H36927J84744j37625M45156m60622k50347J175460k20966n34836m52979j8735
304E66177K27869m00249K47017n71732q52257P41301K62348p70581N11215j28838
294a67730J61770J83115n95141M64830K20636K49925M06489j86313m36887m18550
$$ y = [-614327, -928642, -172133, -66881, -133082, 329206, 776704, 766975, 820440, 804426, 379261, 1176353, 1359842, 650799, 619213, 83150, 142903, 177903, 247010, 1319798, 1152600, 953254, 990174, 179415, -191754, -200261, 648593, 1523881, 570610, 559591, 221954, 109498, 1634211, 1521707, 879555, 1354944, 1528667, 1129880, 126074, 164273, 1421272, 1189634, 623046, 243914, 354402, 1502314, 929778, 472417, 1511063, 1644635, 794200, 472694, 836927, 1021671, 884046, 1329202, 868580, 618233, 1793693, 1572727, 1037891, 584912, 566177, 794046, 393797, 640814, 69082, -783175, -41874, 220474, -550107, -38892, -167730, -5960, 177155, -417986, 46844, 267480, 517405, 923894, 737581, 300694, -117856]
284a17856p8128k04883M79790J73524k59859p13552L53933J219522o14296p08662
274d70467R17845k8853p60841Q10008k35788m01681P6513k17911L6605O24557
264C49987n45308L96043K41364r35553K46705O01520Q37946o05964q64796O711
254b71345K8637N61463L60541l78180J27513P80178j121510l81993P98442J64470
244F68216L07029o09658p53946K40582J037263k36110n48968p0189O9660M25186
234E29065M7762m28329J32936K80478L56028o2396j90190j54584k26833o855r4320
223A82762n33486m4312Q88968l50003j98244l43662p37415P99391J12724p4453
213b97730N51869l60252K24000L37586j10693q018k6001J91599P60171n95440
$$ y = [-117856, -195984, -400867, 78923, 252447, -7412, -720964, -367031, 852491, 238195, -470467, 447378, 418525, -342316, 467692, 231904, -169777, -93264, -311175, -274570, 349987, -195321, 200722, 442086, -493467, -246762, 354758, 1192704, 586740, -278056, -271345, -242708, 318755, 679296, 301116, 428629, 1208807, 87297, -294696, 503746, 668216, 975245, 365587, -388359, -147777, 889486, 653376, 104408, 34219, 103879, 529065, 576827, 148498, 281434, 561912, 917940, 855544, 665354, 510770, 283937, 277082, 182762, -350724, -395036, 493932, 143929, -54315, -397977, -1135392, -336001, -223277, -297730, 254139, -106113, 117887, 455473, 344780, 336762, 310761, 502360, 1262531, 667091]
203F67091o02481K43814J78717J70071p37708j49809K11171P6468K25405k60535
193B2204k62423m1809R9135l61577K90790M0308k31970K15034J92499J41813K20539
182C24543L28070l89819k8562k21319o00412J06882N15680o9014r90388j45663
172a170002J41118j01738L70392P42225L68711o0351j35939l48359K1789M21653
162B49499P5567J82631o34631J63114M26349Q9783K58917l28968l00689l45162
152a63590J29828j5105j91488k86009K58988K81500l87314J031962n25191m04822
142b71241M65887m21313J11114J43800l53555j92150j00949j008589M0113M37094
132a149789P94109Q6838p56530K07921j86723M17231R09342r73597k60528K61205
$$ y = [667091, 64610, 308424, 487141, 657212, -80496, -230305, -19134, 57334, 282739, 22204, -240219, -282028, -182893, -544470, -253680, -213372, -445342, -230308, -37809, 104004, 324543, 652613, 262794, 234232, 12913, -587499, -480617, 35063, -33951, -1024339, -1170002, -1028884, -1130622, -760230, -18005, 350706, 290355, 154416, -193943, -172154, 249499, 325066, 507697, -126934, 36180, 462529, 552312, 811229, 482261, 181572, -163590, -33762, -48867, -240355, -526364, -267376, 14124, -373190, 658772, 133581, -271241, 194646, -226667, -115553, 28247, -325308, -517458, -618407, -1626996, -1586883, -1149789, -355680, -268842, -1025372, -817451, -1004174, -586943, 322399, -651198, -911726, -650521]
122f50521K19322J45123P7933M96737l62893o014J02026j38523l5624m25662N6063
111e22033Q3285j79397M359L47728j87653K02361L577l35589R60984l44340n64572
100e31290j16959K49109P17060k57449l99352m50320L46861J88619J35057m33497
90e52161l2456P43326J0096K91917p6012q7698M38319m4946j52156L38308K10125
79A086662l14083P36028q58570l50319J089198M41547K58709j31239N16061J122867
69C596861M37281Q22499k13626m14852O30653N45651K1942J290981J774695J379428
59I871513K048526L879213O572323R870939J3534117J5644668Q554677j610468
51F8365508o695882j0915110j0324699q156909o402194o276362m751590l365654
$$ y = [-650521, -431199, -286076, -208143, 288594, -74299, -80313, 21713, -116810, -152434, -578096, -522033, -438748, -618145, -613786, -266058, -453711, -251350, -247773, -583362, 377622, 33282, -531290, -648249, -399140, 317920, 60471, -338881, -789201, -442340, -253721, -118664, -552161, -584617, 158709, 168805, 460722, 384710, 297012, 735331, 690385, 538229, 876537, 1086662, 772579, 1508607, 650037, 299718, 1388916, 1830463, 2089172, 1957933, 2473994, 3596861, 4034142, 4856641, 4643015, 4228163, 4858816, 5404467, 5426409, 6717390, 8492085, 9871513, 11920039, 15799252, 22371575, 32242514, 45776631, 61421299, 69975976, 68365508, 61669626, 50754516, 40429817, 32272908, 25870714, 19594352, 14842762, 11477108]
43A1477108j438537j777963j707866o61858m64999P8046n43890o49696p99775
34C510570k06999l79182l82051k82103n89329K24604n78707p30364l04084M17871
24G00226L68138o8069l16142m67011k67523L69402K77772l91945j69387J19252
14A54713m10988P8720J3674o4685L03288K45274o60277r86618M71721L81946K66571
3b06661j18505l34266j38827
0g98259
$$ y = [11477108, 10038571, 8260608, 6552742, 5890884, 5425885, 5503931, 4960041, 4310345, 3510570, 3303571, 2924389, 2542338, 2260235, 1670906, 1895510, 1316803, 586439, 282355, 700226, 1068364, 1000295, 684153, 217142, -50381, 319021, 596793, 204848, 35461, 154713, -256275, -177555, -163881, -228566, 74722, 319996, -340281, -1326899, -855178, -473232, -206661, -325166, -659432, -798259]
$$ Imaginary data points
##PAGE= N=2
##DATA TABLE= (X++(I..I)), XYDATA
16383a6456383L92516J25382J4877K52498K79021J54899J76098J62763O83347
16374a4214982K68417k6700L0809K07942n91K4428N67998O4029J02923K48552
16364a2727175J13876K71796M54926j7856n14977L21042N47572j7564l22991J58659
16354a1732692K47228j07370O82579J90589O7534M24628k45558k79471M84817
16345a0267716R95149k32475p47316l74401O85328R08024l05441J02260N4024
16336i182564j07005K25692P89965j43346j52253M90089j36494M54897j97342
16327g958361P0869J52616l64845J09969r8794J97834R14266l32940p74705O17395
16317g466696N72006J05124P51029m81524L543N22881j34441M05099l03993p8593
$$ y = [-16456383, -16063867, -15938485, -15923608, -15671110, -15392089, -15237190, -15061092, -14898329, -14214982, -13946565, -13973265, -13942456, -13734514, -13735105, -13710677, -13142679, -13078650, -12975727, -12727175, -12613299, -12341503, -11886577, -11904433, -12419410, -12098368, -11550796, -11568360, -11891351, -11732692, -11485464, -11592834, -10910255, -10719666, -10652132, -10227504, -10473062, -10752533, -10267716, -9272567, -9505042, -10252358, -10626759, -9941431, -9033407, -9338848, -9236588, -9182564, -9289569, -9063877, -8273912, -8417258, -8569511, -8079422, -8215916, -7761019, -7958361, -7887492, -7734876, -8099721, -7989752, -8088546, -7890712, -6976446, -7309386, -8084091, -7466696, -6894690, -6789566, -6038537, -6520061, -6516518, -5993637, -6128078, -5722979, -6026972, -6105565]
16307f105565M8841j28658M34425N28820l75785L13621L83523l723L51959m90379
16297e042921l67519P56047L22222L37293l6638l21313K95943K37684J38827K34718
16287c445657M03067p89216p7750L19061j73605Q37711l8310j43117J82201m39737
16277c365352k91753J88404O17519k28814r6076K45688J51931n22185K62585M49425
16267b588628K42079M13237N9467q4330n22413K10869L44567K20857K16739n92688
16257b080244L00667j29114n4895J141307M2629J83193M38644o93531j37993P01677
16247b87660n31343j72726n13117k9873J41274Q1585Q80412k23502j24127M48952
16237c30125K9950L19830l19204l10257K04284k24860O490Q73866J81068J67304
$$ y = [-6105565, -6056724, -6185382, -5750957, -5222137, -5597922, -5284301, -4900778, -4904501, -4552542, -5042921, -5410440, -4654393, -4332171, -3994878, -4031516, -4352829, -4056886, -3819202, -3680375, -3445657, -3042590, -3831806, -3909556, -3590495, -3764100, -2926389, -2964699, -3107816, -2925615, -3365352, -3657105, -3468701, -2851182, -3079996, -3176072, -2930384, -2778453, -3300638, -3038053, -2588628, -2346549, -1933312, -1873845, -1958175, -2480588, -2269719, -1925152, -1704295, -1487556, -2080244, -1779577, -1908691, -1963586, -822279, -779650, -596457, -157813, -851344, -989337, -287660, -819003, -991729, -1504846, -1534719, -1393445, -1311860, -431448, -654950, -779077, -330125, -300175, 19655, -299549, -609806, -405522, -630382, -623892, 249974, 431042, 598346]
16227E98346l74510J91712N8519j75307J0686m31044N46945L72189J29925k27823
16217F99638q79287L66500J303196k20060j58383l81465O65722Q24042m13803
16208A806100J43088m58167o85054P93550q0321l49169K63030J47217Q20880j83010
16198B218144l23039m92991o96070L81618l04179k25457J142438P6737m90992
16189A286209M11063K14474j29781j5882m60140l60150J24270J37093n13358O00745
16179A294543Q73783m30431l45811k13810K95417L86263K72576j47060n50555
16170A434915J165437K59401p80987P6633j93965m3384N22132l49017j43826P01447
16160B648786o88182M35998l77403n07153M78564j63968L64896L00640r7434N62240
$$ y = [598346, 223836, 415548, 474067, 298760, 309446, -121598, 425347, 797536, 927461, 699638, -179649, 186851, 1490047, 1269987, 1111604, 730139, 1395861, 2219903, 1806100, 1949188, 1491021, 805967, 1599517, 1519196, 1170027, 1433057, 1580274, 2401154, 2218144, 1895105, 1402114, 706044, 1087662, 783483, 558026, 1700464, 1777201, 1286209, 1697272, 1911746, 1781965, 1766083, 1305943, 945793, 1070063, 1207156, 693798, 1294543, 2168326, 1737895, 1392084, 1178274, 1473691, 1859954, 2132530, 1985470, 1434915, 2600352, 2859753, 2078766, 2155399, 1961434, 1918050, 2440182, 2091165, 1947339, 2648786, 1960604, 2396602, 2019199, 1512046, 1990610, 1826642, 2191538, 2492178, 2394744, 2956984]
16150B956984Q17848k64504N7676l18089l15890l06599q26504J086270M06411
16141C293603o87471k58816J31927k75414O96750J49081p77070l26364k17860
16132A728366O92620K06895K56716K11476k31785j42793K58333K44204j7637K04969
16122C411364o9353m61939L89919J029143k06474o50757p52667M3914J461435
16113D194585j92172o53690j69183l77897P61762K36557r33132j30077M93436
16104C230189r49094k43710M53122N94525r4402n92370N96269P4781N8800K20845
16094C348955j68029Q9824R52399l56462o27831J031591l62567n06181N9055J84415
16084C645169N54749o55803q18450K87319N76677m95409k7700l46525R6961M8821
$$ y = [2956984, 3774832, 3510328, 3568004, 3249915, 2934025, 2627426, 1800922, 2887192, 3293603, 2606132, 2347316, 2479243, 2203829, 2900579, 3049660, 2272590, 1946226, 1728366, 2420986, 2627881, 2884597, 3096073, 2864288, 2721495, 2979828, 3224032, 3206395, 3411364, 3342011, 2880072, 3269991, 4299134, 4092660, 3441903, 2689236, 2733150, 4194585, 4002413, 3348723, 3179540, 2801643, 3563405, 3799962, 2866830, 2736753, 3230189, 2281095, 2037385, 2490507, 3085032, 2990630, 2398260, 2994529, 3069310, 3128110, 3348955, 3180926, 3270750, 4223149, 3866687, 3238856, 4270447, 3907880, 3401699, 3460754, 3645169, 4199918, 3544115, 2725665, 3012984, 3589661, 3094252, 3066552, 2720027, 2816988, 2865809]
16074B865809m89294N28308J86866J88436j49586j32280r1650K41599O95471n7945
16064C785734J56160k72782p43186J51780P64964J66577p81504L8835L79012q5109
16054C560481j6464j05028J74673k09254K24795n11703k07419N63209J36645o79147
16044B930788L3848P25158n39246j69204M10017K00896J26454p48300O63077q2913
16034C550575n09414K17087m47605J06611M25l86494j36348P63297n1317k98372
16024B808445K6745m88498O08075N61918k15700j70079K31681K46010m02048N29978
16014C736527J31239j24107o55133N0039M49426K03658J53379l04610j56614R1251
16004C575055j60088j65106l50827N62743L77177p50285K82327M69467m52540
$$ y = [2865809, 2376515, 2904823, 3091689, 3280125, 3130539, 2998259, 2906609, 3148208, 3843679, 3785734, 3941894, 3669112, 2925926, 3077706, 3842670, 4009247, 3227743, 3266578, 3645590, 3560481, 3544017, 3438989, 3613662, 3404408, 3629203, 3117500, 2910081, 3473290, 3609935, 2930788, 2964636, 3689794, 3150548, 2981344, 3391361, 3592257, 3718711, 2970411, 3633488, 3550575, 3041161, 3258248, 2810643, 2917254, 2917679, 2531185, 2394837, 3158134, 3106817, 2808445, 2835190, 2346692, 2954767, 3516685, 3300985, 3130906, 3362587, 3608597, 3206549, 3736527, 3867766, 3743659, 3088526, 3138565, 3587991, 3791649, 3945028, 3640418, 3483804, 3575055, 3414967, 3249861, 2899034, 3461777, 3838954, 3088669, 3370996, 3840463, 3387923]
15995C387923l8968K92489j18460N84817N10987j211370j061375P02305R94824
15986D043172q83424m93209L94115q44466Q13933M11953k48972L58992P4694n16192
15976C110596N5929N91832K54095P78654k990j90897k27332m95145K18819J52253
15966D245814q11786R7406K71193J20143j10121l61485J41379J82037l23412N61104
15956D012272K29223q99484P39612M9250n11670M22O7923L12404o77246k04820
15946C117886k36988M6064P65660K90179k25936j48659L35338k23247p52202J23688
15936C091783K89107K75461K94686k82767l94509J036384J23322p32050q8262
15927C613155j05627O69782n72147n92552o4110m75789J42386J010336L09749
$$ y = [3387923, 3348955, 3641444, 3522984, 4107801, 4618788, 3407418, 2346043, 3048348, 4043172, 3159748, 2666539, 3060654, 2216188, 3030121, 3442074, 3193102, 3552094, 3626788, 3110596, 3166525, 3758357, 4012452, 4791106, 4788116, 4597219, 4369887, 3874742, 4093561, 4245814, 3434028, 3531434, 3802627, 3922770, 3812649, 3451164, 3592543, 3774580, 3451168, 4012272, 4241495, 3342011, 4081623, 4130873, 3619203, 3619625, 3687548, 3999952, 3322706, 3117886, 2880898, 2926962, 3692622, 3982801, 3756865, 3608206, 3943544, 3720297, 2968095, 3091783, 3380890, 3656351, 3951037, 3668270, 3273761, 4310145, 4433467, 3701417, 3613155, 3507528, 4177310, 3605163, 3012611, 2948501, 2472712, 2615098, 3625434, 3935183]
15918C935183o88959n13011k3134P06712P47017n74614l12692k31788n83260k23564
15908B237890l80428J60956J048599j38054k36580J46051l03220k417J60307Q182
15898B701286K87672o69240j06098L85645j52296R10568L74905l66162Q16454
15889D182734M8446j040511J95241M32672k35442j01120n95616j75885N34023
15880C244542K5250n31448L82779J04137N2163K18439J7203l64421k40873O12791
15870C520562M726m63993L16823r9489o06253J009859L06572p84094J8069R0477
15860C313259l20532O17770P6171l31741J51004K14465l7997j05574j4206l31459
15850C231160q076p1440j34298K17047P28262N44909n25535k34545k44377L36444
$$ y = [3935183, 3246224, 2733213, 2710079, 3416791, 4163808, 3589194, 3276502, 3044714, 2461454, 2237890, 1857462, 2018418, 3067017, 2928963, 2692383, 2838434, 2535214, 2532797, 2693104, 2701286, 2988958, 2319718, 2213620, 2599265, 2446969, 3357537, 3732442, 3366280, 4182734, 4231180, 3190669, 3385910, 3818582, 3583140, 3482020, 2886404, 2710519, 3244542, 3269792, 2738344, 3121123, 3225260, 3277423, 3495862, 3513065, 3148644, 2907771, 3520562, 3525288, 3061295, 3378118, 3278629, 2672376, 3682235, 3988807, 3204713, 3222782, 3313259, 2992727, 3610497, 3686668, 3354927, 3505931, 3720396, 3682399, 3576825, 3562619, 3231160, 3223084, 3151644, 3017346, 3234393, 3962655, 4507564, 3982029, 3747484, 3503107, 3839551]
15840C839551O73899L16269m74446k27146K47058L03233l35170n48038J36857
15831C932067M69287l37285J36881n98344J33710L50132j0813j047677o04582
15822B423376J010521k14384k50411K61491M81138l43328K44912k76568n05805
15813B830942L69914O42019k7129m29672J4966K40119K37443O99643j70380m11426
15803C996439q56664k50065J207715J41455q13209j37960m59610j81732J84868
15794B831237L47344j69443o04721P17260l34517m90704J521461J73881q53384
15785C138414J24953K67914M5661J09915M83245L79528j261798P04165O24523
15776D616520m53600j60755o15153L4244n45338N06701P62077j262595l53961
$$ y = [3839551, 4513450, 4829719, 4355273, 4128127, 4375185, 4678418, 4343248, 3795210, 3932067, 4401354, 4064069, 4200950, 3602606, 3736316, 4086448, 4075635, 3027958, 2423376, 3433897, 3219513, 2969102, 3230593, 3711731, 3368403, 3613315, 3336747, 2830942, 3200856, 3842875, 3815746, 3386074, 3401040, 3641159, 3878602, 4578245, 4407865, 3996439, 3139775, 2889710, 4097425, 4238880, 3425671, 3287711, 2828101, 2646369, 2831237, 3178581, 3009138, 2404417, 3121677, 2787160, 2296456, 3817917, 3991798, 3138414, 3263367, 3531281, 3576942, 3686857, 4170102, 4549630, 3287832, 3991997, 4616520, 4162920, 4002165, 3387012, 3421256, 2875918, 3382619, 4144696, 2882101, 2528140]
15767B528140J151349j44624j71417N87366J22678k0568M7046K96781n19505m05967
15757C471279R40447j060719J03301N32484l89959l79479J29404K36547M8277
15748C631582K95292m81856o32019N26535M97024o52567L2074K40986o50687N07092
15738C313456n11557P3572K29716k81276K72066l05237N71736Q183p59540K52714
15728B863833p0399Q05703M24896l30377r8229n9290K2140M45035P2593p42081
15718C333824n45275k72557O53287M5146K17835k97250K44778L12542j81144P31157
15708D242343l64261j257129P42288j51315k87262N28946P28948l19123n09002
15699C354433K73442k93367K68476J49961j07298k45339L51108m64024L61657
$$ y = [2528140, 3679489, 3534865, 3363448, 3950814, 4073492, 4052924, 4099970, 4396751, 3877246, 3471279, 4411726, 3351007, 3454308, 3986792, 3596833, 3217354, 3346758, 3583305, 3631582, 3926874, 3445018, 2812999, 3339534, 3836558, 3183991, 3216065, 3457051, 2806364, 3313456, 2801899, 2875471, 3105187, 2823911, 3095977, 2790740, 3362476, 3370659, 2611119, 2863833, 2793434, 3599137, 4024033, 3693656, 3595427, 3536137, 3558277, 4003312, 4075905, 3333824, 2788549, 2515992, 3169279, 3214425, 3432260, 3135010, 3379788, 3692330, 3511186, 4242343, 3878082, 2620953, 3363241, 3211926, 2924664, 3453610, 4182558, 3863435, 3354433, 3627875, 3334508, 3602984, 3752945, 3645647, 3400308, 3751416, 3287392, 3649049]
15690C649049q4403n17469M43643k70743m06121P0567P16242k14881Q5762M48857
15680C920503r25980q85363O84627n10468J53983R40247l57788k73801P83767
15671C529727m65596m79795k02815L77198J04624K93570L83425j03576M6559J003959
15661D487280m23007m61939J32168l37065L43535m75212K87160k48104l93082
15652B911734K60493r4710o30123M84593P59689q97710J99605O69531R5746K63621
15642D022469N96064m29590j304788k1184K00159J307930Q8709j60904p71930
15633C526935N3391Q89117j026893j87041J96562m29113j55115k81124n65158
15624B021561M72216Q39684k66518N5464r50793J011582J19647o30794Q34192
$$ y = [3649049, 3564646, 3047177, 3490820, 3220077, 2813956, 2884523, 3600765, 3385884, 3471646, 3920503, 2994523, 2109160, 2793787, 2283319, 2437302, 3377549, 3019761, 2745960, 3529727, 3064131, 2584336, 2381521, 2758719, 2863343, 3156913, 3540338, 3436762, 3483321, 4487280, 4064273, 3602334, 3734502, 3397437, 3740972, 3265760, 3552920, 3304816, 2911734, 3172227, 3077517, 2447394, 2931987, 3691676, 2793966, 2993571, 3663102, 3758848, 4022469, 4618533, 4188943, 2884155, 2862971, 3063130, 4371060, 4459769, 4298865, 3526935, 3580326, 4469443, 3442550, 3255509, 3452071, 3022958, 2867843, 2586719, 2021561, 2493777, 3333461, 3066943, 3122407, 2171614, 3183196, 3302843, 2672049, 3506241]
15615C506241j39117j52109n26747m83164k48927R35770J99931N10944n43661
15606C059161j26175O42628n3484Q13781o29270m17582P22273J36824m7745o90686
15596C409725l99520O42774j78672M1515l83822L56472N06592j45935j90904n55601
15586C102624l80652L82434N06873P02744o40777j91490P86094Q6955o47247L55519
15576D063077J90480l38110j05338j80577J70920l00764J454534q42506j97870
15567C913846K93564n47021M67022J27508k28743J8668J55058l33558J06759j7007
15557C956096O5536k49056M80832J215784n64982o75110k91530l76621J156181
15548D717130n97781p40481K00766o71903K71415N34438j18868J10593J51271
$$ y = [3506241, 3367124, 3215015, 2688268, 2205104, 1956177, 2891947, 3091878, 3602822, 3059161, 2932986, 3575614, 3522130, 4335911, 3706641, 3289059, 4011332, 4148156, 4100411, 3409725, 3010205, 3652979, 3474307, 3515822, 3132000, 3488472, 3995064, 3849129, 3658225, 3102624, 2721972, 3104406, 3611279, 4314023, 3673246, 3481756, 4267850, 4354805, 3707558, 4063077, 4253557, 3915447, 3810109, 3629532, 3800452, 3499688, 4954222, 4111716, 3913846, 4207410, 3660389, 4127411, 4254919, 4026176, 4044844, 4199902, 3866344, 3973103, 3956096, 4021632, 3772576, 4253408, 5469192, 4904210, 4229100, 3937570, 3560949, 4717130, 4119349, 3378868, 3579634, 2907731, 3179146, 3713584, 3594716, 3705309, 3856580]
15539C856580n68352j59582P2267M25831m03477m53349J54459l11489M38791N62049
15529C613728p49174l0920P79546N33459N5897l74361l7705l93481J079030M46548
15519D922567j106270r92708K94439N92074O00524K77551j033932m39524J45479
15510C260200O81050q962j31522M35127q05798l22346P56279j13169q46926L39913
15500C243846N92678r66676l54135O17242P11461k73475n7329m52805m28470K07477
15490B839814J082276m70385p72914O89681p3540K41062K60414j189729J3507
15481B620186P55365N1777M22658o89474K75221P16599l12089J25957m86843J56207
15471C635564L46916p14564j41772K27186l47483o5051n57566n301J156808M49179
$$ y = [3856580, 3288228, 3128646, 3200913, 3626744, 3223267, 2769918, 2924377, 2612888, 3051679, 3613728, 2864554, 2833634, 3613180, 4146639, 4202536, 3828175, 3790470, 3396989, 4476019, 4922567, 3816297, 2823589, 3118028, 3710102, 4310626, 4588177, 3554245, 3114721, 3260200, 3941250, 3932288, 3800766, 4235893, 3430095, 3107749, 3864028, 3750859, 2903933, 3243846, 3836524, 2869848, 2515713, 3132955, 3844416, 3570941, 3513612, 3060807, 2632337, 2839814, 3922090, 3451705, 2678791, 3368472, 3294932, 3535994, 3796408, 2606679, 2620186, 3375551, 3427328, 3849986, 3160512, 3435733, 4152332, 3840243, 3966200, 3479357, 3635564, 3982480, 3267916, 3126144, 3353330, 3005847, 2940796, 2383230, 2377929, 3534737, 3983916]
15461C983916o34006q88459L13013O99986j63835M7177j88898l72727K82229j60107
15451B918289M15177m1454j68914J5740M54665O2203j2823K09249k6398l9568
15441C786166r01371M41470L57582l31840J00788N52868L5753O3571j60793l37745
15431C606449L14847K91895p56588l68391M46428R61273k42223j109529M46147
15422C590308K81346N35494j9696p32894n25825O55629L67939L4831k12990r9188
15412C874954n32246m29046J234971O10949j339807L13437N00248J08925p74870
15403C567515J48257O74847m48485n56597l59746j65384K48491J025707j5867
15394D118738l17186M72876k17063r82960j72966J136718P35478j022439k56889
$$ y = [3983916, 3349910, 2461451, 2774464, 3474450, 3310615, 3357792, 3168894, 2796167, 3078396, 2918289, 3333466, 3292012, 3123098, 3138838, 3593503, 3655706, 3642883, 3852132, 3825734, 3786166, 2884795, 3326265, 3683847, 3352007, 3452795, 4005663, 4041416, 4104987, 3944194, 3606449, 3921296, 4213191, 3456603, 3088212, 3534640, 4495913, 4253690, 3144161, 3590308, 3871654, 4407148, 4387452, 3654558, 3128733, 3784362, 4152301, 4187132, 3974142, 3874954, 3342708, 2913662, 4148633, 4759582, 3419775, 3733212, 4233460, 4342385, 3567515, 3715772, 4390619, 3942134, 3385537, 3025791, 2860407, 3108898, 4134605, 4118738, 3801552, 4274428, 4057365, 3074405, 2901439, 4038157, 4773635, 3751196, 3494307]
15385C494307M6196k02634L17645J001859o04513r30771L95878j36713J89138
15376C570392K26050j42594q52010q08658Q54454M65885o31380O85926K42659
15367C610724j869095M45155J249073l8780r5804k82646l1800r3207N88762J72945
15357C655327l16146O27529N93216p88509p0527N27981M14151j20276q93197n04
15347C629045p63115K58164M77632j57349M06189l69618J84414l28908n80107
15338B756347M69726K01400m24096K11260j06621o55520J091810j34127l6778
15329C373401j74658k53131n582K93995O96977j86214j22785q43133o74076J304268
15319C409062M00767m67666j59496J4378O10029R3797K10901R147n88263O51974
$$ y = [3494307, 3540503, 3337869, 3655514, 4657373, 4052860, 3122089, 3517967, 3381254, 3570392, 3796442, 3653848, 2801838, 1993180, 2847634, 3313519, 2682139, 3368065, 3610724, 1741629, 2186784, 3435857, 3397077, 3301273, 3018627, 2986827, 2893620, 3482382, 3655327, 3339181, 3966710, 4559926, 3771417, 3700890, 4228871, 4643022, 4522746, 3629549, 3629045, 2865930, 3124094, 3601726, 3444377, 3850566, 3480948, 3665362, 3336454, 2756347, 3226073, 3427473, 3003377, 3214637, 3108016, 2452496, 3544306, 3410179, 3373401, 3198743, 2945612, 2940030, 3234025, 3931002, 3744788, 3622003, 2778870, 2104794, 3409062, 3809829, 3342163, 3182667, 3197045, 3807074, 3900871, 4111772, 4120919, 3532656, 4184630]
15309D184630L89990j065769K77564P12572k53476l07540J29190l9809j99507
15300C827845l27947K754k86181K96121K93704j140922J71837j36054N27411J22641
15290C351209K26634l30050r96096J317280j88166J74392P01971l38519r32164
15281B986491J166308R7967r35356J140656K29589J75191R4471J57306r30150
15272D182473m48002J075461j88344m26216M78994k08100j141114O58871N36038
15263D520061j068785K38247N15282q49363O47458O4048N08R4859m63907J70260
15253C868668r49534N32169N45580J20525J16239J32100q58584J94487P15455
15244D417105o21573l60863p14943O06587J86470k49605J26803o00207L07682
$$ y = [4184630, 4574620, 3508851, 3786415, 4498987, 4245511, 3937971, 4067161, 4027352, 3827845, 3499898, 3502652, 3216471, 3512592, 3806296, 2665374, 2837211, 2701157, 3228568, 3351209, 3577843, 3247793, 2251697, 3568977, 3380811, 3555203, 4257174, 3918655, 2986491, 4152799, 4250766, 3315410, 4456066, 4685655, 4860846, 4955317, 5112623, 4182473, 3734471, 4809932, 4621588, 4195372, 4674366, 4466266, 3325152, 3984023, 4520061, 3451276, 3689523, 4204805, 3355442, 4002900, 4066948, 4067456, 4162315, 3698408, 3868668, 2919134, 3451303, 3996883, 4117408, 4233647, 4365747, 3507163, 3701650, 4417105, 3795532, 3434669, 2719726, 3326313, 3512783, 3263178, 3389981, 2789774, 3097456]
15235C097456M14167k26954l4941M9601Q50407n5857L57186j9661k84232l62165
15225C785007J22066N7032j51195R8257p41834j28554L21615N48394n98012N6272
15215C369048J095633j036628j20283J12816J99258p9034L50116P4454M08384
15206D373764l71211o04673J88654n26371P26375m22247L90452m33144K58126
15197C579725l78895N48800M9111J00593n48772o44697M90832O83739P17476O1179
15187D659091p48224m65105J107371j60996N3661m42135n41991O8521P23302n45937
15177C707558r46033K73759J23440N91007J83223o12299m60777M88363O75261
15168D023502j14994K25552n54226K94927l64288R6118M42237J08301j16952p19738
$$ y = [3097456, 3511623, 3284669, 3249728, 3299329, 4149736, 4093879, 4451065, 4431404, 4147172, 3785007, 3907073, 3964105, 3812910, 3911167, 3169333, 3040779, 3362394, 3910788, 3312776, 3369048, 4464681, 3428053, 3307770, 3420586, 3619844, 3540810, 3890926, 3965380, 4373764, 4002553, 3397880, 3586534, 3060163, 3786538, 3364291, 3754743, 3321599, 3579725, 3200830, 3749630, 3798741, 3899334, 3350562, 2705865, 3196697, 3880436, 4597912, 4659091, 3910867, 3445762, 4553133, 4392137, 4445798, 4003663, 3461672, 3530193, 4253495, 3707558, 2761525, 3035284, 3158724, 3749731, 3932954, 3320655, 2859878, 3348241, 4023502, 3908508, 4134060, 3579834, 3874761, 3510473, 3606591, 4048828, 4157129, 4040177, 3320439]
15158C320439K72767L05313n28436M37888q9623o24303q9176K41616k52992J80234
15148C173727J164888o82801N01045m28260k75780j8031j13777l60804O32521
15139C592728R81390j497903K9527L44263N33219K43590q5270l71549j220156
15130B549839Q15228P95680n85268r487J01443n09076j54712P62048K8830K09775
15120D004300K32319p56140m37557K19498Q37558k57290l10255O30805o89822
15111C473416M4591l03309R57212n18579m71267K05571j1306O08877N33985j29478
15101D389713j026549Q12866l5991q2117n48092J62875K59525K23678j92577o77666
15091C285665j326782Q99306J176784j24409p70042O8261N81331M17810N34285
$$ y = [3320439, 3593206, 3898519, 3370083, 3807971, 3718348, 3094045, 3004869, 3246485, 2993493, 3173727, 4338615, 3655814, 4156859, 3728599, 3452819, 3434788, 3321011, 2960207, 3592728, 4574118, 3076215, 3105742, 3450005, 3983224, 4226814, 4141544, 3769995, 2549839, 3365067, 4160747, 3575479, 3565992, 3667435, 3158359, 3003647, 3765695, 3794525, 4004300, 4236619, 3480479, 3042922, 3262420, 4099978, 3842688, 3532433, 4163238, 3473416, 3518007, 3214698, 4171910, 3653331, 3182064, 3387635, 3376329, 3985206, 4519191, 4389713, 3363164, 4176030, 4140039, 4057922, 3509830, 3672705, 3932230, 4155908, 3963331, 3285665, 1958883, 2858189, 4034973, 3910564, 3140522, 3208783, 3790114, 4207924, 4742209]
15082D742209j182117k36435N0987O60118K34824q78562R83263J15666m55787
15073D034166Q4053J84946m68165L74972p7490j063319O56243l09387J01233L53541
15063C870793o7671l91736l11462M53308P4457o36573M44995M32857l9262J19831
15053C949537J56803j99645L13754R4007l19905k81591n05641O65067l45355L17922
15043C844953k2528l640o47270m58886J315350P0153k91541j1619N42713j120130
15033C217555k03036m6400j31579M40259j23816P1105n21703Q19145Q63885r27933
15023C457482L44138Q05711k76244p59734M25439j65639l06181O03795K40602
15014D369369j33923q41853J56688K48692l51237Q56144r0836n03624l60873k43726
$$ y = [4742209, 3560092, 3323657, 3374644, 4034762, 4269586, 3391024, 4374287, 4489953, 4034166, 4118219, 4303165, 3835000, 4209972, 4132482, 3069163, 3725406, 3416019, 3517252, 3870793, 3803122, 3411386, 3099924, 3553232, 3627689, 2991116, 3436111, 3868968, 3829706, 3949537, 4106340, 3906695, 4220449, 4314456, 3994551, 3712960, 3207319, 3872386, 3527031, 3844953, 3822425, 3818785, 3171515, 2712629, 4027979, 4098132, 3806591, 3794972, 4337685, 3217555, 3014519, 2968119, 2836540, 3276799, 3152983, 3224088, 2702385, 3521530, 4385415, 3457482, 3801620, 4607331, 4331087, 3571353, 3996792, 3831153, 3524972, 4128767, 4369369, 4235446, 3393593, 3550281, 3798973, 3447736, 4303880, 4213044, 3709420, 3348547, 3104821]
15004C104821o75360J384599O24084n06829J04017j013960K68870J84511P14537
14995D189290r2481j108087N23281K41916j34275Q02608q3715n70712J8733L39121
14985D125679o11721Q9635Q2327k83216j30651Q4558N11801o15N81548q56085
14975C593260J60932M86704k78830j1707o98603Q92158n38861N3221M15360M88570
14965D562204O49544m25005n94953k75976O91723o08036M3613L82059n51387J23602
14955C997388p79349O21641O0565N07455k98327n60381M04299k67397L579k1787
14945C667686m19824j2125k84034N99156j31176j8899M50415l62633o0351P11094
14935D139309l97927r14628R79791n27397N04439L86606o59928j42748O39270
$$ y = [3104821, 2429461, 3814060, 4438144, 3931315, 4035332, 3021372, 3290242, 3474753, 4189290, 4096809, 2988722, 3512003, 3753919, 3619644, 4422252, 4338537, 3767825, 3786558, 4125679, 3513958, 3603593, 3685920, 3402704, 3272053, 3356611, 3868412, 3867797, 4449345, 3593260, 3754192, 4240896, 3962066, 3950359, 3251756, 4143914, 3605053, 3658274, 4073634, 4562204, 5211748, 4786743, 4191790, 3915814, 4607537, 3999501, 4043114, 4425173, 3873786, 3997388, 3218039, 3839680, 3900245, 4407700, 4109373, 3548992, 3953291, 3685894, 3689473, 3667686, 3247862, 3235737, 2951703, 3550859, 3419683, 3400784, 3851199, 3488566, 3428215, 4139309, 3741382, 2826754, 3806545, 3279148, 3783587, 4170193, 3510265, 3367517, 4006787]
14926D006787L81139K1261l14381k19301q44779m01913L43965L16518O5085K48318
14916C602699l60534j70817J048150o8150l46251M26084q49730r2339O00622J58908
14906C948642J6989q3963n21271m07069Q78751N3604p316J28575p5825o5725m1743
14895C823649L61800p15396n31802j34876R5937K92968M73913J77604l97554P98796
14885D245039J78475j17996J06401m04006R9621k62692L17126K86110L15928o46868
14875D117138n28449M24420L54199l22967m31436L1704o897m83643K92516L39898
14865C786483n22642j96502Q0288k13393m62788K65079o82125R0627P19992j45518
14855B719501K8426j78362Q88300P4155l24774M81740m9579L70583P87913O85023
$$ y = [4006787, 4387926, 4409187, 4094806, 3875505, 3030726, 2628813, 2972778, 3289296, 3354381, 3602699, 3242165, 3071348, 4119498, 4051348, 3705097, 4131181, 3281451, 3189112, 3789734, 3948642, 3965631, 3881668, 3360397, 2953328, 3832079, 3885683, 3878367, 4006942, 3931117, 3865392, 3823649, 4185449, 3470053, 2938251, 2803375, 2899312, 3192280, 3666193, 3843797, 3446243, 4245039, 4423514, 4305518, 4411919, 4007913, 4107534, 3844842, 4161968, 4448078, 4764006, 4117138, 3588689, 4013109, 4367308, 4044341, 3612905, 3644609, 3637712, 3154069, 3446585, 3786483, 3263841, 3067339, 3147627, 2934234, 2471446, 2736525, 2054400, 2145027, 2865019, 2719501, 2747927, 2569565, 3457865, 3532020, 3207246, 3688986, 3639407, 4009990, 4797903, 5482926]
14845E482926j328449l69902o3098P02822n50278m94573K88131N5699R94268L69927
14835E087473n24095n54577J75477l65368m32881j18802L33688M82718l01473
14826C782160j29936P14285L44676m77511o03942N50212M26092m23927O5600k58810
14816C988899o99806J27826J52684l36486l37947k47940n62109L51545O79064
14807C115730J53142k79620K092Q09232l61116l79126L15261J33401o3652K25555
14797C670899M88746l98652R6770J53980L27477m09659l49459J78659l61210P28743
14787D126294k36049K16359o22633L72628k03500m85345k23277j70867Q86036
14778C659646M1121n2098K5242L44387n39163N5068J55201m33162O43785j59292
$$ y = [5482926, 4154477, 3784575, 3721477, 4424299, 3874021, 3379448, 3667579, 3723278, 4717546, 5087473, 4563378, 4008801, 4184278, 3818910, 3386029, 3267227, 3600915, 4083633, 3782160, 3652224, 4366509, 4711185, 4233674, 3629732, 4179944, 4606036, 4182109, 4247709, 3988899, 3289093, 3416919, 3569603, 3233117, 2895170, 2647230, 2085121, 2436666, 3115730, 3268872, 2989252, 2991344, 3800576, 3439460, 3060334, 3375595, 3508996, 3445344, 3670899, 4159645, 3760993, 3857763, 4011743, 4339220, 3929561, 3580102, 3758761, 3397551, 4126294, 3890245, 4106604, 3483971, 3856599, 3653099, 3167754, 2944477, 2773610, 3659646, 3700767, 3648669, 3673911, 4018298, 3479135, 3534203, 3689404, 3256242, 3900027, 3740735]
14768C740735j87852Q19914j61328N5792r9588J03470j93936k63229J35984K98910
14758D248872q1695J83787O4830m79075q7595o9601o91201R49138k16513k67682
14748C553265n27237n068J140039l7948m8224j079159L78756L4448M12728n47419
14738C274181o45400J208320M8940m29813o68454J68513O47361m5920J14095p19360
14728B952463K47348J20292O29508K61305q0562n85445j323181R23742M68409
14719C613879N25936n50952m38880O54534n44825N87283J06972j56610p16536
14710C080801k49551P86416m2997O78887l71357n38357p2443J168640k6795o30658
14700C782586L03257n53718P02451M39979l98437j37175q99156P43516j34145
$$ y = [3740735, 3552883, 4372797, 4211469, 4267261, 4167673, 4271143, 4077207, 3813978, 3949962, 4248872, 4167177, 4350964, 4415794, 3936719, 3849124, 3779523, 3088322, 4037460, 3820947, 3553265, 3026028, 3020960, 4160999, 4123051, 4074827, 2995668, 3374424, 3408872, 3821600, 3274181, 2628781, 3837101, 3886041, 3456228, 2787774, 2956287, 3603648, 3557728, 3671823, 2952463, 3199811, 3320103, 3949611, 4210916, 4130354, 3544909, 2221728, 3145470, 3613879, 4139815, 3588863, 3149983, 3804517, 3259692, 3846975, 3953947, 3797337, 3080801, 2831250, 3617666, 3574669, 4253556, 3882199, 3343842, 3271399, 4440039, 4413244, 3782586, 4085843, 3532125, 4234576, 4674555, 4276118, 4138943, 3239787, 3983303, 3849158]
14691C849158J50286O12218j42147n92252m7091N00890l03571L57283l39486J61798
14681D207086m94241J51906J16681k24577N15981M90510J63659l73587k22887
14672D330531m36222N64273M99188o02982N2061L4541m53990N74330M40683r81654
14662D020759p57982K75718O15497l49523n82133M5918J84484M93994r02575l91281
14652B652876M98319Q14459o24097m09567K20754K11114m3156J99987m6218p11032
14642B763439M92806J64438J67540P16076J09042p89041l82716L40553J48245
14633C730382j62107M9129n51994j17182O77873j30702j067441M32912O36542
14624C497412k46604k15252K5714l93762L50093J088689M5863r61323M06874J019611
$$ y = [3849158, 3999444, 4611662, 4469515, 3877263, 3830172, 4331062, 4027491, 4384774, 4045288, 4207086, 3712845, 3864751, 3981432, 3756855, 4272836, 4763346, 4927005, 4553418, 4330531, 3894309, 4458582, 4957770, 4354788, 4406849, 4441390, 3987400, 4561730, 5002413, 4020759, 3262777, 3538495, 4153992, 3804469, 3222336, 3268254, 3452738, 3946732, 3044157, 2652876, 3151195, 3965654, 3341557, 2931990, 3152744, 3363858, 3320702, 3520689, 3474471, 2763439, 3256245, 3420683, 3588223, 4304299, 4413341, 3624300, 3241584, 3582137, 3730382, 3568275, 3617404, 3065410, 2948228, 3626101, 3495399, 2427958, 2860870, 3497412, 3250808, 3035556, 3061270, 2667508, 3017601, 4106290, 4152153, 3190830, 3597704, 4617315]
14614D617315j21235l31964m16657P6742J075612o1370j67024j28312j72987l86011
14604C984109n59603J04955P08206p30772l76829J30097p45498R02923M81381
14595C898969n95506n63860R467L28371J008059L12815k58654K21205j27276L77324
14585D610914l10739j32947k25755l16048J79597P84969j26137r85888J88874
14576C666840K46070l46058R0925N9007k24729l36900O6302O87645o38324l29013
14566B941765R21859l9637j4499P77163p89920j4665J210883j14554m40524j24040
14556D313831J78121j77788m33664j77309J81743N38910k47857K59105o05162
14547C829930q8070N14735k09542l80809J78007j96686k54451P7466J49318P17437
$$ y = [4617315, 4496080, 4164116, 3747459, 3824201, 4899813, 4838443, 4671419, 4543107, 4370120, 3984109, 3424506, 3529461, 4237667, 3506895, 3130066, 3260163, 2514665, 3417588, 3898969, 3303463, 2739603, 2749070, 3077441, 4085500, 4398315, 4139661, 4360866, 4233590, 4610914, 4300175, 4167228, 3941473, 3625425, 3805022, 4589991, 4463854, 3477966, 3666840, 3912910, 3566852, 3657777, 3716784, 3492055, 3155155, 3221457, 3909102, 3270778, 2941765, 3863624, 3823987, 3809488, 4586651, 3796731, 3782066, 4992949, 4878395, 4437871, 4313831, 4491952, 4314164, 3880500, 3703191, 3884934, 4423844, 4175987, 4435092, 3829930, 3741860, 4256595, 4047053, 3666244, 3844251, 3647565, 3393114, 3470580, 3619898, 4337335]
$$ [...]
##END NTUPLES=NMR SPECTRUM
##END=
