##TITLE=1H_DE-80H_X3
 200.13MHz, d2o
 8 sc
 
 19ns.26.2.2025
##JCAMPDX= 6.0         $$ Bruker NMR JCAMP-DX V2.0
##DATA TYPE= NMR SPECTRUM
##DATA CLASS= NTUPLES
##ORIGIN= UXNMR, Bruker Analytische Messtechnik GmbH
##OWNER= pz
$$ XWIN-NMR		Version 3.5
$$ Mon May  4 10:15:37 2026 Russian Standard Time (UT+4h)  Yarkov@DPX200
##.OBSERVE FREQUENCY= 200.1313
##.OBSERVE NUCLEUS= ^1H
##.ACQUISITION MODE= SIMULTANEOUS
##.ACQUISITION SCHEME= undefined
##.AVERAGES= 8
##.DIGITISER RES= 18
##SPECTROMETER/DATA SYSTEM= spect
##.PULSE SEQUENCE= zg30
##.SOLVENT NAME= CDCl3
##.SHIFT REFERENCE= (INTERNAL, CDCl3, 0, 15.8989)
##AUDIT TRAIL= $$ (NUMBER, WHEN, WHO, WHERE, WHAT)
$$ ##TITLE= Audit trail, XWIN-NMR		Version 3.5
$$ ##JCAMPDX= 5.01
$$ ##ORIGIN= Bruker BioSpin GmbH
$$ ##OWNER= Yarkov
$$ C:/Bruker/XWIN-NMR/data/yarkov2/nmr/H-C/1/pdata/1/auditp.txt
$$ ##AUDIT TRAIL=  $$ (NUMBER, WHEN, WHO, WHERE, WHAT)
(   1,<2026-05-04 10:14:10.31 +0400>,<Yarkov>,<DPX200>,
      <created by zg, POWCHK disabled, PULCHK disabled
       configuration hash MD5:
       00 E9 B6 7A A2 85 ED C7 34 08 36 98 17 FE 4E 26
       data hash MD5: 16K
       D4 3C 3B B8 8D 39 99 A0 D8 10 73 FE 26 CF 58 DC>)
(   2,<2026-05-04 10:14:25.15 +0400>,<Yarkov>,<DPX200>,
      <Start of raw data processing
       efp BC_mod = 2 LB = 0.25 FT_mod = 6 PKNL = 1 PHC0 = -5300.516 PHC1 = 11.42193 SI = 16K 
       data hash MD5: 16K
       07 26 C6 93 E5 CA AA 0C 0A CD EE 32 2F 67 8A C9>)
(   3,<2026-05-04 10:14:56.87 +0400>,<Yarkov>,<DPX200>,
      <pk PHC0 = -3 PHC1 = 0 
       data hash MD5: 16K
       54 46 D0 77 E6 74 C8 57 10 97 45 F4 30 A1 43 53>)
$$ ##END=
$$ 
$$ hash MD5
$$ 9C D6 BD 0F 2D C6 10 D2 1B FD E0 D9 83 95 2A 3F
##$RELAX= 
##$RELAX= 
##$RELAX= 
##$RELAX= 
##$RELAX= 
##$RELAX= 
$$ Bruker specific parameters
$$ --------------------------
##$DU= <C:/Bruker/XWIN-NMR>
##$EXPNO= 1
##$NAME= <H-C>
##$PROCNO= 1
##$TYPE= <nmr>
##$USER= <yarkov2>
##$AMP= (0..31)
100 100 100 100 100 100 100 100 100 100 100 100 100 100 100 100 100 100 
100 100 100 100 100 100 100 100 100 100 100 100 100 100 
##$AQSEQ= 0
##$AQ_mod= 1
##$AUNM= <au_zg>
##$AUTOPOS= <>
##$BF1= 200.13
##$BF2= 200.13
##$BF3= 200.13
##$BF4= 200.13
##$BF5= 200.13
##$BF6= 200.13
##$BF7= 200.13
##$BF8= 200.13
##$BYTORDA= 1
##$CFDGTYP= 0
##$CFRGTYP= 5
##$CHEMSTR= <none>
##$CNST= (0..31)
1 1 145 1 1 1 1 1 1 1 1 1 1 1 1 1 1 1 1 1 1 1 1 1 1 1 1 1 1 1 1 1 
##$CPDPRG= <>
##$CPDPRG1= <>
##$CPDPRG2= <>
##$CPDPRG3= <>
##$CPDPRG4= <mlev>
##$CPDPRG5= <mlev>
##$CPDPRG6= <mlev>
##$CPDPRG7= <mlev>
##$CPDPRG8= <mlev>
##$CPDPRGB= <>
##$CPDPRGT= <>
##$D= (0..31)
0 0.7 0 0 0 0 0 0 0 0 0 0.03 0 0 0 0 0 0 0 0 0 0 0 0 0 0 0 0 0 0 0 0 
##$DATE= 1777875250
##$DBL= (0..7)
120 120 120 120 120 120 120 120 
##$DBP= (0..7)
150 150 150 150 150 150 150 150 
##$DBP07= 0
##$DBPNAM0= <>
##$DBPNAM1= <>
##$DBPNAM2= <>
##$DBPNAM3= <>
##$DBPNAM4= <>
##$DBPNAM5= <>
##$DBPNAM6= <>
##$DBPNAM7= <>
##$DBPOAL= (0..7)
0.5 0.5 0.5 0.5 0.5 0.5 0.5 0.5 
##$DBPOFFS= (0..7)
0 0 0 0 0 0 0 0 
$$ [...]
##$SUBNAM2= <"">
##$SUBNAM3= <"">
##$SUBNAM4= <"">
##$SUBNAM5= <"">
##$SUBNAM6= <"">
##$SUBNAM7= <"">
##$SUBNAM8= <"">
##$SUBNAM9= <"">
##$SW= 18.0517328524113
##$SWIBOX= (0..15)
0 0 2 0 0 0 0 0 0 0 0 0 0 0 0 0 
##$SW_h= 3612.71676300578
##$TD= 16384
##$TD0= 1
##$TE= 0
##$TE2= 300
##$TE3= 300
##$TEG= 300
##$TL= (0..7)
0 120 120 120 120 120 120 120 
##$TP= (0..7)
150 150 150 150 150 150 150 150 
##$TP07= 0
##$TPNAME0= <>
##$TPNAME1= <>
##$TPNAME2= <>
##$TPNAME3= <>
##$TPNAME4= <>
##$TPNAME5= <>
##$TPNAME6= <>
##$TPNAME7= <>
##$TPOAL= (0..7)
0.5 0.5 0.5 0.5 0.5 0.5 0.5 0.5 
##$TPOFFS= (0..7)
0 0 0 0 0 0 0 0 
##$TUNHIN= 0
##$TUNHOUT= 0
##$TUNXOUT= 0
##$USERA1= <user>
##$USERA2= <user>
##$USERA3= <user>
##$USERA4= <user>
##$USERA5= <user>
##$V9= 5
##$VALIST= <valist>
##$VCLIST= <CCCCCCCCCCCCCCC>
##$VD= 0
##$VDLIST= <DDDDDDDDDDDDDDD>
##$VPLIST= <PPPPPPPPPPPPPPP>
##$VTLIST= <TTTTTTTTTTTTTTT>
##$WBST= 1024
##$WBSW= 4
##$XGAIN= (0..3)
0 0 0 0 
##$XL= 0
##$YL= 0
##$YMAX_a= 932306
##$YMIN_a= -803963
##$ZGOPTNS= <>
##$ZL1= 120
##$ZL2= 120
##$ZL3= 120
##$ZL4= 120
##$ABSF1= 0
##$ABSF2= 0
##$ABSG= 0
##$ABSL= 0
##$ALPHA= 0
##$AQORDER= 0
##$ASSFAC= 0
##$ASSFACI= 0
##$ASSFACX= 0
##$ASSWID= 0
##$AUNMP= <proc_1d>
##$AZFE= 0.1
##$AZFW= 0.1
##$BCFW= 0
##$BC_mod= 2
##$BYTORDP= 0
##$COROFFS= 0
##$CY= -3
##$DATMOD= 1
##$DC= 0
##$DFILT= <>
##$DTYPP= 0
##$F1P= 0
##$F2P= 0
##$FCOR= 1
##$FTSIZE= 16384
##$FT_mod= 6
##$GAMMA= 0
##$GB= 0
##$INTBC= 1
##$INTSCL= 3.241238e-09
##$ISEN= 128
##$LB= 0.25
##$LEV0= 0
##$LPBIN= 0
##$MAXI= 10000
##$MC2= 0
##$MEAN= 0
##$ME_mod= 0
##$MI= 1.114404
##$NCOEF= 0
##$NC_proc= -6
##$NLEV= 6
##$NOISF1= 3.799351
##$NOISF2= 2.8
##$NSP= 0
##$NTH_PI= 0
##$NZP= 0
##$OFFSET= 15.89894
##$PC= 1
##$PHC0= -5303.516
##$PHC1= 11.42193
##$PH_mod= 1
##$PKNL= yes
##$PPARMOD= 0
##$PSCAL= 0
##$PSIGN= 0
##$REVERSE= no
##$SF= 200.129924503085
##$SI= 16384
##$SIGF1= 3
##$SIGF2= 2
##$SINO= 0.751879
##$SIOLD= 32768
##$SREGLST= <19F.Aceton>
##$SSB= 0
##$STSI= 16384
##$STSR= 0
##$SW_p= 3612.71676300578
##$SYMM= 0
##$S_DEV= 0
##$TDeff= 16384
##$TDoff= 0
##$TI= <>
##$TILT= no
##$TM1= 0
##$TM2= 0
##$TOPLEV= 0
##$USERP1= <user>
##$USERP2= <user>
##$USERP3= <user>
##$USERP4= <user>
##$USERP5= <user>
##$WDW= 1
##$XDIM= 16384
##$YMAX_p= 342671310
##$YMIN_p= -3390332
$$ End of Bruker specific parameters
$$ ---------------------------------
##NTUPLES= NMR SPECTRUM
##VAR_NAME=  FREQUENCY,     SPECTRUM/REAL,   SPECTRUM/IMAG
##SYMBOL=    X,             R,               I
##VAR_TYPE=  INDEPENDENT,   DEPENDENT,       DEPENDENT
##VAR_FORM=  AFFN,          ASDF,            ASDF
##VAR_DIM=   16384,         16384,           16384
##UNITS=     HZ,            ARBITRARY UNITS, ARBITRARY UNITS
##FACTOR=    0.220516191357247, 1,           1
##FIRST=     3181.85367916325, 0,            0
##LAST=      -430.863083842532, 0,           0
##MIN=       -430.863083842532, -3390332,    0
##MAX=       3181.85367916325, 342671310,    0
$$ Real data points
##PAGE= N=1
##DATA TABLE= (X++(R..R)), XYDATA
$$ [...]
7244b155271N556P1837L8211K3193j5084Q4010k662p2504j5594j01860l118M3730
7232b099556Q969J0274j8798J8764k7899j9834o0520J1754j5696L1983j4354K0548
7220b154365Q8351l1192K268L6375Q071l1145q096R686p9286L4770N576K3496
7208b095491N4553j7456m0877L6036L6659k4349p8804J0042O0583m7183m2883
7197b149170j7551J9277J8042M1710l808k237j0608l9503l029M1872k5539L0866
7185b099678q4236Q855M1566j660k0139L0595O634L4408l9852k151M2778k6164
7173b109044k1059l0276j7166l0144M0794j6002L269K2844j3426M7274M682M4546
7161b073708m1033n7988k568P055M1010m9484M9507p1510l935M8921J1072M49
$$ y = [-2155271, -2149715, -2077878, -2039667, -2016474, -2031558, -1947548, -1950210, -2022714, -2038308, -2140168, -2143286, -2099556, -2090587, -2080313, -2099111, -2080347, -2108246, -2128080, -2188600, -2176846, -2192542, -2160559, -2174913, -2154365, -2066014, -2097206, -2094938, -2058563, -2050492, -2081637, -2089733, -2080047, -2159333, -2124563, -2118987, -2095491, -2040938, -2058394, -2099271, -2063235, -2026576, -2050925, -2129729, -2119687, -2059104, -2106287, -2149170, -2166721, -2147444, -2129402, -2087692, -2091500, -2093737, -2104345, -2143848, -2146877, -2105005, -2130544, -2099678, -2183914, -2175059, -2133493, -2135153, -2155292, -2124697, -2118063, -2083655, -2123507, -2125658, -2082880, -2109044, -2130103, -2160379, -2177545, -2207689, -2166895, -2182897, -2179628, -2156784, -2170210, -2122936, -2118254, -2073708, -2114741, -2172729, -2175297, -2168242, -2127232, -2176716, -2127209, -2198719, -2202654, -2153733, -2142661, -2142212]
7149b142212m1791o03N2241J2940j0954P7378n8901n1440K9447K6325k5983k0480
7137b154033k2335p5812P247R9319L3797R710Q944p3059m8350R331k7482m5463
7125b278186O1319R9759j058L9207O130n0727j9117m1376J3375K1207O406j2534
7113b155595k1453l9763M493Q6551n8057K8236M808J083p1353k9876J02578l5381
7101b183729M4809O479m2622J5947N649k9995J7148j035k2757n2382L2677M8135
7089b161676m7633L1849l7618j8987j2899j6321R505J2590K5336K448o87l2869
7077b246962L9260P319j814M2374n9822p6582N8427R3723j1960o038K3779p990
7065b146286j4722j131J6720K4193m2112j1371P6089J4788l3446k6786P3201j1464
$$ y = [-2142212, -2184003, -2184606, -2132365, -2119425, -2130379, -2053001, -2111902, -2163342, -2133895, -2107570, -2133553, -2154033, -2176368, -2252180, -2244933, -2145614, -2111817, -2102107, -2093163, -2166222, -2214572, -2205241, -2232723, -2278186, -2216867, -2117108, -2118166, -2078959, -2072829, -2123556, -2142673, -2184049, -2170674, -2149467, -2143061, -2155595, -2177048, -2216811, -2212318, -2125767, -2183824, -2155588, -2150780, -2149697, -2221050, -2250926, -2148348, -2183729, -2138920, -2132441, -2175063, -2159116, -2153467, -2183462, -2166314, -2167349, -2190106, -2242488, -2209811, -2161676, -2209309, -2177460, -2215078, -2234065, -2246964, -2263285, -2253780, -2241190, -2215854, -2213406, -2214093, -2246962, -2207702, -2200383, -2202197, -2159823, -2219645, -2296227, -2237800, -2144077, -2156037, -2162075, -2138296, -2146286, -2161008, -2162139, -2145419, -2121226, -2163338, -2174709, -2098620, -2083832, -2117278, -2144064, -2070863, -2082327]
7053b082327J9202l9859r2106O4112M1124l1883L076p665J8876o3755m1701K4439
7041b188467P7193l5818J5636P6047r2732m2936P4520J9725J4793Q975o5545J7342
7029b121267l3651m2184K2083L117M5373j3655Q360K4600k2900k9458n8419R2679
7017b125322k4536r939O6080o7592l3839J5384M092O2516p1728K031P4078K8497
7005b080278Q6138o9140k5249K7085K5694n4678j14782M0141M9486j3917q694
6994b138194K8747j7309L9894l2061k9256L5646J6290l6810j0621L8629L05m4544
6982b149284L963n0692R5669l188j8004P1057m113p6361p4737J7030M5922O8935
6970b073803J1981j4521m2160k3147J363p375L1671N8454j2026o4458p4289L3080
$$ y = [-2082327, -2063125, -2102984, -2195090, -2130978, -2089854, -2121737, -2118661, -2126326, -2107450, -2171205, -2212906, -2188467, -2111274, -2147092, -2131456, -2055409, -2148141, -2191077, -2116557, -2096832, -2082039, -2073064, -2138609, -2121267, -2154918, -2197102, -2175019, -2171902, -2126529, -2140184, -2131824, -2107224, -2130124, -2159582, -2218001, -2125322, -2149858, -2159797, -2093717, -2161309, -2195148, -2179764, -2175672, -2113156, -2184884, -2182853, -2108775, -2080278, -1994140, -2063280, -2088529, -2061444, -2035750, -2090428, -2205210, -2165069, -2115583, -2129500, -2138194, -2109447, -2126756, -2086862, -2118923, -2148179, -2112533, -2096243, -2133053, -2143674, -2105045, -2104740, -2149284, -2145321, -2196013, -2100344, -2103532, -2121536, -2050479, -2054592, -2130953, -2205690, -2188660, -2142738, -2073803, -2061822, -2076343, -2118503, -2141650, -2140287, -2147662, -2115991, -2057537, -2069563, -2134021, -2208310, -2175230]
6958b175230j238K3094M8784j4967k6275L0353O0498n2081j4034m0394j9638j4112
6946b195240L3925P3024k2994l6320P192L1726M296K3388n304K3607j8352p820
6934b088872j08451m0356M2031K8242L5805N401j2172j1664J7956n5353l1895
6923b219328P861M2774O7155j3357k796l3299k4815L6817q0679l5750M7073l7324
6911b245668K834q882P6227L0463J5621j2520M9888j6681o2278M0817N9557j4480
6899b085102k7491r0420L4555j7326p979M4567N8953l203q454Q3622K3568l7852
6887b032562J4307j6467K1351Q7831j031j4080p6046l0777p1201m213M4577n0118
6875b128429L2769L29K5138L3909O148L3229k1324k2553J1098Q029p5974N96m1253
$$ y = [-2175230, -2176468, -2153374, -2104590, -2119557, -2145832, -2115479, -2054981, -2107062, -2121096, -2161490, -2181128, -2195240, -2161315, -2088291, -2111285, -2147605, -2140413, -2108687, -2104391, -2081003, -2086307, -2062700, -2081052, -2088872, -2197323, -2237679, -2195648, -2167406, -2131601, -2126200, -2138372, -2150036, -2132080, -2187433, -2219328, -2211467, -2168693, -2101538, -2114895, -2117691, -2150990, -2175805, -2138988, -2219667, -2255417, -2208344, -2245668, -2242834, -2251716, -2175489, -2145026, -2129405, -2141925, -2092037, -2108718, -2170996, -2130179, -2070622, -2085102, -2112593, -2203013, -2168458, -2185784, -2193763, -2149196, -2090243, -2093446, -2101900, -2018278, -1994710, -2032562, -2018255, -2034722, -2013371, -1925540, -1926571, -1940651, -2016697, -2047474, -2118675, -2122888, -2078311, -2128429, -2095660, -2095331, -2070193, -2036284, -2030136, -1996907, -2018231, -2040784, -2029686, -2021657, -2097631, -2097035, -2138288]
6862b138288M3029N091l2671K523m3898K1146L6290l6558J6277P647K5331M1989
6850b052092J8305M815j02p4198O28K6802l0805j5529O0041M3228J1952o6972
6838b073927m5779l6012M1814n5j2935k4227O2013O454k3369J1719n4222O497
6826b142029j5660M7430O595K5377l7542j9972J5333J5841J9103n8487J1980M1192
6814b090839j878n4732M1387N4219O5654J2217L6972m9318l6941j465j2997K4607
6802b013114M0672J5725K9290k461o2869l7638j926k5999M5245m127J38j0868
6790b027932N9918n054r3872j0726N0729p780o514J6945j2167n1630J6439J04933
6778a966711l7609N1692m530j5697l310O5721L8433J1764p5616o8512J732L0983
$$ y = [-2138288, -2095259, -2090168, -2122839, -2120316, -2164214, -2143068, -2106778, -2143336, -2127059, -2119412, -2094081, -2052092, -2033787, -2028972, -2029074, -2103272, -2102644, -2075842, -2106647, -2122176, -2062135, -2018907, -2006955, -2073927, -2119706, -2155718, -2113904, -2113959, -2126894, -2151121, -2089108, -2082654, -2106023, -2094304, -2148526, -2142029, -2157689, -2110259, -2103664, -2078287, -2115829, -2135801, -2120468, -2104627, -2085524, -2144011, -2132031, -2090839, -2092717, -2147449, -2106062, -2051843, -1986189, -1973972, -1937000, -1986318, -2023259, -2024724, -2037721, -2013114, -1972442, -1956717, -1927427, -1929888, -1992757, -2030395, -2032321, -2058320, -2013075, -2017202, -2017064, -2027932, -1968014, -1973068, -2066940, -2077666, -2026937, -2034717, -2041231, -2024286, -2036453, -2088083, -2071644, -1966711, -2004320, -1952628, -1957158, -1972855, -1976165, -1910444, -1872011, -1860247, -1935863, -2004375, -2002643, -1971660]
6766a971660m4534M9452l4526o5134K0367L9803K8178m1841J7989M8597k8731
6755a982040J0444j9740M6339m457j3770M5269k2141j9754k5135l0031M2501k4115
6743a996630j0671L1405J238r6642l158k9983L4341M2599K4693k7375k3512L2272
6731b021423j7002L88j708Q8625N7368m944o677l7110m0566O8722r357k1467P3379
6718a871772K7239j5098K2858M4962k5615n7209K3158O7067k0800k2717J5176
6707a812751L062l0398L1171O4479K9951R2876K4459J25785J54305l337k3940
6696a344338q1610l5325L519j23977j8353j2120l8651n6483j8065l3900J5134
6685a744169L3287r8407N2804K8548Q0023L7433N5011R1141r3866j5907O0063
$$ y = [-1971660, -2016194, -1966742, -2001268, -2066402, -2046035, -2006232, -1978054, -2019895, -2001906, -1953309, -1982040, -1971596, -1991336, -1944997, -1949454, -1963224, -1917955, -1940096, -1959850, -1984985, -2015016, -1972515, -1996630, -2007301, -1975896, -1974658, -2071300, -2074458, -2104441, -2070100, -2027501, -2002808, -2030183, -2053695, -2021423, -2038425, -2038037, -2039745, -1951120, -1893752, -1898696, -1905373, -1942483, -1983049, -1914327, -1923684, -1945151, -1871772, -1844533, -1859631, -1836773, -1791811, -1817426, -1874635, -1851477, -1784410, -1805210, -1827927, -1812751, -1809689, -1840087, -1808916, -1744437, -1714486, -1621610, -1597151, -1471366, -1317061, -1320398, -1344338, -1425948, -1461273, -1457754, -1581731, -1600084, -1612204, -1650855, -1707338, -1725403, -1759303, -1744169, -1710882, -1809289, -1756485, -1727937, -1647914, -1610481, -1555470, -1464329, -1558195, -1574102, -1514039]
6674a514039l8487j01073k1154r9108n4918j5957j0989n4874N474L7419j23740
6663a991446l6780J7364L0725l3363m7553K6940m5152p626N4712J7799o472k3745
6651b044597n454P0113J5628M8812P4143o0102q043m9811j4993J6099L8418M0304
6639a879483o2384m2468P375J0088L0061n9336k3189N4134o9508q0097p1420O0686
6627b125541N6546M3925j1732n3756l3278K9216L6311Q3439J933o4108k2904N3003
6615b006946m8796k3140p273J17040N6171j9843l8290j9391J7261n5712J5630
6604b013289m2165N2961L2085j3387j6817k5211j3828J0258J9683J7827K4342
6593a967541J6253O7859p3809m1568J0049l9200o8068L5656m03K0647L7056j1115
$$ y = [-1514039, -1552526, -1653599, -1674753, -1773861, -1828779, -1844736, -1855725, -1910599, -1905125, -1867706, -1991446, -2028226, -2010862, -1980137, -2013500, -2061053, -2034113, -2079265, -2086891, -2032179, -2014380, -2020852, -2044597, -2050051, -1979938, -1964310, -1915498, -1841355, -1901457, -1909500, -1959311, -1974304, -1958205, -1919787, -1879483, -1941867, -1984335, -1976960, -1966872, -1936811, -1996147, -2019336, -1965202, -2034710, -2114807, -2186227, -2125541, -2068995, -2025070, -2036802, -2090558, -2123836, -2094620, -2058309, -1974870, -1972937, -2037045, -2059949, -2006946, -2055742, -2078882, -2086155, -1969115, -1912944, -1932787, -1971077, -1990468, -1973207, -2028919, -2013289, -2055454, -2002493, -1970408, -1983795, -2000612, -2025823, -2039651, -2029393, -2009710, -1991883, -1967541, -1951288, -1883429, -1957238, -1998806, -1988757, -2027957, -2096025, -2060369, -2060772, -2040125, -2003069, -2014184]
6581b014184r325j2951L257J2480L0271K8879p2j7767p7755j6279J06999K4440
6569a942007n758J1542n0998k2609L7870k1181L9872L4501m1147j4459K833J3185
6557a958356j8581K5785K9848N889M8791p0634J8918M0544M5814j1790L9167m2726
6545a847331N9697r1879o5160O9939o608j6181n4877l037K705N73K381k3314k4836
6532a997928n0081M5450K9967p67j7126Q8424N5429n5914k324n8722j9089N8613
6520a924068K4629J3836l3222L028N0377l7646m6556l566N4688k0667q1876m966
6508b006009l262J5482j083J7368n562K7308k4930k3667J8593j3489n89k1511
6496b021351m469M9337J4148J465J5699j8749j057P7503k3991m5972L5208J6197
$$ y = [-2014184, -2023509, -2036460, -2033203, -2020723, -1990452, -1961573, -1961645, -1979412, -2057167, -2073446, -1966447, -1942007, -1947765, -1936223, -1987221, -2009830, -1971960, -1993141, -1953269, -1918768, -1959915, -1974374, -1971541, -1958356, -1976937, -1951152, -1921304, -1915415, -1866624, -1937258, -1918340, -1877796, -1831982, -1843772, -1804605, -1847331, -1787634, -1879513, -1944673, -1874734, -1881342, -1897523, -1952400, -1955437, -1952732, -1952159, -1949778, -1973092, -1997928, -2048009, -2002559, -1972592, -1973359, -1990485, -1902061, -1846632, -1902546, -1904870, -1963592, -1982681, -1924068, -1899439, -1885603, -1918825, -1915797, -1865420, -1903066, -1949622, -1953188, -1898500, -1919167, -2001043, -2006009, -2009271, -1993789, -1994872, -1977504, -1983066, -1955758, -1980688, -2004355, -1985762, -1999251, -1999840, -2021351, -2025820, -1976483, -1962335, -1960870, -1945171, -1963920, -1964977, -1887474, -1911465, -1957437, -1922229, -1906032]
6484a906032m8103j8607K9050p848N7071j4763q7343Q4081L1011q9169O264j663
6472a966051j0289J372q822M0796m9270m2222R7032n7342M6541M197p3157k0149
6460b037364M1220P5657O10o6578q8929J5147r224Q3684M5474p4022P4674k0783
6448a960434j1966k352J6855j4090j8397m2379J9588j3848K3918N3014K4782l4896
6436a960205J3216r3300K1912L5610j2537P5315j2398p7111o2808K5512M9871
6425a996923l8231j2897L6180O1511K303m7136j6396m3152N099O7078P4164n7718
6413a966118K242n1700m8561j1433O9911K3930l0241L2781j9213O926N7344k1272
6401a955404R297J8493L3385o1384r282m050J9157J7632k1771P37l070m5040p3980
$$ y = [-1906032, -1954135, -1972742, -1943692, -1951540, -1894469, -1909232, -1996575, -1912494, -1881483, -1970652, -1964388, -1966051, -1976340, -1974968, -1983790, -1942994, -1992264, -2034486, -1937454, -1994796, -1948255, -1944058, -2017215, -2037364, -1996144, -1920487, -1919877, -1986455, -2075384, -2060237, -2069461, -1985777, -1940303, -2014325, -1939651, -1960434, -1972400, -1974752, -1957897, -1971987, -1990384, -2032763, -2013175, -2027023, -2003105, -1950091, -1925309, -1960205, -1946989, -2040289, -2018377, -1982767, -1995304, -1919989, -1932387, -2009498, -2072306, -2046794, -1996923, -2035154, -2048051, -2011871, -1950360, -1948057, -1995193, -2011589, -2054741, -2049642, -1982564, -1908400, -1966118, -1963876, -2015576, -2064137, -2075570, -2005659, -1981729, -2011970, -1979189, -1998402, -1991476, -1934132, -1955404, -1946107, -1927614, -1894229, -1955613, -1964895, -1968945, -1949788, -1932156, -1953927, -1953190, -1956260, -2001300, -2075280]
6388b075280N0274R617K6117m7270O6548m1035K0338K3005K0144M5021j5516J6293
6376a901744j14775p2573R1309j1152P663J8213m244L0800J4423o131k4586m0954
6364b013751N324k7007K0303l049p1220R6600O8250k3338p5354K8778J4992N9714
6352a919758n5007m1986k107J8427l3961J08605j2401k0688M4626n7973P2096
6341a900127j6823l1909M7567L8296k2090q1958k9363O657O7798j2332J0056j4667
6329a938895n6879M3139N4805k3579K4899Q88k2605l7705N428K8797k9531n3767
6317b005005N9473J04088o5109M7244J7556l1968p4415k9750O7508K0879j8374
6306a907873o183L5461k4586Q895L4199o1701k0717l2556o9557K9403P2954n4723
$$ y = [-2075280, -2025006, -2015389, -1989272, -2036542, -1969994, -2011029, -1990691, -1967686, -1947542, -1902521, -1918037, -1901744, -2016519, -2089092, -1997783, -2008935, -2001272, -1983059, -1987303, -1956503, -1942080, -1948211, -1972797, -2013751, -2008427, -2035434, -2015131, -2018180, -2089400, -1992800, -1924550, -1947888, -2023242, -1994464, -1979472, -1919758, -1974765, -2016751, -2018858, -2000431, -2034392, -1925787, -1938188, -1958876, -1914250, -1972223, -1900127, -1916950, -1948859, -1901292, -1862996, -1885086, -1967044, -1996407, -1989750, -1921952, -1934284, -1924228, -1938895, -1995774, -1952635, -1897830, -1921409, -1896510, -1895622, -1918227, -1955932, -1950504, -1921707, -1951238, -2005005, -1945532, -1841444, -1906553, -1859309, -1841753, -1873721, -1948136, -1977886, -1910378, -1889499, -1907873, -1914056, -1878595, -1903181, -1894286, -1860087, -1921788, -1942505, -1975061, -2044618, -2015215, -1942261, -1996984]
6294a996984j3554L8333N0163M3415j3901K9002p363p3940l671M8323K2027n615
6282a883765m8981K0901L6299p2057k6515M9926L0779L0072o2569j533l969R0449
6270a840963K0336N6045O024m4122J8487k0274m394m3609o731K5428l1612K5518
6258a839867J2680M9655K1560M2983p176j34261Q0026M7736r5l8606Q2872r8536
6246a781029m6609N0898k416K8321m8511J917O6939J1037m0903l1379P3208k2357
6234a740884J0556k5229P8025l213J9680O9531q447k3368n1000L8261L6602k9753
6222a629239j0614l4398p68K6696q761J1220m2822O68k3577M817p507K0310J0498
6209a683477J0923j2490K2426n245L8432K0780J5259j5506j02263l1096l9044
$$ y = [-1996984, -2010538, -1972205, -1922042, -1878627, -1892528, -1863526, -1870889, -1944829, -1948500, -1900177, -1878150, -1883765, -1932746, -1911845, -1875546, -1947603, -1974118, -1924192, -1893413, -1863341, -1925910, -1927443, -1931412, -1840963, -1820627, -1764582, -1758558, -1802680, -1784193, -1804467, -1808861, -1852470, -1859201, -1833773, -1865385, -1839867, -1827187, -1777532, -1755972, -1712989, -1720165, -1854426, -1774400, -1726664, -1726759, -1765365, -1682493, -1781029, -1827638, -1776740, -1779156, -1750835, -1799346, -1797429, -1730490, -1719453, -1760356, -1791735, -1718527, -1740884, -1730328, -1755557, -1677532, -1680745, -1661065, -1591534, -1599981, -1623349, -1674349, -1636088, -1599486, -1629239, -1639853, -1674251, -1675019, -1648323, -1657084, -1645864, -1688686, -1688018, -1711595, -1706778, -1714285, -1693975, -1683477, -1672554, -1685044, -1662618, -1667863, -1629431, -1608651, -1593392, -1608898, -1711161, -1742257, -1781301]
6198a781301P0465k2489n3391L4248P5815l7593j1021J2698K0086L22K6364k2239
6186a688036j803K4448m1526q836k2405O0164m2858j2587N7329j7196q323l5107
6174a736736J1682Q4680l3763k1611K7320L4651n576k8902K1566k6871L0164j8643
6162a662039n8725J32950j9356l4505l1979N7693l2303k0887J4924n566N5968
6151a603825P1937l3889n122l0838K8832K1564q949K659J8213O7726n669j0158
6139a487519j1874n454m5195l37p4288j1949K8807N6801L6492O4999L0560j6074
6127a435031Q9548m0687q4754K3344p4354q6666r102J8368M6867J0182L7131k8916
6115a534070j6195k6140j8611k068m1821P8736R393J897J4836k9107M4800k7476
$$ y = [-1781301, -1710836, -1733325, -1786716, -1752468, -1676653, -1714246, -1725267, -1712569, -1692483, -1692161, -1665797, -1688036, -1689839, -1665391, -1706917, -1715753, -1738158, -1677994, -1720852, -1733439, -1676110, -1693306, -1701629, -1736736, -1725054, -1640374, -1674137, -1695748, -1668428, -1633777, -1639353, -1668255, -1646689, -1673560, -1643396, -1662039, -1720764, -1587814, -1607170, -1641675, -1673654, -1615961, -1648264, -1669151, -1654227, -1659793, -1603825, -1531888, -1565777, -1570899, -1601737, -1572905, -1551341, -1560290, -1557631, -1539418, -1471692, -1477361, -1487519, -1499393, -1504847, -1550042, -1550379, -1624667, -1636616, -1607809, -1551008, -1514516, -1449517, -1418957, -1435031, -1345483, -1386170, -1470924, -1447580, -1521934, -1608600, -1617702, -1599334, -1552467, -1542285, -1505154, -1534070, -1550265, -1576405, -1595016, -1597084, -1638905, -1560169, -1550776, -1548879, -1534043, -1563150, -1518350, -1545826]
6103a545826K326M810j9600J869N2649k9786R642n1838j6703R5111J3557p6993
6091a560782j8958P3211k3141N2408n456J7936J2117L2797M0940J6470j4047r811
6079a386316l9026K1005o0324K1656O8978L8749L9755K7463N5792n0890j8543
6068a281701m374n248o069j4261M7248k6679J6721j0779J0210J3518N0995L9668
6056a170751J188n6856j9652m7412m5124m724q9429K358J5350R082o3487p4353
6044a543810k4625L0790N8041L1264l5083k1119J05109p965n1058M3497K5451
6033a389508k757J4554P0628L016l5714l9035m0066R2643N8633Q25L1118r0114
6021a325777O6282k2233l5959K632l8199K0584K6891K5349K8739L457K9183r708
$$ y = [-1545826, -1543500, -1538690, -1558290, -1556421, -1503772, -1533558, -1523916, -1575754, -1592457, -1497346, -1483789, -1560782, -1579740, -1506529, -1529670, -1477262, -1482718, -1464782, -1452665, -1419868, -1378928, -1362458, -1376505, -1386316, -1425342, -1404337, -1464661, -1443005, -1374027, -1335278, -1295523, -1268060, -1212268, -1263158, -1281701, -1286075, -1291323, -1297392, -1311653, -1264405, -1291084, -1274363, -1285142, -1274932, -1261414, -1210419, -1170751, -1169563, -1226419, -1246071, -1293483, -1338607, -1343331, -1432760, -1430402, -1415052, -1405970, -1469457, -1543810, -1568435, -1537645, -1479604, -1448340, -1483423, -1504542, -1399433, -1407398, -1458456, -1414959, -1389508, -1392265, -1377711, -1307083, -1304067, -1339781, -1378816, -1418882, -1326239, -1267606, -1266781, -1235663, -1325777, -1259495, -1281728, -1317687, -1315055, -1353254, -1332670, -1305779, -1280430, -1251691, -1248234, -1219051, -1228759]
6009a228759j06607k3381M674J4251M7141n301J3186M9678J914k504j7806j1663
5997a265177R36j8081o07j3154O8731m095J6034O8796K1959l6645o9468j9583
5985a250354N3358R936m0885M3861M6830N211r94n0427L3802k48n0498J041O9622
5972a129745J1437r0179j5990K134J8191Q2248K4486m5434k0905P1395O0643j1889
5960a043608K6861O3534n203R53r125l2997J7020J758k1998M0043K2618l1748
5948i71892O5983K2373J6467K455J063n8737m108O481M4258M2573K5417K7054
5936g80613m4576J8798R5717M4786L6060J095j9378q928L3871M4719J13k6243
5924f04579m5351N4375P6894k5852N5277M9210n8427j7595O9983k2607M5748J1367
$$ y = [-1228759, -1335366, -1358747, -1354073, -1339822, -1292681, -1297982, -1284796, -1235118, -1233204, -1235708, -1253514, -1265177, -1264241, -1282322, -1282929, -1296083, -1227352, -1231447, -1215413, -1146617, -1124658, -1161303, -1230771, -1250354, -1196996, -1187060, -1227945, -1184084, -1137254, -1132043, -1133037, -1183464, -1149662, -1149910, -1200408, -1199367, -1129745, -1118308, -1208487, -1224477, -1222343, -1204152, -1121904, -1097418, -1142852, -1163757, -1092362, -1031719, -1043608, -1016747, -953213, -958416, -957463, -966588, -999585, -982565, -980807, -1002805, -962762, -940144, -971892, -905909, -883536, -867069, -864614, -863551, -922288, -926396, -919915, -875657, -833084, -807667, -780613, -825189, -806391, -710674, -665888, -629828, -628733, -648111, -657039, -623168, -578449, -578336, -604579, -649930, -595555, -518661, -544513, -489236, -440026, -498453, -516048, -446065, -468672, -422924, -411557]
5912d11557p8992N9003J51849J21440M1044J4055J15772P2635O4300P1795N0621
5901B71965N9067n8059l1319J5183k7203j4960P830q4445L536L1551M5768L5207
5889B54121J16858J06305L8096R0681M6822M1709J40167P4766J21556J22274L2273
5878A185628O0178P1327O5024m7047P8040N8519M7410J11897J18248J09253M0289
5867A898766J14183J23597J87117Q7592L4243R6397N5044J8435J61558J33745
5857B910677J33880J12620J92915K02513K03560K00020K57546K31968K77954M46231
5847E169884M46809N87870O70280Q67803J010003J377157J639492K306488L164915
5838A7240701M342192N423191N792261M851386K612135k5068k282219l423905
$$ y = [-411557, -490549, -431546, -279697, -158257, -117213, -103158, 12614, 85249, 149549, 221344, 271965, 331032, 272973, 241654, 256837, 229634, 214674, 222504, 138059, 141595, 173146, 218914, 254121, 370979, 477284, 515380, 606061, 652883, 694592, 834759, 909525, 1031081, 1153355, 1185628, 1245806, 1317133, 1382157, 1335110, 1413150, 1471669, 1519079, 1630976, 1749224, 1858477, 1898766, 2012949, 2136546, 2323663, 2411255, 2445498, 2541895, 2596939, 2615374, 2776932, 2910677, 3044557, 3157177, 3350092, 3552605, 3756165, 3956185, 4213731, 4445699, 4723653, 5169884, 5616693, 6204563, 6874843, 7742646, 8752649, 10129806, 11769298, 14075786, 17240701, 21582893, 27006084, 32798345, 37649731, 40261866, 40236798, 37954579, 34530674]
5830C4530674l575111l123445k337576j298097k33196J045181K562688M031574
5822C1602692M762512M047916J941772q09808l287946m709435m969785m426910
5814B4151008l729258l051402k521419k052905j719261j256101q97071o97063
5806H226528m63944n31356m17202k93968k08742k19332j65448j26495r1212n2165
5796E656664o1967K0583P7991J01461R161K0889K4127Q370J01507K06187J25186
5785F290159J62362J89180K10964L12330L81611M61907N12967N00543O01334P39293
5775A0362650R49774J134869J418521J718456J993147K574603L460872N041579
5767B8654471P114366Q985352J0090141R209031O011087J436128k850583n584021
$$ y = [34530674, 30955563, 27832118, 25494542, 24196445, 23963249, 25008430, 27571118, 31602692, 36365204, 40413120, 42354892, 41545084, 38257138, 33547703, 28577918, 24151008, 20421750, 17370348, 14848929, 12796024, 11076763, 9820662, 8923591, 8226528, 7762584, 7231228, 6814026, 6520058, 6311316, 6091984, 5926536, 5800041, 5708829, 5656664, 5594697, 5615280, 5693271, 5794732, 5803893, 5824782, 5848909, 5857279, 5958786, 6164973, 6290159, 6452521, 6641701, 6852665, 7164995, 7546606, 8008513, 8521480, 9022023, 9623357, 10362650, 11312424, 12447293, 13865814, 15584270, 17577417, 20152020, 23612892, 28654471, 35768837, 44754189, 54844330, 64053361, 70064448, 71500576, 68649993, 63065972]
5759F3065972o360373n758501m580706l080543j209426J003534L495542O001072
5751E2576571P580751P148981M375703R2710m200153p116537q255263p904283
5743D4298480o936202n873288m776145l899015l259945k670290k162220j651776
5735A3069599j270901j021344q22907p51845p22054n17685l36539l81459k42653
5726G002212k66991l12559k50912k32227j12012j22027r6990j24523j33221r1359
5716E259391n5801q5143k1164m472k6112l8746J9684K6533q032J00407K9751K360
5704E198656M9645J0953J12622J02928J48309J31984R8604J34253J11338k1159
5694F078133Q0976Q454q5902J7216l5590o8721j13994l31l7182r2513k7750M6578
$$ y = [63065972, 56705599, 50947098, 46366392, 43285849, 42076423, 43079957, 46575499, 52576571, 60157322, 67306303, 71682006, 71774716, 67574563, 60458026, 52202763, 44298480, 37362278, 31488990, 26712845, 22813830, 19553885, 16883595, 14721375, 13069599, 11798698, 10777354, 9954447, 9202602, 8480548, 7962863, 7626324, 7244865, 7002212, 6735221, 6422662, 6171750, 5939523, 5827511, 5705484, 5608494, 5483971, 5350750, 5259391, 5203590, 5118447, 5097283, 5092811, 5066699, 5027953, 5047637, 5074170, 5066138, 5166545, 5196296, 5198656, 5248301, 5259254, 5371876, 5474804, 5623113, 5755097, 5853701, 5987954, 6099292, 6078133, 6159109, 6167563, 6081661, 6098877, 6063287, 5994566, 5880572, 5880241, 5843059, 5750546, 5722796, 5769374]
5682E769374M2819O3309R6063K18249J42279J60902K40946J63150R7194R6382
5672G090667K54000K24693J05642L6601K952O7264N6418P8721J63267J35452J05040
5661H320717K70655L27350K91252L98784M10239M15772M57257L99609L21341K14977
5651A1827953J04065M9263P9086J28397J43497K02741K36296K20204J11137J01920
5641A3204559J15328N8885J4444J5176j03744j0587M3446Q8050Q8195J37228K34594
5630A3885574L33417M01163L73790N11833N77157O24762O81712P51855P22242
5621A8863505O42547N31339O33431O77003O68137O86660N85425M89703L65335
5612B4143085J45468K01327K34398J53293L56077L85363M67583P29470R16534
$$ y = [5769374, 5812193, 5875502, 5971565, 6189814, 6332093, 6492995, 6733941, 6897091, 6994285, 7090667, 7344667, 7569360, 7675002, 7711603, 7714555, 7781819, 7838237, 7916958, 8080225, 8215677, 8320717, 8591372, 8918722, 9209974, 9608758, 10018997, 10434769, 10892026, 11291635, 11612976, 11827953, 11932018, 11981281, 12060367, 12188764, 12332261, 12535002, 12771298, 12991502, 13102639, 13204559, 13319887, 13378772, 13393216, 13408392, 13304648, 13294061, 13337507, 13425557, 13513752, 13650980, 13885574, 14218991, 14620154, 14993944, 15505777, 16082934, 16707696, 17389408, 18141263, 18863505, 19506052, 20037391, 20670822, 21347825, 22015962, 22702622, 23288047, 23777750, 24143085, 24288553, 24489880, 24724278, 24877571, 25233648, 25619011, 26086594, 26816064, 27732598]
5603B7732598J290093J586363J971554K404064L214797M451820O289312Q391314
5595E7331915J0159330J0501413Q556380M524019l09152l721416n275789n281768
5587G6484932m236624k931890j643261k00637J188792K399524L467501M309833
5579G8838170M753193M932910N242465N971123P212091Q860065J0292601J0623076
5571A36725694Q430595L699826k402735p646860j0445789j0739220r612957p855048
5563A00153506o005702m266561k740292j257286R5495J318939K397320L257651
5555I2953070L615057L702621L591332L412845L407218L197793K586039J315508
5547A17781483o68831l243738n328153o755927p126335o711169o014376n118692
$$ y = [27732598, 29022691, 30609054, 32580608, 34984672, 38199469, 42651289, 48940601, 57331915, 67491245, 77992658, 86549038, 91073057, 90763905, 87042489, 81766700, 76484932, 72248308, 69316418, 67673157, 67472520, 68661312, 71060836, 74528337, 78838170, 83591363, 88524273, 93766738, 99737861, 106949952, 115810017, 126102618, 136725694, 145156289, 148856115, 146453380, 138806520, 128360731, 117621511, 108008554, 100153506, 94147804, 89881243, 87140951, 85883665, 85979160, 87298099, 89695419, 92953070, 96568127, 100270748, 103862080, 107274925, 110682143, 113879936, 116465975, 117781483, 117112652, 113868914, 108540761, 101784834, 94658499, 87947330, 81932954, 76814262]
5539G6814262m304182l470373k779594k245705j899592j522623j272148j207485
5531E8112560j192414j270409j151395r51010k46086P31400K113228L536677M371140
5522F4053691M100581K159672n63896k871544m089330m174265l728643l025171
5514E1861095k549230k049420j836254j507781j069224q60299o55007l68132n7974
5505D0907774M90640J357251K553806L988409M999894M999358L328261L97239
5497F3022632k517105m492346n150974m855190m191590l536058k867408k348736
5489C3063225j910594j434123j096360p08440n14124m23948l96611m08327m91473
5480B5679225l52960k31253k24866n9176M4464J38229K40138M11389M72470L77373
$$ y = [76814262, 72510080, 69039707, 66260113, 64014408, 62114816, 60592193, 59320045, 58112560, 56920146, 55649737, 54498342, 53547332, 53301246, 54032646, 56145874, 59682551, 64053691, 68154272, 70313944, 69750048, 66878504, 62789174, 58614909, 54886266, 51861095, 49311865, 47262445, 45426191, 43918410, 42849186, 41988887, 41333880, 40965748, 40907774, 41398414, 42755665, 45309471, 49297880, 54297774, 59297132, 62625393, 63022632, 60505527, 56013181, 50862207, 46007017, 41815427, 38279369, 35411961, 33063225, 31152631, 29718508, 28622148, 27913708, 27399584, 26975636, 26579025, 26170698, 25679225, 25326265, 25095012, 24870146, 24810970, 24855434, 24993663, 25233801, 25645190, 26117660, 26495033]
5470B6495033L75179K36512J73539K25849Q8844L9039Q2595o2715j48678n8377
5460B7446820o5549J21177N2669J16239J19735M5134O5714n598Q1699O8535K1174
5449B8067749m3072j69056l64818l73196m19182m44982m31025k55409j04069M3966
5439B5506906N3951J92169P0949M4895R9393J23975J54145L04010L64362L47134
5429B7261889K73421J50820K1577N0168J26327L8269N0202J8022p1434K3332R7476
5418B8040069K10455L61014N89354P03020N97725M79261K07043M1044p6244j46815
5408C1005926p3076O39j49188k80831l70521m77953n67696n69479m32515l25880
5398B7759426q2138N0896L4222j35264k42592l82055m81816m87393m71322n16940
$$ y = [26495033, 26870212, 27106724, 27280263, 27506112, 27594956, 27633995, 27716590, 27653875, 27505197, 27446820, 27381271, 27502448, 27555117, 27671356, 27791091, 27836225, 27901939, 27896341, 27978040, 28046575, 28067749, 28024677, 27855621, 27490803, 27117607, 26698425, 26253443, 25822418, 25567009, 25462940, 25506906, 25560857, 25753026, 25823975, 25868870, 25968263, 26092238, 26246383, 26550393, 26914755, 27261889, 27535310, 27686130, 27707707, 27757875, 27884202, 27922471, 27972673, 27990695, 27919261, 27942593, 28040069, 28250524, 28611538, 29200892, 29903912, 30501637, 30980898, 31187941, 31228985, 31152741, 31005926, 30932850, 30933489, 30784301, 30503470, 30132949, 29654996, 29087300, 28517821, 28085306, 27759426, 27677288, 27728184, 27762406, 27627142, 27384550, 27002495, 26520679, 26033286, 25561964, 25045024]
5388B5045024p25343j005722j127236j119326j198775j141768r11155p72521p14540
5379A6328638o09517n64121l86529k21906p5422L9167K92699K80403K27018O1475
5369A5371905k35236l85264n88924p17846o30286p99832p20403o94319o76879
5360I922916o57680o68403n21979m92894l22701k28005k61693j59827j43433j64899
5350F301402j3930k4081n7311j39730l5242r6524k51056k77808l72045k73240
5340D760435l02050k54534k62027k41782j59663k19300k39938j00246j47228j36800
5330B696867j4424k9011p6564j22890j52296N3213o3456q0389j07697k23173o3765
5319A816415o5186l0679q5592j05381l1267K7993J4528q8862j1635n1960l3618
$$ y = [25045024, 24319681, 23313959, 22186723, 21067397, 19868622, 18726854, 17815699, 17043178, 16328638, 15719121, 15155000, 14768471, 14546565, 14471143, 14510310, 14803009, 15083412, 15310430, 15371905, 15136669, 14751405, 14162481, 13444635, 12814349, 12014517, 11294114, 10599795, 9922916, 9265236, 8596833, 8074854, 7581960, 7259259, 7031254, 6769561, 6609734, 6466301, 6301402, 6287472, 6263391, 6206080, 6066350, 6031108, 5934584, 5683528, 5405720, 5033675, 4760435, 4458385, 4203851, 3941824, 3700042, 3540379, 3321079, 3081141, 2980895, 2833667, 2696867, 2682443, 2653432, 2576868, 2453978, 2301682, 2354895, 2291439, 2211050, 2103353, 1880180, 1816415, 1751229, 1720550, 1634958, 1529577, 1498310, 1526303, 1540831, 1451969, 1440334, 1388374, 1354756]
5308A354756M7407Q80o8829k6472m5870q132N1833K54k7672l2962K8686j0331
5296A263548k0248Q4540K953r7914J5188j546l9045M3814Q508N5220J29040Q2736
5284A526794L01k1186L9668K8095n1395k9768l3885O0320K6557o9680P7992M918
5272A558731j0045j23001k2365L8403M0626L8875O5941N6412K5969K0145L94N8369
5260A748454J21413N9113L8692N4992k2107j06623j32890m3805M9768r0079p2794
5249A604134l4576j216l0382q1285k639Q819n9604N106k0940K4753j8488o2511
5237A331171l5654J8082o740r2454m5437K5068O6314R844m6789K5175M9359n2093
5225A245846k2313n0931l5456r8167P8559l1007l7464j362k5408O5439n972m3112
$$ y = [1354756, 1402163, 1403043, 1334214, 1307742, 1261872, 1253740, 1305573, 1305827, 1278155, 1245193, 1273879, 1263548, 1243300, 1327840, 1330793, 1232879, 1248067, 1246521, 1207476, 1251290, 1259798, 1315018, 1444058, 1526794, 1527095, 1505909, 1545577, 1573672, 1522277, 1492509, 1458624, 1518944, 1545501, 1475821, 1553813, 1558731, 1548686, 1425685, 1403320, 1441723, 1482349, 1521224, 1587165, 1643577, 1669546, 1689691, 1690085, 1748454, 1869867, 1928980, 1967672, 2022664, 2000557, 1893934, 1761044, 1717239, 1767007, 1676928, 1604134, 1569558, 1568342, 1537960, 1456675, 1454036, 1462855, 1403251, 1408357, 1387417, 1412170, 1393682, 1331171, 1295517, 1313599, 1306859, 1214405, 1168968, 1194036, 1260350, 1270194, 1223405, 1248580, 1297939, 1245846, 1223533, 1172602, 1137146, 1038979, 1117538, 1086531, 1049067, 1047705, 1022297, 1087736, 1081764, 1038652]
5213A038652L8564K3757j0387k95m8619K8624l1509l2682n0779k657l05J6261
5201I68625j9557j1416j2659P3548o5229o4534J18700O2923l860M2401L3978j8356
5189A104564n423J11411J02999J9054J5191O4568R8930R132o3747j2866R3343
5178A537156l8346m8680M606k5700k1574J5531m623m5995p6868l9969L8415L5862
5166A329815M0098p6594l1884P8857j13N6683O1427K4369K351K0955K9438O7007
5154A602409J5042O1172j6340K9571R7577m1824k0669n476p4326o3800l491O1386
5142A641231n8477q7294o1383p7081m5489m4284o2062M829j915m9054J9540K8134
5130A206695n0366J8115l147J4508J4156K6540L8146j5407J7113P6233M7000P2215
$$ y = [1038652, 1077216, 1100973, 1090586, 1090291, 1041672, 1070296, 1038787, 1006105, 955326, 952669, 952364, 968625, 949068, 937652, 924993, 998541, 933312, 868778, 987478, 1050401, 1046541, 1088942, 1122920, 1104564, 1099141, 1210552, 1313551, 1332605, 1347796, 1412364, 1511294, 1520426, 1456679, 1443813, 1537156, 1498810, 1450130, 1454736, 1429036, 1407462, 1422993, 1418370, 1372375, 1295507, 1255538, 1293953, 1329815, 1369913, 1293319, 1261435, 1340292, 1340179, 1396862, 1458289, 1482658, 1485009, 1505964, 1535402, 1602409, 1617451, 1678623, 1662283, 1691854, 1789431, 1747607, 1726938, 1721462, 1647136, 1583336, 1579845, 1641231, 1582754, 1495460, 1434077, 1356996, 1311507, 1267223, 1205161, 1209990, 1208075, 1159021, 1178561, 1206695, 1156329, 1174444, 1171297, 1185805, 1199961, 1226501, 1264647, 1249240, 1266353, 1342586, 1389586, 1461801]
5118A461801L142J304M0745J18939R0670l3886n5133L9367n0702o2899k5070k5216
5106A503062k3348k5508n3196q4136k3311m8503J5035j0362K968l1423K307P8025
5094A301610K0470P7603J04542o4328J5932k0514J8545k2501j3630K9820K3519
5083A471068K4106K3205p9181j193J31908M0651n4583R1035N4302n9342k1643
5072A620333L3803m5888k5577l865m9367k6735l6100J02541K4097l6731N542M5938
5060A607991o8362m0541m9602j4191O6210J8328N1195J5582o7164n5794K2893
5049A486545M796o6136o7304l6958m0990l1767j6857j4132P6347o5520o8816N201
5037A164409m9256J9542m5193P6578M5497r9686j2398m7130N3946L5771m853P0694
$$ y = [1461801, 1464943, 1466247, 1506992, 1625931, 1716601, 1682715, 1627582, 1666949, 1616247, 1553348, 1528278, 1503062, 1479714, 1454206, 1401010, 1316874, 1293563, 1245060, 1260095, 1249733, 1252701, 1221278, 1223585, 1301610, 1322080, 1399683, 1504225, 1439897, 1455829, 1435315, 1453860, 1431359, 1417729, 1447549, 1471068, 1495174, 1518379, 1439198, 1438005, 1569913, 1610564, 1555981, 1647016, 1701318, 1641976, 1620333, 1654136, 1608248, 1582671, 1578806, 1529439, 1502704, 1466604, 1569145, 1593242, 1556511, 1562053, 1607991, 1539629, 1499088, 1449486, 1435295, 1501505, 1519833, 1571028, 1586610, 1519446, 1463652, 1486545, 1491341, 1425205, 1357901, 1320943, 1279953, 1248186, 1231329, 1217197, 1293544, 1228024, 1159208, 1164409, 1115153, 1134695, 1089502, 1166080, 1211577, 1111891, 1099493, 1052363, 1106309, 1142080, 1137227, 1207921]
5025A207921m18p9338p268N6915L1780m9327l4969N6200m2353K8030l247n3755
5013A110171j3831r505m1505P665L3374n3979k6663L67p1053k1043Q192l7872
5001H84318P397J4849m4900l931K6060j6739o6448l0565N5283K2922K7764k7751
4989H48259N5605o986M245L3724L50N9941K6850K0541l900O8835k0505m1553p7026
4976I68380L0300O7858k1670M1635p813k3626n0232m2400n4114K2880K3536j6919
4964I37815L0462K1278P4314N6916m6107p8756R8680o3143K6268l637p8101k6339
4952I49650j4203n888j5807o570k8139N3876K2411O2405M8847m1300L4559m3670
4940A016171p64J613o985j2193m1655n729Q2150K0556N1140M9317k048Q6355l2083
$$ y = [1207921, 1207503, 1128165, 1120897, 1177812, 1209592, 1160265, 1125296, 1181496, 1139143, 1167173, 1163926, 1110171, 1096340, 1086835, 1045330, 1052995, 1086369, 1032390, 1005727, 1006094, 935041, 913998, 922190, 884318, 891715, 906564, 861664, 857733, 883793, 867054, 800606, 770041, 825324, 848246, 876010, 848259, 903864, 896878, 901123, 934847, 935197, 995138, 1021988, 1042529, 1038629, 1107464, 1086959, 1045406, 968380, 998680, 1066538, 1044868, 1086503, 1078690, 1055064, 1004832, 962432, 908318, 931198, 954734, 937815, 968277, 989555, 1063869, 1120785, 1074678, 995922, 1094602, 1031459, 1057727, 1054090, 975989, 949650, 935447, 929559, 913752, 907182, 879043, 932919, 955330, 1017735, 1066582, 1025282, 1059841, 1016171, 1015407, 1017020, 1010035, 997842, 956187, 950458, 1032608, 1053164, 1104304, 1153621, 1151573, 1237928, 1205845]
4927A205845P6073M026l1146M1639N2073k5707m9889L4640N1071n9719L2014J5724
4915A346644K2552Q5857O2970M5216Q2577J718Q0954K6895N2778P6710J64937
4904B049808k3021o7938o6386J2464N1286n92J7359k1903J564R1372O2886O4146
4892B171045J03574k9351Q1475J39050J9809k7469O8401J8661j4421J7416P5572
4881B623762K9204J01038J5900j6928M5326M0450m2926L7348M8279O7535L9539
4870B988527n283Q5821Q7245J07788R4844Q1056J48288N5911N616J1229o1022
4859C600020k2018j0451Q114L4360N6424L2044K3407J05507N0403P852M4471L9743
4847C969876J7849P7023N6985J2948L1061J9476n184k1139m60j5303k2978J1033
$$ y = [1205845, 1281918, 1285944, 1254798, 1296437, 1348510, 1322803, 1272914, 1307554, 1358625, 1298906, 1330920, 1346644, 1369196, 1455053, 1518023, 1563239, 1645816, 1647534, 1728488, 1755383, 1808161, 1884871, 2049808, 2026787, 1958849, 1892463, 1904927, 1956213, 1955621, 1972980, 1951077, 1952641, 2044013, 2106899, 2171045, 2274619, 2245268, 2326743, 2465793, 2485602, 2458133, 2526534, 2545195, 2530774, 2548190, 2623762, 2652966, 2754004, 2769904, 2752976, 2798302, 2838752, 2795826, 2833174, 2881453, 2948988, 2988527, 2983244, 3069065, 3156310, 3264098, 3358942, 3439998, 3588286, 3644197, 3649813, 3661042, 3600020, 3578002, 3567551, 3575665, 3610025, 3666449, 3698493, 3721900, 3827407, 3877810, 3885662, 3930133, 3969876, 3987725, 4064748, 4121733, 4134681, 4165742, 4185218, 4180034, 4158895, 4158435, 4143132, 4120154, 4131187]
4835D131187O0065L8047L9359J51648J28717Q1574J16128P6186Q5431J26835J04665
4824E139842J47614R0056N9270J44199J21440J73650K03666L28246K92477K55970
4814F956430M79770O23266R04466J174686J617595K122686K396820K200365J382589
4805A9858673L82964m06381p14516n18963j45098K81211J033400J872613K877609
4796B4521512L715274M145442L828634K748871J668195J068972P17129M07577
4788D2821606L5085j10576L28388Q50464J052489R58427J061427J084620Q74041
4779D8955971R32144J440377J979650K141425K093177J647264P17745l76639j336651
4770E8194463j981368j943500j313190p16388n16717q39024j151456j279251j559026
$$ y = [4131187, 4191252, 4229299, 4268658, 4420306, 4549023, 4630597, 4746725, 4822911, 4908342, 5035177, 5139842, 5287456, 5377512, 5436782, 5580981, 5702421, 5876071, 6079737, 6407983, 6700460, 6956430, 7436200, 8059466, 8963932, 10138618, 11756213, 13878899, 16275719, 18476084, 19858673, 20241637, 19835256, 19120740, 18601777, 18456679, 18737890, 19771290, 21643903, 24521512, 28236786, 32382228, 36210862, 38959733, 40627928, 41696900, 42414029, 42821606, 42856691, 42746115, 43074503, 43924967, 44977456, 45935883, 46997310, 48081930, 48955971, 49888115, 51328492, 53308142, 55449567, 57542744, 59190008, 59907753, 59531114, 58194463, 56213095, 54269595, 52956405, 52240017, 51723300, 50884276, 49732820, 48453569, 46894543]
4761D6894543j603208j221698p22192l44178K6757K74118M87969J22674r36807
4752D2977978k216792l399152m019664m047227l462471k787836k018191j241046
4744A9785599m40982L18054Q35710Q35760O4141r65207j696929k011953k031056
4735A4693137j826004j475962j137018j046941r00390o11668n36316m42738l64878
4726F351222k37314k73781k35555j70756k25809j75524j59059j51910j17976j63113
4716D440425n5064n9124q1819m3837p4093q0220l8310m0885j19696j22478M860
4705C729759J0405N710l8432m5182p7666l359R150l6516k0449q1252K6944Q1022
4693C560134J6901L4094j1427m348K0681M2677k7524j0738k4483J1177L2268Q7522
$$ y = [46894543, 45291335, 44069637, 43347445, 43003267, 43030024, 43304142, 43792111, 43914785, 42977978, 40761186, 37362034, 33342370, 29295143, 25832672, 23044836, 21026645, 19785599, 19344617, 19662671, 20498381, 21334141, 21398282, 20433075, 18736146, 16724193, 14693137, 12867133, 11391171, 10254153, 9207212, 8306822, 7695154, 7158838, 6716100, 6351222, 6113908, 5840127, 5604572, 5433816, 5208007, 5032483, 4873424, 4721514, 4603538, 4440425, 4385361, 4326237, 4244418, 4200581, 4126488, 4046268, 4007958, 3967073, 3847377, 3724899, 3729759, 3740164, 3745874, 3707442, 3662260, 3584594, 3581235, 3590385, 3553869, 3533420, 3452168, 3479112, 3560134, 3577035, 3611129, 3599702, 3595354, 3616035, 3658712, 3631188, 3620450, 3595967, 3607144, 3639412, 3726934]
4681C726934P8816L6898O4715P9370J03302J23403J07181J82447J30191J21549
4671D754806K21998K27273L05019L75550M81514N57788O24375N78827O55253P49663
4661I532066P76440P13810N97940J78938l15616n89937o43468n22894l28410k27660
4651I171209j76264k8348K04986M02226O52935P96177R17825Q29448O70234R7503
4641A3537931k91689p49780p05830p11387o27512n12788l95644k92107j49367
4632I101827M8501J42561O1907J38954J23267P5825Q1492j09253j49542j73814
4622I341725j95582j81866j28538o3993j643R3993J64188K95240L11348M93095
4612A0127967O67814R02272J245756J522697J686893J377740P70245j41189p66745
$$ y = [3726934, 3805750, 3842648, 3907363, 3986733, 4090035, 4213438, 4320619, 4503066, 4633257, 4754806, 4976804, 5204077, 5509096, 5884646, 6366160, 6923948, 7548323, 8127150, 8782403, 9532066, 10308506, 11022316, 11620256, 11799194, 11483578, 10893641, 10250173, 9727279, 9398869, 9171209, 8994945, 8966597, 9171583, 9573809, 10226744, 11022921, 11940746, 12770194, 13440428, 13537931, 13246242, 12496462, 11790632, 11079245, 10451733, 9938945, 9543301, 9251194, 9101827, 9150328, 9292889, 9354796, 9493750, 9617017, 9692842, 9774334, 9665081, 9515539, 9341725, 9146143, 8964277, 8835739, 8771746, 8770103, 8864096, 9028284, 9323524, 9634872, 10127967, 10795781, 11698053, 12943809, 14466506, 16153399, 17531139, 18301384, 18160195, 17393450]
4603A7393450j127573j223596j155984r21843o87824m76991j75006J36373N10110
4594A2271116Q76552J265865J353163J040773L21467n65943j043467j325310j262406
4585A2931810j173189q31607o69746o79692m68245l18869k75280l2340k5884L9223
4575H496181J65334K17211K92930M39216O39845Q01040Q85964J103955J124174
4566A4165850R13912M75903M5766l68679n91978p39433p16754o18604m61084l38396
4556A1766503k63692n2618J21729K71799M47164O36046R50344J011604Q88107
4547A5776986N85698J87972m35713p09998q43991q47697o62807p35347n97810
4538A1717293m08680k76296k86132k45565m9274J8720J30144J76478K50369K73629
$$ y = [17393450, 16265877, 15042281, 13886297, 12964454, 12276630, 11799639, 11624633, 11761006, 12271116, 13147668, 14413533, 15766696, 16807469, 17128936, 16562993, 15519526, 14194216, 12931810, 11758621, 10927014, 10257268, 9577576, 9109331, 8790462, 8515182, 8482842, 8456958, 8496181, 8661515, 8878726, 9171656, 9610872, 10250717, 11051757, 11937721, 13041676, 14165850, 15079762, 15555665, 15601431, 15232752, 14640774, 13901341, 13184587, 12565983, 12104899, 11766503, 11502811, 11450193, 11571922, 11843721, 12290885, 12926931, 13877275, 14888879, 15776986, 16362684, 16550656, 16114943, 15404945, 14560954, 13713257, 13050450, 12315103, 11717293, 11308613, 11032317, 10746185, 10500620, 10451346, 10470066, 10600210, 10776688, 11027057, 11300686]
4528A1300686K70003K45687K08596K01849J44698J90889J99741K37791M19771
4519A3419711O49534N87801Q04513R15128J247298J562438J746588J953620J725714
4510B4612345J317257P10638J4995l84545m75189k24700P3886M28544P90111Q95749
4500B7759091O42165K62416n1212j63158m9670K80930M47753M56192K82550k22193
4490B9644864o93558j023051j177706j143797j077874r20486o80676m84116k00567
4481B2243033l1741M09909P85234J169393J612936J758169J642582J188713M11503
4472C1189731j70713o30701q26282q56088p82998n64098l82510j51820J54550
4463B6979071L28115M36112N44940O83922Q52406R32724J150323J302707J518537
$$ y = [11300686, 11570689, 11816376, 12024972, 12226821, 12371519, 12562408, 12762149, 12999940, 13419711, 14069245, 14657046, 15461559, 16376687, 17623985, 19186423, 20933011, 22886631, 24612345, 25929602, 26640240, 26655235, 26270690, 25795501, 25570801, 25644687, 26073231, 26863342, 27759091, 28401256, 28663672, 28612460, 28449302, 28399632, 28680562, 29128315, 29584507, 29867057, 29644864, 28951306, 27928255, 26750549, 25606752, 24528878, 23608392, 22927716, 22443600, 22243033, 22211292, 22621201, 23406435, 24575828, 26188764, 27946933, 29589515, 30778228, 31189731, 31019018, 30388317, 29562035, 28705947, 27922949, 27358851, 26976341, 26824521, 26979071, 27307186, 27743298, 28288238, 28972160, 29824566, 30757290, 31907613, 33210320, 34728857]
4454C4728857J546158J668216J812678K122092K311900K306143J995767J676124
4446E0167935J236852R01747O52598N33593O06433P00633Q51075R06755J010518
4437E7568139J040446J162228J308451J375782J561002J696084J968420K066593
4429F9747145K286395K454957K617698K826032L044348L397124L399175L139471
4421I2912345K744783K198093J857557J586965J752244K128623K985978M498705
4413A12665293O627743R089400J0644955R317113M625147j282952n354626o637429
4405A39694644o392161n486803m488673l493489k487112j433457j33135J508431
4397A17288245L295742N751430Q874090J2307437J5134626J5701639J4027976
$$ y = [34728857, 36275015, 37943231, 39755909, 41878001, 44189901, 46496044, 48491811, 50167935, 51404787, 52306534, 52959132, 53492725, 54099158, 54799791, 55650866, 56557621, 57568139, 58608585, 59770813, 61079264, 62455046, 64016048, 65712132, 67680552, 69747145, 72033540, 74488497, 77106195, 79932227, 82976575, 86373699, 89772874, 92912345, 95657128, 97855221, 99712778, 101299743, 103051987, 105180610, 108166588, 112665293, 119293036, 128382436, 139027391, 148344504, 152969651, 151686699, 146332073, 139694644, 133302483, 127815680, 123327007, 119833518, 117346406, 115912949, 115779814, 117288245, 120583987, 126335417, 135209507, 147516944, 162651570, 178353209, 192381185]
4390A92381185J2100117J0322155P188816J823175l780594p581424q801381q320856
4382A95331193p199360n882197m458553l098496j938925p60716N35284K298922
4374A74827152M715024P677645J0779721J2026717R741912M541212m34315k703758
4366B21171310k455011q25283J194826L437257N438894P485951R723429J1410167
4358B56581540J2110083J1490352R367501N988494K268418j188499l765700n172489
4350B87679700n649778n917093n780692n407352m744480l730551k366899r35974
4342B53146881M12760J669487K695450L556791M356007N308198O353398P459380
4334B84958352Q565440R480718J0251414J0282081R289477O887091K956737k160307
$$ y = [192381185, 204481302, 214803457, 221992273, 223815448, 220034854, 212453430, 203652049, 195331193, 188131833, 182249636, 177791083, 174692587, 172753662, 171992946, 172528230, 174827152, 179542176, 187219821, 197999542, 210026259, 219768171, 224309383, 223875068, 221171310, 218716299, 217891016, 219085842, 222523099, 227961993, 235447944, 245171373, 256581540, 268691623, 280181975, 289549476, 295537970, 297806388, 296617889, 292852189, 287679700, 282029922, 276112829, 270332137, 264924785, 260180305, 256449754, 254082855, 253146881, 253559641, 255229128, 257924578, 261481369, 265837376, 271145574, 277498972, 284958352, 293523792, 303004510, 313255924, 323538005, 332827482, 339714573, 342671310, 340511003]
4326C40511003p197869j1368712j4127203j5217334j5134364j4470396j3454940
4319B49540185j2146492j0970980r751623q462444p236404o142550n047620m167326
4311A85614746l496591l042161k790939k614124k698238k825085k929052l180887
4303A62037669l320169l496828l866920m569420n411024o045609o343606o296958
4295A22687135n921647n289823m594763l862338l583701l521704l794990l998085
4287H8120084m241345m271230m191674l831262l389421l147035k821993k432327
4279E9793797k044516j838778j518703j250375r85879q13151o32375m97403l99111
4270D9813506m35726l66083m34493o43937p37193o43131o14057m85152l12712
$$ y = [340511003, 333313134, 321944422, 307817219, 292599885, 277465521, 262995125, 249540185, 237393693, 226422713, 216671090, 208208646, 200972242, 194829692, 189782072, 185614746, 182118155, 179075994, 176285055, 173670931, 170972693, 168147608, 165218556, 162037669, 158717500, 155220672, 151353752, 146784332, 141373308, 135327699, 128984093, 122687135, 116765488, 111475665, 106880902, 103018564, 99434863, 95913159, 92118169, 88120084, 83878739, 79607509, 75415835, 71584573, 68195152, 65048117, 62226124, 59793797, 57749281, 55910503, 54391800, 53141425, 52155546, 51342395, 50710020, 50212617, 49813506, 49377780, 49011697, 48577204, 47933267, 47196074, 46552943, 45938886, 45453734, 45141022]
4261D5141022p2087J64286L90738P12327R42348R06236N32437q5679q04504j440418
4251D6386706j689689j835616j581700j401266j036796p56556l52238j42737O8120
4242C7658228J58940K88154L68594M80858N43527O15018N19768M23465K69330
4233D1325882k6583k91025m61663l56568k10774O0245L70370M60617M13176J21488
4223D1405165k23100q18265j244707j426141j558291j478248j299041j036772
4215C2320600q78696n49468l14852r4302p6788j60322l77747n56502n98891m08724
4205B8304308k11239J68584L58226O03169O51820P84466O01643L07641r0647l67429
4195C1110542n67550n71388m11077j49585J30220J68660p9483m12790p04411q43498
$$ y = [45141022, 45068935, 45233221, 45623959, 46336286, 47278634, 48184870, 48717307, 48631628, 47827124, 46386706, 44697017, 42861401, 41279701, 39878435, 38841639, 38085083, 37732845, 37590108, 37658228, 37817168, 38105322, 38473916, 38954774, 39498301, 40113319, 40633087, 41056552, 41325882, 41299299, 41008274, 40546611, 40190043, 39979269, 40039514, 40409884, 40870501, 41283677, 41405165, 41182065, 40363800, 39119093, 37692952, 36134661, 34656413, 33357372, 32320600, 31441904, 30892436, 30577584, 30483282, 30406494, 30246172, 29868425, 29311923, 28713032, 28304308, 28093069, 28261653, 28619879, 29223048, 29874868, 30659334, 31260977, 31568618, 31477971, 31110542, 30542992, 29971604, 29560527, 29410942, 29541162, 29709822, 29630339, 29217549, 28513138, 27669640]
4185B7669640q40882r24161r66742r50729r56515r90961p70168n84394m93099
4176B0191989m18184l38918j69007P8283L13501N46337N88515M48576J74896l15704
4166B1100284p23050r70846r76369r22622q72384p86974o90744o16108m16367
4157A4124820j99150k3376J32191J99381K43208M09702O02047Q42186J256180
4148A7587189J556812J647892J288097N99729l08581q61085j067487r68593p07763
4139A8766210k82039J6808M39024P24484Q40885Q49585O32243M36521L52536O15162
4129B3391419R28592J211504J420161J270020J208047J056428O04978N6571n67757
4120C0579963p35135n30850L40488J435600L192569N459594Q250630J0494782
$$ y = [27669640, 26828758, 25904597, 24937855, 23987126, 23030611, 22039650, 21269482, 20685088, 20191989, 19773805, 19434887, 19265880, 19344163, 19657664, 20204001, 20792516, 21241092, 21415988, 21100284, 20377234, 19406388, 18430019, 17507397, 16635013, 15848039, 15157295, 14541187, 14124820, 13925670, 13902294, 14034485, 14233866, 14477074, 14886776, 15488823, 16331009, 17587189, 19144001, 20791893, 22079990, 22679719, 22371138, 21510053, 20442566, 19473973, 18766210, 18484171, 18500979, 18940003, 19664487, 20505372, 21354957, 21987200, 22423721, 22776257, 23391419, 24320011, 25531515, 26951676, 28221696, 29429743, 30486171, 31091149, 31147720, 30579963, 29844828, 29313978, 29654466, 31090066, 34282635, 39742229, 47992859, 58487641]
4112E8487641J0465038P073753J448727l214285n462041n271268l742774j843595
4104E7941196J80702K399292N112270P247652O958255L594135j498182n622018
4096G6313302p065482o125595l740363m95449K886640N473975N511105K451028
4088G5209161k060430n439647o900785o526855n060866l031986o65875K067088
4080D7589805M773845O556534N649690J833998k915500o308548p675065p420823
4072D2083936o355454n246881m286509l434335k762708k250168j611262j212723
4064A4923896q95590p52582o43599m34145l94921n22758m00108l77590l14701
4055A0187902k90218k63819l29501l02795j94190k20606j42293j03922j18162
$$ y = [58487641, 68952679, 76026432, 77475159, 74260874, 68798833, 63527565, 59784791, 57941196, 58121898, 60521190, 65633460, 72881112, 79839367, 83433502, 81935320, 76313302, 69247820, 63122225, 59381862, 58886413, 61773053, 67247028, 72758133, 75209161, 73148731, 67709084, 60808299, 54281444, 49220578, 46188592, 45522717, 47589805, 52363650, 58920184, 64569874, 66403872, 63488372, 57179824, 49504759, 42083936, 35728482, 30481601, 26195092, 22760757, 19998049, 17747881, 16136619, 14923896, 14028306, 13275724, 12632125, 12197980, 11803059, 11280301, 10880193, 10502603, 10187902, 9897684, 9633865, 9304364, 9001569, 8807379, 8586773, 8444480, 8340558, 8222396]
4046H222396j36149j65693M1722p953j51197q6013k9465p8064j29770j14957j43263
4035G221594j7913q4505j18510p1293o4927j61693j52282o5156j23577p1520j64688
4024F125530j56067j2804k8198o7480p1195n0324j44328q2141r7013m2676j678
4013E371626r7092j12914j13275j0337o7669p874o9539j22101p4107j21861j48181
4002D426676o3190k2165o0344N4815o4111Q1804K578q740K0570L8119R2268J47461
3990D645741O2994M4168J01814Q1704J30958J01184M9386o0943m1120O4928K13874
3979E394688L36268M24012Q33408J176089J093585N47482k12293o70315q31508
3970H091416p81413n17329m17668l92903k31482j86165j62680k62610r1207r7327
$$ y = [8222396, 8086247, 7920554, 7962276, 7954323, 7803126, 7717113, 7687648, 7609584, 7479814, 7364857, 7221594, 7203681, 7119176, 7000666, 6929373, 6864446, 6702753, 6550471, 6485315, 6361738, 6290218, 6125530, 5969463, 5956659, 5928461, 5860981, 5789786, 5739462, 5595134, 5512993, 5415980, 5373304, 5371626, 5274534, 5161620, 5048345, 5038008, 4970339, 4962465, 4892926, 4770825, 4696718, 4574857, 4426676, 4363486, 4341321, 4280977, 4335792, 4271681, 4353485, 4356063, 4347323, 4367893, 4406012, 4498280, 4645741, 4708735, 4752903, 4854717, 4936421, 5067379, 5168563, 5217949, 5157006, 5115886, 5180814, 5394688, 5730956, 6154968, 6988376, 8164465, 9258050, 9805532, 9593239, 8922924, 8091416, 7310003, 6792674, 6375006, 5982103, 5750621, 5564456, 5401776, 5139166, 5047959, 4950632]
3960D950632p4607j6418n9591j40021j06629r0660k3108M4075P4796O5516M65
3949D624450o1983l5912N8145J12709J9329N8009O4542M384P3820P2413R9073
3938E088979J38356J14781L7879R0486O2601R9916J96633J41688P7150J46804
3928F195273P4356n0626M7660N0747P8645L7774p3011q4400J5118K2529R1028
3917F405093J14120J24896R6877j9236O4353J65008K24608L27221K15574J03514
3907G822028O3130P4872J76998K20149K69031J48741L9148m4402L6778P6522J16266
3896H999261J08925J48739J46451J5626N42K67946M71559L93573L09312K78507
3886A1140441K71477M21490P09969R06857J019531J067555R43021J053528J110778
$$ y = [4950632, 4876025, 4859607, 4800016, 4659995, 4553366, 4462706, 4439598, 4483673, 4558469, 4623985, 4624450, 4562467, 4526555, 4584700, 4697409, 4716738, 4774747, 4839289, 4843673, 4917493, 4989906, 5088979, 5227335, 5342116, 5379995, 5470481, 5533082, 5632998, 5829631, 5971319, 6048469, 6195273, 6269629, 6219003, 6266663, 6317410, 6396055, 6433829, 6360818, 6276418, 6291536, 6314065, 6405093, 6519213, 6644109, 6740986, 6721750, 6786103, 6951111, 7175719, 7502940, 7718514, 7822028, 7885158, 7960030, 8137028, 8357177, 8626208, 8774949, 8814097, 8769695, 8806473, 8882995, 8999261, 9108186, 9256925, 9403376, 9419002, 9419544, 9687490, 10159049, 10552622, 10861934, 11140441, 11411918, 11833408, 12543377, 13450234, 14469765, 15537320, 16480341, 17533869, 18644647]
3877A8644647J420244J918416K502267K590122L053722L953052O154208J0142045
3869E0378723J7257722K8848959M1427763M0666178J8206188j0862398k6916838
3862A59006297k8614473k4183443j8239523j3434850j0781363q920374p243957
3855D7588314o432279m785334l299939k342392j740029j181239p66611j73845
3847B6866646L95756N65360J81423m34633r29369j167748j177446p39045j87499
3838B3373445N47484J021466J238910P97120R4085o23469o14826m24509n4367
3829B5355339K95828O07282J275060J954904K681029L446502L917058L926693
3821D3459695L882453L979514M031730M053118L902084L496945K917902K137546
$$ y = [18644647, 20064891, 21983307, 24485574, 27075696, 30129418, 34082470, 40236678, 50378723, 67636445, 96485404, 137913167, 178579345, 196785533, 185923135, 159006297, 130391824, 106208381, 87968858, 74534008, 63752645, 54832271, 47588314, 41156035, 36370701, 33070762, 30728370, 28988341, 27807102, 27040491, 26866646, 27262402, 27827762, 28009185, 27574552, 26645183, 25477435, 24299989, 23560944, 23373445, 23920929, 24942395, 26181305, 26978425, 27072510, 26449041, 25834215, 25409706, 25355339, 25651167, 26258449, 27533509, 29488413, 32169442, 35615944, 39533002, 43459695, 47342148, 51321662, 55353392, 59406510, 63308594, 66805539, 69723441, 71860987]
3813G1860987J375388O91347M0283p31448j500979k271942l220283l970200m806420
3804E7466733n254811n284419n099811m540411m047659l579022l061188k456200
3796B4143212j993475j567399j311172j137103j091693q12269o77297m93537m26980
3787A4632287m01621l40305l28301l64403j65401j30159p5646p4709r7825j27169
3777A2526748j75190k22037r6950m1428m1404j3161p0293o1860N711k9792M2446
3766A1822790L4070J11845Q8655L4318L7620N1383J78711J12557J10108J06383
3756A2688440J7871J72656K21426K13761K32111K69010J36381K35240K68151K36405
3746A4691452M32297N18944M77141M69306M72060N97669O40366Q33607R56062
$$ y = [71860987, 73236375, 73927722, 73968005, 73236557, 71735578, 69463636, 66243353, 62273153, 57466733, 52211922, 46927503, 41827692, 37287281, 33239622, 29660600, 26599412, 24143212, 22149737, 20582338, 19271166, 18134063, 17042370, 16230101, 15552804, 15059267, 14632287, 14230666, 13890361, 13562060, 13197657, 13032256, 12902097, 12826451, 12751742, 12653917, 12526748, 12351558, 12129521, 12032571, 11991143, 11949739, 11936578, 11866285, 11804425, 11810136, 11780344, 11822790, 11856860, 11968705, 12057360, 12091678, 12129298, 12180681, 12359392, 12471949, 12582057, 12688440, 12706311, 12878967, 13100393, 13314154, 13546265, 13815275, 13951656, 14186896, 14455047, 14691452, 15123749, 15642693, 16119834, 16589140, 17061200, 17658869, 18299235, 19132842, 20088904]
3737B0088904R05517J068236J209213J269187J408694J562051J559322J504499
3729C0575623J399822J403868J335644J252855J136164J218394J042095R39046
3721D0303511R74960J029474J235592J478871J769836K087543K284948K610874
3713E3775609K639120K397124K117668J960554J669375J558157J593818J589104
3705F9300529J748154J760696J759355J701807J592469J639489J745231K055829
3697H3303559K182124K140036J987019J795785J841367K096639K580400L346595
3689A01273524M144864M813164N081359M782311L869343K680943J731013J130046
3681A29506567R94534R92053J172012J320805J466268J543253J578408J524432
$$ y = [20088904, 20994421, 22062657, 23271870, 24541057, 25949751, 27511802, 29071124, 30575623, 31975445, 33379313, 34714957, 35967812, 37103976, 38322370, 39364465, 40303511, 41278471, 42307945, 43543537, 45022408, 46792244, 48879787, 51164735, 53775609, 56414729, 58811853, 60929521, 62890075, 64559450, 66117607, 67711425, 69300529, 71048683, 72809379, 74568734, 76270541, 77863010, 79502499, 81247730, 83303559, 85485683, 87625719, 89612738, 91408523, 93249890, 95346529, 97926929, 101273524, 105418388, 110231552, 115312911, 120095222, 123964565, 126645508, 128376521, 129506567, 130501101, 131493154, 132665166, 133985971, 135452239, 136995492, 138573900, 140098332]
3673A40098332J546027J502386J375360J142526R63609P52973N67422O11703J040081
3664A49600419J755803K583191L877559N257754O622424P513321P940790P935115
3656A93086376P388271O267195N001289M298986M014708L741664L237099K718369
3648B29753957K306777J805082J277344N57890j08436o08328p08964n76023j47449
3639B33551850L36451O98840J038048J226155J058780P00445L60052K83j63752
3630B38807152l78320l15540o8311K67584Q62912J473477J829159J967157J904930
3621B46350200J224649J94944q57553j514122j960416j993194j965913k431539
3613B37047056l328881m169882m564963m617888m492550m779100n439454o057824
$$ y = [140098332, 141644359, 143146745, 144522105, 145664631, 146628240, 147381213, 147948635, 148560338, 149600419, 151356222, 153939413, 157816972, 163074726, 169697150, 177210471, 185151261, 193086376, 200474647, 206741842, 211743131, 216042117, 220056825, 223798489, 227035588, 229753957, 232060734, 233865816, 235143160, 235701050, 235592614, 234984286, 234275322, 233699299, 233551850, 233888301, 234587141, 235625189, 236851344, 237910124, 238610569, 238970621, 238970904, 238807152, 238428832, 238113292, 238044981, 238312565, 239175477, 240648954, 242478113, 244445270, 246350200, 247574849, 247769793, 246912240, 245398118, 243437702, 241444508, 239478595, 237047056, 233718175, 229548293, 224983330, 220365442, 215872892, 211093792, 205654338, 199596514]
3605A99596514o298542o141855n547672m670563l577882k572234j631703j045294
3597A68110769o23533l87980n20407o12319q67325j088396j253533j453404j503143
3588A59800729j583091j720087j913260k196251k320000k195641k076924j932260
3580A43863215k085901k560045l420976l971230m120301l976831l630867l235421
3572A16861643k827846k552539k491499k526220k458283k469787k428495k353238
3564I6753736k180599k052139k072389k101141k100323k157024k149844k109020
3556G9831257k067694j963064j973683k091438k213002k338834k467160k544209
3548F2172173k424569k224888k078114j838126j662083j470394j389477j391999
$$ y = [199596514, 193297972, 187156117, 181608445, 176937882, 173360000, 170787766, 169156063, 168110769, 167487236, 167099256, 166578849, 165966530, 165099205, 164010809, 162757276, 161303872, 159800729, 158217638, 156497551, 154584291, 152388040, 150068040, 147872399, 145795475, 143863215, 141777314, 139217269, 135796293, 131825063, 127704762, 123727931, 120097064, 116861643, 114033797, 111481258, 108989759, 106463539, 104005256, 101535469, 99106974, 96753736, 94573137, 92520998, 90448609, 88347468, 86247145, 84090121, 81940277, 79831257, 77763563, 75800499, 73826816, 71735378, 69522376, 67183542, 64716382, 62172173, 59747604, 57522716, 55444602, 53606476, 51944393, 50473999, 49084522, 47692523]
3540D7692523j294737j281317j295415j258810j222415j093867j215698j291413
3532C7738851j280211j389957j275164j139966j101921r99823j010901r64535
3524B8576373q77086p97826p42817p38990o54522n49568m35660n30814m26331
3515B2822759m33361n28763m54055n54528m84745m28938l70577l11813l67314
3506A8888665k30683k34600l44779k93518k59543k26554l01825k86068l12330
3497A6398765k66907k07196j49102q1822j92416j49017k27368k99686k52543j78580
3487A4394128k58905l29217k08170j22672j64780j70879j78726j4654K8819l1949
3477A2942995q1271o1566k9848n6900j19976j24595j01996J0736R7967L8189P7418
$$ y = [47692523, 46397786, 45116469, 43821054, 42562244, 41339829, 40245962, 39030264, 37738851, 36458640, 35068683, 33793519, 32653553, 31551632, 30551809, 29540908, 28576373, 27699287, 26901461, 26158644, 25419654, 24765132, 24215564, 23779904, 23249090, 22822759, 22389398, 21860635, 21406580, 20852052, 20367307, 19938369, 19567792, 19255979, 18888665, 18657982, 18423382, 18078603, 17785085, 17525542, 17298988, 16997163, 16711095, 16398765, 16131858, 15924662, 15775560, 15693738, 15501322, 15352305, 15124937, 14825251, 14572708, 14394128, 14135223, 13806006, 13597836, 13475164, 13310384, 13139505, 12960779, 12946125, 12974944, 12942995, 12861724, 12800158, 12770310, 12713410, 12593434, 12468839, 12366843, 12377579, 12475546, 12513735, 12591153]
3466A2591153L507p1492j38268j57087j15723j77097n4223k2473p688l9360n3694
3455A1757555K0805L7668J6186J14329N0160Q2961P3351L6933j3069J3786J06458
3444A2297123J06098R8151J46528M4055J21215K49213K08065J70536J29743J24724
3434A3695451P4168J02800R4220J43236P6375K27605J66100J39730J66626L10394
3424A5196705K61040K39075L17524L88679L59737N61391N90465O85219R07763
3415A9507598J037506J151742J303446J353125J416575J481089J521910J595224
3407C0368215J671562J714432J702244J654614J630654J677541J576893J605910
3399D3602065J619747J755973J754263J689225J666426J732289J849709J761893
$$ y = [12591153, 12594660, 12523168, 12384900, 12227813, 12112090, 11934993, 11880770, 11858297, 11850609, 11811249, 11757555, 11778360, 11816028, 11832214, 11946543, 11996703, 12079664, 12153015, 12189948, 12176879, 12190665, 12297123, 12403221, 12501372, 12647900, 12691955, 12813170, 13062383, 13270448, 13440984, 13570727, 13695451, 13769619, 13872419, 13966639, 14109875, 14186250, 14413855, 14579955, 14719685, 14886311, 15196705, 15457745, 15696820, 16014344, 16403023, 16762760, 17324151, 17914616, 18599835, 19507598, 20545104, 21696846, 23000292, 24353417, 25769992, 27251081, 28772991, 30368215, 32039777, 33754209, 35456453, 37111067, 38741721, 40419262, 41996155, 43602065, 45221812, 46977785, 48732048, 50421273, 52087699, 53819988, 55669697, 57431590]
3391E7431590J702191J550180J235854Q35848K64864l4428l50988o56052p52248
3382F1226811r14634j053701j154219j245918j166235j088250r44566q67311r64986
3373E1826991r57284j116262j281170j409337j566561j589423j615539j517170
3365D0774245j468003j334781j208053j082837r40843p22566o61163m84757k77880
3356C2593362j29877p1053o2202O9797J56796K48704L39511M12061N51518N80979
3346C4689596N73235N27423O34065O05970N30343M38472M36958M29287K63359
3337C9128708K34540L06972K86904K52047K92766J64604Q4070l7109k30229l62044
3327D0121229l52808m91724n03785n34476n28178n47849m64086l71896l78704
$$ y = [57431590, 59133781, 60683961, 61919815, 62755663, 63020527, 62986099, 62635111, 61979059, 61226811, 60312177, 59258476, 58104257, 56858339, 55692104, 54603854, 53659288, 52791977, 51826991, 50869707, 49753445, 48472275, 47062938, 45496377, 43906954, 42291415, 40774245, 39306242, 37971461, 36763408, 35680571, 34739728, 34017162, 33355999, 32871242, 32593362, 32463485, 32392432, 32330230, 32400027, 32556823, 32805527, 33145038, 33557099, 34108617, 34689596, 35262831, 35790254, 36424319, 37030289, 37560632, 37999104, 38436062, 38865349, 39128708, 39363248, 39670220, 39957124, 40209171, 40501937, 40666541, 40750611, 40713502, 40483273, 40121229, 39768421, 39276697, 38772912, 38238436, 37710258, 37162409, 36698323, 36326427, 35947723]
3318C5947723m52392m41160n12441o41153p00479p77033p65973o79968n34130
3309C0442994m71069k79101q1079O0712Q2456J82186K23296J71271L38026K60416
3299C0930108L30033N04030M66982L91143M33322N83942O38991N84280O73524
3290C5536355O30461N90077O87786O47086N22191K76773J37666J57521j0515l0909
3280C9144492p1089j81981j55043j81864k78226m31615n32065o51967o77382p83870
3270C5199390q29506r08253q07798q37870p65982p48281q49518p57082q12582
3261B7882518p37628o83439o16193n27591l56090j61204l280K36452L21191L43559
3251B5698295L82597L18748K95547L33953M02113O53417Q62304R26674J072940
$$ y = [35947723, 35495331, 35054171, 34541730, 33900577, 33200098, 32423065, 31657092, 30977124, 30442994, 29971925, 29692824, 29611745, 29672457, 29754913, 29937099, 30160395, 30331666, 30669692, 30930108, 31260141, 31764171, 32231153, 32622296, 33055618, 33639560, 34278551, 34862831, 35536355, 36166816, 36756893, 37444679, 38091765, 38613956, 38890729, 39028395, 39185916, 39175401, 39144492, 39073403, 38891422, 38736379, 38554515, 38276289, 37844674, 37312609, 36660642, 35983260, 35199390, 34369884, 33461631, 32653833, 31815963, 31049981, 30301700, 29452182, 28695100, 27882518, 27144890, 26461451, 25845258, 25317667, 24961577, 24800373, 24797093, 25033545, 25354736, 25698295, 26080892, 26399640, 26695187, 27029140, 27431253, 28084670, 28946974, 29873648, 30946588]
3242C0946588J203863J177145J160574J207522J201274J076587J110668J081250
3234D0165471Q75067Q19421O35913N45007L79450J37765o1096l20310m84307n73582
3224D2118799m82033l26820k29560r5925j39504j70893j39438l45059k66086l61504
3214C9561977l73137k62526j75474K0891l6020j13794j78564k24767m56700o49646
3204C7112240p07173p92370q73836q30530p66045n63742m75499k79853j98614
3195C1624578p7869J98119L23140M17458M23759M27839M52608L28104L91731L41333
3185C4850800L50632O13086P39732P60535Q07441P21403N80901M10897J87763
3176D0023190R2512l0184j40979k13949l99202m84577n16378n73269m78939l87186
$$ y = [30946588, 32150451, 33327596, 34488170, 35695692, 36896966, 37973553, 39084221, 40165471, 41040538, 41859959, 42495872, 43040879, 43420329, 43558094, 43496998, 43176688, 42692381, 42118799, 41636766, 41309946, 41080386, 40984461, 40844957, 40674064, 40534626, 40189567, 39923481, 39561977, 39188840, 38926314, 38750840, 38771731, 38735711, 38621917, 38443353, 38218586, 37761886, 37112240, 36405067, 35612697, 34738861, 33908331, 33142286, 32578544, 32103045, 31823192, 31624578, 31546709, 31744828, 32067968, 32485426, 32909185, 33337024, 33789632, 34117736, 34509467, 34850800, 35201432, 35814518, 36554250, 37314785, 38122226, 38843629, 39424530, 39835427, 40023190, 40115702, 40085518, 39944539, 39730590, 39331388, 38846811, 38330433, 37757164, 37278225, 36891039]
3166C6891039p8479J30281L25566O72844P30299O22975P03422Q48363Q32094Q59007
3156D2537411P50096O77745N56977L83333K15530J64945j22146m38405p15843
3147D4009643r89353j055283j113100j003473p83822n32062l05748N7892K52488
3138C8537182N79925O87870O46993M11526J80517k05300n38743r63620j205871
3129C8130479j348412j321844j223813j052197p83152o37180l96678m09044l37235
3120C0620924j57437j98637j27703j62332j04773j5380J04956L34001M10981N81344
3110C1285944Q23267R46806J096735J275947J460872J671057K023670K259707
3102D2844005K409499K433656K438416K428153K449097K343199K333721K486503
$$ y = [36891039, 36812560, 36942841, 37268407, 37941251, 38671550, 39294525, 39997947, 40846310, 41678404, 42537411, 43287507, 43965252, 44522229, 44905562, 45121092, 45286037, 45163891, 44725486, 44009643, 43020290, 41965007, 40851907, 39848434, 39064612, 38532550, 38226802, 38284694, 38537182, 39117107, 39804977, 40451970, 40863496, 41044013, 40838713, 40299970, 39336350, 38130479, 36782067, 35460223, 34236410, 33184213, 32401061, 31763881, 31367203, 30958159, 30620924, 30463487, 30264850, 30137147, 29974815, 29870042, 29854662, 29959618, 30293619, 30704600, 31285944, 32109211, 33056017, 34152752, 35428699, 36889571, 38560628, 40584298, 42844005, 45253504, 47687160, 50125576, 52553729, 55002826, 57346025, 59679746, 62166249]
3094F2166249K849460L158776L277917K925576J620950n25844k572520l817393
3086F9083171m286628l967433l399733k730527k310063j967291j674189j530908
3078D7216399j573756j591208j648652j709556j645038j544967j442835j406989
3070C4653398j326604j067950j115135j134945j079311j019788r32788q86411
3062B6090466p74177n78831l82405k14924k68325j60184o6181O3417J43069L04839
3052B4156764M54304M61979M31155K70011M9075m4645j46546j63752q8534q6038
3042B5293773j42008k06555k68491r3273j18646j95886j31767k1806O5883M6292
3032B4227516J51743K39735K84404M54122N13110M35298N66606O45666N82822
$$ y = [62166249, 65015709, 68174485, 71452402, 74377978, 75998928, 75473084, 72900564, 69083171, 64796543, 60829110, 57429377, 54698850, 52388787, 50421496, 48747307, 47216399, 45642643, 44051435, 42402783, 40693227, 39048189, 37503222, 36060387, 34653398, 33326794, 32258844, 31143709, 30008764, 28929453, 27909665, 26976877, 26090466, 25316289, 24737458, 24355053, 24140129, 23871804, 23711620, 23645439, 23708856, 23851925, 24156764, 24611068, 25073047, 25504202, 25774213, 25823288, 25778643, 25632097, 25468345, 25379811, 25293773, 25151765, 24945210, 24676719, 24583446, 24464800, 24268914, 24137147, 24115341, 24181224, 24227516, 24379259, 24618994, 24903398, 25357520, 25870630, 26305928, 26872534, 27518200, 28101022]
3023B8101022N69433O08535O28432O13081O12965M83246M24803M09477M66471
3014C2917465N64456M86974J35316k35256o32646q92588j078871j037403r02330
3005B9325117o74078n19575l37196n6541O4200K37201M82117N98005N44110P72243
2995C0435603P92757Q21974O15677M07602L60588J99173J95736K60767L87070
2986C4476947K41749J74574J75255R3253j1637j13863j95917k87036l90402l14028
2976C3848895j54931J33469M30907Q22341J585759K198487K454002J872551O28051
2967D3819531r16811k067313k437758k350917j902304j347033r20786o65511n29460
2958C0681638k01044k02625j62435n636j1293m8900p7506K6448K21887J96734
$$ y = [28101022, 28670455, 29278990, 29907422, 30520503, 31133468, 31616714, 32041517, 32450994, 32917465, 33481921, 33968895, 34104211, 33868955, 33236309, 32343721, 31264850, 30227447, 29325117, 28651039, 28131464, 27794268, 27737727, 27801927, 28039128, 28521245, 29119250, 29663360, 30435603, 31228360, 32050334, 32666011, 33073613, 33434201, 33633374, 33829110, 34089877, 34476947, 34718696, 34893270, 35068525, 35161778, 35150141, 35036278, 34840361, 34553325, 34162923, 33848895, 33693964, 33827433, 34258340, 35080681, 36666440, 38864927, 41318929, 43191480, 43819531, 42902720, 40835407, 38397649, 36046732, 34144428, 32797395, 31876609, 31211098, 30681638, 30480594, 30277969, 30115534, 30109898, 30098605, 30049705, 29972199, 29998647, 30220534, 30417268]
2948C0417268J60299J17600J41593J55150J36731J79205J58453P2576J41608K53919
2938C1934402M42427O49552J039600J422385J722881J982867K215349K455018
2930D3864481K397544K046385J631729J127836R15751R32879J320864J884196
2922E6121665K296548K212862J787210R14168n1078o89757q26764n66386k65979
2913F0932489j7568N1330j01852m92704n87689m62157j36404M39342R49763J548954
2903F2123504K116608K701084L513800M843876O795420R540787J3048416J6853405
2895A21536900J9787178J9748643J5012924O481630l107086j0613935j4477144
2888A54369110j4951408j3260489j0969408q482934o599059n011080l731506k508741
$$ y = [30417268, 30577567, 30695167, 30836760, 30991910, 31128641, 31307846, 31466299, 31538875, 31680483, 31934402, 32376829, 33026381, 34065981, 35488366, 37211247, 39194114, 41409463, 43864481, 46262025, 48308410, 49940139, 51067975, 51983726, 52916605, 54237469, 56121665, 58418213, 60631075, 62418285, 63332453, 63281375, 62591618, 61764854, 61198468, 60932489, 60914921, 60966251, 60864399, 60371695, 59784006, 59321849, 59185445, 59624787, 60574550, 62123504, 64240112, 66941196, 70454996, 75298872, 82094292, 91635079, 104683495, 121536900, 141324078, 161072721, 176085645, 182567275, 179460189, 168846254, 154369110, 139417702, 126157213, 115187805, 106704871, 100105812, 95094732, 91363226, 88854485]
2880H8854485j200044J92371J329945K332608K879303K944303L220498L509952
2872A04063421M205019N641538P740933J0699817J4595322J8789551K1633272
2865A87368873K2107931J9900579J4590443N729203n028265j4083268j9493841
2858B11091655k0838049j9237816j6187803j2570688q995460n695334l154344
2851A24412161j305961k07291K14011O2906l48717r20796j961196l136856m033354
2842A12774907m398530m144241l109501j488788K39295J994082L283785L734344
2834A08885353L064626J937309Q26912L52260P49103J982377L871485O204357
2826A27873782Q907150J2256251J5881261J9722782K3424690K5952456K6261087
$$ y = [88854485, 87654441, 87846812, 89176757, 91509365, 94388668, 97332971, 100553469, 104063421, 108268440, 113909978, 121650911, 132350728, 146946050, 165735601, 187368873, 209476804, 229377383, 243967826, 249697029, 244668764, 230585496, 211091655, 190253606, 171015790, 154827987, 142257299, 133261839, 127566505, 124412161, 123106200, 122898909, 123112920, 123175826, 122827109, 121906313, 119945117, 116808261, 112774907, 108376377, 104232136, 101122635, 99633847, 99873142, 101867224, 105151009, 108885353, 111949979, 113887288, 114714200, 115066460, 115815563, 117797940, 121669425, 127873782, 136780932, 149037183, 164918444, 184641226, 208065916, 234018372, 260279459]
2819B60279459K3457431J8215331J1980457N456769j570298r286765j6862795
2812B91669589k2754263k5626557k5808686k4021648k1171751j8158764j5374428
2805A38753492j2913673j0794995r223929p822180o592536n695279m940366m353482
2797G6417052l664841l216753k784247k297888j876268j555017j098193q32125
2789E9091720o80834n63623n85716l96865k69194j71791o7819j87422l63017p04291
2779E5101148q92617j136251j259399j062313r55786o65460l82850l1560R7042
2770D8811954M02333O79155R23910J040405P89630K26987k01288o05060p73573
2761E1294453q75182q57537r05822q08996o26052n19029l57588o6615J86971K59010
$$ y = [260279459, 283736890, 301952221, 313932678, 319389447, 317819149, 308532384, 291669589, 268915326, 243288769, 217480083, 193458435, 172286684, 154127920, 138753492, 125839819, 115044824, 105820895, 97998715, 91406179, 85710900, 80770534, 76417052, 72752211, 69535458, 66751211, 64453323, 62577055, 61022038, 59923845, 59091720, 58410886, 57847263, 57261547, 56864682, 56595488, 56423697, 56355878, 56168456, 55805439, 55101148, 54208531, 53072280, 51812881, 50750568, 49794782, 49129322, 48746472, 48714912, 48811954, 49214287, 49893442, 50817352, 51857757, 52647387, 52874374, 52673086, 52068026, 51294453, 50419271, 49561734, 48655912, 47846916, 47220864, 46701835, 46344247, 46277632, 46464603, 46723613]
2751D6723613L9655n86617j299959j740738j871985j791482j528555j294133j076484
2742C5573315p99776p86500o26737n05317l51368l36430k36971j11502k6824m4761
2732C1747129j25279j24228j16895j30547j13692l6633Q7316J34855K79497L24594
2722C1926117K54872K48016K22074J50405J44256K57826L55500O48047J118355
2713C5325468J557209K229467L264162M332461N744704O834717P315173O678380
2705G3281741M563193J618152j639866m267906n849656o539028o384537n782091
2697D9000002n069515m341012l621419l021370k434117j943739j621225j252290
2689B5695315j075960q98754p03360o07499m68896l88308k32962j84596n2383
$$ y = [46723613, 46763268, 46176651, 44876692, 43135954, 41263969, 39472487, 37943932, 36649799, 35573315, 34773539, 33987039, 33360302, 32854985, 32503617, 32167187, 31930216, 31818714, 31791890, 31747129, 31621850, 31497622, 31380727, 31250180, 31136488, 31099855, 31187171, 31322026, 31601523, 31926117, 32180989, 32429005, 32651079, 32801484, 32945740, 33203566, 33559066, 34207113, 35325468, 36882677, 39112144, 42376306, 46708767, 52453471, 59288188, 66603361, 73281741, 77844934, 79463086, 77823220, 73555314, 67705658, 61166630, 54782093, 49000002, 43930487, 39589475, 35968056, 32946686, 30512569, 28568830, 26947605, 25695315, 24619355, 23720601, 23017241, 22409742, 21940846, 21552538, 21319576, 21134980, 21082597]
2680B1082597L957R6777J78909K71908L33473L50836K95754J74204K01888J03407
2670B3093710J88581K92901M82582M93669O79620R18138J109682J306245J455532
2661C0020660J666695J836650K091461K394050K804146L369028M122998N090809
2653E3396497O499103Q193193J0577733J3034545J5021469J5946712J4912672
2646A37581924J1425706O149596N10735m182965o905990p328436n941944l224867
2638A28083759M68613M562578Q046919J0105744R704072O588336J154982m983397
2630A63731606j0280232j3707719j5182404j4906105j3663130j1995505j0307532
2623G3688979q673515p152743n766438m626106l793226k931845k129706j436579
$$ y = [21082597, 21086554, 21183331, 21362240, 21634148, 21967621, 22318457, 22614211, 22788415, 22990303, 23093710, 23282291, 23575192, 24057774, 24551443, 25231063, 26149201, 27258883, 28565128, 30020660, 31687355, 33524005, 35615466, 38009516, 40813662, 44182690, 48305688, 53396497, 59895600, 68088793, 78666526, 91701071, 106722540, 122669252, 137581924, 149007630, 155157226, 155667961, 151484996, 144579006, 137250570, 131308626, 128083759, 128552372, 133114950, 141161869, 151267613, 160971685, 167560021, 168715003, 163731606, 153451374, 139743655, 124561251, 109655146, 95992016, 83996511, 73688979, 65015464, 57862721, 52096283, 47470177, 43676951, 40745106, 38615400, 37178821]
2615C7178821q42232l25070K51199N05054L84865L7431o01077j351107j874153
2606C3363731k093350k290991k339454k115272j880597j698479j548502j361115
2598A8035971j163712r46533q59332q16223o08602o35350n76685n28026l79468
2589A1522040m32448l71216l79407l91454k15006j86041k49493j07094k27914
2580H961967j24715o7349j96817j87905k74604l15968k10456k93057k29812k16538
2570F844746k72754j41263j29787k12433k22950j82249j45190j07127j61901j39088
2560E130004k44816o5561j14620j73025n8980p5273j34208m4685l4534j45773
2550D038529j25205r4134r3038l2608q7250p2169m9188q4896M87K1580J5807Q3051
$$ y = [37178821, 36336589, 36011519, 36262718, 36767772, 37152637, 37190068, 36588991, 35237884, 33363731, 31270381, 28979390, 26639936, 24524664, 22644067, 20945588, 19397086, 18035971, 16872259, 15925726, 15066394, 14250171, 13641569, 13006219, 12429534, 11901508, 11522040, 11089592, 10718376, 10338969, 9947515, 9732509, 9546468, 9296975, 9189881, 8961967, 8837252, 8769903, 8573086, 8385181, 8110577, 7794609, 7584153, 7291096, 7061284, 6844746, 6571992, 6430729, 6300942, 6088509, 5865559, 5683310, 5538120, 5430993, 5269092, 5130004, 4885188, 4819627, 4705007, 4531982, 4473002, 4397729, 4263521, 4218836, 4184302, 4038529, 3913324, 3819190, 3726152, 3693544, 3606294, 3534125, 3484937, 3400041, 3400528, 3422108, 3437915, 3520966]
2538C520966J09284P0419k3807l7531M5540M8349q1714n7915j39194r0188j00987
2527C263222j87479k38829k12038n2175j76696j08260q3665j25948o9382o4590
2517A944160j02084p1218l7733p1504o9617p89n9574r073p0118l740j2489m8045
2505A388176m3060J9565m3029o3527j1216q0970J1267O1677q0210k4480o1998
2494A072195j19219j3655L9723k4102r9319j4441K135r9684j4862j0602m5360
2483F72809l3608K7629n5189m3267j3640o3179M815K5342p0525K4557J6121L94
2471D92259m7929m4779j2480o2388P4732r1730K946J2581p3592j6049K9342k977
2459B59936m8409j35135k0945J7651j9074K5185o3611J0746Q7805q3485o9478
$$ y = [3520966, 3630250, 3700669, 3676862, 3639331, 3684871, 3733220, 3651506, 3593591, 3454397, 3364209, 3263222, 3075743, 2836914, 2624876, 2572701, 2396005, 2287745, 2204080, 2078132, 2008750, 1944160, 1842076, 1770858, 1733125, 1661621, 1592004, 1591215, 1531641, 1522568, 1452450, 1448710, 1436221, 1388176, 1345116, 1364681, 1321652, 1258125, 1246909, 1165939, 1177206, 1238883, 1158673, 1134193, 1072195, 952976, 939321, 979044, 954942, 855623, 841182, 843317, 743633, 728771, 718169, 672809, 639201, 666830, 611641, 568374, 554734, 491555, 496370, 521712, 451187, 475744, 491865, 492259, 444330, 399551, 387071, 324683, 399415, 307685, 310631, 323212, 249620, 233571, 262913, 259936, 211527, 76392, 55447, 73098, 54024, 79209, 15598, 26344, 114149, 30664, -38814]
2448c8814O1943j817k9348q5036m3340q3k1101J04344l1395k1223l1227l9416
2436a76513J5585N6340j1827l1919L553o9944k5828J33573m0053J534N6901k8629
2424a17227p2290r3931J14872J05550o911q7250O36J3630n5447m9419m0695j5782
2412c04264l9454q2622q5201J9744J1624M4948m5458m3870J2330k4081J61l430
2400e39573J1161J081K6028n9040K973k6871j0292j8424J8717k8032M1718L7330
2388e43224k3819q9682r627J03327N706l0593N359k7823o723Q727L6661m228l4507
2375f10446L2527n2061j1382L8036n10P5257J3209m916J08715K2191j060J9276
2363c71164Q2931M8619J4844L4614L9618p750K5240m1969K0915L0597k2426l5285
$$ y = [-38814, 23129, 21312, -8036, -93072, -136412, -136495, -157596, -53252, -84647, -105870, -137097, -176513, -160928, -104588, -116415, -148334, -144781, -214725, -240553, -106980, -147033, -145499, -88598, -117227, -189517, -283448, -168576, -63026, -69937, -157187, -156551, -142921, -198368, -247787, -288482, -304264, -343718, -426340, -511541, -491797, -480173, -435225, -480683, -524553, -512223, -536304, -536143, -539573, -528412, -527331, -501303, -560343, -557370, -584241, -594533, -612957, -594240, -622272, -580554, -543224, -567043, -656725, -666352, -563025, -557319, -587912, -582553, -610376, -617099, -608372, -571711, -575939, -610446, -577919, -629980, -641362, -603326, -603836, -528579, -515370, -520286, -411571, -389380, -390440, -371164, -288233, -239614, -224770, -190156, -150538, -158288, -133048, -175017, -154102, -123505, -145931, -181216]
2351a81216M5954P6732M2205n7374m7253j03051m8973n9480m1886j21879o0602
2340e56823n2312j1698l5081m9660l631l7132l4620K9808o6933M783M7407m3876
2328h09768K508n2431J7203P3765o5073j7255J989n0404j1952j3071m4526o9583
2316a038598L9619k8588K6398o3094j3355J5587L8151m1197R0883m8732o1648
2305a084574K9945R80l3728j801L4956K4746o5478k2294k7610M4484R382K1758
2293a069234o419n7164m0367n1188l280M9334L6810l3257K0760J4487k7860r139
2281a176517O1963q6625k4857N4285j2798m2128k4140Q3449J02405o810l1637
2270a103410k1741m5788p378K9260K659k8577L943k9646K3285N374K4103J5852
$$ y = [-181216, -135262, -58530, -16325, -73699, -120952, -224003, -272976, -332456, -374342, -496221, -556823, -609135, -620833, -655914, -705574, -709205, -746337, -780957, -751149, -818082, -813299, -765892, -809768, -807260, -859691, -842488, -768723, -833796, -851051, -849062, -899466, -911418, -924489, -969015, -1038598, -998979, -1027567, -1001169, -1064263, -1077618, -1062031, -1023880, -1065077, -974194, -1022926, -1084574, -1054629, -1053649, -1087377, -1089178, -1054222, -1029476, -1094954, -1117248, -1144858, -1100374, -1090992, -1069234, -1075653, -1132817, -1173184, -1224372, -1227652, -1178318, -1141508, -1174765, -1154005, -1139518, -1167378, -1176517, -1114554, -1201179, -1226036, -1171751, -1184549, -1226677, -1250817, -1167368, -1064963, -1071773, -1103410, -1125151, -1170939, -1178317, -1149057, -1146398, -1174975, -1171032, -1200678, -1177393, -1172019, -1147916, -1132064]
2258a132064q1299j2272N6244o5749m5544M4977L4701m3632l5460N7221J7717
2247a205160K5496j0301J3017J6179k7570m111K8909m0821r358N0592p14o571
2235a170413m032Q493j0019m356k3181l3084m6817L7537K0192J03865K1008N8817
2223a041990P4862o5425n5319O7042N5346o7015J8574r184n0483n4608n8383p7994
2211a264577M6631k366L6806q3223p3470J8554N6163L2432J3811k2198q9601M0728
2199a290310l2252N535K8826j5715J1190l5526M8987n6280M459K0411O5715j0397
2187a255357l4370N5382o0921m1345L8200l6016N960K644m5723O2960k327K637
2175a308276O8810r9332k1815M2705o5503l9535j92Q0220j9191k5154N3768j0813
$$ y = [-1132064, -1213363, -1225635, -1169391, -1235140, -1280684, -1235707, -1201006, -1244638, -1280098, -1222877, -1205160, -1179664, -1189965, -1176948, -1160769, -1188339, -1192450, -1163541, -1204362, -1213720, -1163128, -1163842, -1170413, -1174445, -1165952, -1175971, -1180327, -1203508, -1236592, -1283409, -1245872, -1225680, -1121815, -1100807, -1041990, -967128, -1032553, -1087872, -1020830, -965484, -1032499, -1013925, -1023109, -1073592, -1128200, -1186583, -1264577, -1217946, -1220312, -1183506, -1266729, -1340199, -1321645, -1265482, -1233050, -1219239, -1241437, -1331038, -1290310, -1322562, -1317027, -1288201, -1303916, -1292726, -1328252, -1279265, -1335545, -1331086, -1310675, -1244960, -1255357, -1289727, -1234345, -1295266, -1336611, -1298411, -1334427, -1328467, -1325823, -1371546, -1308586, -1310913, -1308276, -1239466, -1338798, -1360613, -1317908, -1383411, -1422946, -1423138, -1342918, -1362109, -1387263, -1333495, -1344308]
2163a344308J1872M5536P1020l4341l7793O682l1076n2044L1950J6961L3571l4828
2151a316798k9552O121l7931k1992K2111K0654K8731o3806l9184M8143m670l3115
2139a421288j1148J5348L4269K8377r9333n637R4430j5283j03899j6612M9344
2128a451432O501M7668m757k173o629O2204m672n0730o0952j2108N4593L6691
2116a385796J4132j14149Q723M7979m4477K0984P9519l1618j7814R363k8351k3075
2104a464580M508K396M874J4102L0661l2610J90m9613L0861J4405O7407q9888
2092a467287R516J1155N3960K3128n0748n8056J1296M0185J0628j6177L6445k6103
2080a422058j5662j3238M0188P2604n697n5979k739k6717q2083M3871N2645L0610
$$ y = [-1344308, -1332436, -1286900, -1215880, -1250221, -1288014, -1281332, -1312408, -1364452, -1332502, -1315541, -1281970, -1316798, -1346350, -1340229, -1378160, -1400152, -1378041, -1357387, -1328656, -1392462, -1431646, -1383503, -1388173, -1421288, -1432436, -1417088, -1382819, -1354442, -1453775, -1459412, -1364982, -1380265, -1484164, -1500776, -1451432, -1444931, -1397263, -1402020, -1404193, -1410822, -1348618, -1353290, -1404020, -1464972, -1477080, -1422487, -1385796, -1371664, -1485813, -1477090, -1429111, -1473588, -1452604, -1373085, -1404703, -1422517, -1413154, -1441505, -1464580, -1460072, -1457676, -1452802, -1438700, -1408039, -1440649, -1440459, -1490072, -1459211, -1444806, -1377399, -1467287, -1457771, -1446616, -1392656, -1369528, -1420276, -1478332, -1467036, -1426851, -1416223, -1432400, -1395955, -1422058, -1437720, -1450958, -1410770, -1338166, -1343863, -1399842, -1402581, -1429298, -1511381, -1467510, -1414865, -1384255]
2068a384255m869r0018m8432N0414Q2075J1176K5723N5428q7214n3255O3816K3075
2056a356336j7317L2682l1900o1085K8306j0584p176O3355K6699N868j2509O699
2044a333298J61M8400n5805L1534J7067l5622J4492J5784p448j7141p560N7412
2032a272024O5401m275m5169K4305m7259K8514M7372k9308k4651J230J087O331
2020a248446p047m2822m5213P2778O5919q775L2817J7116o9794M3480l1559l8360
2008a259906K3892K0775o041O5492o8362q1963Q0151M4533l826J04316l2657j7666
1996a131262j3709J7525N1575R4785M8084K0413P017k7233L7813Q244N4368J27185
1984g05195J3382r5633L6664J54650Q032M7673J33532Q0270N5220J15124J70437
$$ y = [-1384255, -1389124, -1479142, -1527574, -1477160, -1395085, -1383909, -1358186, -1302758, -1389972, -1443227, -1379411, -1356336, -1373653, -1340971, -1372871, -1433956, -1405650, -1416234, -1423410, -1360055, -1333356, -1327488, -1339997, -1333298, -1333137, -1284737, -1340542, -1309008, -1291941, -1327563, -1313071, -1297287, -1304735, -1321876, -1329436, -1272024, -1206623, -1210898, -1256067, -1231762, -1279021, -1250507, -1203135, -1232443, -1257094, -1255864, -1254777, -1248446, -1255493, -1298315, -1343528, -1270750, -1204831, -1213606, -1180789, -1163673, -1233467, -1189987, -1221546, -1259906, -1236014, -1215239, -1221280, -1155788, -1224150, -1306113, -1225962, -1181429, -1185255, -1080939, -1113596, -1131262, -1144971, -1127446, -1075871, -981086, -933002, -912589, -905572, -932805, -894992, -886748, -832380, -705195, -691813, -787446, -750782, -596132, -588100, -540427, -406895, -326625, -271405, -156281, 14156]
1973A4156K15742L83978M76156M16952J88246K7995R2549K03001L49734M40265
1963B808774N05320Q11129R73909J608734K710595M780516P532952R954370P858641
1954C9544940J526412m605942o436693o281291n431041m070337l239921k564266
1946H441861j934722j448333j214461p90941n06710q3577o0520k85777l89156
1937A727664m10574l91727j81783j68120k23805j37287n5745j99160j49538j02011
1927b92086j5806l4332k4407k0077j29533j15868j31731k5244J17147m6437k6336
1916g44710M0694l5850r7861o8217p339k5501k6818L6250r671L74j3407p5925
1904a027981K2625m7665J6703q50p4648L763L2293m7953n2072q1920K863L5172
$$ y = [14156, 229898, 613876, 1090032, 1506984, 1695230, 1723225, 1815774, 2018775, 2368509, 2808774, 3314094, 4125223, 5099132, 6707866, 9418461, 14198977, 21731929, 31686299, 39544940, 41071352, 36465410, 30028717, 23747426, 18316385, 14246048, 11006127, 8441861, 6507139, 5058806, 3844345, 3053404, 2546694, 2463117, 2402597, 2116820, 1727664, 1317090, 925363, 743580, 575460, 351655, 214368, 158623, -40537, -190075, -292086, -307892, -342224, -366631, -386708, -516241, -632109, -763840, -789084, -671937, -718374, -744710, -704016, -739866, -837727, -905944, -913283, -938784, -965602, -929352, -939023, -938649, -952056, -1027981, -1005356, -1053021, -1036318, -1037168, -1111816, -1108053, -1075760, -1123713, -1175785, -1257705, -1254842, -1219670]
1892a219670k5664l7742O7787R663j8997J9981m4640m9924l637k6269K458j4504
1880a341158q2383J0296O4824L7679l2744m0139m9773J1137o495P5862l2593J5318
1868a370169m7584J1698o5936O435j7777N2365Q4268k6157K2049J9489p8065r6445
1856a505829l0733O9011m345o6736k0077J7584M6336L4904m1686l7560N0499L9031
1844a449601n3364m7772j8124M234m8372l314P6113L4515k6401L8874M019l5549
1832a524742m4404L032q149N700J03368p9072K9521n4494p4117m4368O7552l346
1820a623519k3181M4151l4113j5786O1491J8824p258L4080k6626j0320O3194m6164
1808a565227p3671L5240L1419l8531K2720o7176M228O6658K8199l1254j5810K8150
$$ y = [-1219670, -1245334, -1283076, -1215289, -1205626, -1224623, -1204642, -1249282, -1299206, -1302843, -1329112, -1326654, -1341158, -1423541, -1413245, -1348421, -1310742, -1343486, -1383625, -1433398, -1422261, -1428756, -1352894, -1385487, -1370169, -1417753, -1406055, -1471991, -1465556, -1483333, -1430968, -1346700, -1372857, -1350808, -1331319, -1409384, -1505829, -1536562, -1467551, -1471896, -1538632, -1558709, -1541125, -1494789, -1459885, -1501571, -1539131, -1488632, -1449601, -1502965, -1550737, -1568861, -1564627, -1612999, -1616313, -1540200, -1505685, -1532086, -1493212, -1489193, -1524742, -1569146, -1566114, -1574263, -1568563, -1465195, -1544267, -1514746, -1569240, -1643357, -1687725, -1620173, -1623519, -1646700, -1602549, -1636662, -1652448, -1590957, -1572133, -1579391, -1545311, -1571937, -1582257, -1519063, -1565227, -1638898, -1603658, -1572239, -1610770, -1588050, -1655226, -1650998, -1584340, -1556141, -1587395, -1603205, -1575055]
1796a575055Q670k960k0434K0062j2387n8m2306j42802N934O5421Q2897M0759
1784a572259j2495m2122P102l1304k4070n3137k1594P1473o023l5659R541J9570
1772a690977Q3053K517N218k3898n5068Q03L6638m149K5878n1235j8858L3985
1760a656093k7824K8480K3937l1451M868l181m7350L801M4063q5739P7467N2233
1748a616789K0892L5690j46645m6677J5450O5572j2335J1986q878k1276k5463
1737a728473O2979M1620n873k8055L1851j3392n2038K5863n0023n516r787n4714
1725a785558j2352K1943N5417l7358K9502l500J6338J3120o4163n2614L6494M3975
1713a738756J04n3036M2782J0434k0546J3230N6939N696k4599j02035K3164J9864
$$ y = [-1575055, -1566385, -1569345, -1589779, -1569717, -1582104, -1582162, -1624468, -1767270, -1761336, -1695915, -1613018, -1572259, -1584754, -1626876, -1619774, -1651078, -1675148, -1728285, -1749879, -1678406, -1684429, -1720088, -1710547, -1690977, -1607924, -1605407, -1600189, -1624087, -1679155, -1678352, -1641714, -1645863, -1619985, -1671220, -1690078, -1656093, -1683917, -1655437, -1631500, -1662951, -1658083, -1661264, -1708614, -1704813, -1660750, -1746489, -1669022, -1616789, -1595897, -1560207, -1706852, -1753529, -1738079, -1672507, -1684842, -1672856, -1681734, -1703010, -1728473, -1665494, -1623874, -1629747, -1657802, -1625951, -1639343, -1691381, -1665518, -1715541, -1721057, -1730844, -1785558, -1797910, -1775967, -1720550, -1757908, -1728406, -1731906, -1715568, -1702448, -1766611, -1819225, -1782731, -1738756, -1738652, -1791688, -1748906, -1738472, -1759018, -1745788, -1688849, -1683153, -1707752, -1809787, -1786623, -1766759]
1701a766759L9009n9093J6948L9196j3783k1087p455J13521n0582L6910M8510
$$ y = [-1766759, -1727750, -1786843, -1769895, -1730699, -1744482, -1765569, -1773024, -1659503, -1710085, -1673175, -1624665]
$$ [...]
##END NTUPLES=NMR SPECTRUM
##END=
