##TITLE=1H_DE-80H_X3
 200.13MHz, d2o
 8 sc
 
 19ns.26.2.2025
##JCAMPDX= 6.0         $$ Bruker NMR JCAMP-DX V2.0
##DATA TYPE= NMR SPECTRUM
##DATA CLASS= NTUPLES
##ORIGIN= UXNMR, Bruker Analytische Messtechnik GmbH
##OWNER= pz
$$ XWIN-NMR		Version 3.5
$$ Wed Apr 15 10:10:14 2026 Russian Standard Time (UT+4h)  Yarkov@DPX200
##.OBSERVE FREQUENCY= 200.1313
##.OBSERVE NUCLEUS= ^1H
##.ACQUISITION MODE= SIMULTANEOUS
##.ACQUISITION SCHEME= undefined
##.AVERAGES= 8
##.DIGITISER RES= 18
##SPECTROMETER/DATA SYSTEM= spect
##.PULSE SEQUENCE= zg30
##.SOLVENT NAME= CDCl3
##.SHIFT REFERENCE= (INTERNAL, CDCl3, 0, 15.51)
##AUDIT TRAIL= $$ (NUMBER, WHEN, WHO, WHERE, WHAT)
$$ ##TITLE= Audit trail, XWIN-NMR		Version 3.5
$$ ##JCAMPDX= 5.01
$$ ##ORIGIN= Bruker BioSpin GmbH
$$ ##OWNER= Yarkov
$$ C:/Bruker/XWIN-NMR/data/yarkov2/nmr/H-C/1/pdata/1/auditp.txt
$$ ##AUDIT TRAIL=  $$ (NUMBER, WHEN, WHO, WHERE, WHAT)
(   1,<2026-04-15 10:09:23.37 +0400>,<Yarkov>,<DPX200>,
      <created by zg, POWCHK disabled, PULCHK disabled
       configuration hash MD5:
       00 E9 B6 7A A2 85 ED C7 34 08 36 98 17 FE 4E 26
       data hash MD5: 16K
       22 76 4D 6A D1 E0 F4 6C D1 7C 7D 88 5F DD B2 44>)
(   2,<2026-04-15 10:09:27.53 +0400>,<Yarkov>,<DPX200>,
      <Start of raw data processing
       efp BC_mod = 2 LB = 0.25 FT_mod = 6 PKNL = 1 PHC0 = -5301.948 PHC1 = 6.821927 SI = 16K 
       data hash MD5: 16K
       DD BD 0A 65 AB 2D 39 5F 63 D0 F9 67 03 03 5D C4>)
$$ ##END=
$$ 
$$ hash MD5
$$ AC 56 7F 78 05 93 9F BD EB 5D B4 B9 82 29 C7 74
##$RELAX= 
##$RELAX= 
##$RELAX= 
##$RELAX= 
##$RELAX= 
##$RELAX= 
$$ Bruker specific parameters
$$ --------------------------
##$DU= <C:/Bruker/XWIN-NMR>
##$EXPNO= 1
##$NAME= <H-C>
##$PROCNO= 1
##$TYPE= <nmr>
##$USER= <yarkov2>
##$AMP= (0..31)
100 100 100 100 100 100 100 100 100 100 100 100 100 100 100 100 100 100 
100 100 100 100 100 100 100 100 100 100 100 100 100 100 
##$AQSEQ= 0
##$AQ_mod= 1
##$AUNM= <au_zg>
##$AUTOPOS= <>
##$BF1= 200.13
##$BF2= 200.13
##$BF3= 200.13
##$BF4= 200.13
##$BF5= 200.13
##$BF6= 200.13
##$BF7= 200.13
##$BF8= 200.13
##$BYTORDA= 1
##$CFDGTYP= 0
##$CFRGTYP= 5
##$CHEMSTR= <none>
##$CNST= (0..31)
1 1 145 1 1 1 1 1 1 1 1 1 1 1 1 1 1 1 1 1 1 1 1 1 1 1 1 1 1 1 1 1 
##$CPDPRG= <>
##$CPDPRG1= <>
##$CPDPRG2= <>
##$CPDPRG3= <>
##$CPDPRG4= <mlev>
##$CPDPRG5= <mlev>
##$CPDPRG6= <mlev>
##$CPDPRG7= <mlev>
##$CPDPRG8= <mlev>
##$CPDPRGB= <>
##$CPDPRGT= <>
##$D= (0..31)
0 0.7 0 0 0 0 0 0 0 0 0 0.03 0 0 0 0 0 0 0 0 0 0 0 0 0 0 0 0 0 0 0 0 
##$DATE= 1776233362
##$DBL= (0..7)
120 120 120 120 120 120 120 120 
##$DBP= (0..7)
150 150 150 150 150 150 150 150 
##$DBP07= 0
##$DBPNAM0= <>
##$DBPNAM1= <>
##$DBPNAM2= <>
##$DBPNAM3= <>
##$DBPNAM4= <>
##$DBPNAM5= <>
##$DBPNAM6= <>
##$DBPNAM7= <>
##$DBPOAL= (0..7)
0.5 0.5 0.5 0.5 0.5 0.5 0.5 0.5 
##$DBPOFFS= (0..7)
0 0 0 0 0 0 0 0 
##$DE= 6
##$DECBNUC= <off>
##$DECIM= 32
##$DECNUC= <off>
##$DECSTAT= 4
##$DIGMOD= 1
##$DIGTYP= 9
##$DL= (0..7)
0 120 120 120 120 120 120 120 
##$DP= (0..7)
$$ [...]
##$SUBNAM2= <"">
##$SUBNAM3= <"">
##$SUBNAM4= <"">
##$SUBNAM5= <"">
##$SUBNAM6= <"">
##$SUBNAM7= <"">
##$SUBNAM8= <"">
##$SUBNAM9= <"">
##$SW= 18.0517328524113
##$SWIBOX= (0..15)
0 0 2 0 0 0 0 0 0 0 0 0 0 0 0 0 
##$SW_h= 3612.71676300578
##$TD= 16384
##$TD0= 1
##$TE= 0
##$TE2= 300
##$TE3= 300
##$TEG= 300
##$TL= (0..7)
0 120 120 120 120 120 120 120 
##$TP= (0..7)
150 150 150 150 150 150 150 150 
##$TP07= 0
##$TPNAME0= <>
##$TPNAME1= <>
##$TPNAME2= <>
##$TPNAME3= <>
##$TPNAME4= <>
##$TPNAME5= <>
##$TPNAME6= <>
##$TPNAME7= <>
##$TPOAL= (0..7)
0.5 0.5 0.5 0.5 0.5 0.5 0.5 0.5 
##$TPOFFS= (0..7)
0 0 0 0 0 0 0 0 
##$TUNHIN= 0
##$TUNHOUT= 0
##$TUNXOUT= 0
##$USERA1= <user>
##$USERA2= <user>
##$USERA3= <user>
##$USERA4= <user>
##$USERA5= <user>
##$V9= 5
##$VALIST= <valist>
##$VCLIST= <CCCCCCCCCCCCCCC>
##$VD= 0
##$VDLIST= <DDDDDDDDDDDDDDD>
##$VPLIST= <PPPPPPPPPPPPPPP>
##$VTLIST= <TTTTTTTTTTTTTTT>
##$WBST= 1024
##$WBSW= 4
##$XGAIN= (0..3)
0 0 0 0 
##$XL= 0
##$YL= 0
##$YMAX_a= 473631
##$YMIN_a= -483001
##$ZGOPTNS= <>
##$ZL1= 120
##$ZL2= 120
##$ZL3= 120
##$ZL4= 120
##$ABSF1= 0
##$ABSF2= 0
##$ABSG= 0
##$ABSL= 0
##$ALPHA= 0
##$AQORDER= 0
##$ASSFAC= 0
##$ASSFACI= 0
##$ASSFACX= 0
##$ASSWID= 0
##$AUNMP= <proc_1d>
##$AZFE= 0.1
##$AZFW= 0.1
##$BCFW= 0
##$BC_mod= 2
##$BYTORDP= 0
##$COROFFS= 0
##$CY= -3
##$DATMOD= 1
##$DC= 0
##$DFILT= <>
##$DTYPP= 0
##$F1P= 0
##$F2P= 0
##$FCOR= 1
##$FTSIZE= 16384
##$FT_mod= 6
##$GAMMA= 0
##$GB= 0
##$INTBC= 1
##$INTSCL= 3.241238e-09
##$ISEN= 128
##$LB= 0.25
##$LEV0= 0
##$LPBIN= 0
##$MAXI= 10000
##$MC2= 0
##$MEAN= 0
##$ME_mod= 0
##$MI= 1.114404
##$NCOEF= 0
##$NC_proc= -6
##$NLEV= 6
##$NOISF1= 3.799351
##$NOISF2= 2.8
##$NSP= 0
##$NTH_PI= 0
##$NZP= 0
##$OFFSET= 15.51
##$PC= 1
##$PHC0= -5301.948
##$PHC1= 6.821927
##$PH_mod= 1
##$PKNL= yes
##$PPARMOD= 0
##$PSCAL= 0
##$PSIGN= 0
##$REVERSE= no
##$SF= 200.130002342062
##$SI= 16384
##$SIGF1= 3
##$SIGF2= 2
##$SINO= 0.751879
##$SIOLD= 32768
##$SREGLST= <19F.Aceton>
##$SSB= 0
##$STSI= 16384
##$STSR= 0
##$SW_p= 3612.71676300578
##$SYMM= 0
##$S_DEV= 0
##$TDeff= 16384
##$TDoff= 0
##$TI= <>
##$TILT= no
##$TM1= 0
##$TM2= 0
##$TOPLEV= 0
##$USERP1= <user>
##$USERP2= <user>
##$USERP3= <user>
##$USERP4= <user>
##$USERP5= <user>
##$WDW= 1
##$XDIM= 16384
##$YMAX_p= 489479114
##$YMIN_p= -992437
$$ End of Bruker specific parameters
$$ ---------------------------------
##NTUPLES= NMR SPECTRUM
##VAR_NAME=  FREQUENCY,     SPECTRUM/REAL,   SPECTRUM/IMAG
##SYMBOL=    X,             R,               I
##VAR_TYPE=  INDEPENDENT,   DEPENDENT,       DEPENDENT
##VAR_FORM=  AFFN,          ASDF,            ASDF
##VAR_DIM=   16384,         16384,           16384
##UNITS=     HZ,            ARBITRARY UNITS, ARBITRARY UNITS
##FACTOR=    0.220516191357247, 1,           1
##FIRST=     3104.0163821315, 0,             0
##LAST=      -508.700380874276, 0,           0
##MIN=       -508.700380874276, -992437,     0
##MAX=       3104.0163821315, 489479114,     0
$$ Real data points
##PAGE= N=1
##DATA TABLE= (X++(R..R)), XYDATA
$$ [...]
6060A249056J24806O1387j11596J14216k13411O4949O5152k4268R6520M5713K2387
6049A494911K5328l2260n7309R1422k1530M9282l7458o6317K3238Q3027N1875
6038A604209q3159J31830M0047O6420J11833q1813K16726k5374L3245R9457k5735
6027B087686J98159k8117m439j17501j88710p190l8735N6473O3500j6470j43032
6016A861624Q0933l586l2997Q5146k44972J03027K0858j64868K35509j37668O2142
6005A865148p236n3278R4512J3415q2916J58225n2495n2911K06677j28281K80976
5994B241836P3906o6296K05152j41839J92347K04245J13826J93265M1053M2741
5984C100236J85490P959K5784J24475r7177J5230n7184j01423J31951L0142O4639
$$ plain form
6060 1249056 1373862 1435249 1323653 1437869 1224458 1289407 1354559 1330291 1426811 1472524 1494911
6049 1494911 1520239 1487979 1430670 1522092 1500562 1549844 1512386 1446069 1469307 1552334 1604209
6038 1604209 1521050 1652880 1692927 1759347 1871180 1789367 2006093 1980719 2013964 2113421 2087686
6027 2087686 2285845 2257728 2253289 2135788 1947078 1939888 1901153 1957626 2021126 2004656 1861624
6016 1861624 1942557 1938971 1905974 1991120 1746148 1849175 1870033 1705165 1940674 1803006 1865148
6005 1865148 1857912 1804634 1899146 1912561 1829645 1987870 1935375 1882464 2089141 1960860 2241836
5994 2241836 2315742 2249446 2454598 2312759 2505106 2709351 2823177 3016442 3057495 3100236
5984 3100236 3285726 3293685 3319469 3443944 3346767 3361997 3304813 3203390 3335341 3365483 3430122
5973C430122k7840k15106l0126j19895M5715q3323p4194N0582l0639J66786K00477
5962C312559J47508R7824k8456r3828k9970M4959j38089n432l9782M8456J444
5951C317193J60365K19052r0882J3152k43143j34210o0774j33422n1595j26269
5941B869467j37852o6547m910j15262M2737p7901j46104M4058j83374J45288l2192
5930B337408J2803J44007k97553J94187j02279j5878J41828j80986R8340p7535
5920B254342j27769K8263O726p7334P533J0409k02371J88906k04533O7701k5665
5909A926208k13039J46416k69679J76809M4561j4995J71057k81992R0896J5769
5899A792011j8571J22774J990p7681k3844R4540m4683K04735j28847J3302J26468
$$ plain form
5973 3430122 3402282 3187176 3157050 3037155 3082870 2999547 2925353 2975935 2945296 3112082 3312559
5962 3312559 3460067 3557891 3529435 3435607 3405637 3450596 3312507 3307075 3267293 3315749 3317193
5951 3317193 3477558 3696610 3605728 3618880 3375737 3241527 3180753 3047331 2995736 2869467
5941 2869467 2731615 2665068 2660158 2544896 2587633 2509732 2363628 2407686 2224312 2369600 2337408
5930 2337408 2350211 2494218 2196665 2390852 2288573 2272695 2414523 2233537 2331877 2254342
5920 2254342 2126573 2154836 2161562 2084228 2091761 2102170 1899799 2088705 1884172 1951873 1926208
5909 1926208 1713169 1859585 1589906 1766715 1811276 1796281 1967338 1685346 1776242 1792011
5899 1792011 1773440 1896214 1898204 1820523 1796679 1891219 1846536 2051271 1922424 1935726 2062194
5888B062194j81541J59729q4872J15024N3344j45651J19361j87048J60782J2077
5878B083399K0479O3251j08885k8192j07787K42703o3079j6050M5622k07771J18899
5867B042589l0981P3889N869n816J2682k3517O1561j41273Q8746n3837n7066Q3485
5855B056331n8656O7295N7009j4563j3632p303N3970J10596p8070j36225L7797
5844B074549o4658J11420P7899m5831Q8575j22513M7008m9625j18310J21588N7976
5833B178078L9562N6315p3445l0648O6666p9966J120L0871k08229M5737M0630
5822B066691o0684K0848Q6401P1792l5490L9605j0362p6300M7012M1648q3819
5811B107342L621J3004k10723Q6772o8303j86539P1819j43449o7075m0255K4828
$$ plain form
5888 2062194 1880653 2040382 1955510 2070534 2123878 1978227 2097588 1910540 2071322 2083399
5878 2083399 2103878 2167129 2058244 2030052 1922265 2164968 2101889 2085839 2131461 1923690 2042589
5867 2042589 2011608 2085497 2091366 2085550 2098232 2074715 2136276 1995003 2083749 2029912 1972846 2056331
5855 2056331 1997675 2064970 2121979 2107416 2093784 2086481 2140451 2251047 2172977 2036752 2074549
5844 2074549 2009891 2121311 2199210 2153379 2241954 2119441 2166449 2116824 1998514 2120102 2178078
5833 2178078 2217640 2273955 2200510 2169862 2236528 2156562 2157682 2188553 1980324 2026061 2066691
5822 2066691 2006007 2026855 2113256 2185048 2149558 2189163 2178801 2102501 2149513 2191161 2107342
5811 2107342 2110963 2123967 1913244 2000016 1931713 1745174 1816993 1673544 1606469 1566214 1591042
5800A591042j09411M2485r7863L5858J06928j11310J70431p8871l9003N7073j91883
5789A375476J64790L987k0293M614r2134R1397o7202K3175o5188Q540j0162p734
5777A409266R485l6549J9645q4325K3152N3511n0962K7587j4193n8778R2388L388
5765A393615q2050K09747r1827J1288J66893k02075N8374L777j19595k7810j4469
5754A305868J8794m3395J1898r8172p3865m0661Q0033K4419j877J36151j25647
5743A193546K0827K9786j88262J35985l0267j5250N1768o0796L2800P1010j61160
5732A079987m9569J56137j55236J33862o0667j31448J87993j51606K4022m5791
5722I87684p6842R978N4414L2574o4453O0544r8124P7137J8835Q9065N9800j37567
$$ plain form
5800 1591042 1481631 1524116 1426253 1462111 1569039 1457729 1628160 1549289 1510286 1567359 1375476
5789 1375476 1540266 1544253 1523960 1528574 1436440 1527837 1460635 1483810 1418622 1427162 1417000 1409266
5777 1409266 1418751 1382202 1401847 1317522 1340674 1394185 1343223 1370810 1356617 1297839 1390227 1393615
5765 1393615 1311565 1521312 1429485 1440773 1607666 1405591 1463965 1467742 1348147 1320337 1305868
5754 1305868 1324662 1281267 1293165 1194993 1121128 1080467 1160500 1184919 1183042 1319193 1193546
5743 1193546 1214373 1244159 1055897 1191882 1161615 1146365 1198133 1137337 1170137 1241147 1079987
5732 1079987 1030418 1186555 1031319 1165181 1104514 973066 1161059 1009453 1033475 987684
5722 987684 910842 920820 975234 1007808 943355 1003899 905775 982912 1001747 1090812 1150612 1013045
5710A013045K30755j36531P0717N0630l21921J87080m0628K4240J4958o6068m1993
5699I84284Q6356J49823o5613M9110k6627L0904O2449m8971J55586j98552K6606
5688A205355j36415m0182L7432q7502R2712n0310L5644q809J9913N962K3582J41976
5676A239358r1222R6733o5677J9393P1891j01949M8368j11795M8049r1411L2874
5665A094612k0068k2035J82637k00115J47132N2177o9163J57841j22235N5124
5655A255907k7713Q0848P1425q5102M7615k1307k6192L7287n0433r2230N3605
5644A243710l3163m676J55073j94553R6921L4704j22372Q1677j74759j0179J8190
5633A090573M7389L7893m1366o2089n2145J13477p4422R2020j5464J03891m046
$$ plain form
5710 1013045 1243800 1107269 1177986 1228616 906695 1093775 1053147 1077387 1092345 1026277 984284
5699 984284 1070640 1220463 1154850 1203960 1177333 1208237 1270686 1221715 1377301 1178749 1205355
5688 1205355 1068940 1028758 1066190 978688 1071400 1021090 1056734 1047925 1067838 1073800 1097382 1239358
5676 1239358 1148136 1244869 1179192 1198585 1270476 1168527 1216895 1105100 1153149 1061738 1094612
5665 1094612 1074544 1052509 1235146 1035031 1182163 1234340 1165177 1323018 1200783 1255907
5655 1255907 1228194 1309042 1380467 1295365 1342980 1321673 1295481 1332768 1282335 1190105 1243710
5644 1243710 1210547 1205871 1360944 1166391 1263312 1298016 1175644 1257321 1082562 1072383 1090573
5633 1090573 1137962 1175855 1134489 1072400 1020255 1133732 1059310 1151330 1135866 1239757 1235711
5622A235711j11832J69006j68538R2348L658o3674J34431j80178J57906q9987
5612A178851l3360O4834N4780J78859q7646J00662K619j38718R995p1103L6505
5601A296278l6971L2640O135K5015O6072j00817O1364q6096K1526j2987j3876
5590A258283Q5604q3797q744o6894n9627M9301J6007k3718N0588M0296r6771Q2387
5578A242915N4714K3330p786J5526O2429j45965O2542K8508k5092R4667j67748
5567A238040P3387M9267o5705L5869L0912o7194j6142L9925R534M0921k1918k8790
5555A318106j0039j38633P8352n4681j07900J87278j73103j3387M4869j08107
5545A022755R3364m7379q387r509o5837L7847M9653L5860r972k0947j0355J63546
$$ plain form
5622 1235711 1123879 1292885 1124347 1216695 1220353 1156679 1291110 1110932 1268838 1178851
5612 1178851 1145491 1210325 1265105 1443964 1356318 1456980 1459599 1320881 1330876 1259773 1296278
5601 1296278 1259307 1291947 1298082 1323097 1389169 1288352 1349716 1263620 1285146 1272159 1258283
5590 1258283 1343887 1260090 1251346 1184452 1124825 1174126 1190133 1166415 1217003 1257299 1160528 1242915
5578 1242915 1297629 1320959 1313173 1328699 1391128 1245163 1307705 1336213 1311121 1405788 1238040
5567 1238040 1311427 1360694 1294989 1330858 1361770 1294576 1278434 1318359 1327893 1368814 1346896 1318106
5555 1318106 1308067 1169434 1247786 1193105 1085205 1272483 1099380 1085993 1130862 1022755
5545 1022755 1116119 1068740 1060353 1050844 985007 1022854 1072507 1108367 1098395 1077448 1067093 1230639
5533A230639M1295m7050J15428j60751O0512J17706j39189M3720p7183r0643l2564
5522A061920M0285N5052k4044O804J1334k2036J2092j1722k5549P2631n4391j44510
5510I77866k9929K1311K2448O2202L6512j25366k7239O6123o0604R6334M8566
5499A088224o7805J13015o2085L6788O0550j2774j12594r5646J2657o9985P1099
5488I61444k1254l3742r696n5340J18223l6647J66131O981r6911J51229Q57O1763
5476A213038M2758K0458p8476l8377J1690Q073K1245m1780J26156q5176p3062
5465A126547J66767p5797J67336O2853r3492J69231r3471k5113Q3833n2080P6040
5454A512654J1321m6886N0511j66526N4721J03892j45560J59116r6012j0391J41154
$$ plain form
5533 1230639 1271934 1224884 1340312 1179561 1240073 1357779 1218590 1262310 1185127 1094484 1061920
5522 1061920 1102205 1157257 1133213 1140017 1151351 1129315 1141407 1129685 1104136 1176767 1122376 977866
5510 977866 947937 969248 991696 1053898 1090410 965044 937805 1003928 943324 1039658 1088224
5499 1088224 1020419 1133434 1071349 1108137 1168687 1155913 1043319 947673 960330 890345 961444
5488 961444 940190 906448 896752 841412 959635 922988 1089119 1096100 999189 1150418 1151275 1213038
5476 1213038 1255796 1276254 1197778 1159401 1171091 1179164 1200409 1158629 1284785 1199609 1126547
5465 1126547 1293314 1217517 1384853 1447706 1354214 1523445 1429974 1404861 1488694 1436614 1512654
5454 1512654 1523975 1477089 1527600 1361074 1415795 1519687 1374127 1533243 1437231 1426840 1567994
5443A567994K0575o0174j40125q738k1647Q397O447j16872K7303p4759J4162J0629
5431A233192M7299Q6480p023Q9359j02678K542N9002j6591K2432l5126l2123p8433
5419A268332O7799j26381o7564R5662j44939m736Q3391P4031R7793N530k0838
5408A328080J7937j4325M1688M1086q8330N7928r6539q004k5329m6816J18777
5397A326153q7595J42819P8339p2583J66279q352J11095j1774l6619L7226q0943
5386A564045J08415j15065J580j11942j6137O9308m6464l7845P1860N8605m5828
5375A500532l1555O1165o3747J25682o2620M2378R2505j66471L4584q6596K8056
5364A473913J9M6319N3090n0505J52782N3808Q59O4110M1326O486P5881P9089
$$ plain form
5443 1567994 1588569 1528395 1388270 1379532 1357885 1366282 1372729 1255857 1283160 1208401 1222563 1233192
5431 1233192 1280491 1366971 1359948 1449307 1346629 1349171 1408173 1391582 1414014 1378888 1346765 1268332
5419 1268332 1336131 1209750 1142186 1237848 1092909 1088173 1171564 1245595 1343388 1348918 1328080
5408 1328080 1346017 1331692 1373380 1414466 1326136 1384064 1287525 1279521 1254192 1207376 1326153
5397 1326153 1238558 1381377 1459716 1387133 1553412 1545060 1656155 1644381 1607762 1644988 1564045
5386 1564045 1672460 1557395 1558975 1447033 1430896 1500204 1453740 1415895 1487755 1546360 1500532
5375 1500532 1468977 1530142 1466395 1592077 1529457 1571835 1664340 1497869 1532453 1445857 1473913
5364 1473913 1473932 1520251 1573341 1522836 1675618 1729426 1730285 1794395 1835721 1842207 1918088 1997177
5352A997177L739J37399p3328n4144J8538m9260L3075J9131J11257o0919N9723
5341B142388J32348M9838J00283J3225M6506L5729J65985Q4111J42383J88613
5331C101409M0577K41572K86831L76323N49789M82007O68254N70222N57103M95001
5321G369088K72003K78230J44Q4580J05033k7330J11299j55928l78439l52109
5311G306571n41955n49881l98866m78577m05883l09859m31952l10642j02558j62900
5301C613498r3450m0821j25528j42096k4398M9728j44865L9502m5152l6955K00322
5290C249785J9718K08765K96233P7292J54160K25828K89504K27499N16613M63642
5280E729039K89131N76226L42045L72197L53175N4479N9440m0327L0963K1952
$$ plain form
5352 1997177 2000916 2138315 2064987 2010843 2029381 1980121 2013196 2032327 2143584 2082665 2142388
5341 2142388 2274736 2324574 2424857 2438082 2484588 2520317 2686302 2770413 2912796 3101409
5331 3101409 3141986 3383558 3670389 4046712 4596501 5078508 5746762 6316984 6874087 7369088
5321 7369088 7641091 7919321 7919465 8004045 8109078 8081748 8193047 8037119 7658680 7306571
5311 7306571 6764616 6214735 5815869 5337292 4931409 4621550 4189598 3878956 3776398 3613498
5301 3613498 3520048 3479227 3353699 3211603 3187205 3236933 3092068 3131570 3086418 3049463 3249785
5290 3249785 3269503 3478268 3774501 3851793 4005953 4231781 4521285 4748784 5265397 5729039
5280 5729039 6018170 6594396 6936441 7308638 7661813 7716292 7775732 7735405 7766368 7788320
5270G788320J0479n1277m64217m11422n61282o64743k82003m79160m46116l42591
5260D095988l93025k33474j94803j45916j11028l3649j27736m1405K5576l9175
5250B801353m7355n8522j07268j41593j04944M0517K4122O5079q9627r9120Q646
5239B291288m1871R4213M5989j40526J44002m0148r9521J99080r493l4648j2444
5228B395921q9837n9305K0227Q0688m3574M2079K7402j02641N3989P7519k1576
5217B380892M7726N2637p3332j34189J01680L8634J2863j4228j92863Q2875j02989
5206B199706J27519J45660j30306P0005q1269J4878Q2517M8205P0688j07177k5537
5195B414889l6226L9055J64079j11460J9054j8758q4973J20867Q1828j8540N8937
$$ plain form
5270 7788320 7798799 7747522 7283305 6871883 6310601 5645858 5363855 4884695 4438579 4095988
5260 4095988 3702963 3469489 3274686 3128770 3017742 2984093 2856357 2814952 2840528 2801353
5250 2801353 2753998 2695476 2588208 2446615 2341671 2382188 2406310 2471389 2381762 2282642 2291288
5239 2291288 2249417 2343630 2389619 2249093 2393095 2352947 2253426 2452506 2443013 2408365 2395921
5228 2395921 2306084 2246779 2267006 2347694 2304120 2346199 2373601 2270960 2324949 2402468 2380892
5217 2380892 2428618 2481255 2407923 2273734 2375414 2414048 2426911 2412683 2219820 2302695 2199706
5206 2199706 2327225 2472885 2342579 2412584 2331315 2346193 2428710 2476915 2547603 2440426 2414889
5195 2414889 2378663 2417718 2581797 2470337 2489391 2470633 2385660 2506527 2588355 2569815 2628752
5184B628752P0571r6335J1997O5403m654L986O8191l9892M3853k89l3198J07914
5172B826299K9350r5792k822P3829O1666P7155O6533j3307M1857K7228M0938J24892
5160C257826n5038k3186P671k0271l6188J46069J31748p3574J12678o9432L6783
5149C415086J79782L669O8486j5931L7307K2933r900R9629p6644J09742m5505
5138C788654j05643K11955O4189N7066J60274r8975k2159Q7492m528J02704R2777
5127D333806p1902M6713o6658j8151J94665K7560J0884j12678R2887L6947N3513
5116D527586J79455k3585J03833Q7431M3823K7567K43947O3114o180J02290j38240
5105E211041K07888k4056p60J45667j58437L8529L2729J84849L7502P0203J58461
$$ plain form
5184 2628752 2699323 2602988 2614985 2680388 2675734 2679720 2747911 2708019 2751872 2751583 2718385 2826299
5172 2826299 2855649 2759857 2757035 2830864 2892530 2969685 3036218 3022911 3064768 3091996 3132934 3257826
5160 3257826 3202788 3179602 3187273 3167002 3130814 3276883 3408631 3335057 3447735 3378303 3415086
5149 3415086 3594868 3598537 3667023 3651092 3688399 3711332 3701432 3801061 3724417 3834159 3788654
5138 3788654 3683011 3894966 3959155 4016221 4176495 4077520 4055361 4142853 4138325 4241029 4333806
5127 4333806 4261904 4308617 4241959 4223808 4418473 4446033 4456917 4344239 4437126 4474073 4527586
5116 4527586 4707041 4683456 4787289 4874720 4918543 4946110 5190057 5253171 5246991 5349281 5211041
5105 5211041 5418929 5394873 5394113 5539780 5381343 5419872 5452601 5637450 5674952 5745155 5903616
5094E903616k21710N0748M2578J33975M8006j65418O2057o0896J05848k689K18104
5083F114219J09039r8659Q5838q7009K47141P3533R5840P0113m6043K66408r2521
5072F737899J48499J09650j08406J64377j33584O1408O7456J03255K4490K1568
5062G196612K5525k4766K14895R4308J29513J23817n0870l446Q5250J97735n7589
5051G930984J99502q7081m6439J75653K1317K88896Q0042J77947J9718R3226J95664
5040I049429O7377L27064M1360J41886K18363j1354K79879J78272J03237N9637
5030A0455150Q5814P6248M9886K12464J48418K14373M6322R3874K13805K01773
5020A1798127L17311J07054J62538K4691P1600K82629K03841J25663J15174L9221
$$ plain form
5094 5903616 5681906 5732654 5775232 5909207 5957213 5791795 5853852 5792956 5898804 5896115 6114219
5083 6114219 6223258 6124599 6210437 6123428 6370569 6444102 6539942 6610055 6564012 6830420 6737899
5072 6737899 6886398 6996048 6887642 7052019 6918435 6979843 7047299 7150554 7175044 7196612
5062 7196612 7222137 7197371 7412266 7506574 7636087 7759904 7709034 7705588 7790838 7988573 7930984
5051 7930984 8130486 8043405 7996966 8172619 8193936 8482832 8562874 8740821 8760539 8853765 9049429
5040 9049429 9116806 9443870 9485230 9627116 9845479 9834125 10114004 10292276 10395513 10455150
5030 10455150 10540964 10617212 10667098 10879562 11027980 11242353 11288675 11382549 11596354 11798127
5020 11798127 12115438 12222492 12385030 12409721 12481321 12763950 12967791 13093454 13208628 13247849
5010A3247849J34854K81693K18611J58833K30354J56113K08781J82459K62496
5001A5082043K68587J74830K13243J57186K32616J21882K44335K34412K37865
4992A6966999J84852P0769L21706L12051L13267L48192K50549L68542K57414M49865
4982A9844206M68834L62845L37725K11205M23332L58740L61910L22062K67561
4973B2958420L14261J23052K26963L37891L69044M06419J97410L96113L10761
4964B5640334K91575M28552K59110K96655L33679K29023L52621L35099K45516
4955B8412164M66451L24890K88346M68790L86497M43048N36583N11742L46898
4946C2185409M80044N03606L76159M76751L58226K45846K92506K87055L35434
$$ plain form
5010 13247849 13382703 13664396 13883007 14041840 14272194 14428307 14637088 14819547 15082043
5001 15082043 15350630 15525460 15738703 15895889 16128505 16250387 16494722 16729134 16966999
4992 16966999 17151851 17222620 17544326 17856377 18169644 18517836 18768385 19136927 19394341 19844206
4982 19844206 20313040 20675885 21013610 21224815 21648147 22006887 22368797 22690859 22958420
4973 22958420 23272681 23395733 23622696 23960587 24329631 24736050 24933460 25329573 25640334
4964 25640334 25931909 26360461 26619571 26916226 27249905 27478928 27831549 28166648 28412164
4955 28412164 28878615 29203505 29491851 29960641 30347138 30790186 31326769 31838511 32185409
4946 32185409 32665453 33169059 33545218 34021969 34380195 34626041 34918547 35205602 35541036
4937C5541036L13374K30666J76827J49844K27852K70193J97040L65886J87751
4928C7660469R3452L06867J89717K93828K31914J74372K62379J25713K33069L80751
4918C9952531R3953K45658K56282L9155J87714J79242J53742K99048P4802J00237
4908D1582364J41526J04474J76027J0829m2138n6277j11642P8028q9063q8805
4898D1705323n4359k81638k00563j56782j42917j07748j05597j91281k56356j71823
4888D0036259j37134k18164p4978k38721j93731r0409k56736k21983k82396m09566
4878C7912441k85359m29850l92565l03844m21621k48100l23354l26355l06736
4869C4874657k77022k75734k81208l39393l31880k68399k89915k04683k85834
$$ plain form
4937 35541036 35854410 36085076 36261903 36411747 36639599 36909792 37106832 37472718 37660469
4928 37660469 37753921 38060788 38250505 38544333 38776247 38950619 39212998 39338711 39571780 39952531
4918 39952531 40046484 40292142 40548424 40587579 40775293 40954535 41108277 41407325 41482127 41582364
4908 41582364 41723890 41828364 42004391 42015220 41973082 41916805 41805163 41883191 41794128 41705323
4898 41705323 41650964 41369326 41168763 41011981 40869064 40761316 40655719 40464438 40208082 40036259
4888 40036259 39899125 39680961 39605983 39367262 39173531 39083122 38826386 38604403 38322007 37912441
4878 37912441 37627082 37197232 36804667 36500823 36079202 35831102 35507748 35181393 34874657
4869 34874657 34597635 34321901 34040693 33701300 33369420 33101021 32811106 32606423 32320589
4860C2320589l47947k59138n14145l38174k74052m02606j26624l83785k72070
4851B9402048j90660l64062j27252k09025k84095k14131l93236k69742l44561
4842B7005284m38684l41052n30557m77598l25608m08857j98038k01711k33010
4833B3850169q6996j24606J4187P1688Q3706J08353n318j14720j10255j38501
4823B3547707k20713k41150l09121l82851j53466k21691k46970k97960l43076
4814B1130709k05392k21409j94167j74039j51366k06955k26054j63895l9468o8619
4804A9479345K9850j23458j42243j11903j67006k13273j13553j87935k16859j50834
4794A8082131j39964j04868k485j9092q7383K3141j40177m1152K9884l8163k1062
$$ plain form
4860 32320589 31972642 31713504 31199359 30861185 30587133 30184527 30057903 29674118 29402048
4851 29402048 29211388 28847326 28720074 28511049 28226954 28012823 27619587 27349845 27005284
4842 27005284 26566600 26225548 25694991 25217393 24891785 24482928 24284890 24083179 23850169
4833 23850169 23763173 23638567 23652754 23724442 23808148 23916501 23911183 23796463 23686208 23547707
4823 23547707 23326994 23085844 22776723 22393872 22240406 22018715 21771745 21473785 21130709
4814 21130709 20925317 20703908 20509741 20335702 20184336 19977381 19751327 19587432 19547964 19479345
4804 19479345 19509195 19385737 19243494 19131591 18964585 18751312 18637759 18449824 18232965 18082131
4794 18082131 17942167 17837299 17834814 17815722 17728339 17751480 17611303 17570151 17600035 17561872 17540810
4783A7540810j66221j04403k44139k79126j33437j23932J1965j36623m5971M3671
4773A6362594q5411q0757j86574k27450k35237l24776j21914k33565l60072l98430
4763A4108408k88569k46898k25094N7459J45010J01628K17052L03969L82612L35705
4753A4891282K19983n9628j39440l15861m28588k43141l65782l55999m25412m24276
4743A2353138l19731l24441j77147q2218j94191J9443j55169k51293O5985j96243
4733A0738133n1487j10197j92113j9107j68695Q7757l9015r0065M6001r9543R9325
4722A0200994n6984j18520M0613n8765j33182k60667o4406j36676r4421q6161
4712I231825j77293n7229j71699R737k35872n5740j0530k34140R2101j07601j5419
$$ plain form
4783 17540810 17374589 17270186 17026047 16746921 16613484 16489552 16501517 16364894 16318923 16362594
4773 16362594 16277183 16196426 16009852 15782402 15547165 15222389 15100475 14866910 14506838 14108408
4763 14108408 13819839 13572941 13347847 13405306 13550316 13651944 13868996 14172965 14555577 14891282
4753 14891282 15111265 15051637 14912197 14596336 14167748 13924607 13558825 13202826 12777414 12353138
4743 12353138 12033407 11708966 11531819 11449601 11255410 11274853 11119684 10868391 10934376 10738133
4733 10738133 10686646 10576449 10384336 10365229 10196534 10284291 10245276 10155211 10201212 10101669 10200994
4722 10200994 10144010 10025490 10066103 10007338 9874156 9613489 9549083 9412407 9317986 9231825
4712 9231825 9054532 8997303 8825604 8835341 8599469 8543729 8533199 8299059 8391160 8283559 8268140
4701H268140j8387o7975M8977q3634J4970m1476j09020q4106j40572j71835O446
4690G621528j19163j36248r0789k20378o0411j37041m7571J05923j51731K03390
4680F967509m8806J5931J39678k67346m8422j09399j71182k01825l1390p49j58472
4669F085527J1948l9434n8065r4453L8467n4296j90554J41912l27619P9979R684
4658E603096k90271K54393j04254P908R6399n4124J33257J3778J36873q500m9428
4647E739127J70684J72700J7668R059q9841j36405L8080k66465j81048p9692k93516
4636E100351Q9795k33092k0799N1939k19594J68303j80741P5860J81099m9360
4626D963761J29963J190J92881J87981J61864R2007j0967j34622P8542j56643
$$ plain form
4701 8268140 8249753 8181778 8230755 8147121 8162091 8120615 8011595 7927489 7786917 7615082 7621528
4690 7621528 7502365 7366117 7275328 7054950 6994539 6857498 6809927 6915850 6764119 6967509
4680 6967509 6918703 6934634 7074312 6806966 6758544 6649145 6477963 6276138 6244748 6243999 6085527
4669 6085527 6097475 6058041 5999976 5905523 5943990 5889694 5699140 5841052 5513433 5593412 5603096
4658 5603096 5312825 5567218 5462964 5470872 5567271 5513147 5646404 5660182 5797055 5788555 5739127
4647 5739127 5909811 6082511 6100179 6109238 6019397 5882992 5921072 5654607 5473559 5393867 5100351
4636 5100351 5190146 4957054 4936255 4988194 4768600 4936903 4756162 4832022 5013121 4963761
4626 4963761 5093724 5094914 5287795 5475776 5637640 5729647 5718680 5584058 5662600 5505957
4616E505957j72324J97616k53469k2913J02619j49560J56264J29694J12205R9173
4606E705262J21836Q2573J0411N6246l3098j62762M582O5824o4930J96192M9723
4595F031859p7229J76997K7083l6025M2875j03472p5369k08466m4414j63826j66377
4584E403636j9924k34871m1054j09725p2302M2831q794l4188k24420J0480j24864
4573D586805o0354K6279q6663n4333p4823n707m8845J3869j5917j11202L4379
4562D203488o2088J08432J0588J23832N3127k4397K31107k7483M3941J03456l310
4551D760693Q628j6242J70582j6586Q8910K56514M6343l0319J03886j03829o470
4540E262110J57852j97374r1523M73n5440J24620J4424J29715o9185J27598K32715
$$ plain form
4616 5505957 5333633 5531249 5277780 5254867 5357486 5207926 5364190 5493884 5606089 5705262
4606 5705262 5827098 5909671 5920082 5976328 5943230 5780468 5785050 5850874 5785944 5982136 6031859
4595 6031859 5954630 6131627 6158710 6122685 6165560 6062088 5986719 5778253 5733839 5570013 5403636
4584 5403636 5383712 5148841 5107787 4998062 4925760 4968591 4959797 4925609 4701189 4711669 4586805
4573 4586805 4526451 4552730 4466067 4411734 4336911 4331204 4282359 4296228 4280311 4169109 4203488
4562 4203488 4141400 4249832 4260420 4384252 4437379 4412982 4644089 4616606 4660547 4764003 4760693
4551 4760693 4769321 4753079 4923661 4907075 4995985 5252499 5298842 5268523 5372409 5268580 5262110
4540 5262110 5419962 5222588 5131065 5131538 5076098 5200718 5215142 5344857 5275672 5403270 5635985
4529E635985j75071J67288j13296k92359m9456k45319j97460J333p3077p9563
4519D579005O6189q7992r8963N8923l4515N1639k23911q3100k7392j06406J82378
4508D275855l5275o2064J37404j50425L9095j8436o1736J47094n1537K7748R912
4497D257635j38386J56743l4015j16556P1175j31270j0945J83602J7K5246N4800
4486D318046J4841n5980P1109J24079n4801Q4337j9893n7946J59860J19647p610
4475D695689J04301Q1397L4904N6292J47792J34765Q4653K18789L1548J73409
4465E763539K85215J41741K54202L30181J51848K40174M20056L34740M46485M90495
4455H858676L42196N37947N60680P61227Q05702P54761J100508R99447J413587
$$ plain form
4529 5635985 5460914 5628202 5514906 5222547 5173091 4927772 4730312 4731645 4658568 4579005
4519 4579005 4645194 4557202 4458239 4517162 4482647 4534286 4310375 4227275 4199883 4093477 4275855
4508 4275855 4240580 4178516 4315920 4165495 4204590 4186154 4124418 4271512 4219975 4247723 4257635
4497 4257635 4119249 4275992 4241977 4125421 4196596 4065326 4054381 4237983 4238000 4263246 4318046
4486 4318046 4332887 4276907 4348016 4472095 4417294 4501631 4481738 4423792 4583652 4703299 4695689
4475 4695689 4799990 4881387 4916291 4972583 5120375 5255140 5339793 5558582 5590130 5763539
4465 5763539 6048754 6190495 6444697 6774878 6926726 7166900 7586956 7921696 8368181 8858676
4455 8858676 9200872 9738819 10299499 11060726 11866428 12621189 13721697 14721144 16134731
4446A6134731J782865K274386K856076L677472N270037P068464R497105J1297069
4438E9858205J1291211Q786119M254449K27844j952610j674791Q1666K476110
4430H3348203L775911K290691j286327n740764q768485j0360824r939108q934216
4422D4385081p632585n840170m950212l834911l022317k568949j866676j568653
4414A3100608j127215r69142p99882o72258o64966n17787m46965k78711m74804
4405G148878k00229m07898k24388m4394l89988J28325k21298j78860o9410k53055
4395E287683P5926j58812m0625K093o0610j36771j51741Q2550k11562J52181n1621
4384D788691j23064J17225j54452J08618r1865O185j49441j2364N8523p0894P8617
$$ plain form
4446 16134731 17917596 20191982 23048058 26725530 31995567 39064031 48561136 59858205
4438 59858205 71149416 79935535 84189984 84417828 82465218 80790427 80872093 83348203
4430 83348203 87124114 89414805 88128478 82387714 73619229 63258405 53319297 44385081
4422 44385081 36752496 30912326 25962114 22127203 19104886 16535937 14669261 13100608
4414 13100608 11973393 11004251 10204369 9532111 8867145 8349358 7902393 7623682 7148878
4405 7148878 6948649 6540751 6316363 6271969 5881981 6010306 5789008 5610148 5540738 5287683
4395 5287683 5363609 5204797 5164172 5166265 5105655 4968884 4817143 4899693 4688131 4840312 4788691
4384 4788691 4665627 4782852 4628400 4737018 4645153 4651338 4501897 4489533 4548056 4477162 4555779
4373D555779k07807j4260r8950J2807Q9718j39407J43916j84961J31091J19152
4363D407078n4143O186r8036j047o4399J16606m8870M2303P5585j00802K67149
4352D547610k35804J28631J57617j24838K85557j10644L3650J67102m7988M7563
4342D848456O6414j1596q4635M1823l3734J1360r0576k4429O4433j4691K92151
4331E064976j7219J67457L9586n9180J97251J15007o1379J00982J99734k10354
4321E536861J19685J56323J398L12587k8622J66101N3806J0210J92035n9364L06017
4310F767037l0593J1236O2640j21305Q4465j33843R8997m4645q0367j595j63436
4299F448591O3986q7280m6722j2107j067K5926J11134n453n2065J17806j3368
$$ plain form
4373 4555779 4347972 4333712 4234762 4247569 4337287 4197880 4341796 4156835 4287926 4407078
4363 4407078 4352935 4359121 4261085 4260038 4195639 4312245 4263375 4305678 4381263 4280461 4547610
4352 4547610 4311806 4440437 4598054 4473216 4758773 4648129 4681779 4848881 4800893 4848456
4342 4848456 4914870 4903274 4818639 4860462 4826728 4838088 4747512 4723083 4787516 4772825 5064976
4331 5064976 5047757 5215214 5254800 5195620 5392871 5507878 5446499 5547481 5747215 5536861
4321 5536861 5656546 5812869 5814267 6126854 6098232 6264333 6318139 6328349 6520384 6461020 6767037
4310 6767037 6736444 6747680 6810320 6689015 6773480 6639637 6738634 6693989 6613622 6612027 6448591
4299 6448591 6512577 6425297 6378575 6366468 6365401 6391327 6502461 6497008 6444943 6562749 6549381
4288F549381K78823P6753q9682K79285l2213J64453K08563j5214J07455P8789
4278G606393j06405o9482Q9864l15785K0142K3518j79011N048j78067K02575p3362
4267G025428J02203J18809k18994L43037l9757J10882K82306N5713K05956J26984
4257H112567J94935O3886J13809J68059m4238K18669Q0399K7776J19646J54061
4247I209569n4049k7966n8616l0858j6339j5999M5467j01043q5966p6792j29905
4236H657503j22263j13685k14677o7164n2853j38000J6027o7515j81037m6770
4226G669566j08483q3633r0230r2626o7110l70982l0945q9175k90416J45021j66266
4215F424721k60352J44078q8820r9395P3352j16857j44199j31612o2471j60676
$$ plain form
4288 6549381 6828204 6904957 6815275 7094560 7062347 7226800 7435363 7420149 7527604 7606393
4278 7606393 7499988 7430506 7520370 7204585 7224727 7248245 7069234 7074282 6896215 7098790 7025428
4267 7025428 7127631 7246440 7027446 7370483 7330726 7441608 7723914 7779627 7985583 8112567
4257 8112567 8307502 8371388 8485197 8653256 8609018 8827687 8908086 8935862 9055508 9209569
4247 9209569 9155520 9127554 9068938 9038080 9021741 9005742 9051209 8950166 8864200 8787408 8657503
4236 8657503 8535240 8421555 8206878 8139714 8086861 7948861 7964888 7897373 7716336 7669566
4226 7669566 7561083 7477450 7387220 7294594 7227484 6856502 6825557 6736382 6445966 6590987 6424721
4215 6424721 6164369 6308447 6219627 6120232 6193584 6076727 5932528 5800916 5738445 5577769
4205E577769j03146J1992k40062o8299q1565j52474k3598j3029q8067j18180K19387
4194D920728j09949O0831K47809l5310L0584P8813N8071N1546J74055J41928Q8189
4183E707295M10237J88362L90378K33075J03965J97887k17627R9850o6679j63433
4173F883310J16934j14013l8308N6858n5694q572J2973j06513j00763q2643n0465
4162F513104j75574k54124K1113j47379j80871O8317j94734L1402J88402q1148
4152E788508J82935K19118J081P9961J74440N3689R5537J37765J00204J20048
4142F953286K70946K15863J07809K40329K35061K48115K37268K15189J95286r476
4132H909676J01609j6180J5757K60274K5135J79679J76222J18469J83990J13979
$$ plain form
4205 5577769 5474623 5486615 5246553 5178254 5096689 4944215 4920617 4907588 4819521 4701341 4920728
4194 4920728 4810779 4871610 5119419 5084109 5114693 5193506 5251577 5303123 5477178 5619106 5707295
4183 5707295 6117532 6305894 6696272 6929347 7033312 7231199 7013572 7113422 7046743 6883310
4173 6883310 7000244 6886231 6847923 6904781 6849087 6840515 6853488 6746975 6646212 6563569 6513104
4162 6513104 6337530 6083406 6104519 5957140 5776269 5844586 5649852 5681254 5869656 5788508
4152 5788508 5971443 6190561 6191642 6271603 6446043 6499732 6595269 6733034 6833238 6953286
4142 6953286 7224232 7440095 7547904 7788233 8023294 8271409 8508677 8723866 8919152 8909676
4132 8909676 9011285 8995105 9010862 9271136 9296271 9475950 9652172 9770641 9954631 10068610
4122A0068610K44491J38898P0417J57881l0273p4451K0634j61247j49266j4459
4112A0271235k53775m7453J87400j70541k9132J32492j28693m7893J7532k13580
4102I717592k35570k89698m07634m91050k44415l29169l31615j43736k45024j35920
4092F863761k5519k2698L4952l9880K0029j14459o4493P6942l01955m687j56384
4081F265609j49349L3680j40822k3306n44Q346O6220k315r0700O7136N7448J410
4069F092813J99572q7971R3246K10455n4953J69633P1999J32912J17815Q9011
4059G034532J33665P8628J23531J31594q5795J39907K40624j82595L13978O7684
4049G995753k86738L35372l946M9230J22561O4683J74092O5962R9708m2544J08726
$$ plain form
4122 10068610 10313101 10451999 10522416 10680297 10650024 10575573 10596207 10434960 10285694 10271235
4112 10271235 10017460 9970007 10157407 9986866 9957734 10090226 9961533 9913640 9931172 9717592
4102 9717592 9482022 9192324 8784690 8293640 8049225 7720056 7388441 7244705 6999681 6863761
4092 6863761 6838242 6815544 6850496 6810616 6830645 6716186 6651693 6728635 6426680 6421993 6265609
4081 6265609 6116260 6149940 6009118 5985812 5985268 5993614 6059834 6057519 5966819 6033955 6091403 6092813
4069 6092813 6292385 6204414 6297660 6508115 6453162 6622795 6694794 6827706 6945521 7034532
4059 7034532 7168197 7246825 7370356 7501950 7416155 7556062 7796686 7614091 7928069 7995753
4049 7995753 7709015 8044387 8040441 8089671 8212232 8276915 8451007 8516969 8616677 8574133 8682859
4038H682859k432r1041P0788N8877M3287j2529J77226k969N2875J12828o6485
4027I023284J80746q1961L2573o9982m5042j9965k45554J42201j38073J2137K9395
4016H819759j31624J18506k35193M1829p973j32695J48107N5015j00177l4227
4006H541327J10403q6462J16620L1302p4639J11397o866L3886L206J30492P7551
3995H988217j2403K09000k0659M4002J6558j20189r0952J1822m001j33437j1817
3984H876141k20542j35774k1076j70208J4550l1539K5816q4591P5378q414m3017
3973H276724J27070j48190J40130j28990q4776J7024j82102J71721l4999K9640
3963H183252J61559j704J17500J65978J37115L3492K506L7920N6004p1412O0602
$$ plain form
4038 8682859 8680427 8589386 8660174 8719051 8762338 8749809 8927035 8924066 8976941 9089769 9023284
4027 9023284 9204030 9122069 9154642 9084660 9039618 9019653 8774099 8916300 8778227 8790364 8819759
4016 8819759 8688135 8806641 8571448 8613277 8605304 8472609 8620716 8675731 8575554 8541327
4006 8541327 8651730 8565268 8681888 8713190 8638551 8749948 8743082 8776968 8780174 8910666 8988217
3995 8988217 8975814 9184814 9164155 9208157 9224715 9104526 9013574 9025396 9021395 8887958 8876141
3984 8876141 8655599 8519825 8498749 8328541 8343091 8311552 8337368 8252777 8328155 8319741 8276724
3973 8276724 8403794 8255604 8395734 8266744 8181968 8198992 8016890 8188611 8153612 8183252
3963 8183252 8344811 8343107 8460607 8626585 8763700 8797192 8799698 8837618 8893622 8822210 8882812
3952H882812J16686l63581K7891j27397k54360J09025k14897k173l9092j00554
3942H034360j40308J2566n6668j33426Q4902l13752p2067o0580j31383J00270
3932G323914j63466N1371j45345n870K59367N6057J19835P8814J23855K7243K29929
3921G955704J16455Q3437L14339Q1779K71558M1054K27897K95283j23801J21551
3911I385256m6174p1956R0101K6235K4398J00531J55689Q3917K94889Q3461P9758
3900A0206105Q4533l0836k6780k57398k3480k59987j75742j27549l59835N6653
3890I085684P1475J41789J59196K00599K55773K0599K37229P1297J3062J72617
3880A0429320j88471O2225J68766J00223K36406K01820R6897Q1364K77322K55483
$$ plain form
3952 8882812 8999498 8635917 8663808 8536411 8282051 8391076 8176179 8174006 8134914 8034360
3942 8034360 7894052 7906618 7849950 7716524 7801426 7487674 7415607 7355027 7223644 7323914
3932 7323914 7160448 7211819 7066474 7060604 7319971 7376028 7495863 7574677 7698532 7725775 7955704
3921 7955704 8072159 8155596 8469935 8551714 8823272 8864326 9092223 9387506 9263705 9385256
3911 9385256 9339082 9267126 9357227 9383462 9407860 9508391 9664080 9747997 10042886 10126347 10206105
3900 10206105 10290638 10259802 10233022 9975624 9952144 9692157 9516415 9388866 9029031 9085684
3890 9085684 9157159 9298948 9458144 9658743 9914516 9935115 10172344 10243641 10256703 10429320
3880 10429320 10240849 10303074 10471840 10572063 10808469 11010289 11107186 11188550 11465872 11721355
3870A1721355M23212M02728N56118N86101M66426Q07273M69561O93342Q73719
3861A6999835N64785R09004O61554Q26202J131872J079505J337409J106621J190695
3852B5807482J171379J031868J210474J338609J536439J815607K365494K313518
3844C8590870K574702K734241K599139K858623K816588L074735K950345K790393
3836F0989636K470423J618958J362700R71881O68313Q90635M73894K48290K70476
3827F9965206P6177j38820n3828k07131m51600l74204l74751l82204n42603q23900
3817F6692342j406751j676468j915865k279899k232585k333072k606639k805618
3809D9435445k763141k542378k481725j849814j505137j281954r28904j010001
$$ plain form
3870 11721355 12144567 12547295 13103413 13689514 14155940 14963213 15432774 16126116 16999835
3861 16999835 17564620 18473624 19135178 19961380 21093252 22172757 23510166 24616787 25807482
3852 25807482 26978861 28010729 29221203 30559812 32096251 33911858 36277352 38590870
3844 38590870 41165572 43899813 46498952 49357575 52174163 55248898 58199243 60989636
3836 60989636 63460059 65079017 66441717 67413598 68081911 68972546 69446440 69694730 69965206
3827 69965206 70041383 69902563 69848735 69641604 69190004 68815800 68441049 68058845 67516242 66692342
3817 66692342 65285591 63609123 61693258 59413359 57180774 54847702 52241063 49435445
3809 49435445 46672304 44129926 41648201 39798387 38293250 37011296 36082392 35072391
3801C5072391r49790p10097n10641l56707j06611k71596m33269n73716r68173
3792C0191791o71539q46008n09488j68347l36873J87133Q2797J83730K78520j44653
3782B8247063n7692n351K97506L12055N35332P73012L60542M79483N32676K24728
3772C1699354K16496J16080j36987p4843N08919O41383R84605J770626J825825
3763C7551458K234164K389249J771450R17515J97400o73613j312827j440381j485366
3754D0149049j517956r30650l12114L72282J256271J653699J698809J413297J016440
3745D4799127K53005n73639j189293j940887k175319k190171k271136j629470
3737C3082217j156602p46103o7835L66595R23610J097775J142458J325005R21867
$$ plain form
3801 35072391 34122601 33412504 32901863 32545156 32438545 32166949 31733680 31159964 30191791
3792 30191791 29520252 28674244 28164756 27996409 27659536 27846669 27929466 28113196 28391716 28247063
3782 28247063 28189371 28184020 28481526 28793581 29328913 30101925 30462467 30941950 31474626 31699354
3772 31699354 31915850 32031930 31894943 31820100 32329019 32970402 33955007 35725633 37551458
3763 37551458 39785622 42174871 43946321 44863836 45061236 44387623 43074796 41634415 40149049
3754 40149049 38631093 37700443 37388329 37760611 39016882 40670581 42369390 43782687 44799127
3745 44799127 45052132 44478493 43289200 41348313 39172994 36982823 34711687 33082217
3737 33082217 31925615 31179512 31111677 31478272 32401882 33499657 34642115 35967120 36888987
3728C6888987O71621L89168K97649M64153M82066R3489n78734p00846r12985r37992
3718C6156576m59300k84200j27341J45381N15827N78737R78227Q86847M14063
3709C8804817J43448p43435j326218j611935j589161j682661j475536j019675
3701B9499644j149138q04283m06441p18472l51828m33913p16750n11141l55650
3692B4052028j99845J70866N09085N89450J001300J192266R86638Q15368N64950
3683B9682106L44806L07476J078507J411752J342241J418901P67117L46086k02
3674C6698790k71493R6761M61960R11658J288607J587204J656939J267769O81501
3665D4379696K59105J9612j78053j47387k08142p21588j007874j202214j454605
$$ plain form
3728 36888987 37560608 37949776 38247425 38711578 39193644 39287133 38708399 38007553 37094568 36156576
3718 36156576 35697276 35413076 35285735 35431116 35946943 36525680 37503907 38390754 38804817
3709 38804817 38948265 38204830 36878612 35266677 33677516 31994855 30519319 29499644
3701 29499644 28350506 27546223 27139782 26421310 26069482 25635569 24918819 24407678 24052028
3692 24052028 23852183 24023049 24532134 25121584 26122884 27315150 28301788 29117156 29682106
3683 29682106 30026912 30334388 31412895 32824647 34166888 35585789 36352906 36698992 36698790
3674 36698790 36427297 36524058 36986018 37897676 39186283 40773487 42430426 43698195 44379696
3665 44379696 44638801 44658413 44480360 44332973 44124831 43403243 42395369 41193155 39738550
3656C9738550j325378j178449j448698j446582j369368j464083j102114q24187
3648B9579691o57911o62518o49066o97244q91490k85925o6039Q9933P04035R07891
3638B7371357J404979K220085K803435K826229K903481J901999P33140N96388
3630D2761093R2928L78287J074849J366957K006401K148122K317316K088643J622760
3621E5857356J529270J223111J284127J431426J081686O57460J89548k76981n8214
3612F2918789N63879N85074R16317Q16351j3202q10973k167328k796768l094809
3603E6917330l242021k763387k634137k308792j627085j307648r82450m10429
3595D1641381k0050M73799J088069J016325L11141n93089j625781j767610j130995
$$ plain form
3656 39738550 38413172 37234723 35786025 34339443 32970075 31505992 30403878 29579691
3648 29579691 28921780 28259262 27610196 26912952 26021462 25735537 25669498 25759431 26463466 27371357
3638 27371357 28776336 30996421 33799856 36626085 39529566 41431565 42164705 42761093
3630 42761093 42854021 43232308 44307157 45674114 47680515 49828637 52145953 54234596 55857356
3621 55857356 57386626 58609737 59893864 61325290 62406976 63064436 63253984 62977003 62918789
3612 62918789 63482668 64067742 64984059 65800410 65787208 64976235 62808907 60012139 56917330
3603 56917330 53675309 50911922 48277785 45968993 44341908 43034260 42051810 41641381
3595 41641381 41621331 42095130 43183199 44199524 44510665 43917576 42291795 40524185 39393190
3586C9393190k45453M50814J096386J030540K66584l05925o48540r43294p70470
3577C9323832l37610j54244N13214J236976J121154Q61602j05260j302288j582518
3568C9574858j452552r69124m31480L74199J020340K067636L137394L764883M629019
3559E1715173M488399L714935K767493J542853Q72904P7697r7057k4958Q7293
3550F5144732N85662O71463Q39991R41832R39890P01535K71527m01876j271602
3541F8423154k122529l138498l613645l733664l460230k449915j839243j532062
3533D6533368j644889k225146k524010k328239k183576j587181q72255o26434
3525C2541638Q3607M10967R16990J713195K068929J930468R52149J2825j176560
$$ plain form
3586 39393190 39147737 39598551 40694937 41725477 41992061 41686136 41037596 40094302 39323832
3577 39323832 38986222 38831978 39345192 40582168 41703322 42564924 42459664 41157376 39574858
3568 39574858 38122306 37153182 36721702 37095901 38116241 40183877 43321271 47086154 51715173
3559 51715173 56203572 59918507 62686000 64228853 65101757 65179454 65082397 65057439 65144732
3550 65144732 65730394 66401857 67241848 68183680 69123570 69825105 70096632 69694756 68423154
3541 68423154 66300625 63162127 59548482 55814818 52354588 49904673 48065430 46533368
3533 46533368 44888479 42663333 40139323 37811084 35627508 34040327 33168072 32541638
3525 32541638 32625245 33036212 33953202 35666397 37735326 39665794 40617943 40630768 39454208
3516C9454208j587518j384722j351607p66294j95360M22420Q45959J403060J426093
3507C8266239R27439Q23967K11740J26851K73489Q2471J79264J12370L23830M49931
3497D1777591M33302l33856j490117k348108k897916k959509k507434k055759
3489B7618194j586515j238579q41877m35029j13612L53769Q39427R63210J052311
3480B6611299R34645N65886J00967n54582q99111q63718n68084k46105k49252
3471B4831945l17918o85981r55378j133938j165410j063211q20951o99370r03089
3462A7086699n01374n45173n86361l1809k72154n3490J50653J4379P1714J18685
3452A5451769O8604J07209L50034M11654L69061L69082K76988j544n9595j33881
$$ plain form
3516 39454208 37866690 36481968 35130361 34364067 34168707 34591127 35437086 36840146 38266239
3507 38266239 39193678 40017645 40229385 40356236 40629725 40712196 40891460 41003830 41327660 41777591
3497 41777591 42210893 41877037 40386920 38038812 35140896 32181387 29673953 27618194
3489 27618194 26031679 24793100 23951223 23516194 23402582 23756351 24595778 25558988 26611299
3480 26611299 27545944 28111830 28212797 27658215 26759104 25895386 25327302 25081197 24831945
3471 24831945 24514027 23828046 22872668 21738730 20573320 19510109 18689158 17989788 17086699
3462 17086699 16585325 16040152 15453791 15421982 15149828 15096338 15246991 15261370 15333084 15451769
3452 15451769 15520373 15627582 15977616 16389270 16758331 17127413 17404401 17402857 17343262 17209381
3442A7209381m67519l18282k76929m54870j90644k15134k86627j47439m7506j54115
3432A4650316J2603N964N6337J18441J59964N2937k4042m9274Q3855j01001o367
3421A4959733L5946K156n2884N4953J43249K25130L09836K01816L71684L76771
3411A6628390K51385M41056M74659N60319N53387O19867P87515M25793L71225
3402B1113596J42328k18524k413P5704K46201M39860M82062J41677j69354n9644
3392B2191493l25023j19816K10441J71730O56245Q69821J024735J216436J123851
3383B7019913J229705J371239J804690K503883L707316N736909P797003R074644
3375F0245302R026066O463710L155755Q45898J49298J010776J968558J809516
$$ plain form
3442 17209381 16741862 16423580 16146651 15691781 15501137 15286003 14999376 14851937 14804431 14650316
3432 14650316 14662919 14668883 14725220 14843661 15003625 15056562 15032520 14983246 15067101 14966100 14959733
3421 14959733 14995679 14997835 14944951 14999904 15143153 15368283 15678119 15879935 16251619 16628390
3411 16628390 16879775 17320831 17795490 18355809 18909196 19529063 20316578 20742371 21113596
3402 21113596 21255924 21037400 21034987 21110691 21356892 21796752 22278814 22420491 22251137 22191493
3392 22191493 21866470 21746654 21957095 22128825 22785070 23654891 24679626 25896062 27019913
3383 27019913 28249618 29620857 31425547 33929430 37636746 43373655 51170658 60245302
3375 60245302 69271368 75735078 78890833 79736731 79886029 80896805 82865363 84674879
3367H4674879K94603j489406k526430k484184j298133l79150o10932j950366m249929
3358F9980952o142171o992768o814601o042247n015213l797038l056263k328021
3350B9792630j678409j149228o13142l57704J45561J56588L97895M89940K96320
3341B7480451N67923J93413K46917M73518M49394Q28042O92374J251592J419807
3332C3603431J457471K227700K316696L110378L988060M960321N994916O227092
3324F3886065N613794L735648J562049j48600j059826o73279J3551K58702k68743
3315G2919361j683429l409621m584883m885643m446896l810732k790553k182008
3307D5125596j472118q21882p42671n76614o35027m85565m09936k86416J11410
$$ plain form
3367 84674879 84969482 83480076 80953646 78469462 77171329 76792179 76181247 74230881 69980952
3358 69980952 63838781 56846013 50031412 43989165 38973952 35176914 32120651 29792630
3350 29792630 28114221 26964993 26351851 25994147 26139708 26296296 26694191 27184131 27480451
3341 27480451 28048374 28241787 28488704 28962222 29411616 30239658 30932032 32183624 33603431
3332 33603431 35060902 37288602 39605298 42715676 46703736 51664057 57658973 63886065
3324 63886065 69499859 73235507 74797556 74648956 73589130 72915851 72929402 73188104 72919361
3315 72919361 71235932 67826311 63241428 58355785 53908889 50098157 47307604 45125596
3307 45125596 43653478 42831596 42088925 41512311 40877284 40391719 39981783 39695367 39806777
3298C9806777K15224O55489J051217J504914K195072K606775L454239M046177
3290E5535884M569376N241325N804943P100094P247132O611112M590990J189797
3282I7890653j644332m141009n056203n095019m702791l520148k832279j660888
3274F9237984o63856J72640J345900K033774K736297L328397M628478N995923
3266H8815537P402943R341868J0748343J1626154J1151630Q509075M192146j030598
3258A50757098n160585p115139o844768m940683k364977O23533L415351O351971
3250A34721801R230498J0950282J2093737J1959206J1782668J2963465J6677861
3243B20379518K4823446L7168561N1722038O1589658N7597440L5528844O69609
$$ plain form
3298 39806777 40022001 40677490 41728707 43233621 45428693 48035468 51489707 55535884
3290 55535884 60105260 65346585 71151528 78251622 85498754 92109866 96700856 97890653
3282 97890653 96246321 92105312 87049109 81954090 77251299 73731151 70898872 69237984
3274 69237984 68574128 68746768 70092668 72126442 74862739 78191136 82819614 88815537
3266 88815537 96218480 105560348 116308691 127934845 139086475 147595550 151787696 150757098
3258 150757098 145596513 138481374 131636606 126695923 124330946 124954479 128369830 134721801
3250 134721801 143952299 154902581 166996318 178955524 190738192 203701657 220379518
3243 220379518 245202964 282371525 334093563 395683221 453280661 488809505 489479114
3236D89479114l2800068n3715991n9717387n4681485m4969756l4793298k6128282
3229A82672847j9759357j5190871j2320872j0306519q671072o968381n486587
3222A03969188m176795l076646k569136k283313j980925j528857r65864m24791
3214H6962861L26105M95908L63159K09025l13577j61728M76318J116018K211439
3205I1685528K785055L096676L383903K916933K780070L141325M248233O590569
3197A20628292J0333370J6244023K5092500L6643621M9405427N8451293N7951072
3190C74749598M3165331J6477952j3572847l7848475n0535047n2242127m7133604
3183B33060781l9156881l1010003k4085906j8750471j4547188j1550099r481312
$$ plain form
3236 489479114 456679046 402963055 343245668 288564183 243594427 208801129 182672847
3229 182672847 162913490 147722619 135401747 125095228 116424156 109455775 103969188
3222 103969188 99792393 96715747 94146611 91863298 89882373 88353516 87387652 86962861
3214 86962861 87288966 87784874 88148033 88357058 88043481 87881753 88358071 89474089 91685528
3205 91685528 94470583 97567259 100951162 103868095 106648165 109789490 114037723 120628292
3197 120628292 130961662 147205685 172298185 208941806 258347233 316798526 374749598
3190 374749598 417914929 434392881 420820034 382971559 332436512 280194385 233060781
3183 233060781 193903900 162893897 138807991 120057520 105510332 93960233 84478921
3176H4478921p779860o674167n531623m521145l695115k857749k354502j820766
3168D9243994j596361j301812j203199j159512r02148j008198q77164q06778q76775
3159C9512047r68110j024361j023996j024922q78078q41528q81963r08412r60905
3150C0999772r64690r60534r44111r93012q67744p84202n92994m99445m25411
3141B3967629k50775k79307r7537j32652j83984j88962k23358q2640l81095k21067
3131B1926252j59811m27867m3588j84806j12418n0924j6465K62856K75381N94718
3121B2063328P08042Q39028R79704N58304K29343j54731n77300o66840o57223
3112B3321655o17866m37916k55864k91673k00462o7139k37827p3723O5587k0231
$$ plain form
3176 84478921 76699061 70024894 64493271 59972126 56277011 53419262 51064760 49243994
3168 49243994 47647633 46345821 45142622 43983110 43080962 42072764 41195600 40388822 39512047
3159 39512047 38543937 37519576 36495580 35470658 34592580 33751052 32869089 31960677 30999772
3150 30999772 30035082 29074548 28130437 27137425 26269681 25485479 24892485 24393040 23967629
3141 23967629 23716854 23437547 23340010 23207358 23023374 22834412 22611054 22528414 22147319 21926252
3131 21926252 21766441 21338574 21294986 21110180 20997762 20946838 20930373 21193229 21468610 22063328
3121 22063328 22771370 23610398 24590102 25148406 25377749 25223018 24645718 23978878 23321655
3112 23321655 22703789 22265873 22010009 21718336 21517874 21450735 21212908 21139185 21204772 21184541
3102B1184541j61902j33700K1427p1808n3458L601j14568r4087j37035j66071
3092B0276940r3431l77534k62274l30666l92910k80657k40654r5312r3677n4344
3082A8055481J50034J00085Q4843J14903K00034J54640J66562K46640J58177K95019
3072A9726418L82531M44615M31425P41826Q54796Q49455J336140J336315J394063
3063B7497584J762522J607276J956883K302201K255888K787965L203718L663487
3055D7037524M379655N159196O131390P355387R142623J1917797J5966346K2373596
3047A29463514L0758037M0314425M9209080N2757013M7731353L2578290J0439181
3040C93250893j2815137l1573927m2261245m4963827m1958877l5928640k9403409
$$ plain form
3102 21184541 21022639 20888939 20910366 20838558 20785100 20788701 20674133 20580046 20443011 20276940
3092 20276940 20183509 19805975 19543701 19213035 18820125 18539468 18298814 18203502 18109825 18055481
3082 18055481 18205515 18305600 18390443 18505346 18705380 18860020 19026582 19273222 19431399 19726418
3072 19726418 20108949 20553564 20984989 21726815 22581611 23431066 24767206 26103521 27497584
3063 27497584 29260106 30867382 32824265 35126466 37382354 40170319 43374037 47037524
3055 47037524 51417179 56576375 62707765 70063152 79205775 91123572 107089918 129463514
3047 129463514 160221551 200535976 249745056 302502069 350233422 382811712 393250893
3040 393250893 380435756 348861829 306600584 261636757 219677880 183749240 154345831
3033A54345831k3446832j8291625j4373932j1124332q537506o644246m837656
3026F7089702l360515k103508p78246J49647J271611J817764J905990J843205
3018F7835650Q21266l51041j720282l256105m299388m970330n006403m863094
3010D4190273m362963l825860l456218k910945k519980k167861j886184j538909
3002B1521353j432237j154619r78678j147874p62150o94582o67788n65643o20742
2993A3497040m52757m84942k67481l42393k99996l57281l95522l16727l47141
2984A0232800l07171l52867k42224k86282l28453j38819k30447k72852k10293
2975G863392j47956k55828k64459r6174j65927p7474j31772k96859k1059j31024
$$ plain form
3033 154345831 130898999 112607374 98233442 87109110 78571604 71927358 67089702
3026 67089702 63729187 61625679 60847433 60997080 62268691 64086455 65992445 67835650
3018 67835650 68656916 68305875 66585593 63329488 59030100 54059770 49053367 44190273
3010 44190273 39827310 36001450 32545232 29634287 27114307 24946446 23060262 21521353
3002 21521353 20089116 18934497 17955819 16807945 16045795 15351213 14683425 14117782 13497040
2993 13497040 13044283 12559341 12291860 11949467 11649471 11292190 10896668 10579941 10232800
2984 10232800 9925629 9572762 9330538 9044256 8715803 8576984 8346537 8073685 7863392
2975 7863392 7715436 7459608 7195149 7098975 6933048 6855574 6723802 6426943 6405884 6274860
2965F274860o1889j6477q5962J283j50364J02815J65423Q4678L19084L22208P3502
2954G029161l431j23299m07009k46075k65411m57834k79921k85716k25994l01990
2944D432481k44297k94549j71457j20595r4125j25767j16580o811j19681n782
2934C132837J13060j38384Q2779q7958p7706n2138k19990J3796p7032J273q3002
2923B607535q1871m1391M64L4861K773J53722j03046J2767L9154j58835K16677
2912B682810L2104j1823K05083k9913K51858L15971K06986J34756j16320j46060
2902C525452l49126k28551k46996l93282j82307j56318k05715j08822p6137j38720
2892A439478j06717j5001j49348q1974Q1375l2864l5246Q0479j12259J6836k1261
$$ plain form
2965 6274860 6212971 6196494 6110532 6111815 5961451 6064266 6229689 6314367 6633451 6955659 7029161
2954 7029161 7025730 6902431 6495422 6249347 5983936 5526102 5246181 4960465 4734471 4432481
2944 4432481 4188184 3893635 3722178 3601583 3507458 3381691 3265111 3258300 3138619 3132837
2934 3132837 3245897 3107513 3190292 3102334 3024628 2972490 2752500 2766296 2689264 2690537 2607535
2923 2607535 2525664 2484273 2484737 2519598 2522371 2676093 2573047 2585814 2624968 2466133 2682810
2912 2682810 2714914 2703091 2908174 2878261 3130119 3446090 3653076 3787832 3671512 3525452
2902 3525452 3176326 2947775 2700779 2307497 2125190 1968872 1763157 1654335 1578198 1439478
2892 1439478 1332761 1317760 1168412 1086438 1167813 1134949 1099703 1180182 1067923 1084759 1063498
2881A063498q6787J17697k5867j10066n721m8125k628M0852J9486K3678L7788
2870A023805j20225m6360J5913k2274J44478j95950K1042Q790r417J05570j73329
2859G52043k2972n8405j97391O1225j44893o5776R8209j98586O9812J02631m3625
2848C52272M9280O7597J6523L4795n9886n3435p7941p612J6771j06222K3889m6435
2836B09596j32313J01942p4007k6954J54054k1754l0282M9091m6720J12970k4859
2825B70764j05729N2354p2982P0923M3065P1942J34258j50977J53947l1441j3254
2814D22870K90516r286M3292j9383j73356K191j07220m6627r1620q6960o3667
2803A60750q5593O5864j6093J8501r8289R237O857K9371P1384p2759l738j38975
$$ plain form
2881 1063498 976711 1094408 1068541 958475 952754 904629 902001 942853 962339 986017 1023805
2870 1023805 903580 857220 873133 850859 995337 799387 820429 829219 819802 925372 752043
2859 752043 729071 670666 473275 534500 389607 323831 422040 223454 293266 395897 352272
2848 352272 401552 469149 485672 520467 460581 407146 329205 321593 338364 232142 256031 209596
2836 209596 77283 179225 105218 78264 232318 210564 180282 229373 182653 295623 270764
2825 270764 165035 217389 144407 215330 258395 330337 464595 313618 467565 436124 422870
2814 422870 713386 704100 747392 728009 554653 556844 449624 402997 311377 224417 160750
2803 160750 75157 141021 124928 143429 45140 54377 61234 90605 161989 89230 85492 -53483
2791e3483j9617L4290l165P9421q6698j2946l3796r535L2246O7017M2199l0532
2779E401M8440J3595j51432Q0459L7811r2990L4116l2426N0389J79042N7730m400
2767B25735J01223J07913J16611K31230J37001K23762J66504J97450J09053K71482
2757A887964K21800j98598m2596j69823l04183k40353j40230q5840j53531P5439
2747H50049j60830j10000O0945j17431m2713j16783p0106j03697Q06l7638k362
2736A50240L7677r6612J29540j42562J09854P2134j59212J47253j58498n0639
2726C9175K06436k10288N6024K250j63628J21076o2806J03823L2210o2982m108
2715E7182q2172P6515J76607j01890L0447Q7890k21384R2089M5814k12824J6945
$$ plain form
2791 -53483 -73100 -38810 -41975 37446 -49252 -62198 -95994 -105529 -73283 -6266 35933 5401
2779 5401 53841 67436 -83996 -3537 34274 -58716 -24600 -57026 -6637 172405 230135 225735
2767 225735 326958 434871 551482 782712 919713 1143475 1309979 1507429 1616482 1887964
2757 1887964 2109764 1911166 1868570 1698747 1394564 1154211 1013981 928141 774610 850049
2747 850049 689219 579219 640164 522733 480020 363237 293131 189434 190240 152602 150240
2736 150240 187917 91305 220845 78283 188137 260271 101059 248312 89814 39175
2726 39175 245611 35323 91347 93597 -70031 51045 -11761 92062 124272 61290 57182
2715 57182 -24990 51525 228132 126242 156689 244579 23195 115284 161098 -51726 -34781
2704c4781r7461p9805O728q9767J17220N3645m6731k1897j04333J16399O8636
2693a12147J306R748j4857p1867j2631J4795L0896m5805l6510K794n3324J29178
2681a58424K1094j12170K01188j17588J08298M4366l5205J40835j31449J77666
2671A38611p7280o0413K26209j14473j4222N2337k27014J9999N2909o9137Q5179
2660A2705M6756r4942Q6784J6880J4267M7215k13865N8712j23874j3562J11709
2649e1215j94232J08259r9304n5089N7043N1071P6830J1494K9109r3538p6344
2638b35916L8260m1637M2653M301m4691J4523l6139M4402q833O0180L0223q2626
2626b15300J7188J19124p9464M4264N7195j36622O2934Q39M279J43306q9481o8050
$$ plain form
2704 -34781 -132242 -212047 -205319 -295086 -177866 -124221 -170952 -192849 -297182 -180783 -112147
2693 -112147 -110841 -101093 -115950 -187817 -200448 -185653 -154757 -200562 -237072 -234278 -287602 -158424
2681 -158424 -137330 -249500 -48312 -165900 -57602 -13236 -48441 92394 -39055 138611
2671 138611 61331 918 227127 112654 98432 150769 -76245 -56246 -3337 -72474 12705
2660 12705 59461 -35481 51303 68183 82450 129665 -84200 -25488 -149362 -162924 -51215
2649 -51215 -245447 -137188 -236492 -291581 -234538 -183467 -106637 -95143 -66034 -159572 -235916
2638 -235916 -197656 -239293 -196640 -192339 -237030 -222507 -258646 -214244 -223077 -162897 -132674 -215300
2626 -215300 -198112 -78988 -158452 -114188 -56993 -193615 -130681 -129842 -125563 17743 -71738 -139788
2614a39788P0994q6280L4284J46548J513l17p4966k570J36103K3719J53979O0429
2602C23648Q9888K81126N3259K31391J01529j7403M9660q9648O0204j3701j19204
2591I50749j534K7896j5322L1271K6623o2991n8890p9072j77486p3186m1253m9374
2579D77431k211o08r540O7597J33359R20J31731j320q0906j02785j12356q0680
2567D20632n0941J65124p1741j54474j7735r0294R822j23428r1250j19115k615
2556a26015l5734p6562J90108m0236N0104J1008q3402L8818Q6608Q2702j4224
2545H3175J8864L3093j4995n6594o2950J47056j55413m396j6312j72394K35099
2534C4233m7873n922k0396n8114O5636j77304J26524k0640o8960L0884j02257
$$ plain form
2614 -139788 -68794 -155074 -120790 25758 27271 26954 -48012 -50582 85521 109240 263219 323648
2602 323648 413536 694662 747921 979312 1080841 1063438 1113098 1023450 1083654 1069953 950749
2591 950749 949215 977111 961789 993060 1019683 956692 897802 818730 641244 568058 526805 477431
2579 477431 475220 474612 465072 532669 666028 666948 798679 797359 716453 613668 501312 420632
2567 420632 369691 534815 463074 308600 290865 200571 210393 86965 -4285 -123400 -126015
2556 -126015 -161749 -238311 -48203 -88439 -38335 -27327 -110729 -71911 14697 97399 83175
2545 83175 102039 135132 120137 63543 593 147649 -7764 -12160 -28472 -200866 34233
2534 34233 -13640 -19562 -39958 -98072 -32436 -209740 -83216 -103856 -172816 -141932 -244189
2523b44189r4653P3858O3868q5418P7491o5041p0349J16947k8790R7311l3195
2512a92160R5597m1188r860L5438j21578L4690j15215k2294Q098k9590J53699
2501b04363n3163K6765n325L6241N8323j6471L3463k152L9906j27012K3063L0608
2489a60117n5832J588m1936L0706m6524L6692L3276m5261J18127j28947P1006
2478a87222Q8778O7448p4657J6641O0156j66217J10807k8924j16721N1396p4490
2467b53005O8781o0483n325J606J1887P918p2745P0243M2081L4296Q143O7414
2455g9189j1665j38865P0069m9887R2870n4349l9192J3880j31036J36283j1068
2444b02149l9198M7443J5384O997J49603J8073j24537Q1813k14152J4255Q0397
$$ plain form
2523 -244189 -338842 -264984 -201116 -286534 -209043 -274084 -344433 -227486 -256276 -158965 -192160
2512 -192160 -96563 -137751 -147611 -112173 -233751 -199061 -314276 -336570 -328472 -358062 -204363
2501 -204363 -257526 -230761 -236086 -199845 -141522 -157993 -124530 -126682 -86776 -213788 -190725 -160117
2489 -160117 -215949 -214361 -256297 -225591 -272115 -235423 -202147 -247408 -129281 -258228 -187222
2478 -187222 -98444 -30996 -105653 -89012 -28856 -195073 -84266 -113190 -229911 -178515 -253005
2467 -253005 -184224 -244707 -250032 -248426 -236539 -228621 -301366 -231123 -189042 -154746 -146603 -79189
2455 -79189 -90854 -229719 -159650 -209537 -116667 -171016 -210208 -196328 -327364 -191081 -202149
2444 -202149 -241347 -193904 -178520 -171523 -21920 -3847 -128384 -46571 -260723 -246468 -166071
2433a66071l1871j581k1396P5255j72129J01386J30686n6313J40304m3663p6704
2422a22097M6733J3260l0317K5986N423k02082J73708j23476J2579J09681n0231
2411a40833J26905j41083J55934k6091K2556J90241j42622R0446j41130l3187
2401c8864J934r2696J21376j05863Q5437j02626O3020K9931M3015Q6451j67967
2390g6852J49314j8421j1008O6457k7139R2402p0952K888q816O8511L0734n7780
2378A39338l6304L765l4352M8768J22271j34885O7890O3029j20830J88148o14
2367C06224L9846J23894j08591m3266j18589Q6001n0570L5797R8903n9109J5032
2356C25572J16605O1786J15097J18546l3424J1543O3789p6673J85788K9049n3635
$$ plain form
2433 -166071 -197942 -199523 -220919 -145664 -317793 -216407 -85721 -142034 -1730 -45393 -122097
2422 -122097 -75364 -62104 -92421 -66435 -61012 -263094 -89386 -212862 -200283 -90602 -140833
2411 -140833 -13928 -155011 923 -25168 -2612 187629 45007 135453 -5677 -38864
2401 -38864 -36930 -129626 -8250 -114113 -28676 -131302 -68282 -38351 4664 91115 -76852
2390 -76852 72462 54041 43033 109490 82351 174753 103801 106689 97873 166384 197118 139338
2378 139338 103034 106799 72447 121215 243486 108601 176491 239520 118690 306838 306224
2367 306224 346070 469964 361373 318107 199518 285519 234949 270746 369649 310540 325572
2356 325572 442177 503963 619060 737606 704182 715725 779514 702841 888629 917678 864043
2345H64043J7117r9265J63646L1905L4867J54148m9130J75835J35097P0299J48466
2334A647028J64825R4312J22249J78365L79983J58773K74623L08345L03059M49761
2324D081323P58127P72101R06243L53506J60633Q1971L62484M25262Q77835J116661
2314I896146J838353K599633M067372O227332J1643928J7510166K2001218J6671570
2306I2455718l364059j5784208j7003521j3542525j0022864p040928n491762m187381
2298A6018470l443505k426392j635703j126891n18775k05412j77073m30605q17386
2289E236728p44110o82592n36294m52402l36242j91823q3012j62644o2633p1573
2279A913403k29597j0462j14975m7847j19814k22516L3306j9077l2197l0897j38917
$$ plain form
2345 864043 881160 781895 945541 977446 1012313 1166461 1117331 1293166 1428263 1498562 1647028
2334 1647028 1811853 1906165 2028414 2206779 2586762 2745535 3020158 3328503 3631562 4081323
2324 4081323 4839450 5611551 6517794 6871300 7031933 7113904 7476388 7901650 8779485 9896146
2314 9896146 11734499 14334132 18401504 24628836 36272764 53782930 75784148 92455718
2306 92455718 89091659 73307451 56303930 42761405 32738541 25697613 20205851 16018470
2298 16018470 12574965 10148573 8512870 7385979 6867204 6661792 6484719 6054114 5236728
2289 5236728 4492618 3810026 3273732 2821330 2485088 2293265 2210253 2047609 1984976 1913403
2279 1913403 1683806 1673344 1558369 1510522 1390708 1168192 1201498 1182421 1150224 1119327 980410
2268I80410L419j01763j72241P7289m1617j2194L2125j13545Q7277l5885j2213
2257F91062l8233m7557O7377q1207k8618O186j63599j7854j5482p7991M0249J63710
2245D98043j23427K7572j11517o3924P4121o1916N4435p0671k4287Q1141k16383
2234F3187J05697p9446j10024J13321j02765P7314R3687j50407L3604J09716k2618
2223A31266O0437n0190l4512K8141j17106N8063j38325n8816O2579j09191J37880
2212b9774j5143j02426J08084j12830L840K6037l6717N2392J4695m7698L0094
2201a09446r1426J4648J14471r3707N164M010o6846N7217J3753N0865k5125q8735
2189b15157P5957j19243P1052K2708J1779P826j07878m9642L4547k3138m5795
$$ plain form
2268 980410 983829 882066 709825 787114 745497 733303 765428 651883 739160 703275 691062
2257 691062 652829 605272 672649 591442 562824 569010 405411 387557 372075 294084 334333 498043
2245 498043 374616 402188 290671 226747 300868 238952 293387 222716 198429 279570 63187
2234 63187 168884 89438 -20586 92735 -10030 67284 160971 10564 44168 153884 131266
2223 131266 191703 141513 107001 135142 18036 76099 -62226 -121042 -58463 -167654 -29774
2212 -29774 -44917 -147343 -39259 -152089 -148249 -122212 -158929 -106537 -91842 -139540 -109446
2201 -109446 -200872 -186224 -71753 -165460 -160296 -156286 -223132 -165915 -152162 -101297 -126422 -215157
2189 -215157 -139200 -258443 -187391 -164683 -152904 -145078 -252956 -302598 -268051 -291189 -336984
2178c36984O9132k6582n086Q4413J637J5654O613L9677p5041m276K8232p5498
2166b78109J86599j20071r0360J69430j33647R198J9517k4554Q2208p9072O5854
2155a93007p6490o7284R9289j02696L8272O0699j09085N0226k9089m2419N4963
2144c16621J1654q0841j0561Q0277J0899O464q5939J17466l4166l9323Q3998p7143
2132c33836M7164N058r2858J15387o542L1086j20422K0185J7179o3886J99887
2121a81598l6657M768J7200j51961R037P5656k6936L8592p6523K6085q2415O003
2109c78749J12674l2536l8317R1097j10640n1786J23994o4423J7891O3608j22356
2098c89543L8172q299K9344R1235j72900J6070k7050r424J40003M6377k2960O1188
$$ plain form
2178 -336984 -267852 -294434 -299520 -215107 -213470 -197816 -191203 -151526 -226567 -230843 -202611 -278109
2166 -278109 -91510 -211581 -301941 -132511 -266158 -256960 -237443 -261997 -179789 -258861 -193007
2155 -193007 -269497 -336781 -237492 -340188 -301916 -241217 -350302 -300076 -329165 -371584 -316621
2144 -316621 -304967 -385808 -396369 -316092 -305193 -298729 -384668 -267202 -301368 -340691 -256693 -333836
2132 -333836 -286672 -281614 -374472 -259085 -265627 -234541 -354963 -334778 -317599 -381485 -181598
2121 -181598 -218255 -213487 -196287 -348248 -339211 -263555 -290491 -251899 -328422 -302337 -384752 -378749
2109 -378749 -266075 -298611 -336928 -245831 -356471 -408257 -284263 -348686 -330795 -267187 -389543
2098 -389543 -351371 -359670 -330326 -239091 -411991 -395921 -422971 -432395 -292392 -246015 -268975 -207787
2086b07787j29509L8308K6068j02676J41473q2320j17305M52j9574J57820o0974
2075c56024M0940N9664j20951M0160J09562k677o4537o1475o8107L6575Q3203
2064c03667j09671J34919l2106j17481P463J3944P5046o019L3157p4000N7085
2053c21330Q6378r8177J11357m9075n9043j4607K1077J25477o5194K3513N283
2042b34341j8642J55009M6688K4115O0455M9388l0038o3458j0742j34671M7027
2031a09210j24442j15475j4760K8419j2216n5274J23059M8989j48540M3434N324
2020c30692L8783P8591K082j35605J1408l427o0349J20177J2393j17510N601m018
2008c82566K6201O3162L9737m2980l2106M2575J5419l9744J07127o7400j34465
$$ plain form
2086 -207787 -337296 -298988 -272920 -375596 -234123 -316443 -433748 -433296 -452870 -295050 -356024
2075 -356024 -315084 -255420 -376371 -336211 -226649 -229326 -293863 -355338 -423445 -386870 -303667
2064 -303667 -413338 -278419 -310525 -428006 -420543 -406599 -331553 -337572 -304415 -378415 -321330
2053 -321330 -234952 -333129 -221772 -270847 -329890 -344497 -323420 -197943 -263137 -239624 -234341
2042 -234341 -252983 -97974 -51286 -27171 33284 82672 52634 -10824 -21566 -156237 -109210
2031 -109210 -233652 -349127 -363887 -335468 -347684 -402958 -279899 -230910 -379450 -336016 -330692
2020 -330692 -291909 -213318 -211236 -346841 -335433 -338860 -399209 -279032 -266639 -384149 -378548 -382566
2008 -382566 -356365 -293203 -253466 -296446 -328552 -285977 -270558 -310302 -203175 -270575 -405040
1997d05040J00808o5043K372O4638j1554m8731N8726j1452n4510J70240j10118
1986c09664J7765M1376q8774L0816j38049J17001o7654p0430J09727k08562P7610
1975d88838R7016k1037R5532J4601J8054k4598N5167O0720m3591L4999n9566o8191
1963c29732L9357q7288q1229o017q3L1146L0379K4963J49504j11894M4568o34
1951b96960j08647J23657o467q0457N2796k2715M2912k7108r0641L7585l5576
1940d11621L7068P130j04968K38337j4171j66784K10151k07200K9102J28610k36745
1929d91091J66360N2525j07628r351o5767L3130M7064n434J0244K3959O9945K5936
1917b50108j24807Q8090Q1793k04424J07197n0358j25327R4139k2907J9544M3976
$$ plain form
1997 -405040 -304232 -369275 -366903 -302265 -313819 -362550 -303824 -315276 -369786 -199546 -309664
1986 -309664 -291899 -250523 -339297 -308481 -446530 -329529 -397183 -467613 -357886 -566448 -488838
1975 -488838 -391822 -412859 -317327 -302726 -284672 -309270 -254103 -193383 -236974 -201975 -261541 -329732
1963 -329732 -290375 -377663 -458892 -464909 -464992 -433846 -403467 -378504 -229000 -340894 -296326 -296960
1951 -296960 -405607 -281950 -288417 -368874 -316078 -338793 -295881 -322989 -413630 -376045 -411621
1940 -411621 -374553 -367423 -472391 -234054 -248225 -415009 -204858 -412058 -382956 -254346 -491091
1929 -491091 -324731 -272206 -379834 -389185 -454952 -421822 -374758 -380192 -369948 -345989 -276044 -250108
1917 -250108 -374915 -286825 -205032 -409456 -302259 -352617 -477944 -383805 -406712 -387168 -343192
1906c43192J5002k1069J01489J6130r4214M3470P33j9950J492m0789m563M3149
1894c02312j5085m492m4391q95P6211m8159J6248J0128m0045K6546k4694J13204
1882b37736J0720Q13k8071q9743O5363k5906m2551m3105J08581r6087l0425K00882
1870b07265k10930J99449N5285j99325J69495r0281l3905J9753o0345r584K0170
1859c47483J2006l5486m4147M6418J1853K586P3744n542p5895K17258j01165j1485
1847b57338P1199j75121J57588J151j54006J00634o6945p6503O6565J978L033
1836c27765q0817l1282J04064r1294Q4086R4729l9649J02720j91097N9468N0878
1825b65959o1573J35913j94124J9646J27467n9330J5055l0069p6035K9299P856
$$ plain form
1906 -343192 -328190 -349259 -247770 -231640 -325854 -282384 -281651 -301601 -300109 -340898 -345461 -302312
1894 -302312 -317397 -321889 -366280 -367175 -290964 -339123 -322875 -312747 -352792 -326246 -350940 -237736
1882 -237736 -227016 -226203 -254274 -344017 -278654 -304560 -347111 -390216 -281635 -377722 -408147 -207265
1870 -207265 -418195 -218746 -163461 -362786 -193291 -283572 -317477 -297724 -358069 -367653 -347483
1859 -347483 -335477 -370963 -415110 -368692 -356839 -354253 -280509 -286051 -361946 -144688 -245853 -257338
1847 -257338 -186139 -361260 -203672 -202521 -356527 -255893 -322838 -399341 -332776 -330798 -327765
1836 -327765 -408582 -439864 -335800 -427094 -343008 -248279 -287928 -185208 -376305 -316837 -265959
1825 -265959 -327532 -191619 -385743 -366097 -238630 -297960 -282905 -312974 -389009 -359710 -351854
1814c51854M8761M4781o1189K2246n5824M8760L0279j60650J96723q4781j40382
1803d63130K01334j81788O5759J58076k2897j8818p3273K8411J7386j2057O8677
1792b32320m6027l6258n0071m6323O5473J80134j00188n8790j5872o3090J45523
1781b57809j1133r22K9301n8596L245L319J4057L4639p2677j7293l5908Q3579
1769b86198q256m6730P0854j20053N2049O0583n0620Q8985R470j03568Q150n4511
1757c79845L0378J14760j66525P461j520M073N3914q5646J24926R353j11168J01171
1745b98668o5996L5657J27065p8356n9095N9177m8880j6149Q0346j57579R5308
1734c27170j04442o2021J66618r4040J48443o3404n3343K2837m2198J30753J1735
$$ plain form
1814 -351854 -303093 -258312 -319501 -297255 -353079 -304319 -274040 -434690 -237967 -322748 -463130
1803 -463130 -261796 -443584 -377825 -219749 -242646 -261464 -334737 -306326 -288940 -300997 -232320
1792 -232320 -278347 -314605 -364676 -410999 -345526 -165392 -265580 -324370 -340242 -403332 -257809
1781 -257809 -268942 -269864 -240563 -299159 -295914 -292595 -278538 -243899 -316576 -333869 -369777 -286198
1769 -286198 -294454 -341184 -270330 -390383 -338334 -277751 -328371 -239386 -229916 -333484 -325334 -379845
1757 -379845 -349467 -234707 -401232 -393771 -395291 -391218 -337304 -422950 -298024 -288671 -399839 -298668
1745 -298668 -364664 -329007 -201942 -280298 -339393 -280216 -329096 -345245 -264899 -422478 -327170
1734 -327170 -431612 -493633 -327015 -421055 -272612 -336016 -389359 -366522 -408720 -277967 -266232
1723b66232k5071l6233P900j6792M6603P6906l9294p9844j03379L8655J9648J2977
1711c64156Q1572k6901n4647M1464N2821k5922J6982k0762o5923j6051P015P7098
1699b97410k1567p5127P4158r2274K2581K7562R296J43823j07497l0525J1692
1688c35288l3601K2897N1993R16p6653J09319j19324m3651O3421o8315J29226
1677b99060q631n5036Q5305m3625P0071o407j04972m660j1280J36882L0960j01957
1665c12410O9538j33619l0472M4458k3545Q4459o3793n323j9402O7730J44933
1654a77446r8088K0122n4316o8741P6650j01035J73179q7221j05802P2726j05629
1643d55601O6111j8926P4147l9142o193J6420j72663J78930N3022l7939P0532
$$ plain form
1723 -266232 -291303 -327536 -319636 -336428 -289825 -212919 -252213 -332057 -435436 -396781 -377133 -364156
1711 -364156 -282584 -309485 -364132 -322668 -269847 -295769 -278787 -299549 -365472 -381523 -374508 -297410
1699 -297410 -318977 -394104 -319946 -412220 -389639 -362077 -352781 -208958 -316455 -346980 -335288
1688 -335288 -368889 -345992 -293999 -293083 -369736 -260417 -379741 -423392 -359971 -428286 -299060
1677 -299060 -307691 -362727 -277422 -321047 -250976 -257383 -362355 -367015 -378295 -241413 -210453 -312410
1665 -312410 -242872 -376491 -406963 -362505 -386050 -301591 -365384 -370707 -390109 -322379 -177446
1654 -177446 -275534 -255412 -309728 -378469 -301819 -402854 -229675 -316896 -422698 -349972 -455601
1643 -455601 -389490 -408416 -334269 -373411 -379604 -363184 -535847 -356917 -303895 -341834 -271302
1632b71302j70476Q3179J33689r973P0039j70654j8781q6586L971J71845m7222
1621c12271N9366l1474j24084Q1098J1214N8041j7161l1107k9975l6772M7319
1610c25806p7003J07666l3420o8514P0169n8250J06859J7286r2308O1164q8622
1599c80779L5326O9231l770K13631j72531q5821j9245n1806J54915q2340p2402
1588c95591O0271l8170J15464J3608j4596K0857j01882K1506L7454J9562J9864
1577b41653N9953n6861j68786o686K838J12424j4583j6660N7737o2718J00707
1566b34288k31285J39181J31462j93693J62879j37332J23987J26180j73135Q6622
1556a99422k60664M7585P6823j39462J99140k1818M670O8101p3323M1991Q3360
$$ plain form
1632 -271302 -441778 -358599 -224910 -234883 -164844 -335498 -354279 -440865 -436894 -265049 -312271
1621 -312271 -252905 -284379 -408463 -327365 -316151 -258110 -275271 -306378 -336353 -373125 -325806
1610 -325806 -402809 -295143 -328563 -397077 -326908 -385158 -278299 -261013 -353321 -292157 -380779
1599 -380779 -345453 -276222 -279992 -66361 -238892 -324713 -343958 -395764 -240849 -323189 -395591
1588 -395591 -335320 -373490 -258026 -244418 -259014 -238157 -340039 -318533 -281079 -261517 -241653
1577 -241653 -181700 -238561 -407347 -414033 -411195 -298771 -313354 -330014 -272277 -334995 -234288
1566 -234288 -465573 -326392 -194930 -388623 -225744 -363076 -239089 -112909 -286044 -199422
1556 -199422 -460086 -412501 -335678 -475140 -276000 -297818 -293148 -225047 -298370 -256379 -173019
1545a73019o9677J0072J5825j12431J69201k7628q7278L8510j72468J53291o2768
1534c18370j38202J90915j19312P1296P1205k00349J53810P1044r1251J50136
1524a59078m1676l0681J0017j42798R5080j8659p4155O8995j17492J45387k4318
1513b89378m8640Q0400o2393L6245l453K5904L4701J3629J9118r0628m6007o771
1501c37273O8639o2393o3232q881l9314J07033q4129J03024J5563n1465J14559
1490b37869q1988J12086k8354m9163K36494k38944N043L1436j91700J27523k3234
1479c38670p1698J38691m6180M897M0662l1555J48786j48006K0893J01366j37812
1468c18626M5494k3024q0475O9104q2754p1270J60235q956j1296J19165j45838
$$ plain form
1545 -173019 -242696 -232624 -216799 -329230 -160029 -187657 -274935 -236425 -408893 -255602 -318370
1534 -318370 -456572 -265657 -384969 -313673 -242468 -442817 -289007 -217963 -309214 -159078
1524 -159078 -200754 -231435 -221418 -364216 -269136 -287795 -361950 -292955 -410447 -265060 -289378
1513 -289378 -338018 -257618 -320011 -283766 -287219 -261315 -226614 -212985 -193867 -284495 -330502 -337273
1501 -337273 -268634 -331027 -394259 -403140 -442454 -335421 -419550 -316526 -300963 -352428 -237869
1490 -237869 -319857 -207771 -236125 -285288 -48794 -287738 -282695 -251259 -442959 -315436 -338670
1479 -338670 -410368 -271677 -317857 -312960 -272298 -303853 -155067 -303073 -282180 -180814 -318626
1468 -318626 -273132 -296156 -376631 -307527 -390281 -461551 -301316 -310272 -321568 -202403 -348241
1457c48241Q6501P1440j05048K03532q7183r7534L3061o6546o201m8352J091m3712
1445d07192J944l0100P507J10659O01Q6708k25m0915M7403j5900J13349j00729
1433b26890q7294R0582n2295m4696N6164r5910n5338M7667k1063Q3385j8030j4088
1421c37806J09563q1533M1114J6323J7727L2447j5385o5472l7891r232m5628J5840
1409c59933p5581M829Q195J0026Q9259K9937J03520N5013j30031J7684o6874N1211
1397b62745L728p4311o6524p404L5930o5410J22015n1342m089P4036j88070J93514
1385b90672Q4261k8632J6688p4150R914l4737L695N4783p2793q9573k8716J7141
1373d32791Q868J73351k0114J970R370j07197J32601P0607P077K2528j32502l6670
$$ plain form
1457 -348241 -261740 -190300 -295348 -91816 -178999 -276533 -243472 -310018 -316219 -364571 -363480 -407192
1445 -407192 -405248 -435348 -427841 -317182 -316581 -229873 -230098 -271013 -223610 -239510 -126161 -226890
1433 -226890 -314184 -223602 -275897 -320593 -264429 -360339 -415677 -368010 -389073 -305688 -323718 -337806
1421 -337806 -228243 -309776 -268662 -252339 -234612 -202165 -217550 -283022 -320913 -330145 -375773 -359933
1409 -359933 -435514 -430685 -422490 -412464 -323205 -293268 -189748 -134735 -264766 -247082 -313956 -262745
1397 -262745 -259017 -333328 -399852 -407256 -371326 -436736 -314721 -366063 -370152 -296116 -484186 -290672
1385 -290672 -206411 -235043 -218355 -292505 -282591 -317328 -313633 -258850 -331643 -421216 -449932 -432791
1373 -432791 -423923 -250572 -270686 -268716 -259346 -366543 -233942 -163335 -156258 -133730 -266232 -302902
1361c02902p1118k2674K1147m8452K0004m5312K5290N258L5343R2171j3540L0482
1349b74303M7059N7741K6722m5288n703p0377o5835l0563l5256J11729o169l9379
1337c29622O7467j28169J00696O3517k7851O5852l0106n7398M1166K292K2792
1326b09364p3360N389j01094O7191P4496l3343Q4473j40117K544l2462K0324J40982
1314a94341n9507R0568k7067q0339J35968m3442m1850j6028j02124m0166N887
1303c72441j184J4323l6815J11579M2933j02134J4330O2875o694N7885o3282p0222
1291c48847J34207p1394O5464J7584j25789M3397j47247M0713J69915q6341R2160
1280b16178l5494o3635Q8652j338r461J44603j47896l7795L0117j62528J68190
$$ plain form
1361 -302902 -374020 -396694 -375547 -423999 -403995 -449307 -424017 -418759 -383416 -291245 -304785 -274303
1349 -274303 -227244 -169503 -142781 -188069 -193772 -264149 -329984 -360547 -395803 -284074 -290243 -329622
1337 -329622 -262155 -390324 -289628 -226111 -253962 -188110 -218216 -275614 -234448 -232156 -209364
1326 -209364 -282724 -277335 -378429 -311238 -236742 -270085 -185612 -325729 -323185 -355647 -335323 -194341
1314 -194341 -253848 -163280 -190347 -270686 -134718 -178160 -220010 -236038 -338162 -378328 -372441
1303 -372441 -373625 -359302 -396117 -284538 -241605 -343739 -329409 -266534 -273228 -215343 -278625 -348847
1291 -348847 -214640 -286034 -220570 -202986 -328775 -285378 -432625 -391912 -221997 -308338 -216178
1280 -216178 -251672 -315307 -226655 -227993 -237454 -92851 -240747 -278542 -248425 -410953 -242763
1269b42763J6487l7261o6924j67109J52877M4965N9892l232j19514P6329L5662
1258b50591j9065K5823M5032p3470m3459N0553j46195K5835M0861j02602J72639
1247b74639l3975j756J6276J8944Q9112k6397k9763J4053o0978P2522P9581j34549
1235b71569J23313m2763r1705N4906o4408q903j8715N0520j6246J1253J3301J3052
1223b47964J471j07411K12897j15059L0153J29540j91932O4447j98832Q6679J61312
1212a74699j22238J09764j76783o952P7102p8547J02856o040R4855K8565q7097
1201b39214j9387j3277O963n4999L3765k1302r8860M4022M4359p8583L2381M3132
1189c21000k1473J48251m9751k772J449M7202O688K6781l8878j54438P160j251
$$ plain form
1269 -242763 -226276 -263537 -330461 -497570 -344693 -299728 -239836 -243068 -362582 -286253 -250591
1258 -250591 -269656 -243833 -198801 -272271 -315730 -265177 -411372 -385537 -344676 -447278 -274639
1247 -274639 -308614 -310370 -294094 -275150 -186038 -212435 -242198 -228145 -289123 -216601 -137020 -271569
1235 -271569 -148256 -191019 -282724 -227818 -292226 -301129 -319844 -269324 -285570 -274317 -261016 -247964
1223 -247964 -246493 -353904 -141007 -256066 -225913 -96373 -288305 -223858 -422690 -336011 -174699
1212 -174699 -296937 -187173 -363956 -370908 -293806 -372353 -269497 -275537 -180682 -152117 -239214
1201 -239214 -258601 -271878 -264915 -319914 -286149 -307451 -406311 -362289 -317930 -396513 -364132 -321000
1189 -321000 -342473 -194222 -243973 -246745 -245296 -198094 -191406 -164625 -203503 -357941 -350781 -352032
1177c52032J16627m952q3295L4989j21255J85885m5939m0101J34730k20018J77331
1166b18030m5622r0168P2029j09062K6939k2453O64O421R7372q5426l8666J64357
1154b41645j53460J22852k2769n8066L33319j75676J4607j5429q7157R3382j18457
1143c08499L8156k0606r4053J85151k9444j05088J20187j64747k2642K37955r5138
1132b58768J5185J03195j50810M0996K4599p1431n4148K9737l1606n0844j3627
1121d17522J70377m9501n0712K16402j75886J30513j0873j03280J02062j45498
1111c33918J06166m6828j24647O2906r4596K6112K1747K0467R5563p7329P6833
1100b67524j3023r075K3810m3956R0009j4j09969N7777p0964o5903J20374l1211
$$ plain form
1177 -352032 -235405 -240357 -323652 -288663 -409918 -224033 -269972 -310073 -175343 -395361 -218030
1166 -218030 -263652 -353820 -281791 -390853 -363914 -386367 -385703 -379282 -281910 -367336 -406002 -241645
1154 -241645 -395105 -272253 -295022 -353088 -19769 -195445 -180838 -196267 -283424 -190042 -308499
1143 -308499 -270343 -290949 -385002 -199851 -229295 -334383 -214196 -378943 -401585 -163630 -258768
1132 -258768 -243583 -140388 -291198 -250202 -225603 -297034 -351182 -321445 -353051 -403895 -417522
1121 -417522 -247145 -296646 -347358 -130956 -306842 -176329 -187202 -290482 -188420 -333918
1111 -333918 -227752 -274580 -399227 -336321 -430917 -404805 -383058 -362591 -267028 -344357 -267524
1100 -267524 -280547 -289622 -265812 -309768 -219759 -219773 -329742 -271965 -342929 -408832 -288458 -319669
1088c19669k8636Q1838r6429K5148R0973m4991J01933n2371Q7721M210k00190
1077c50463J31609j17940O5034J41492k63839K07647n6993j64641J18671q1896
1067c71319l8879Q1671K581k8758J31685k4353K7015k8606r1224J32704o3907
1056b71390l757J12439j56388J11847j5798j06775R5196j3788K0251j03922L6651
1045b95434L3538n2185P5613l0945n7536L3550J37910j20878M8839L5728k21944
1034d13744J41429r142o2709J00876j7392J4815o2448J02203n7560m90L3506j49170
1022c79826k6361Q6198K8800J4202N6890p8155k4684j3602Q9627L8987m1987J4603
1010b35308j17389N9435P0771j0482P4936r3225q4736p971k0904N7280P269Q883
$$ plain form
1088 -319669 -348305 -266467 -362896 -337748 -246775 -291766 -189833 -242204 -154483 -150273 -350463
1077 -350463 -218854 -336794 -271760 -130268 -394107 -186460 -243453 -408094 -289423 -371319
1067 -371319 -410198 -328527 -325946 -354704 -223019 -247372 -220357 -248963 -340187 -207483 -271390
1056 -271390 -275147 -162708 -319096 -207249 -223047 -329822 -234626 -248414 -228163 -332085 -295434
1045 -295434 -261896 -314081 -238468 -269413 -326949 -293399 -155489 -276367 -227528 -191800 -413744
1034 -413744 -272315 -281457 -344166 -243290 -260682 -245867 -308315 -206112 -263672 -264162 -230656 -379826
1022 -379826 -406187 -319989 -291189 -276987 -220097 -298252 -322936 -336538 -246911 -207924 -249911 -235308
1010 -235308 -352697 -293262 -222491 -232973 -158037 -251262 -335998 -343969 -364873 -307593 -300324 -291441
998b91441K3622j61836P913J74236k0189P7096M7114j74177J43731o6329m3765
987b84025J77653o8955j10512o8382R2388O8129o9371P6727j48697l6013J74937
976a96121m6902R5700J39994j81818m2630l5823n6861o185P9100j3736j28627
965c93909J15989n887r491J72467j80325m9508J3845k9589R5227J9832N3975q3528
953b80902m6739n7187J3633m2323Q9076j4789r9377J02953m8894J23567J28466
942a32516j40049Q2481r7989j7269O5981q7307J74245p6215l0491K5370j11708
931c45467k1058R0710j08243l5774K33134j89280R521K42354r9314j27819M6077
920c05159o8912k1138J91217r7546j14712j7774j4933L7269L6271J29625q9143
$$ plain form
998 -291441 -267819 -429655 -421742 -247506 -267695 -190599 -143485 -317662 -173931 -240260 -284025
987 -284025 -106372 -175327 -285839 -354221 -261833 -193704 -263075 -186348 -335045 -371058 -196121
976 -196121 -243023 -147323 -7329 -189147 -231777 -267600 -324461 -330646 -251546 -265282 -393909
965 -393909 -277920 -283807 -293298 -120831 -301156 -350664 -336819 -366408 -271181 -251349 -197374 -280902
953 -280902 -327641 -384828 -371195 -413518 -324442 -339231 -438608 -335655 -384549 -260982 -132516
942 -132516 -272565 -190084 -288073 -305342 -239361 -326668 -152423 -228638 -259129 -233759 -345467
931 -345467 -366525 -275815 -384058 -419832 -186698 -375978 -366457 -124103 -223417 -351236 -305159
920 -305159 -374071 -395209 -203992 -301538 -416250 -434024 -448957 -411688 -375417 -245792 -334935
909c34935K1153P0688r1146J35121k8174r5140P98K3037n0663j5255L4525n2798
897c82789J11962q6602m7886J32797o7432K28941j04582q0328J59987p8065J26739
886h7258J7768j27698o5002n6709k1119N4785J16997m8240o7587p3542o7300O0551
874c64354P4580J33119k9165l5319Q488j27346Q4037J08986j37464K7666j0968
863b67740j54581J38851k1478j8247P2275p1268O0843O2059N0267k5990J6040
852a58969m0603r2799m2489K8720J20587j50453l2430N895o6999K06661m7293
841b70172N2669J5129q5160l2173J02015J35653l2793l8243j9596n3715j41781
830c68167J4628P9628k5413L5314q0378j2702l7212N6505O0090Q9929j3481j15582
$$ plain form
909 -334935 -313782 -243094 -334240 -199119 -227293 -322433 -321635 -298598 -349261 -364516 -329991 -382789
897 -382789 -270827 -357429 -405315 -272518 -339950 -111009 -215591 -295919 -135932 -213997 -87258
886 -87258 -69490 -197188 -262190 -318899 -340018 -285233 -168236 -216476 -284063 -357605 -424905 -364354
874 -364354 -289774 -156655 -185820 -221139 -212651 -339997 -255960 -146974 -284438 -256772 -267740
863 -267740 -422321 -283470 -304948 -323195 -250920 -322188 -261345 -199286 -149019 -175009 -158969
852 -158969 -199572 -292371 -334860 -306140 -185553 -336006 -368436 -362541 -429540 -222879 -270172
841 -270172 -217503 -202374 -287534 -319707 -217692 -82039 -114832 -153075 -172671 -226386 -368167
830 -368167 -353539 -273911 -299324 -264010 -344388 -357090 -394302 -337797 -277707 -187778 -201259 -316841
818c16841J60368p5519o7685J77107j90226j5116o7609K5930N0688m1869R0681
807b70091n4393P445J06366L5787M731M5723j01441o5476J05218j26177M7329
796b64979L2493j70572M9588j33762M8113Q5290j8315J90156l4870p6612J04284
785a89186n3383P016J9562K0332j6170K098j69504j0483M4885K29M5709p408L671
772c02632K7561k5705L2440K0369m4928J58462q7238r6124J74860j62623Q2581
761b22977o5472j32015J37457r5156j6729O6343j7922L64N5243R3898L9619O5855
749i1492p1500m4756k7873k1816M1171o8531n2662p0314k9080L7177r995N4086
737c55585M2778m648K1716R6126n109K6019j01810N375J69515j15217n7862J0323
$$ plain form
818 -316841 -156473 -231992 -299677 -122570 -312796 -327912 -395521 -369591 -318903 -360772 -270091
807 -270091 -324484 -317039 -210673 -174886 -170155 -124432 -225873 -291349 -186131 -312308 -264979
796 -264979 -232486 -403058 -353470 -487232 -439119 -353829 -372144 -181988 -216858 -293470 -189186
785 -189186 -242569 -235553 -215991 -195659 -211829 -209731 -379235 -389718 -344833 -344604 -298895 -306303 -302632
772 -302632 -275071 -300776 -268336 -247967 -292895 -134433 -221671 -317795 -142935 -305558 -222977
761 -222977 -288449 -420464 -283007 -378163 -394892 -328549 -346471 -346107 -290864 -196966 -157347 -91492
749 -91492 -162992 -207748 -235621 -257437 -216266 -284797 -337459 -407773 -436853 -399676 -409671 -355585
737 -355585 -312807 -317455 -295739 -199613 -204722 -178703 -280513 -275138 -105623 -220840 -278702 -268379
725b68379o7994J3851P0545p4925j28486J35484L8732O2378J60481j98194R4036
714a62471o0801r206M8082m8759J2062r2837P1713r2873p2449N3759J541O2588
702b89651j0250M2494j8071J1577M8329m2548K1285N355j0305l4762p9447L4252
690c21742k9413p5297R9878m8537o6800J36139n9373N7371J33711j51678J08420
679b17321O2175j44263L3899n6339j24641J36893o1k0951M2240l1863N9642n9112
667c19702j0118O8469j03796J34690P336l5145J36460p8851j6384L5730q9427
656b70738k1259k7634n784M4647j0250L8930J8351l1468R6054P4715l5898l2087
644a62421q6922L3125j17383J39412n000j52150J43013j13667o1669J18614K6654
$$ plain form
725 -268379 -336373 -322522 -251977 -326902 -455388 -319904 -281172 -218794 -58313 -256507 -162471
714 -162471 -223272 -232478 -184396 -233155 -221093 -313930 -242217 -335090 -407539 -353780 -352239 -289651
702 -289651 -299901 -257407 -275478 -263901 -215572 -258120 -236835 -231480 -241785 -276547 -355994 -321742
690 -321742 -351155 -426452 -326574 -375111 -441911 -305772 -365145 -307774 -174063 -325741 -217321
679 -217321 -155146 -299409 -265510 -321849 -446490 -309597 -309658 -330609 -288369 -320232 -260590 -319702
667 -319702 -329820 -261351 -365147 -230457 -223121 -258266 -121806 -200657 -217041 -181311 -270738
656 -270738 -291997 -319631 -325415 -280768 -291018 -252088 -233737 -265205 -169151 -94436 -130334 -162421
644 -162421 -249343 -216218 -333601 -194189 -199189 -351339 -208326 -321993 -383662 -265048 -238394
633b38394R179M9122q0454K2481J66104j51008R0304l3416p4040P600j21022J46069
621b07475o2119k5655M2583k18055J83682J14149k7187Q3130m3605j02024J8902
610b43674k2534L0764R7124j65343o2684M4910l7127J10826m8459L7184O320j36812
598c89505J54801M79l0457L9527R8910j8812l1646o0467j4646L7907j48777O5740
586b96946p4355O4530J33496k06581J00189m5765q933J28241o4984L7612K2991
575b10505P462l6601j5268J3432k7906O6090O011n8453l3896j606p3805J21516
563b43529J02060j58279J25822j18250l4099J06624j12474P4784n7227k2548O7762
552b69354j1740K6068k2255j9490P8819j46260N5243J51250r9907J35004o2438
$$ plain form
633 -238394 -229215 -180093 -260547 -238066 -71962 -222970 -132666 -166082 -240122 -232522 -353544 -207475
621 -207475 -269594 -295249 -252666 -470721 -287039 -172890 -200077 -116947 -160552 -262576 -243674
610 -243674 -266208 -235444 -138320 -303663 -366347 -321437 -358564 -247738 -296197 -259013 -252693 -389505
598 -389505 -234704 -234225 -264682 -225155 -126245 -145057 -176703 -237170 -251816 -213909 -362686 -296946
586 -296946 -371301 -306771 -173275 -379856 -279667 -325432 -334365 -206124 -271108 -233496 -210505
575 -210505 -203043 -239644 -254912 -241480 -269386 -203296 -197285 -255738 -289634 -291240 -365045 -243529
563 -243529 -141469 -299748 -173926 -292176 -326275 -219651 -332125 -257341 -314568 -337116 -269354
552 -269354 -281094 -255026 -277281 -296771 -217952 -364212 -308969 -157719 -257626 -122622 -185060
541a85060q0576J75981j67503K0164J43786k25463R5094j0205j70507J45528q3275
530c42036j6377J08363j02955N1904N0045M3516Q6361j53029J11108p3454p6143
519c12697J45896j29272j9770R0988j39172J33380P594q2654Q6447K5221o3394
508b57433J09187l1012k0636m7147j903J15644j48102Q5496K6037j49215J18653
497b00431r8452o341N5055m1613J12669j4663q1698P1612n0765Q411Q1977j18336
485b82575m6904m0951L9098J02314q9370M9006O5888j15761J07452j12626J31325
474a93104Q3233p6891M6167j1029p9562K0161L5060q9727k1340r6290J4117J02438
462b66767j04823R6078N575P6996l0688m8002O8438n3306N755J8742q1503Q7081
$$ plain form
541 -185060 -265636 -89655 -257158 -236994 -93208 -318671 -223577 -233782 -404289 -258761 -342036
530 -342036 -358413 -250050 -353005 -301101 -251056 -207540 -121179 -274208 -163100 -236554 -312697
519 -312697 -166801 -296073 -315843 -224855 -364027 -230647 -223053 -305707 -219260 -194039 -257433
508 -257433 -148246 -179258 -199894 -247041 -248944 -133300 -281402 -195906 -169869 -319084 -200431
497 -200431 -298883 -305224 -250169 -291782 -179113 -193776 -275474 -203862 -254627 -246216 -164239 -282575
485 -282575 -329479 -370430 -331332 -229018 -318388 -269382 -203494 -319255 -211803 -324429 -193104
474 -193104 -109871 -186762 -140595 -151624 -231186 -211025 -175965 -265692 -287032 -383322 -369205 -266767
462 -266767 -371590 -275512 -269937 -192941 -223629 -271631 -203193 -256499 -250744 -232002 -313505 -226424
450b26424n9065k9694l197p2135K1695p895J00820J6460m110Q3024m9967j3016
438b43504N7373n7629j5269J97m6938N4241n8765j4730Q9275q7378j6025k0183
426c59335m7516Q0581J3843L3078Q6348j17903P3093n1946j9983O0539j03935
415c53136N7973M5271j18840J55702j0868J935P0197j70336N6873N9141l0135
404b36223O6245m2050N2964m1210m0057k0383l9596J14837r1998o5153J5826J2305
392c14493N3283L4624j1315l4328N3227K7173k8245O0271K9392j552o8096j872
380b01931l5447j66089J77867j15777n9986P1104j17356K54460p1676p724J09795
369a62760n6735J4014J6177m4269J12903n5197r9911J9357m2619K49O6136p3311
$$ plain form
450 -226424 -285489 -315183 -318380 -390515 -368820 -376715 -275895 -259435 -263545 -180521 -230488 -243504
438 -243504 -186131 -243760 -259029 -258832 -305770 -251529 -310294 -325024 -235749 -323127 -339152 -359335
426 -359335 -406851 -326270 -312427 -279349 -193001 -310904 -237811 -289757 -309740 -249201 -353136
415 -353136 -295163 -249892 -368732 -213030 -223898 -221963 -151766 -322102 -265229 -206088 -236223
404 -236223 -169978 -212028 -159064 -200274 -240331 -260714 -300310 -185473 -277471 -342624 -326798 -314493
392 -314493 -261210 -226586 -237901 -272229 -219002 -191829 -220074 -159803 -130411 -131963 -200059 -201931
380 -201931 -237378 -403467 -225600 -341377 -401363 -330259 -447615 -193155 -264831 -272555 -162760
369 -162760 -219495 -205481 -189304 -233573 -120670 -175867 -275778 -256421 -299040 -298791 -232655 -305966
357c05966M250m4320m233N9179O7865J2558n6920o530J6318n0007p0044J98228
345a79622q4413j12709P2988j94681J27523Q8632n1241J63775j37965O6636m8908
334b89985M8511P4409m9582R9308k05580M4607R4717j42440J11994m8965l2532
323b95538l7979k1345P2099J8365K2378j0561m3931l8332J27172l4938M0144P730
311a94736q3916R4836j53401M6827J13160j55363Q4535L0335p8503J22538j51226
300c24914k558J97273j56387P6835N6869j75120J47364q0287n689j5283o3907
289c45804J16922j59331J14289P5337j58295J26930o8260r229J16017j1181q4455
278b87060Q3815k2974j14657P9240k9696M1791j3294j28266L1352K0753Q2459
$$ plain form
357 -305966 -301716 -346036 -350269 -291090 -223225 -210667 -267587 -274117 -257799 -307806 -377850 -179622
345 -179622 -264035 -376744 -303756 -498437 -370914 -282282 -333523 -169748 -307713 -241077 -289985
334 -289985 -241474 -167065 -216647 -117339 -322919 -278312 -183595 -326035 -214041 -263006 -295538
323 -295538 -333517 -354862 -282763 -264398 -242020 -252581 -296512 -334844 -207672 -242610 -202466 -194736
311 -194736 -278652 -183816 -337217 -290390 -177230 -332593 -248058 -217723 -296226 -173688 -324914
300 -324914 -327472 -130199 -286586 -209751 -152882 -328002 -180638 -260925 -266614 -281897 -345804
289 -345804 -228882 -388213 -273924 -198587 -356882 -229952 -298212 -307441 -191424 -202605 -287060
278 -287060 -203245 -226219 -340876 -261636 -291332 -249541 -262835 -391101 -359749 -338996 -256537
267b56537J2160M269K1947l7776R1086q3719P056P883p7055J17534n5469k4854
255b73475j814p4694J1034J07641j3230L7169L9723o4884l8683r2699J33055R9920
243a30937j11119M7496r0228L6370j40j7253N3611j7053j05319l5271J33264j26922
231c63501J93056j4846j17027J21101r2414M0518K7578l2277K4273j20671L9148
220b95062m1996K9257l4550K3901j5339K3135m7444K1305J13030q5599M7454M2999
208b18909q6437J10035p4951K4142J8861l4727l1112N3271m0197j07027J27022
197b60029o9653o619L1843m0277K21364j07624R358k1770j07904L8534j4939N4771
185b72945m8863L0334K2864k4413j3932o0774R9824k5404k9291K4544n7751J39882
$$ plain form
267 -256537 -244377 -240108 -218161 -255937 -164851 -248570 -241514 -233631 -310686 -193152 -248621 -273475
255 -273475 -275289 -349983 -338949 -231308 -244538 -207369 -167646 -232530 -271213 -363912 -230857 -130937
243 -130937 -242056 -194560 -284788 -248418 -248558 -265811 -212200 -229253 -334572 -369843 -236579 -363501
231 -363501 -170445 -185291 -302318 -181217 -273631 -233113 -205535 -237812 -213539 -334210 -295062
220 -295062 -337058 -307801 -342351 -318450 -333789 -310654 -358098 -336793 -223763 -309362 -261908 -218909
208 -218909 -305346 -195311 -270262 -246120 -227259 -261986 -293098 -239827 -280024 -387051 -260029
197 -260029 -329682 -336301 -304458 -344735 -123371 -230995 -221637 -243407 -351311 -312777 -327716 -272945
185 -272945 -321808 -291474 -268610 -293023 -306955 -367729 -267905 -293309 -322600 -298056 -355807 -215925
173b15925j02512L2716j061J9186K5088M2980j30031l1755J38889j96525R4621
$$ plain form
173 -215925 -318437 -285721 -286782 -267596 -242508 -199528 -329559 -361314 -222425 -418950 -324329
$$ [...]
##END NTUPLES=NMR SPECTRUM
##END=
