##TITLE=1H_DE-80H_X3
 200.13MHz, d2o
 8 sc
 
 19ns.26.2.2025
##JCAMPDX= 6.0         $$ Bruker NMR JCAMP-DX V2.0
##DATA TYPE= NMR SPECTRUM
##DATA CLASS= NTUPLES
##ORIGIN= UXNMR, Bruker Analytische Messtechnik GmbH
##OWNER= pz
$$ XWIN-NMR		Version 3.5
$$ Fri Apr 10 09:50:15 2026 Russian Standard Time (UT+4h)  Yarkov@DPX200
##.OBSERVE FREQUENCY= 200.1313
##.OBSERVE NUCLEUS= ^1H
##.ACQUISITION MODE= SIMULTANEOUS
##.ACQUISITION SCHEME= undefined
##.AVERAGES= 8
##.DIGITISER RES= 18
##SPECTROMETER/DATA SYSTEM= spect
##.PULSE SEQUENCE= zg30
##.SOLVENT NAME= CDCl3
##.SHIFT REFERENCE= (INTERNAL, CDCl3, 0, 15.4891)
##AUDIT TRAIL= $$ (NUMBER, WHEN, WHO, WHERE, WHAT)
$$ ##TITLE= Audit trail, XWIN-NMR		Version 3.5
$$ ##JCAMPDX= 5.01
$$ ##ORIGIN= Bruker BioSpin GmbH
$$ ##OWNER= Yarkov
$$ C:/Bruker/XWIN-NMR/data/yarkov2/nmr/H-C/1/pdata/1/auditp.txt
$$ ##AUDIT TRAIL=  $$ (NUMBER, WHEN, WHO, WHERE, WHAT)
(   1,<2026-04-10 09:49:27.65 +0400>,<Yarkov>,<DPX200>,
      <created by zg, POWCHK disabled, PULCHK disabled
       configuration hash MD5:
       00 E9 B6 7A A2 85 ED C7 34 08 36 98 17 FE 4E 26
       data hash MD5: 16K
       8D 6C A5 02 CF 0E D6 3C 28 2F 8D 90 0F 1C 96 A2>)
(   2,<2026-04-10 09:49:33.34 +0400>,<Yarkov>,<DPX200>,
      <Start of raw data processing
       efp BC_mod = 2 LB = 0.25 FT_mod = 6 PKNL = 1 PHC0 = -5301.948 PHC1 = 6.821927 SI = 16K 
       data hash MD5: 16K
       67 B4 F3 F2 8E CE EF F5 F3 29 A8 98 33 50 EC BB>)
$$ ##END=
$$ 
$$ hash MD5
$$ 07 B7 C3 08 6F A8 A1 6A F4 75 21 34 FE 56 E4 49
##$RELAX= 
##$RELAX= 
##$RELAX= 
##$RELAX= 
##$RELAX= 
##$RELAX= 
$$ Bruker specific parameters
$$ --------------------------
##$DU= <C:/Bruker/XWIN-NMR>
##$EXPNO= 1
##$NAME= <H-C>
##$PROCNO= 1
##$TYPE= <nmr>
##$USER= <yarkov2>
##$AMP= (0..31)
100 100 100 100 100 100 100 100 100 100 100 100 100 100 100 100 100 100 
100 100 100 100 100 100 100 100 100 100 100 100 100 100 
##$AQSEQ= 0
##$AQ_mod= 1
##$AUNM= <au_zg>
##$AUTOPOS= <>
##$BF1= 200.13
##$BF2= 200.13
##$BF3= 200.13
##$BF4= 200.13
##$BF5= 200.13
##$BF6= 200.13
##$BF7= 200.13
##$BF8= 200.13
##$BYTORDA= 1
##$CFDGTYP= 0
##$CFRGTYP= 5
##$CHEMSTR= <none>
##$CNST= (0..31)
1 1 145 1 1 1 1 1 1 1 1 1 1 1 1 1 1 1 1 1 1 1 1 1 1 1 1 1 1 1 1 1 
##$CPDPRG= <>
##$CPDPRG1= <>
##$CPDPRG2= <>
##$CPDPRG3= <>
##$CPDPRG4= <mlev>
##$CPDPRG5= <mlev>
##$CPDPRG6= <mlev>
##$CPDPRG7= <mlev>
##$CPDPRG8= <mlev>
##$CPDPRGB= <>
##$CPDPRGT= <>
##$D= (0..31)
0 0.7 0 0 0 0 0 0 0 0 0 0.03 0 0 0 0 0 0 0 0 0 0 0 0 0 0 0 0 0 0 0 0 
##$DATE= 1775800167
##$DBL= (0..7)
120 120 120 120 120 120 120 120 
##$DBP= (0..7)
150 150 150 150 150 150 150 150 
##$DBP07= 0
##$DBPNAM0= <>
##$DBPNAM1= <>
##$DBPNAM2= <>
##$DBPNAM3= <>
##$DBPNAM4= <>
##$DBPNAM5= <>
##$DBPNAM6= <>
##$DBPNAM7= <>
##$DBPOAL= (0..7)
0.5 0.5 0.5 0.5 0.5 0.5 0.5 0.5 
##$DBPOFFS= (0..7)
0 0 0 0 0 0 0 0 
##$DE= 6
##$DECBNUC= <off>
##$DECIM= 32
##$DECNUC= <off>
##$DECSTAT= 4
##$DIGMOD= 1
##$DIGTYP= 9
##$DL= (0..7)
0 120 120 120 120 120 120 120 
##$DP= (0..7)
$$ [...]
##$SUBNAM2= <"">
##$SUBNAM3= <"">
##$SUBNAM4= <"">
##$SUBNAM5= <"">
##$SUBNAM6= <"">
##$SUBNAM7= <"">
##$SUBNAM8= <"">
##$SUBNAM9= <"">
##$SW= 18.0517328524113
##$SWIBOX= (0..15)
0 0 2 0 0 0 0 0 0 0 0 0 0 0 0 0 
##$SW_h= 3612.71676300578
##$TD= 16384
##$TD0= 1
##$TE= 0
##$TE2= 300
##$TE3= 300
##$TEG= 300
##$TL= (0..7)
0 120 120 120 120 120 120 120 
##$TP= (0..7)
150 150 150 150 150 150 150 150 
##$TP07= 0
##$TPNAME0= <>
##$TPNAME1= <>
##$TPNAME2= <>
##$TPNAME3= <>
##$TPNAME4= <>
##$TPNAME5= <>
##$TPNAME6= <>
##$TPNAME7= <>
##$TPOAL= (0..7)
0.5 0.5 0.5 0.5 0.5 0.5 0.5 0.5 
##$TPOFFS= (0..7)
0 0 0 0 0 0 0 0 
##$TUNHIN= 0
##$TUNHOUT= 0
##$TUNXOUT= 0
##$USERA1= <user>
##$USERA2= <user>
##$USERA3= <user>
##$USERA4= <user>
##$USERA5= <user>
##$V9= 5
##$VALIST= <valist>
##$VCLIST= <CCCCCCCCCCCCCCC>
##$VD= 0
##$VDLIST= <DDDDDDDDDDDDDDD>
##$VPLIST= <PPPPPPPPPPPPPPP>
##$VTLIST= <TTTTTTTTTTTTTTT>
##$WBST= 1024
##$WBSW= 4
##$XGAIN= (0..3)
0 0 0 0 
##$XL= 0
##$YL= 0
##$YMAX_a= 419974
##$YMIN_a= -430777
##$ZGOPTNS= <>
##$ZL1= 120
##$ZL2= 120
##$ZL3= 120
##$ZL4= 120
##$ABSF1= 0
##$ABSF2= 0
##$ABSG= 0
##$ABSL= 0
##$ALPHA= 0
##$AQORDER= 0
##$ASSFAC= 0
##$ASSFACI= 0
##$ASSFACX= 0
##$ASSWID= 0
##$AUNMP= <proc_1d>
##$AZFE= 0.1
##$AZFW= 0.1
##$BCFW= 0
##$BC_mod= 2
##$BYTORDP= 0
##$COROFFS= 0
##$CY= -3
##$DATMOD= 1
##$DC= 0
##$DFILT= <>
##$DTYPP= 0
##$F1P= 0
##$F2P= 0
##$FCOR= 1
##$FTSIZE= 16384
##$FT_mod= 6
##$GAMMA= 0
##$GB= 0
##$INTBC= 1
##$INTSCL= 3.241238e-09
##$ISEN= 128
##$LB= 0.25
##$LEV0= 0
##$LPBIN= 0
##$MAXI= 10000
##$MC2= 0
##$MEAN= 0
##$ME_mod= 0
##$MI= 1.114404
##$NCOEF= 0
##$NC_proc= -6
##$NLEV= 6
##$NOISF1= 3.799351
##$NOISF2= 2.8
##$NSP= 0
##$NTH_PI= 0
##$NZP= 0
##$OFFSET= 15.48907
##$PC= 1
##$PHC0= -5301.948
##$PHC1= 6.821927
##$PH_mod= 1
##$PKNL= yes
##$PPARMOD= 0
##$PSCAL= 0
##$PSIGN= 0
##$REVERSE= no
##$SF= 200.130006531413
##$SI= 16384
##$SIGF1= 3
##$SIGF2= 2
##$SINO= 0.751879
##$SIOLD= 32768
##$SREGLST= <19F.Aceton>
##$SSB= 0
##$STSI= 16384
##$STSR= 0
##$SW_p= 3612.71676300578
##$SYMM= 0
##$S_DEV= 0
##$TDeff= 16384
##$TDoff= 0
##$TI= <>
##$TILT= no
##$TM1= 0
##$TM2= 0
##$TOPLEV= 0
##$USERP1= <user>
##$USERP2= <user>
##$USERP3= <user>
##$USERP4= <user>
##$USERP5= <user>
##$WDW= 1
##$XDIM= 16384
##$YMAX_p= 289039833
##$YMIN_p= -1567888
$$ End of Bruker specific parameters
$$ ---------------------------------
##NTUPLES= NMR SPECTRUM
##VAR_NAME=  FREQUENCY,     SPECTRUM/REAL,   SPECTRUM/IMAG
##SYMBOL=    X,             R,               I
##VAR_TYPE=  INDEPENDENT,   DEPENDENT,       DEPENDENT
##VAR_FORM=  AFFN,          ASDF,            ASDF
##VAR_DIM=   16384,         16384,           16384
##UNITS=     HZ,            ARBITRARY UNITS, ARBITRARY UNITS
##FACTOR=    0.220516191357247, 1,           1
##FIRST=     3099.82766798947, 0,            0
##LAST=      -512.889095016308, 0,           0
##MIN=       -512.889095016308, -1567888,    0
##MAX=       3099.82766798947, 289039833,    0
$$ Real data points
##PAGE= N=1
##DATA TABLE= (X++(R..R)), XYDATA
$$ [...]
$$ plain form
6008 10914921 11692783 12396270 12949318 13565001 14241953 15065073 15958795 16898771 17787246
5999 17787246 18772131 19900846 21210340 22685824 24114883 25177575 25858114 26282852 26837917
5990 26837917 27632658 28555579 29422722 30105822 30422582 30245377 29664337 28655651 27321485
5981 27321485 26019002 24906931 24125127 23869859 24344691 25155544 26254564 27478383 28499243
5972 28499243 29368459 29688332 29326369 28588051 27757314 27021525 26410468 26048989 25987885 26274676
5962 26274676 26888487 27484933 27592880 26831782 25212707 22837856 20248018 17692729 15432191
5953 15432191 13480611 11852246 10543880 9550496 8701356 7969074 7341358 6867394 6496691
5944 6496691 6306794 6121040 5958818 5855516 5740417 5716470 5680085 5613360 5570456 5550744
$$ packed form
6008A0914921P77862P03487N53048O15683O76952Q23120Q93722R39976Q88475
5999A7787246R84885J128715J309494J475484J429059J062692O80539M24738N55065
5990B6837917P94741R22921Q67143O83100L16760j77205n81040j008686j334166
5981B7321485j302483j112071p81804k55268M74832Q10853J099020J223819J020860
5972B8499243Q69216L19873l61963p38318q30737p35789o11057l61479o1104K86791
5962B6274676O13811N96446J07947p61098j619075k374851k589838k555289k260538
5953A5432191j951580j628365j308366r93384q49140p32282o27716m73964l70703
5944F496691j89897j85754j62222j03302j15099k3947l6385o6725m2904j9712
$$ plain form
5934 5550744 5533054 5533331 5516307 5390255 5361388 5337114 5287025 5283066 5177648 5187536 5258329 5235396
5922 5235396 5265975 5188281 5229079 5187065 5067439 5007061 4998102 4967062 4955662 4952791 4976044 5052711
5910 5052711 5152926 5268156 5259362 5284689 5285347 5239313 5311537 5308797 5303379 5454928 5532579 5650807
5898 5650807 5882481 6166532 6543660 7080437 7523065 7881254 7965544 7857328 7656765 7430599
5888 7430599 7138439 6879446 6687049 6461945 6278355 6092032 6044633 6019647 6087630 6192192
5878 6192192 6328230 6576532 6810055 6983442 7208584 7531969 7880535 8240328 8501105 8692618
5868 8692618 8821966 8839203 8779774 8761291 8559861 8436115 8351627 8327496 8400417 8478925 8552616
5857 8552616 8692441 8881146 9099842 9316540 9654934 10030062 10358088 10589259 10724144 10844234
$$ packed form
5934E550744j7690K77j7024j26052k8867k4274n0089l959j05418R888P0793k2933
5922E235396L0579p7694M0798m2014j19626o0378q959l1040j1400k871K3253P6667
5910E052711J00215J15230q794K5327O58m6034P2224k740n418J51549P7651J18228
5898E650807K31674K84051L77128N36777M42628L58189Q4290j08216k00563k26166
5888G430599k92160k58993j92397k25104j83590j86323m7399k4986O7983J04562
5878F192192J36038K48302K33523J73387K25142L23385L48566L59793K60777J91513
5868H692618J29348J7237n9429j8483k01430j23746q4488k4131P2921P8508P3691
5857H552616J39825J88705K18696K16698L38394L75128L28026K31171J34885J20090
$$ plain form
5847 10844234 10856861 10982102 11047028 11038804 11070543 11022660 10976668 10824864 10671513 10506987 10628223
5836 10628223 10934962 11184218 11423501 11607823 11703834 11581921 11376829 11100522 10950957 10955814
5826 10955814 10954989 10908724 10838233 10733417 10505862 10318839 10229670 10306338 10406522 10478018 10603483
5815 10603483 10664954 10686579 10705229 10648433 10654544 10584830 10447643 10344940 10065142 9710810 9244342
5804 9244342 8794208 8456699 8151904 7920694 7777208 7584246 7471180 7335110 7188963 7193704
5794 7193704 7283615 7378899 7489059 7575698 7648216 7723377 7580555 7359805 7124287 6807100
5784 6807100 6491852 6171667 5858033 5575551 5245587 4970364 4795089 4672224 4538830 4406092
5774 4406092 4324618 4220902 4212217 4179802 4194995 4117642 4095925 4187380 4275657 4241283 4139962
$$ packed form
5847A0844234J2627J25241O4926q224L1739m7883m5992j51804j53351j64526J21236
5836A0628223L06739K49256K39283J84322R6011j21913k05092k76307j49565M857
5826A0955814q25m6265p0491j04816k27555j87023q9169P6668J00184P1496J25465
5815A0603483O1471K1625J8650n6796O111o9714j37187j02703k79798l54332m66468
5804I244342m50134l37509l04795k31210j43486j92962j13066j36070j46147M741
5794G193704Q9911R5284J10160Q6639P2518P5161j42822k20750k35518l17187
5784F807100l15248l20185l13634k82482l29964k75223j75275j22865j33394j32738
5774D406092q1474j03716q685l2415J5193p7353k1717R1455Q8277l4374j01321
$$ plain form
5763 4139962 4052913 3924378 3767768 3647475 3527786 3389330 3257136 3163691 3008407 2937140
5753 2937140 2915006 2879805 2912643 2886472 2776406 2719359 2727458 2697958 2711187 2603011 2655155
5742 2655155 2654323 2590098 2612587 2594071 2553037 2471862 2479484 2452364 2488448 2519674 2582961 2607880
5730 2607880 2658731 2656527 2609898 2584153 2603749 2577802 2592548 2630560 2630835 2632535 2570512 2568799
5718 2568799 2598872 2593097 2580319 2538002 2514036 2533754 2562895 2575178 2529236 2569834 2519266 2475846
5706 2475846 2471529 2463359 2360659 2370462 2311035 2219796 2140438 2172494 2190389 2150871 2146118 2156787
5694 2156787 2214947 2215707 2207525 2186335 2208973 2167285 2247751 2190672 2240120 2309489 2300204 2293698
5682 2293698 2280159 2283732 2301048 2297783 2308521 2297912 2271478 2332294 2348731 2370139 2422441 2438708
$$ packed form
5763D139962q7049j28535j56610j20293j19689j38456j32194r3445j55284p1267
5753B937140k2134l5201L2838k6171j10066n7047Q099k9500J3229j08176N2144
5742B655155q32o4225K2489j8516m1034q1175P622k7120L6084L1226O3287K4919
5730B607880N0851k204m6629k5745J9596k5947J4746L8012K75J700o2023j713
5718B568799L0073n775j2778m2317k3966J9718K9141J2283m5942M0598n0568m3420
5706B475846m317q170j02700R803n9427r1239p9358L2056J7895l9518m753J0669
5694B156787N8160P60q182k1190K2638m1688Q0466n7079M9448O9369r285o506
5682B293698j3539L573J7316l265J0738j0609k6434O0816J6437K1408N2302J6267
$$ plain form
5670 2438708 2561944 2552209 2510244 2527220 2524675 2536587 2516234 2497229 2453349 2541716 2464807 2445921
5658 2445921 2371279 2286462 2270620 2237662 2208916 2232959 2177674 2115822 2076900 2030489 2028404 2032960
5646 2032960 2103876 2171799 2126453 2129694 2150754 2121566 2106513 2124191 2082767 2099537 2150896 2127676
5634 2127676 2144025 2188316 2215710 2238939 2246986 2289398 2256692 2187196 2214177 2300578 2322145 2313967
5622 2313967 2370288 2398973 2338117 2302749 2249765 2253611 2280907 2241508 2220380 2238269 2204398 2151615
5610 2151615 2190782 2235414 2257737 2214157 2110166 2093457 2131167 2095639 2021043 2063556 2075165
5599 2075165 2096609 2093256 2059961 2021937 1995924 1993340 2012709 2069165 2039316 2010308 1976886 2006595
5587 2006595 2021086 1965646 1929831 2011903 2032739 2045921 2010435 1969199 1957616 1909688 1950343
$$ packed form
5670B438708J23236r735m1965J6976k545J1912k0353j9005m3880Q8367p6909j8886
5658B445921p4642q4817j5842l2958k8746K4043n5285o1852l8922m6411k085M556
5646B032960P0916O7923m5346L241K1060k9188j5053J7678m1424J6770N1359k3220
5634B127676J6349M4291K7394K3229Q047M2412l2706o9496K6981Q6401K1567q178
5622B313967N6321K8685o0856l5368n2984L846K7296l9399k1128J7889l3871n2783
5610B151615L9167M4632K2323m3580j03991j6709L7710l5528p4596M2513J1609
5599B075165K1444l353l3295l8024k6013k584J9369N6456k9849k9008l3422K9709
5587B006595J4491n5440l5815Q2072K0836J3182l5486m1236j1583m7928M0655
$$ plain form
5576 1950343 1954118 1933184 1932087 1906518 1914436 1932475 1957751 1936708 1932025 1961311 1992136 1965873
5564 1965873 1949575 1949560 1992493 1924018 1920496 1882200 1924311 1939909 1921176 1975258 2000719 1955987
5552 1955987 1979593 1966586 2002974 2025038 1989413 1981639 1970695 1909030 1960745 1952235 1936030 1944114
5540 1944114 1943792 1949659 1960695 2012619 2006433 1972230 1948541 2048460 2011830 1993033 1935701 1926938
5528 1926938 1903777 1940257 1957219 1928783 1868184 1816317 1784319 1851869 1891802 1820098 1807729
5517 1807729 1808915 1900181 1919759 1861296 1913011 1978067 1959874 1917767 1876020 1922309 1866048 1837334
5505 1837334 1882017 1864937 1865020 1873412 1846861 1871794 1858289 1765632 1804973 1786494 1793859 1828220
5493 1828220 1874980 1884522 1838278 1814398 1837106 1811219 1866561 1877873 1864616 1861689 1845205 1897238
$$ packed form
5576A950343L775k0934j097k5569P918J8039K5276k1043m683K9286L0825k6263
5564A965873j6298j5M2933o8475l522l8296M2111J5598j8733N4082K5461m4732
5552A955987K3606j3007L6388K2064l5625p774j0944o1665N1715q510j6205Q084
5540A944114l22N867J1036N1924o186l4203k3689R9919l6630j8797n7332q763
5528A926938k3161L6480J6962k8436o0599n1867l1998O7550L9933p1704j2369
5517A807729J186R1266J9578n8463N1715O5056j8193m2107m1747M6289n6261k8714
5505A837334M4683j7080Q3Q392k6551K4933j3505r2657L9341j8479P365L4361
5493A828220M6760R542m6244k3880K2708k5887N5342J1312j3257k927j6484N2033
$$ plain form
5481 1897238 1840794 1795097 1880966 1836354 1850560 1820294 1814605 1815427 1758372 1747921 1706749 1718902
5469 1718902 1721914 1767340 1817664 1756708 1663726 1670279 1756912 1785923 1757124 1753826 1745407 1767486
5457 1767486 1739017 1696812 1651870 1701986 1741866 1668005 1697764 1739029 1772975 1725886 1703516
5446 1703516 1677245 1702917 1717802 1694218 1695742 1689233 1698099 1711100 1730783 1755727 1742796 1711178
5434 1711178 1713202 1687600 1724268 1699974 1758345 1716563 1708437 1728929 1674362 1622081 1654776 1737966
5422 1737966 1743550 1736331 1718815 1663706 1660788 1656465 1648366 1603820 1625646 1658976 1674103 1714579
5410 1714579 1723968 1705356 1706896 1732349 1783531 1836113 1857374 1828187 1768952 1796635 1773708 1738375
5398 1738375 1751235 1746668 1695592 1690227 1704632 1735478 1668259 1626942 1658016 1684893 1648290 1629977
$$ packed form
5481A897238n6444m5697Q5869m4612J4206l0266n689Q22n7055j0451m1172J2153
5469A718902L012M5426N0324o0956r2982O553Q6633K9011k8799l298q419K2079
5457A767486k8469m2205m4942N0116L9880p3861K9759M1265L3946m7089k2370
5446A703516k6271K5672J4885k3584J524o509Q866J3001J9683K4944j2931l1618
5434A711178K024k5602L6668k4294N8371m1782q126K0492n4567n2281L2695Q3190
5422A737966N584p219j7516n5109k918m323q099m4546K1826L3330J5127M0476
5410A714579R389j8612J540K5453N1182N2582K1261k9187n9235K7683k2927l5333
5398A738375J2860m567n1076n365J4405L0846o7219m1317L1074K6877l6603j8313
$$ plain form
5386 1629977 1640999 1631545 1680763 1669352 1635507 1678165 1692337 1671343 1744431 1717926 1688108 1719851
5374 1719851 1696979 1744042 1760277 1752729 1791840 1757566 1740175 1775798 1792167 1750686 1816388 1873036
5362 1873036 1926929 1896637 1855088 1893142 1958146 2001972 1928463 1936038 1964808 1983872 1931584 1856760
5350 1856760 1767283 1748318 1881475 1872419 1792900 1802579 1785863 1763982 1762179 1804192 1853735 1827407
5338 1827407 1827539 1753253 1801748 1803745 1807321 1880561 1821211 1892538 1901389 1914733 1906213 1916307 1909164
5325 1909164 1876469 1842891 1817140 1786065 1852286 1857878 1844181 1883515 1861733 1876439 1887544 1931569
5313 1931569 1991951 1894837 1905749 1902243 1930106 1921838 1916283 1935792 1895084 1897212 1918658 1955157
5301 1955157 1949605 1982361 2006231 2001399 2058117 2070881 2067574 2093502 2097272 2093591 2081951 2094478
$$ packed form
5386A629977J1022r454M9218j1411l3845M2658J4172k0994P3088k6505k9818L1743
5374A719851k2872M7063J6235p548L9111l4274j7391L5623J6369m1481O5702N6648
5362A873036N3893l0292m1549L8054O5004M3826p3509P575K8770J9064n2288p4824
5350A856760q9477j8965J33157r056p9519R679j6716k1881j803M2013M9543k6328
5338A827407J32p4286M8495J997L576P3240n9350P1327Q851J3344q520J0094p143
5325A909164l2695l3578k5751l1075O6221N592j3697L9334k1782J4706J1105M4025
5313A931569O0382r7114J0912l506K7863q268n555J9509m0708K128K1446L6499
5301A955157n552L2756K3870m832N6718J2764l307K5928L770l681j1640J2527
$$ plain form
5289 2094478 2057293 2089411 2019744 2026464 1985835 1960465 1909169 1907398 1892373 1942918 1922884 1852128
5277 1852128 1809412 1889329 1956927 1901541 1928478 1956282 1963833 1905237 1903085 1888565 1901857 1883585
5265 1883585 1898513 1867520 1875107 1921345 1892558 1957991 1956000 1859213 1881435 1907285 1956413 1913677
5253 1913677 1941956 1984526 1998190 1994093 1911672 1876338 1895358 1930910 1934592 1822711 1893805 1942305
5241 1942305 2005850 2112195 2030834 1992062 1974144 1997214 2008533 2082637 2073782 2037348 1978962
5230 1978962 1967735 1943674 1996659 2027583 2093609 2088470 2042590 2041196 2041873 2008656 1960686 1936392
5218 1936392 1929865 2005850 2034550 2054340 2012657 1993741 2001859 2050557 2062219 2062280 2058734 2058953 2028465
5205 2028465 1954080 1958757 2012546 2052306 2020244 2123173 2136852 2020368 2021405 1994725 2026668
$$ packed form
5289B094478l7185L2118o9667O720m0629k5370n1296j771j5025N0545k0034p0756
5277A852128m2716P9917O7598n5386K6937K7804P551n8596k152j4520J3292j8272
5265A883585J4928l0993P587M6238k8787O5433j991r6787K2222K5850M9128m2736
5253A913677K8279M2570J3664m097q2421l5334J9020L5552L682j11881P1094M8500
5241A942305O3545J06345q1361l8772j7918K3070J1319P4104q855l6434n8386
5230A978962j1227k4061N2985L0924O6026n139m5880j394O77l3217m7970k4294
5218A936392o527P5985K8700J9790m1683j8916Q118M8698J1662O1l546K19l0488
5205B028465p4385M677N3789L9760l2062J02929J3679j16484J037k6680L1943
$$ plain form
5194 2026668 2034391 2000533 2021804 2105225 2139728 2157857 2181019 2136108 2082010 2090834 2113038 2083244
5182 2083244 2103207 2168260 2186715 2185891 2227492 2240860 2266576 2256166 2296105 2290985 2274458 2315693
5170 2315693 2323580 2332878 2325538 2345266 2311181 2268179 2277827 2297938 2241069 2294930 2266484 2280429
5158 2280429 2279219 2259852 2265692 2324215 2359194 2347391 2375372 2412931 2402270 2467068 2496023 2446863
5146 2446863 2423524 2464765 2516145 2450536 2503121 2494631 2503335 2548004 2592606 2536141 2508733 2557224
5134 2557224 2613983 2609491 2602086 2514608 2565414 2585558 2564961 2655216 2549455 2559674 2589759 2597454
5122 2597454 2666818 2707128 2727773 2692209 2689163 2702110 2625693 2587507 2641525 2672107 2709385 2696455
5110 2696455 2665871 2648317 2683964 2735117 2777195 2821536 2841378 2894322 2897030 2873345 2952175 3004614
$$ packed form
5194B026668P723l3858K1271Q3421L4503J8129K3162m4911n4098Q824K2204k9794
5182B083244J9963O5053J8455q24M1601J3368K5716j0410L9939n120j6527M1235
5170B315693P887R298p340J9728l4085m3002R648K0111n6869N3861k8446J3945
5158B280429j210j9367N840N8523L4979j1803K7981L7559j0661O4798K8955m9160
5146B446863k3339M1241N1380o5609N2585q490Q704M4669M4602n6465k7408M8491
5134B557224N6759m492p405q7478N0806K0144k0597R0255j05761J0219L0085P695
5122B597454O9364M0310K0645l5564l046J2947p6417l8186N4018L0582L7278j2930
5110B696455l0584j7554L5647N1153M2078M4341J9842N2944K708k3685P8830N2439
$$ plain form
5098 3004614 3144759 3236220 3169693 3160845 3160492 3183908 3164973 3123179 3160865 3244511 3239166 3159352
5086 3159352 3160925 3198557 3165397 3138283 3121122 3100326 3199055 3191754 3223554 3265111 3242750 3325330
5074 3325330 3375682 3416858 3427260 3514723 3542827 3579569 3582835 3572662 3550080 3582326 3631567 3630341
5062 3630341 3584088 3585963 3584458 3609474 3626204 3665279 3634242 3604248 3705388 3765713 3839944 3929889
5050 3929889 4058340 4105089 4169302 4265487 4437008 4531481 4538894 4613193 4660969 4639476 4608296
5039 4608296 4574586 4548236 4576867 4588571 4627466 4632391 4626139 4593596 4595747 4686541 4817871 4906937
5027 4906937 4980875 5012936 5089221 5191153 5285218 5416656 5577685 5694574 5808659 5924259
5017 5924259 5977591 6068493 5991025 5966068 5898694 5852564 5763778 5608710 5516603 5391976 5287406
$$ packed form
5098C004614J40145R1461o6527q848l53K3416j8935m1794L7686Q3646n345p9814
5086C159352J573L7632l3160k7114j7161k0796R8729p301L1800M1557k2361Q2580
5074C325330N0352M1176J0402Q7463K8104L6742L266j0173k2582L2246M9241j226
5062C630341m6253J875j505K5016J6730L9075l1037k9994J01140O0325P4231Q9945
5050C929889J28451M6749O4213R6185J71521R4473P413P4299M7776k1493l1180
5039D608296l3710k6350K8631J1704L8895M925o252l2543K151R0794J31330Q9066
5027D906937P3938L2061P6285J01932R4065J31438J61029J16889J14085J15600
5017E924259N3332R0902p7468k4957o7374m6130q8786j55068r2107j24627j04570
$$ plain form
5006 5287406 5124550 5018175 5000443 5069709 5082410 5020680 5004196 5044232 5144103 5263664 5306066
4995 5306066 5343574 5448275 5464414 5554268 5571251 5574851 5621560 5671905 5596271 5592947 5543408 5407778
4983 5407778 5313866 5210896 5112148 5047950 4963206 4965208 4958690 4899356 4899925 4942411 5012161 5120804
4971 5120804 5166627 5175649 5245634 5316541 5363622 5400577 5435829 5528313 5611302 5654327 5767621
4960 5767621 5852499 5942254 6071608 6377711 6679555 6885602 6949563 6941434 6903736 6776128 6679675
4949 6679675 6626899 6557331 6591342 6669520 6739382 6864515 7013570 7191455 7376804 7655989
4939 7655989 8000956 8395244 8839818 9116700 9392121 9599200 9829732 10076315 10427728 10954418
4929 10954418 11546249 12055737 12354458 12330310 12017286 11601547 11072676 10601077 10216290 9886658
$$ packed form
5006E287406j62856j06375j7732O9266J2701o1730j6484M0036R9871J19561M2402
4995E306066L7508J04701J6139Q9854J6983L600M6709N0345p5634l324m9539j35630
4983E407778r3912j02970r8748o4198q4744K002o518n9334N69M2486O9750J08643
4971E120804M5823R022O9985P0907M7081L6955L5252R2484Q2989M3025J13294
4960E767621Q4878Q9755J29354L06103L01844K06047O3961q129l7698j27608r6453
4949F679675n2776o9568L4011P8178O9862J25133J49055J77885J85349K79185
4939G655989L44967L94288M44574K76882K75421K07079K30532K46583L51413N26690
4929A0954418N91831N09488K98721k4148l13024m15739n28871m71599l84787l29632
$$ plain form
4919 9886658 9762373 9653978 9677733 9807800 10088953 10429598 10920624 11576153 12308712 13098952
4909 13098952 13719984 14063958 13933188 13697312 13287693 13002126 12746652 12590056 12574278 12476141
4899 12476141 12341397 12085813 11785491 11430361 11075376 10800215 10660160 10478789 10505197 10499636
4889 10499636 10516248 10630646 10821480 11103240 11463681 11898049 12332350 12733476 12986734 13246210
4879 13246210 13510030 13744155 13976358 14441945 15062752 15927474 16905545 17727818 18151539
4870 18151539 18207548 17997140 17559092 17176289 16880322 16737407 16918594 17142641 17546198 18249051
4860 18249051 19019584 19740824 20491251 21298800 21962323 22673142 23296490 23591864 23471774
4851 23471774 23008378 22453875 21853553 21299020 21081361 21038406 21102454 21388248 21979198 22759645
$$ packed form
4919I886658j24285j08395K3755J30067K81153L40645M91026O55529P32559P90240
4909A3098952O21032L43974j30770k35876m09619k85567k55474j56596j5778r8137
4899A2476141j34744k55584l00322l55130l54985k75161j40055j81371K6408n561
4889A0499636J6612J14398J90834K81760L60441M34368M34301M01126K53258K59476
4879A3246210K63820K34125K32203M65587O20807Q64722R78071Q22273M23721
4870A8151539N6009k10408m38048l82803k95967j42915J81187K24047M03557P02853
4860A8249051P70533P21240P50427Q07549O63523P10819O23348K95374j20090
4851B3471774m63396n54503o00322n54533k17659m2955O4048K85794N90950P80447
$$ plain form
4841 22759645 23587212 24470950 25247145 25967226 26600763 27107369 27700181 28260587 28671090
4832 28671090 28976130 29080150 28975523 28738730 28306936 27908917 27526010 27102885 26697613
4823 26697613 26310340 25960450 25614210 25347495 25235377 25281803 25475297 25853201 26310952 26867636
4813 26867636 27527218 28243347 28861979 29330452 29621533 29808938 29919103 29978495 29980971 29936992
4803 29936992 29739380 29176587 28301076 27180586 26089480 25039339 24090049 23343252 22700756
4794 22700756 22260962 21876353 21549914 21465031 21498828 21563919 21692426 21921110 22237835 22516435
4784 22516435 22642778 22654236 22442688 22099392 21837526 21715180 21738422 21883310 22327780 22842884
4774 22842884 23303713 23802021 24205225 24519923 24820009 25096296 25139180 25110635 25064532 24901367
$$ packed form
4841B2759645Q27567Q83738P76195P20081O33537N06606N92812N60406M10503
4832B8671090L05040J04020j04627k36793m31794l98019l82907m23125m05272
4823B6697613l87273l49890l46240k66715j12118M6426J93494L77904M57751N56684
4813B6867636O59582P16129O18632M68473K91081J87405J10165N9392K476m3979
4803B9936992j97612n62793q75511j120490j091106j050141r49290p46797o42496
4794B2700756m39794l84609l26439q4883L3797O5091J28507K28684L16725K78600
4784B2516435J26343J1458k11548l43296k61866j22346K3242J44888M44470N15104
4774B2842884M60829M98308M03204L14698L00086K76287M2884k8545m6103j63165
$$ plain form
4764 24901367 24590496 24164578 23797926 23375667 23017708 22790125 22703065 22709305 22841842 23086066
4754 23086066 23419548 23744024 24178766 24873121 25698624 26679675 27892470 29131717 30550949
4745 30550949 31968863 33496712 35127015 36633763 37980406 38929537 39294489 39086155 38316049
4736 38316049 37212032 35835426 34316107 32796583 31214213 29734248 28375524 27253959
4728 27253959 26495731 25914790 25594210 25548355 25536930 25503664 25427384 25448141 25440133 25453744 25328317
4717 25328317 25273013 25319200 25309077 25301998 25195174 24803778 24235041 23672952 22888715 21983118
4707 21983118 20907954 19666754 18255640 16895495 15706762 14524855 13495804 12545466
4699 12545466 11788232 11275476 10826645 10440526 10177205 10093216 10039731 10025895 10068530 10114805
$$ packed form
4764B4901367l10871m25918l66652m22259l57959k27583q7060O240J32537K44224
4754B3086066L33482L24476M34742O94355Q25503R81051J212795J239247J419232
4745C0550949J417914J527849J630303J506748J346643R49131L64952k08334p70106
4736C8316049j104017j376606j519319j519524j582370j479965j358724j121565
4728B7253959p58228n80941l20580m5855j1425l3266p6280K0757q008J3611j25427
4717B5328317n5304M6187j0123p079j06824l91396n68737n62089p84237r05597
4707B1983118j075164j241200j411114j360145j188733j181907j029051r50338
4699A2545466p57234n12756m48831l86119k63321q3989n3485j3836M2635M6275
$$ plain form
4689 10114805 10159154 10087581 10015094 9827501 9722688 9596789 9479681 9438882 9473355 9527727
4679 9527727 9706286 10055079 10504184 11139225 12057456 13165136 14360654 15394883 16129766
4670 16129766 16317467 15996963 15315726 14360301 13328933 12374462 11544939 10843537 10275402
4661 10275402 9818315 9510751 9188550 8935147 8733732 8671664 8653307 8858129 9169911 9500926
4651 9500926 9820280 10056529 10056557 9970598 9908513 9679629 9525256 9383739 9332666 9450949 9739544
4640 9739544 10003363 10567716 11258049 12106823 12898703 13456213 13736489 13546863 13047465 12377319
4630 12377319 11732581 11082316 10444062 9992156 9665572 9462718 9383653 9475883 9621829 9915444
4620 9915444 10438680 11081504 11840296 12665340 13468346 14005018 14035597 13594510 12827209 11877529
$$ packed form
4689A0114805M4349p1573p2487j87593j04813j25899j17108m0799L4473N4372
4679I527727J78559L48793M49105O35041R18231J107680J195518J034229P34883
4670A6129766J87701l20504o81237r55425j031368r54471q29523p01402n68135
4661A0275402m57087l07564l22201k53403k01415o2068j8357K04822L11782L31015
4651I500926L19354K36249K8q5959o2085k28884j54373j41517n1073J18283K88595
4640I739544K63819N64353O90333Q48774P91880N57510K80276j89626m99398o70146
4630A2377319o44738o50265o38254m51906l26584k02854p9065R2230J45946K93615
4620I915444N23236O42824P58792Q25044Q03006N36672L0579m41087p67301r49680
$$ plain form
4610 11877529 11023598 10253132 9606099 8988551 8565503 8226321 7924518 7559626 7224090
4601 7224090 6999579 6801676 6772668 6771541 6809324 6997521 7162701 7334103 7395512 7422503 7390280
4590 7390280 7235344 7098006 7029793 6951787 6952582 7001269 7173018 7440939 7834030 8265671 8664623
4579 8664623 8954937 8931143 8621047 8109384 7628225 7225172 6867641 6611812 6365250 6230342
4569 6230342 6107834 5980892 5874877 5839634 5793335 5856257 5960889 6172382 6322198 6539465
4559 6539465 6662561 6638822 6506803 6410701 6204192 5986754 5897400 5712956 5534231 5413808
4549 5413808 5434064 5453705 5420258 5479121 5556795 5557551 5616720 5560998 5451551 5258114 5138159
4538 5138159 4987805 4834139 4729055 4639451 4648407 4676383 4645635 4683621 4600928 4539211 4396716
$$ packed form
4610A1877529q53931p70466o47033o17548m23048l39182l01803l64892l35536
4601G224090k24511j97903k9008j127L7783J88197J65180J71402O1409K6991l2223
4590G390280j54936j37338o8213p8006P95M8687J71749K67921L93091M31641L98952
4579H664623K90314k3794l10096n11663m81159m03053l57531k55829k46562j34908
4569F230342j22508j26942j06015l5243m6299O2922J04632K11493J49816K17267
4559F539465J23096k3739j32019r6102k06509k17438q9354j84444j78725j20423
4549E413808K0256J9641l3447N8863P7674P56N9169n5722j09447j93437j19955
4538E138159j50354j53666j05084q9604Q956K7976l0748L7986q2693o1717j42495
$$ plain form
4527 4396716 4304573 4294973 4264964 4216364 4181561 4201068 4164536 4081698 4095159 4092390 4112729 4105412
4515 4105412 4115424 4172709 4132384 4071383 4051967 3995177 3957984 3972142 3937015 3975767 3852589
4504 3852589 3854727 3907254 3886541 3869058 3886904 3924612 3921211 3925326 3887089 3915842 3800655 3788793
4492 3788793 3790033 3832085 3804830 3815553 3751754 3724320 3749366 3756451 3696257 3585182 3517175 3463681
4480 3463681 3469205 3469536 3442953 3457659 3462327 3448002 3484532 3510785 3497368 3532991 3529924 3502980
4468 3502980 3629158 3612735 3604318 3645486 3669614 3643785 3644722 3684304 3691170 3689089 3737328 3757376
4456 3757376 3794431 3792303 3783329 3717833 3730357 3737751 3757414 3718341 3761414 3822816 3869895 3872668
4444 3872668 3808455 3809828 3753883 3823310 3885116 3833301 3822149 3851471 3813636 3805184 3778052 3789285
$$ packed form
4527D396716r2143r600l0009m8600l4803J9507l6532q2838J3461k769K0339p317
4515D105412J0012N7285m0325o1001j9416n6790l7193J4158l5127L8752j23178
4504C852589K138N2527k0713j7483J7846L7708l401M115l8237K8753j15187j1862
4492C788793J240M2052k7255J0723o3799k7434K5046P085o0194j11075o8007n3494
4480C463681N524L31k6583J4706M668j4325L6530K6253j3417L5623l067k6944
4468C502980J26178j6423q417M1168K4128k5829R37L9582O866k081M8239K0048
4456C757376L7055k128q974o5496J2524P394J9663l9073M3073O1402M7079K773
4444C872668o4213J373n5945O9427O1806n1815j1152K9322l7835q452k7132J1233
$$ plain form
4432 3789285 3814209 3825780 3773841 3795202 3758730 3780491 3834184 3808164 3807233 3839452 3854183 3913035
4420 3913035 3904660 3927200 3929712 3952965 4012324 4028442 4121545 4137514 4139640 4200650 4269674 4274555
4408 4274555 4264767 4274756 4305806 4313351 4455563 4478113 4537449 4646260 4647032 4689081 4772373 4820865
4396 4820865 4895675 5013817 5063823 5075372 5136220 5225089 5379833 5484334 5520336 5556148 5647688
4385 5647688 5738591 5842524 5942410 6207877 6334570 6467078 6586093 6745603 7014965 7237661
4375 7237661 7439345 7604623 7753439 7981790 8299428 8712013 9227800 9783992 10453173 11381268
4365 11381268 12734929 14544369 16821345 19110029 20968038 21899874 21854063 21255868 20801235
4356 20801235 20737807 21207979 21972786 22590885 22383549 21208493 19313491 17158513 15126876
$$ packed form
4432C789285K4924J1571n1939K1361l6472K1761N3693k6020r31L2219J4731N8852
4420C913035q375K2540K512K3253N9359J6118R3103J5969K126O1010O9024M881
4408D274555r788R989L1050P545J42212K2550N9336J08811P72M2049Q3292M8492
4396D820865P4810J18142N0006J1549O0848Q8869J54744J04501L6002L5812R1540
4385E647688R0903J03933R9886K65467J26693J32508J19015J59510K69362K22696
4375G237661K01684J65278J48816K28351L17638M12585N15787N56192O69181R28095
4365A1381268J353661J809440K276976K288684J858009R31836m5811n98195m54633
4356B0801235o3428M70172P64807O18099k07336j175056j895002k154978k031637
$$ plain form
4347 15126876 13358556 11977298 10906208 10136358 9449658 8930675 8578967 8267649 8139603
4338 8139603 8087346 8094647 8122888 8159121 8219670 8359890 8387407 8484451 8649731 8679795 8637337
4327 8637337 8691329 8693506 8664268 8778230 8727608 8629208 8571937 8572836 8548868 8590678 8637262 8747805
4315 8747805 8850276 8942195 8996893 8938257 8871405 8773990 8767241 8770908 8720498 8761268 8814073 8905996
4303 8905996 8988250 9055151 9225983 9428947 9535049 9650410 9805720 9878487 9930948 9973552
4293 9973552 9992770 10043254 10156986 10210072 10118939 10095779 10088552 10059644 9987834 10051967 10032833
4282 10032833 10079061 10132919 10106953 10083073 10036881 9974261 9982313 10031089 10047571 10073265 10153161
4271 10153161 10271241 10377649 10574664 10768090 10948203 11048963 11192839 11269553 11358316 11458415
$$ packed form
4347A5126876j768320j381258j071090p69850o86700n18983l51708l11318j28046
4338H139603n2257P301K8241L6233O0549J40220K7517R7044J65280L0064m2458
4327H637337N3992K177k9238J13962n0622r8400n7271Q99k3968M1810M6584J10543
4315H747805J02471R1919N4698n8636o6852r7415o749L667n0410M0770N2805R1923
4303H905996Q2254O6901J70832K02964J06102J15361J55310P2767N2461M2604
4293I973552J9218N0484J13732N3086r1133k3160p227k8908p1810O4133j9134
4282A0032833M6228N3858k5966k3880m6192o2620Q052M8776J6482K5694P9896
4271A0153161J18080J06408J97015J93426J80113J00760J43876P6714Q8763J00099
$$ plain form
4261 11458415 11463001 11487377 11526511 11547116 11616441 11666634 11691693 11697439 11699661 11699595 11777290 11747726
4249 11747726 11739921 11728273 11744261 11692415 11711325 11652478 11714433 11726727 11699656 11706147 11654029 11645288
4237 11645288 11536710 11356141 11187140 11089432 10865039 10831532 10903757 10912902 10974574 11113532
4227 11113532 11320377 11681124 12103670 12595402 13177264 13684812 14112517 14422382 14540252
4218 14540252 14504270 14422160 14434395 14384780 14312358 14089543 13740857 13128076 12440749 11766074
4208 11766074 11154006 10670210 10182712 9802978 9582881 9408937 9311557 9294451 9273846 9266826
4198 9266826 9244558 9167919 9059793 9030151 8908309 8857792 8857171 8913247 9062650 9271068 9384421
4187 9384421 9519783 9719774 9867829 10007131 10050026 9987483 9870518 9669751 9493428 9393617
$$ packed form
4261A1458415M586K4376L9134K0605O9325N0193K5059N746K222o6P7695k9564
4249A1747726p805j1648J5988n1846J8910n8847O1955J2294k7071O491n2118q741
4237A1645288j08578j80569j69001r7708k24393l3507P2225R145O1672J38958
4227A1113532K06845L60747M22546M91732N81862N07548M27705L09865J17870
4218A4540252l5982q2110J2235m9615p2422k22815l48686o12781o87327o74675
4208A1766074o12068m83796m87498l79734k20097j73944r7380j7106k0605p020
4198I266826k2268p6639j08126k9642j21842n0517o21N6076J49403K08418J13353
4187I384421J35362J99991J48055J39302M2895o2543j16965k00767j76323r9811
$$ plain form
4177 9393617 9327988 9321861 9199931 9175460 9142598 9157945 9190638 9254021 9384251 9462383 9516428
4166 9516428 9554977 9672264 9817087 9901710 9950223 10066839 10176759 10361979 10640066 10925780
4156 10925780 11176443 11451583 11715904 12087353 12471332 12869799 13330864 13877832 14542676
4147 14542676 15395267 16303436 17372772 18547194 19759910 21172532 22734796 24379892
4139 24379892 25979996 27537382 28879528 30058322 31155401 32462570 33873196 35043179
4131 35043179 35947728 36493898 36757932 36924141 37188479 37752057 38431466 39038194 39220218
4122 39220218 39041314 38757796 38376926 38015871 37721094 37354386 36800714 36043140 35133083
4113 35133083 34091207 32984877 31922401 30854277 29835444 28726923 27593810 26401533
$$ packed form
4177I393617o5629o127j21930k4471l2862J5347L2693O3383J30230P8132N4045
4166I516428L8549J17287J44823Q4623M8513J16616J09920J85220K78087K85714
4156A0925780K50663K75140K64321L71449L83979L98467M61065N46968O64844
4147A4542676Q52591R08169J069336J174422J212716J412622J562264J645096
4139B4379892J600104J557386J342146J178794J097079J307169J410626J169983
4131C5043179R04549N46170K64034J66209K64338N63578O79409O06728J82024
4122C9220218j78904k83518l80870l61055k94777l66708n53672p57574r10057
4113C5133083j041876j106330j062476j068124j018833j108521j133113j192277
$$ plain form
4105 26401533 25089479 23837637 22657564 21593760 20717111 20093946 19682826 19406726 19248726
4096 19248726 19161392 19184474 19215194 19371574 19564865 19699989 19838103 19939501 20137740 20391087
4086 20391087 20813897 21407619 22105668 22810364 23506147 23972570 24285692 24498971 24632129
4077 24632129 24657207 24614741 24661580 24729270 24767967 24803163 24903074 25163207 25465555 25781275 26123384
4066 26123384 26451609 26686053 26915627 27087478 27268328 27490407 27746989 28149749 28749757
4057 28749757 29542176 30528625 31624050 32710607 33668438 34438530 35050885 35563748 36142260
4048 36142260 36714085 37192638 37550739 37889338 38220590 38433628 38501911 38505626 38322402 37978124
4038 37978124 37651249 37323539 37075903 37025303 37066963 37169091 37320141 37369072 37441261 37430415
$$ packed form
4105B6401533j312054j251842j180073j063804q76649o23165m11120k76100j58000
4096A9248726q7334K3082L0720J56380J93291J35124J38114J01398J98239K53347
4086B0391087M22810N93722O98049P04696O95783M66423L13122K13279J33158
4077B4632129K5078m2466M6839O7690L8697L5196R9911K60133L02348L15720L42109
4066B6123384L28225K34444K29574J71851J80850K22079K56582M02760O00008
4057B8749757P92419R86449J095425J086557R57831P70092O12355N12863N78512
4048C6142260N71825M78553L58101L38599L31252K13038O8283L715j83224l44278
4038C7978124l26875l27710k47636n0600M1660J02128J51050M8931P2189j0846
$$ plain form
4028 37430415 37324617 37140676 36915675 36751134 36640466 36638696 36807198 37200202 37556176 37913673
4018 37913673 38213476 38361522 38461926 38516299 38366035 38229600 38019326 37781078 37626654 37724299
4008 37724299 37852847 37910668 37710202 37210476 36536372 35833175 35207840 34814752 34639152 34760322
3998 34760322 34992919 35171902 35359500 35472151 35511877 35619007 35947969 36577239 37421500 38412495
3988 38412495 39366863 40093962 40524004 40502525 40390603 40412114 40588354 40918266 41133755 40976881
3978 40976881 40229622 38922743 37152231 35074770 32978640 31101114 29450968 27983000
3970 27983000 26752842 25778734 24871394 24194024 23601263 23033075 22499598 21974707 21641870
3961 21641870 21357891 21159268 21014956 20930220 20719848 20481007 20270003 20032202 19611074 19136879
$$ packed form
4028C7430415j05798j83941k25001j64541j10668j770J68502L93004L55974L57497
4018C7913673K99803J48046J00404N4373j50264j36435k10274k38248j54424R7645
4008C7724299J28548N7821k00466m99726o74104p03197o25335l93088j75600J21170
3998C4760322K32597J78983J87598J12651L9726J07130L28962O29270Q44261R90995
3988C8412495R54368P27099M30042k1479j11922K1511J76240L29912K15489j56874
3978D0976881p47259j306879j770512k077461k096130j877526j650146j467968
3970B7983000j230158r74108r07340o77370n92761n68188n33477n24891l32837
3961B1641870k83979j98623j44312q4736k10372k38841k11004k37801m21128m74195
$$ plain form
3951 19136879 18673775 18230678 17885725 17744982 17746264 17649322 17524417 17402679 17185149 16910914
3941 16910914 16503407 16056583 15693146 15494449 15467562 15416758 15432189 15555698 15642606 15790392
3931 15790392 15863084 15923755 15952800 15935485 15996932 16184789 16486326 17050874 17822214 18750400
3921 18750400 19621673 20416479 21017932 21427490 21675222 21680473 21497018 21191458 20960476 20966349
3911 20966349 21132571 21544154 22074324 22573428 23040529 23516713 23855828 24150859 24239882 23976182
3901 23976182 23381362 22566733 21641046 20688069 19941736 19338394 18934396 18863565 19036735 19507341
3891 19507341 20041742 20459962 20633153 20515220 20213942 19715712 19311261 19008072 19014079 19237191
3881 19237191 19481016 19710292 20002044 20267373 20557390 20837572 21139818 21610330 22254790
$$ packed form
3951A9136879m63104m43097l44953j40743J282r6942j24905j21738k17530k74235
3941A6910914m07507m46824l63437j98697k6887n0804J5431J23509Q6908J47786
3931A5790392P2692O0671K9045j7315O1447J87857L01537N64548P71340R28186
3921A8750400Q71273P94806O01453M09558K47732N251j83455l05560k30982N873
3911B0966349J66222M11583N30170M99104M67101M76184L39115K95031Q9023k63700
3901B3976182n94820q14629r25687r52977p46333o03342m03998p0831J73170M70606
3891A9507341N34401M18220J73191j17933l01278m98230m04451l03189O007K23112
3881A9237191K43825K29276K91752K65329K90017K80182L02246M70512O44460
$$ plain form
3872 22254790 23173799 24304866 25488791 26614594 27414777 27840867 28011021 28028826 28111225
3863 28111225 28556393 29677759 31581452 33790340 35765374 36885256 36816299 35960695 34853369
3854 34853369 33862127 33417859 33396212 33770254 34357789 34815292 35030494 34935274 34831902 35115733
3844 35115733 35939388 37319331 38782661 39818257 40216301 40088729 39686090 39242097 38976799
3835 38976799 39141410 39531184 39671698 39481593 38911540 38158148 37316660 36474285 35730962
3826 35730962 35234063 34986389 34871544 35051726 35673423 36618455 37793703 39255748 40684769
3817 40684769 41795016 42622809 43436619 44162392 44785903 45428727 46304974 47624839 49502248
3808 49502248 51349523 52728234 53592251 54077242 54278750 53962847 53115335 51857870 50495406
$$ packed form
3872B2254790R19009J131067J183925J125803Q00183M26090J70154J7805Q2399
3863B8111225M45168J121366J903693K208888J975034J119882o8957q55604j107326
3854C4853369r91242m44268k1647L74042N87535M57503K15202r5220j03372K83831
3844C5115733Q23655J379943J463330J035596L98044j27572m02639m43993k65298
3835C8976799J64611L89774J40514j90105n70053p53392q41488q42375p43323
3826C5730962m96899k47674j14845J80182O21697R45032J175248J462045J429021
3817D0684769J110247Q27793Q13810P25773O23511O42824Q76247J319865J877409
3808D9502248J847275J378711Q64017M84991K01508l15903q47512j257465j362464
$$ plain form
3799 50495406 49572907 49308404 49748834 50972836 52407344 53763007 55002894 55955711 56288247
3790 56288247 55661665 54056504 52198641 50983338 50632128 50864589 51260289 50833372 49133988
3781 49133988 46494635 43435776 40592039 38095752 35962845 34101205 32563040 31315616
3773 31315616 30274027 29547246 29236151 29500411 30312754 31555646 32550253 32785715 32070783
3764 32070783 30744622 29385310 28194416 27434586 26924039 26652002 26635481 26867206 27449778
3755 27449778 28400140 29654559 31045172 32138461 32821990 33122326 33305168 33614781 34060364
3746 34060364 34612412 35235972 35887149 36731261 37713680 38740381 39976856 41437268 43476382
3737 43476382 46001821 48778111 51285433 52998629 53888333 54122161 53677842 52650324 51192743
$$ packed form
3799E0495406r22499k64503M40430J224002J434508J355663J239887R52817L32536
3790E6288247o26582j605161j857863j215303l51210K32461L95700m26917j699384
3781D9133988k639353l058859k843737k496287k132907j861640j538165j247424
3773C1315616j041589p26781l11095K64260Q12343J242892R94607K35462p14932
3764C2070783j326161j359312j190894p59830n10547k72037j6521K31725N82572
3755B7449778R50362J254419J390613J093289O83529L00336J82842L09613M45583
3746C4060364N52048O23560O51177Q44112R82419J026701J236475J460412K039114
3737D3476382K525439K776290K507322J713196Q89704K33828m44319j027518j457581
$$ plain form
3728 51192743 49726551 48667270 48283611 48456160 49063989 49654852 49953286 49642473 48754822
3719 48754822 47422199 45680791 43691485 41486328 38961724 36209841 33442560 30934918
3711 30934918 28735731 26944711 25560564 24496442 23673203 22963949 22370650 21798127 21280975
3702 21280975 20827651 20580801 20474290 20528190 20784187 21213373 21747129 22266608 22762114 23085275
3692 23085275 23341154 23604433 23789978 24107074 24644078 25488039 26624945 28030300 29851700
3683 29851700 31798103 33409620 34435579 34881964 34727324 33852282 32482372 31083092 29818545
3674 29818545 28746086 27974738 27526092 27376037 27426688 27823331 28548417 29650910 31110791
3665 31110791 32765984 34100888 34661425 34451817 33615829 32447204 31324601 30402605 29804580
$$ packed form
3728E1192743j466192j059281l83659J72549O07829N90863K98434l10813q87651
3719D8754822j332623j741408j989306k205157k524604k751883k767281k507642
3711C0934918k199187j791020j384147j064122q23239p09254n93299n72523n17152
3702B1280975m53324k46850j06511N3900K55997M29186N33756N19479M95506L23161
3692B3085275K55879K63279J85545L17096N37004Q43961J136906J405355J821400
3683B9851700J946403J611517J025959M46385j54640q75042j369910j399280j264547
3674B9818545j072459p71348m48646j50055N0651L96643P25086J102493J459881
3665C1110791J655193J334904N60537k09608q35988j168625j122603r21996n98025
$$ plain form
3656 29804580 29528016 29619062 29802907 30030487 30233937 30428467 30551157 30654542 30826034 30911101
3646 30911101 30877436 30830594 30809646 30819490 30799489 30804017 30838253 30802609 30797399 30956156 31211200
3635 31211200 31627990 32277562 32978079 33742811 34497928 35076557 35362395 35290106 34682070 33666220
3625 33666220 32504795 31447601 30729579 30318353 30218305 30284807 30498231 30879339 31640799
3616 31640799 32740480 34340854 36315453 38458302 40602709 42439314 43921710 45301235
3608 45301235 46789977 48960270 52209117 56488063 61178016 64795895 66494669 66357807
3600 66357807 65258385 64438113 64651534 65690667 66661270 66398550 64445039 60991693 57047789
3591 57047789 53517229 50853137 49327765 48929523 49659405 51071746 52255791 52455930 51525619
$$ packed form
3656B9804580k76564R1046J83845K27580K03450J94530J22690J03385J71492Q5067
3646C0911101l3665m6842k0948R844k0001M528L4236l5644n210J58757K55044
3635C1211200M16790O49572P00517P64732P55117N78629K85838p2289o08036j015850
3625C3666220j161425j057194p18022m11226j00048O6502K13424L81108P61460
3616C1640799J099681J600374J974599K142849K144407J836605J482396J379525
3608D5301235J488742K170293L248847M278946M689953L617879J698774j36862
3600F6357807j099422q20272K13421J039133R70603k62720j953511l453346l943904
3591E7047789l530560k664092j525372l98242P29882J412341J184045K00139r30311
$$ plain form
3582 51525619 49891370 47862325 45949951 44613138 43671169 42960250 42341215 41491289 40362869
3573 40362869 39015760 37590947 36331458 35309476 34581681 34174687 33981863 34040462 34135563
3564 34135563 34357811 34683594 35408422 36703054 38780141 41644770 44728324 47271143 48684128
3555 48684128 49171694 49389117 50010459 51446290 53493630 55285572 56151328 55466627 53328986
3546 53328986 50460985 47676761 45356897 43631155 42356787 41241583 40142422 38889842
3538 38889842 37758986 36815539 36110059 35770290 35723868 35714890 35626719 35029808 33933045 32496641
3528 32496641 30828219 29118312 27640629 26286714 25123059 24337192 23978339 23994856 24390581
3519 24390581 24941789 25563921 26204572 26902881 27539319 27954825 28209369 28324875 28403374 28432398
$$ packed form
3582E1525619j634249k029045j912374j336813r41969p10919o19035q49926j128420
3573D0362869j347109j424813j259489j021982p27795m06994j92824N8599R5101
3564C4135563K22248L25783P24828J294632K077087K864629L083554K542819J412985
3555D8684128M87566K17423O21342J435831K047340J791942Q65756o84701k137641
3546E3328986k868001k784224k319864j725742j274368j115204j099161j252580
3538C8889842j130856r43447p05480l39769m6422q978q8171n96911j096763j436404
3528C2496641j668422j709907j477683j353915j163655p85867l58853J6517L95725
3519B4390581N51208O22132O40651O98309O36438M15506K54544J15506P8499K9024
$$ plain form
3509 28432398 28450599 28270550 28161736 28260574 28559325 28968041 29429924 29838441 30194230 30442940
3499 30442940 30733657 31046446 31266945 31279548 31153207 31059845 30949639 30853824 30763352 30594771
3489 30594771 30250699 29811451 29307784 28766653 28349934 28000037 27642079 27215341 26728843
3480 26728843 26286139 26073673 25988410 25942177 26013924 26323522 26768344 27218591 27671092 28065237
3470 28065237 28320276 28513245 28726398 28952139 29164297 29423836 29736247 29971468 30110590
3461 30110590 30169977 30191584 30251977 30254167 30014114 29502351 29088821 28518249 27927474 27512635
3451 27512635 27083718 26715001 26474938 26109068 25706757 25139033 24578271 23909790 23283406
3442 23283406 22810624 22568419 22448086 22373122 22449754 22365095 22228832 22100485 22075692 22216428
$$ packed form
3509B8432398J8201j80049j08814R8838K98751M08716M61883M08517L55789K48710
3499C0442940K90717L12789K20499J2603j26341r3362j10206r5815r0472j68581
3489C0594771l44072m39248n03667n41131m16719l49897l57958m26738m86498
3480B6728843m42704k12466q5263m6233P1747L09598M44822M50247M52501L94145
3470B8065237K55039J92969K13153K25741K12158K59539L12411K35221J39122
3461C0110590N9387K1607O0393K190k40053n11763m13530n70572n90775m14839
3451B7512635m28917l68717k40063l65870m02311n67724n60762o68481o26384
3442B3283406m72782k42205j20333p4964P6632q4659j36263j28347k4793J40736
$$ plain form
3432 22216428 22565011 23065470 23688015 24192034 24551105 24705630 24593834 24305388 24064894
3423 24064894 24029905 24181569 24408599 24750165 25229236 25811614 26478764 27309184 28270162 29215717
3413 29215717 30070120 30599613 30832596 30867387 30835061 31132147 31740075 32703404 33688517 34477996
3403 34477996 34901444 34931313 34583780 34141288 33652197 33354776 33399878 33620106 34018761 34621965
3393 34621965 35279570 36019678 36850162 37995937 39425032 41079710 43106275 45499461 48393344
3384 48393344 51690976 55367306 59372712 63877405 69053153 75231717 83324460 94086901
3376 94086901 108498686 127338627 149637881 172729974 192110945 202806379 202235580
3369 202235580 191235153 173207231 152257597 131931353 114171595 99698189 88429210
$$ packed form
3432B2216428L48583N00459O22545N04019L59071J54525j11796k88446k40494
3423B4064894l4989J51664K27030L41566M79071N82378O67150Q30420R60978R45555
3413B9215717Q54403N29493K32983L4791l2326K97086O07928R63329R85113P89479
3403C4477996M23448K9869l47533m42492m89091k97421M5102K20228L98655O03204
3393C4621965O57605P40108Q30484J145775J429095J654678K026565K393186K893883
3384D8393344L297632L676330M005406M504693N175748O178564Q092743J0762441
3376I4086901J4411785J8839941K2299254K3092093J9380971J0695434n70799
3369B02235580j1000427j8027922k0949634k0326244j7759758j4473406j1268979
$$ plain form
3362 88429210 79759147 73196098 67883450 63365643 59406766 55910730 52897238 50445842
3354 50445842 48444105 46519922 44434952 42173468 40051617 38233051 36806404 35760015
3346 35760015 35136233 34818766 34831005 34998532 35294433 35626798 35954815 36286806 36576844 36778868
3336 36778868 36959705 37055954 36906337 36776982 36677208 36777533 36893637 36970566 36969623 36986007 37030012
3325 37030012 37255453 37758123 38385848 39255027 40343739 41801157 43721388 45789163 47919352
3316 47919352 49655369 50804868 51557630 52123438 52777461 53365534 53959544 54370252 54481710
3307 54481710 54287765 53955664 53787181 53935946 54449221 55392848 56650451 58097810 59716615
3298 59716615 61429234 63285982 65382112 67921310 71077949 75091966 80174399 86599330
$$ packed form
3362H8429210q670063o563049n312648m517807l958877l496036l013492k451396
3354E0445842k001737j924183k084970k261484k121851j818566j426647j046389
3346C5760015o23782l17467J2239J67527K95901L32365L28017L31991K90038K02024
3336C6778868J80837R6249j49617j29355r9774J00325J16104P6929r43J6384M4005
3325C7030012K25441N02670O27725Q69179J088712J457418J920231K067775K130189
3316D7919352J736017J149499P52762N65808O54023N88073N94010M10708J11458
3307E4481710j93945l32101j68483J48765N13275R43627J257603J447359J618805
3298E9716615J712619J856748K096130K539198L156639M014017N082433O424931
$$ plain form
3290 86599330 94579229 104422364 115964675 129054449 143864800 160773952 180155029
3283 180155029 201333482 221469545 236583853 243035957 239102873 226110394 207285976
3276 207285976 186392182 166413052 149112205 135229062 124764710 117351697 112369976
3269 112369976 109447368 108396484 108995108 111298799 115791336 122877390 133693513 149524278
3261 149524278 171672865 199735395 230739842 259384254 279979614 289039833 286752438
3254 286752438 276345544 261917337 245833494 228158410 208787607 188408723 168659317
3247 168659317 151093541 136902447 126446162 119676632 116631109 116768980 119060430 122237404
3239 122237404 124368377 123953183 120448503 114207743 106389529 98412891 91167157 85400692
$$ packed form
3290H6599330P979899R843135J1542311J3089774J4810351J6909152J9381077
3283A80155029K1178453K0136063J5114308O452104l933084j2992479j8824418
3276B07285976k0893794j9979130j7300847j3883143j0464352p413013m981721
3269A12369976k922608j050884N98624K303691M492537P086054J0816123J5830765
3261A49524278K2148587K8062530L1004447K8644412K0595360R060219k287395
3254B86752438j0406894j4428207j6083843j7675084j9370803k0378884j9749406
3247A68659317j7565776j4191094j0456285o769530l045523J37871K291450L176974
3239A22237404K130973m15194l504680o240760p818214p976638p245734n766465
$$ plain form
3231 85400692 81101694 78468058 77155574 77159654 78122196 79848970 82509712 86298421 92068186
3222 92068186 101088699 114601136 133336096 155802179 177719475 193275356 197653577
3215 197653577 190508757 175286359 156948921 139191428 123929030 111690494 102584724
3208 102584724 96029542 91186939 86811482 81934490 76584643 70956097 65475056 60601634
3200 60601634 56533171 53155536 50351319 48002563 45837277 44068387 42594603 41312474
3192 41312474 40243920 39359720 38563044 38030665 37774394 37812902 38179869 38923615 40185959
3183 40185959 42364198 46272566 52839220 62553016 74972879 87924774 97649832 101174286
3175 101174286 97572370 88549450 77015340 65721680 56241172 48964740 43783030 40286604
$$ packed form
3231H5400692m298998k633636j312484M080R62542J726774K660742L788709N769765
3222I2068186R020513J3512437J8734960K2466083K1917296J5555881M378221
3215A97653577p144820j5222398j8337438j7757493j5262398j2238536r105770
3208A02584724o555182m842603m375457m876992n349847n628546n481041m873422
3200F0601634m068463l377635k804217k348756k165286j768890j473784j282129
3192D1312474j068554q84200p96676n32379k56271L8508L66967P43746J262344
3183D0185959K178239L908368O566654R713796J2419863J2951895R725058L524454
3175A01174286l601916r022920j1534110j1293660r480508p276432n181710l496426
$$ plain form
3167 40286604 37694790 35626106 33795708 32191623 30951758 29978092 29352438 29008708 28672187
3158 28672187 28212992 27641271 26984951 26284482 25578994 24917225 24419558 23961062 23497193
3149 23497193 23101546 22695323 22133792 21611538 20947476 20275734 19678238 19259297 19027454
3140 19027454 18944571 18962942 19057048 19128060 19274004 19495435 19905931 20530848 21292017 22284207
3130 22284207 23275373 24347936 25412627 26698486 28138505 30079834 32675983 36137593
3122 36137593 40843225 46977503 54637036 63143200 71532279 79172418 85855178 91931977
3114 91931977 97398219 101158968 101414215 96855024 88105063 77125858 65763669 55498167
3106 55498167 46899752 39953202 34414894 30083131 26706448 24154587 22158073 20539933
$$ packed form
3167D0286604k591814k068684j830398j604085j239865r73666o25654l43730l36521
3158B8672187m59195n71721o56320p00469p05488o61769m97667m58496m63869
3149B3497193l95647m06223n61531n22254o64062o71742n97496m18941k31843
3140A9027454q2883J8371R4106P1012J45944K21431M10496O24917P61169R92190
3130B2284207R91166J072563J064691J285859J440019J941329K596149L461610
3122C6137593M705632O134278P659533Q506164Q389079P640139O682760O076799
3114I1931977N466242L760749K55247m559191q749961j0979205j1362189j0265502
3106E5498167q598415o946550n538308m331763l376683k551861j996514j618140
$$ plain form
3098 20539933 19250868 18267990 17453572 16821898 16270330 15889585 15576050 15284244 15012811
3089 15012811 14759701 14609853 14235460 13849697 13343068 12736117 12117636 11574948 11170229
3080 11170229 10898346 10812111 10852452 10853568 10832477 10770134 10604738 10436621 10261181 10266325 10395772
3069 10395772 10516396 10698396 10804112 10965669 11014267 11199421 11501376 12000124 12800668 13931126
3059 13931126 15537535 17552530 19976973 22461679 24632621 26049801 26355338 25394948
3051 25394948 23749779 21837388 20103719 18819282 18091049 17987810 18467843 19210878 19961963
3042 19961963 20278383 19857936 18840654 17505127 16050803 14561354 13218969 12176855
3034 12176855 11418739 10740628 10248068 10010107 9990513 10218786 10642345 11156438 11763973 12407726
$$ packed form
3098B0539933j289065r82878q14418o31674n51568l80745l13535k91806k71433
3089A5012811k53110j49848l74393l85763n06629o06951o18481n42688m04719
3080A1170229k71883q6235M0341J116k1091o2343j65396j68117j75440N144J29447
3069A0395772J20624J82000J05716J61557M8598J85154L01955M98748Q00544J130458
3059A3931126J606409K014995K424443K484706K170942J417180L05537r60390
3051B5394948j645169j912391j733669j284437p28233j03239M80033P43035P51085
3042A9961963L16420m20447j017282j335527j454324j489449j342385j042114
3034A2176855p58116o78111m92560k37961j9594K28273M23559N14093O07535O43753
$$ plain form
3024 12407726 13007157 13551212 14036885 14572015 15182450 16010988 17104858 18652246 20936357
3015 20936357 24430856 29789715 37570511 47820230 59395833 70123172 77388691 79156851
3007 79156851 75098220 66746204 56220756 45637351 36278718 28542902 22461885 17805962
2999 17805962 14212118 11428655 9298579 7751416 6473699 5492216 4791976 4149797 3592451
2990 3592451 3185652 2822360 2472723 2163393 1861003 1679012 1533010 1350433 1277616 1249290
2980 1249290 1096429 989187 972558 924134 905601 858345 873918 894533 973321 1044580 1214188
2969 1214188 1430533 1582584 1603811 1560238 1417922 1270629 1069107 888028 678922 456066
2959 456066 345351 258679 205984 86748 -10338 -122131 -150586 -234566 -245986 -309816 -339184
$$ packed form
3024A2407726N99431N44055M85673N35130O10435Q28538J093870J547388K284111
3015B0936357L494499N358859P780796J0249719J1575603J0727339P265519J768160
3007G9156851m058631q352016j0525448j0583405r358633p735816o081017m655923
2999A7805962l593844k783463k130076j547163j277717r81483p00240o42179n57346
2990C592451m06799l63292l49637l09330l02390j81991j46002j82577p2817k8326
2980A249290j52861j07242j6629m8424j8533m7256J5573K0615P8788P1259J69608
2969A214188K16345J52051K1227m3573j42316j47293k01522j81079k09106k22856
2959D56066j10715q6672n2695j19236r7086j11793k8455q3980j1420o3830k9368
$$ plain form
2948 -339184 -378243 -429774 -503613 -518298 -455432 -422320 -370457 -365805 -360944 -316526 -190776 -125436
2936 -125436 -10174 77236 54658 65485 -61405 -180306 -321272 -424014 -598363 -694879
2926 -694879 -744297 -840218 -802121 -802849 -839965 -884630 -934900 -977794 -954052 -955156 -1017812 -1062564
2914 -1062564 -1013814 -1091374 -1174376 -1189511 -1160315 -1152508 -1173092 -1171835 -1228599 -1226631 -1198803 -1134340
2902 -1134340 -1139516 -1213164 -1202967 -1090869 -964597 -912750 -865446 -838660 -670067 -483641 -539689
2891 -539689 -559304 -574500 -704957 -808961 -917768 -976545 -1049145 -1173901 -1203730 -1256269 -1278725
2880 -1278725 -1262651 -1331725 -1388474 -1314045 -1252356 -1298172 -1318854 -1355402 -1393130 -1435998 -1435483 -1386820
2868 -1386820 -1400118 -1368656 -1389881 -1333169 -1298313 -1319323 -1338593 -1307073 -1300157 -1353131 -1305629 -1382803
$$ packed form
2948c39184l9059n1531p3839j4685O2866L3112N1863M652M861M4418J25750O5340
2936a25436J15262Q7410k2578J0827j26890j18901j40966j02742j74349r6516
2926f94879m9418r5921L8097p28l7116m4665n0270m2894K3742j104o2656m4752
2914a062564M8750p7560q3002j5135K9196P807k0584J257n6764J968K7828O4463
2902a134340n176p3648J0197J12098J26272N1847M7304K6786J68593J86426n6048
2891e39689j9615j5196j30457j04004j08807n8777p2600j24756k9829n2539k2456
2880a278725J6074o9074n6749P4429O1689m5816k0682l6548l7728m2868N15M8663
2868a386820j3298L1462k1225N6712L4856k1010j9270L1520O916n2974M7502p7174
$$ plain form
2856 -1382803 -1385175 -1330943 -1364699 -1323064 -1303669 -1400805 -1439475 -1381170 -1310947 -1371073 -1446834 -1361782
2844 -1361782 -1346031 -1334589 -1269566 -1313785 -1264792 -1182117 -1196804 -1097325 -1010634 -887022 -731047
2833 -731047 -578198 -447737 -374547 -333455 -375283 -405136 -529728 -653543 -786830 -840906 -950548
2822 -950548 -1067329 -1165506 -1228591 -1225451 -1240142 -1304533 -1366004 -1344900 -1318502 -1317242 -1308273 -1385676
2810 -1385676 -1401201 -1356618 -1363473 -1386384 -1435480 -1436992 -1450245 -1567888 -1516115 -1416155 -1471346 -1486187
2798 -1486187 -1434441 -1432478 -1473272 -1395580 -1409154 -1348186 -1361601 -1374091 -1419588 -1436696 -1378717 -1314296
2786 -1314296 -1277965 -1355757 -1364902 -1333243 -1299347 -1271430 -1172894 -1189936 -1282666 -1222203 -1189979 -1199371
2774 -1199371 -1194264 -1154274 -1194831 -1233591 -1203539 -1177255 -1127290 -1148291 -1136502 -1090463 -1112051 -1017222
$$ packed form
2856a382803k372N4232l3756M1635J9395r7136l8670N8305P0223o0126p5761Q5052
2844a361782J5751J1442O5023m4219M8993Q2675j4687R9479Q6691J23612J55975
2833g31047J52849J30461P3190M1092m1828k9853j24592j23815j33287n4076j09642
2822i50548j16781r8177o3085L140j4691o4391o1471K1104K6398J260Q969p7403
2810a385676j5525M4583o855k2911m9096j512j3253j17643N1773R9960n5191j4841
2798a486187N1746J963m0794P7692j3574O0968j3415j2490m5497j7108N7979O4421
2786a314296L6331p7792r145L1659L3896K7917R8536j7042r2730O0463L2224r392
2774a199371N107L9990m0557l8760L0052K6284M9965k1001J1789M6039k1588R4829
$$ plain form
2762 -1017222 -939031 -950125 -961607 -967930 -1067137 -1068759 -1099911 -1206423 -1186661 -1182157 -1293601 -1292084
2750 -1292084 -1273407 -1306867 -1292498 -1269762 -1268540 -1286231 -1226349 -1244846 -1230655 -1387993 -1340121
2739 -1340121 -1278478 -1258892 -1231223 -1243021 -1250400 -1172088 -1118975 -1177244 -1226220 -1183635 -1150407 -1046758
2727 -1046758 -977757 -1034799 -1003452 -992167 -1018979 -1005767 -1027931 -1103536 -1163973 -1220469 -1270314
2716 -1270314 -1310271 -1310421 -1306349 -1355389 -1346624 -1323656 -1320799 -1247913 -1271887 -1257132 -1280208 -1339402
2704 -1339402 -1385636 -1335775 -1306247 -1297377 -1286710 -1295293 -1369344 -1316824 -1272262 -1278441 -1321856 -1280345
2692 -1280345 -1301210 -1332729 -1266855 -1256533 -1294046 -1236610 -1221018 -1231021 -1235629 -1232136 -1227191 -1205350
2680 -1205350 -1218740 -1229877 -1124321 -1096076 -1135861 -1144547 -1170341 -1154388 -1120798 -1248486 -1267212
$$ packed form
2762a017222P8191j1094j1482o323r9207j622l1152j06512J9762M504j11444J517
2750a292084J8677l3460J4369K2736J222j7691N9882j8497J4191j57338M7872
2739a340121O1643J9586K7669j1798p379P8312N3113n8269m8976M2585L3228J03649
2727a046758O9001n7042L1347J1285k6812J3212k2164p5605o0437n6496m9845
2716a270314l9957j50M072m9040Q765K2968K857P2886k3974J4755k3076n9194
2704a339402m6234M9861K9528Q870J0667q583p4051N2520M4562o179m3415M1511
2692a280345k0865l1519O5874J0322l7513N7436J5592j0003m608L493M945K1841
2680a205350j3390j1137J05556K8245l9785q686k5794J5953L3590j27688j8726
$$ plain form
2669 -1267212 -1239667 -1275299 -1246716 -1157792 -1225868 -1282261 -1339541 -1269115 -1244353 -1284973 -1246594
2658 -1246594 -1295540 -1272470 -1232019 -1240837 -1255500 -1322490 -1322031 -1254502 -1254867 -1300721 -1270803 -1263913 -1255805
2645 -1255805 -1238823 -1239869 -1189345 -1117050 -1139252 -1175763 -1226398 -1185702 -1209668 -1285425 -1188036 -1138019
2633 -1138019 -1208912 -1182215 -1259453 -1287135 -1206113 -1219345 -1176167 -1139535 -1112112 -1139890 -1158974
2622 -1158974 -1145668 -1133126 -1046061 -983720 -1005410 -969538 -872747 -889728 -967633 -933370 -902334
2611 -902334 -853255 -881388 -878749 -830367 -830101 -894867 -869828 -830929 -922817 -920205 -986078 -950987
2599 -950987 -860136 -786676 -773423 -701367 -543711 -478133 -397791 -301039 -267067 -336371 -377972
2588 -377972 -462237 -656863 -704243 -689372 -750185 -702494 -625572 -661058 -798178 -834920 -875576
$$ packed form
2669a267212K7545l5632K8583Q8924o8076n6393n7280P0426K4762m0620L8379
2658a246594m8946K3070M0451q818j4663o6990M59O7529l65m5854K9918O890Q108
2645a255805J6982j046N0524P2295k2202l6511n0635M0696k3966p5757R7389N0017
2633a138019p0893K6697p7238k7682Q1022j3232M3178L6632K7423k7778j9084
2622a158974J3306J2542Q7065O2341k1690L5872R6791j6981p7905L4263L1036
2611i02334M9079k8133K639M8382K66o4766K5039L8899r1888K612o5873L5091
2599i50987R0851P3460J3253P2056J57656O5578Q0342R6752L3972o9304m1601
2588c77972q4265j94626m7380J4871o0813M7691P6922l5486j37120l6742m0656
$$ plain form
2577 -875576 -919775 -942309 -928753 -1014622 -1059907 -1001947 -1000528 -966579 -986062 -940704 -956569 -939495
2565 -939495 -853838 -893555 -847480 -846868 -847723 -820499 -776074 -691434 -757060 -777194 -795719 -851637
2553 -851637 -835902 -882950 -979650 -938698 -955785 -1050804 -1101008 -1057733 -973306 -983303 -969926 -957456
2541 -957456 -1077050 -1120783 -1064125 -1082331 -1163350 -1174413 -1141377 -1091620 -1112319 -1129831 -1099791
2530 -1099791 -1072970 -1093522 -1026325 -1057259 -1090612 -1065507 -1073021 -1021221 -1070198 -1067228 -1090717 -1071231
2518 -1071231 -1029048 -990023 -948168 -1001094 -1066504 -1068742 -1123576 -1092613 -1061547 -1010725 -1044179 -1075472
2506 -1075472 -1061821 -1087179 -1038192 -1000537 -990263 -1017514 -1058135 -959528 -984454 -1032234 -1027457 -998592
2494 -998592 -1000179 -932736 -885344 -922088 -1010737 -988660 -954291 -926683 -916424 -953491 -947076 -936396
$$ packed form
2577h75576m4199k2534J3556q5869m5285N7960J419L3949j9483M5358j5865J7074
2565i39495Q5657l9717M6075O12q55K7224M4425Q4640o5626k0134j8525n5918
2553h51637J5735m7048r6700M0952j7087r5019n0204M3275Q4427r997J3377J2470
2541i57456j19594m3733N6658j8206q1019j1063L3036M9757k0699j7512L0040
2530a099791K6821k0552O7197l0934l3353K5105p514N1800m8977K970k3489J9486
2518a071231M2183L9025M1855n2926o5410k238n4834L0963L1066N0822l3454l1293
2506a075472J3651k5358M8987L7655J0274k7251m0621R8607k4926m7780M777K8865
2494i98592j587O7443M7392l6744q8649K2077L4369K7608J0259l7067O415J0680
$$ plain form
2482 -936396 -902695 -915434 -893369 -917607 -977549 -988698 -939763 -846177 -873700 -895644 -880800 -897481
2470 -897481 -896902 -898597 -905452 -899753 -951236 -912680 -882231 -951047 -920118 -858283 -845259 -780265 -790513
2457 -790513 -818498 -869882 -864109 -879406 -890704 -893385 -912802 -890718 -849938 -843572 -821995 -780686
2445 -780686 -833523 -790534 -800485 -748767 -725717 -730978 -821181 -842122 -788623 -750322 -696414 -650288
2433 -650288 -667572 -690219 -725347 -682701 -715210 -645447 -688116 -718963 -732333 -732887 -657822 -560943
2421 -560943 -592196 -635458 -626321 -654929 -685125 -640532 -701387 -690051 -640310 -609792 -572584 -500869
2409 -500869 -493334 -523892 -559563 -552220 -513479 -520841 -458648 -429105 -432974 -411148 -389655 -399863
2397 -399863 -379293 -333354 -388600 -347822 -284645 -220169 -210402 -211458 -164638 -121961 -161217 -171478
$$ packed form
2482i36396L3701j2739K2065k4238n9942j1149M8935R3586k7523k1944J4844j6681
2470h97481N79j695o855N699n1483L8556L0449o8816L0929O1835J3024O4994j0248
2457g90513k7985n1384N773j5297j1298k681j9417K2084M0780O366K1577M1309
2445g80686n2837M2989r951N1718K3050n261r0203k0941N3499L8301N3908M6126
2433f50288j7284k2647l5128M2646l2509O9763m2669l0847j3370n54P5065R6879
2421e60943l1253m3262R137k8608l0196M4593o0855J1336M9741L0518L7208P1715
2409e00869P535l0558l5671P343L8741p362O2193K9543l869K1826K1493j0208
2397c99863K0570M5939n5246M0778O3177O4476R767j056M6820M2677l9256j0261
$$ plain form
2385 -171478 -158973 -100133 -87121 -110442 -32608 21815 31111 32113 86679 167030 134077 193856
2373 193856 172152 223981 325159 381909 413105 415468 479248 561122 577744 654525 736320 828292
2361 828292 903446 946866 1014828 1135442 1194251 1288072 1396706 1503923 1672981 1868800 2098183
2350 2098183 2251306 2508925 2758613 3166955 3520269 4006068 4545121 5274637 6256145 7274261
2340 7274261 7883282 8139169 8213012 8503345 8909798 9766868 10870339 12540016 14509961
2331 14509961 17604543 22222491 31587501 48131272 72569082 93435478 97211849 82559057
2323 82559057 62798724 47347120 35597031 27161007 20493210 15387671 11410655 8662057
2315 8662057 6528032 5210434 4558455 4452151 4325169 4135366 3420887 2713355 2091748
$$ packed form
2385a71478J2505N8840J3012k3321P7834N4423R296J002N4566Q0351l2953N9779
2373A93856k1704N1829J01178N6750L1196K363O3780Q1874J6622P6781Q1795R1972
2361H28292P5154M3420O7962J20614N8809R3821J08634J07217J69058J95819K29383
2350B098183J53123K57619K49688M08342L53314M85799N39053P29516R81508J018116
2340G274261O09021K55887P3843K90333M06453Q57070J103471J669677J969945
2331A4509961L094582M617948R365010J6543771K4437810K0866396L776371j4652792
2323H2559057j9760333j5451604j1750089q436024o667797n105539l977016k748598
2315H662057k134025j317598o51979j06304j26982j89803p14479p07532o21607
$$ plain form
2306 2091748 1687754 1369266 1141020 951845 865410 717339 582172 496518 423947 331925
2296 331925 293107 233941 110138 -54830 -74747 -151604 -167559 -199244 -201037 -330591 -349457
2285 -349457 -353928 -383902 -369490 -349140 -401272 -482783 -596569 -592180 -620710 -584580 -628345 -606018
2273 -606018 -630868 -661607 -731448 -666954 -711155 -711744 -689784 -757066 -731605 -769614 -742569 -717554
2261 -717554 -749324 -780235 -815670 -811642 -783275 -835964 -882179 -862247 -884137 -875186 -954674 -948615
2249 -948615 -927699 -920234 -965137 -917330 -827239 -832564 -906534 -1010885 -932521 -907092 -903087 -901441
2237 -901441 -909947 -968189 -1000636 -1012455 -1041679 -966710 -912549 -969191 -1009209 -1025480 -1077944 -1049088
2225 -1049088 -1057878 -1127839 -1092918 -1072496 -1027117 -1058805 -1038124 -1051099 -1100702 -1062103 -981487 -1047304
$$ packed form
2306B091748m03994l18488k28246j89175q6435j48071j35167q5654p2571r2022
2296C31925l8818n9166j23803j64968j9917p6857j5955l1685j793j29554j8866
2285c49457m471k9974J4412K0350n2132q1511j13786M389k8530L6130m3765K2327
2273f06018k4850l0739o9841O4494m4201n89K1960o7282K5461l8009K7045K5015
2261g17554l1770l0911l5435M028K8367n2689m6215J9932k1890Q951p9488O059
2249i48615K0916P465m4903M7807R0091n325p3970j04351P8364K5429M005J646
2237i01441q506n8242l2447j1819k9224P4969N4161n6642m0018j6271n2464K8856
2225a049088q790o9961L4921K0422M5379l1688K0681j2975m9603L8599Q0616o5817
$$ plain form
2213 -1047304 -1083578 -998201 -950373 -982551 -1076443 -1074360 -1019594 -1050484 -1039574 -1055818 -1046664 -1101423
2201 -1101423 -1102413 -1074239 -1121812 -1164021 -1153374 -1193489 -1135926 -1103358 -1088814 -1129698 -1129731 -1101811
2189 -1101811 -1075033 -1076956 -1106860 -1126460 -1163161 -1098734 -1075439 -1072740 -1070753 -1099076 -1013796 -1075716
2177 -1075716 -1169946 -1135802 -1153692 -1141579 -1148926 -1182403 -1100201 -1142076 -1129854 -1104128 -1059923 -1151930
2165 -1151930 -1134345 -1142412 -1149005 -1129556 -1141695 -1107508 -1083726 -992082 -1011693 -1050514 -1094867 -1075038
2153 -1075038 -1052962 -1108981 -1139598 -1135266 -1105414 -1127019 -1088073 -1067166 -1128984 -1156457 -1093651 -1085274
2141 -1085274 -1065344 -1085391 -1122282 -1106200 -1104345 -1104319 -1113059 -1071356 -1075517 -1035189 -1055973 -1032216 -1010591
2128 -1010591 -1024153 -1022962 -1003122 -1027939 -1043595 -1041551 -1132568 -1117687 -1114623 -1075165 -1087369 -1045621
$$ packed form
2213a047304l6274Q5377M7828l2178r3892K083N4766l0890J0910j6244R154n4759
2201a101423r90K8174m7573m2209J0647m0115N7563L2568J4544m0884l3K7920
2189a101811K6778j923k9904j9600l6701O4427K3295K699J987k8323Q5280o1920
2177a075716r4230L4144j7890J2113p347l3477Q2202m1875J2222K5726M4205r2007
2165a151930J7585q067o593J9449j2139L4187K3782R1644j9611l8821m4353J9829
2153a075038K2076n6019l0617M332K9852k1605L8946K0907o1818k7473O2806Q377
2141a085274J9930k0047l6891J6082J855K6q740M1703m161M0328k0784K3757K1625
2128a010591j3562J191J9840k4817j5656K044r1017J4881L064L9458j2204M1748
$$ plain form
2116 -1045621 -1009181 -1043218 -1036395 -1073950 -1115260 -1158501 -1085291 -1031388 -1021417 -1028685 -1060989 -1056667
2104 -1056667 -1060894 -1089281 -1083258 -1105450 -1144864 -1075781 -1046558 -1141709 -1158880 -1078804 -997022 -1062591
2092 -1062591 -1123997 -1109912 -1042814 -1045694 -1053337 -1095188 -1103006 -1090819 -1119258 -1119390 -1066421 -1087690
2080 -1087690 -1056734 -1004679 -981236 -933725 -922746 -996250 -1019359 -1063863 -1078869 -1050846 -1023227
2069 -1023227 -1099229 -1083179 -1018318 -984504 -942684 -908169 -981287 -970469 -947773 -919585 -907004
2058 -907004 -831460 -681774 -565952 -528868 -641391 -785714 -871497 -878021 -909750 -914183 -985639
2047 -985639 -1022453 -1080521 -1049819 -1091905 -1085048 -1054466 -1055560 -1045401 -1043427 -1038692 -1043240 -1000905 -1042863
2034 -1042863 -985341 -994141 -1077746 -1085514 -1035206 -1062337 -1032032 -1000084 -1035419 -1016348 -999891 -1080436
$$ packed form
2116a045621L6440l4037O823l7555m1310m3241P3210N3903R971p268l2304M322
2104a056667m227k8387O023k2192l9414O9083K9223r5151j7171Q0076Q1782o5569
2092a062591o1406J4085O7098k880p643m1851p818J2187k8439j32N2969k1269
2080a087690L0956N2055K3443M7511J0979p3504k3109m4504j5006K8023K7619
2069a023227p6002J6050O4861L3814M1820L4515p3118J0818K2696K8188J2581
2058i07004P5544J49686J15822L7084j12523j44323q5783o524l1729m433p1456
2047i85639l6814n8068L0702m2086O857L0582j094J0159J974M735m548M2335m1958
2034a042863N7522q800q3605p768N0308k7131L0305L1948l5335J9071J6457q0545
$$ plain form
2022 -1080436 -1087296 -1077544 -1021022 -1025406 -981580 -984523 -975916 -983373 -1038051 -951491 -967959 -994195 -1030326
2009 -1030326 -1069337 -1126513 -1059875 -1022238 -1087329 -1043213 -1037996 -1126366 -1093565 -1109617 -1123140 -1079126
1997 -1079126 -1143184 -1164741 -1070167 -1055281 -1052838 -1035324 -1010456 -1069056 -1020833 -1003765 -1032562 -1027600
1985 -1027600 -985171 -1049958 -1053872 -1005614 -1039754 -966634 -904370 -932843 -966388 -993780 -1078602 -1080036
1973 -1080036 -1059856 -1068437 -1048416 -1092589 -1062068 -1085295 -1063098 -1030482 -994419 -1001190 -927976 -937793
1961 -937793 -936116 -998656 -1025995 -986391 -1016613 -1030440 -1008911 -993817 -1025656 -1023674 -1031803 -1062957
1949 -1062957 -1047990 -998902 -993007 -1000395 -1027997 -1027122 -1045652 -1003209 -983684 -993890 -1000755 -1000119 -970775
1936 -970775 -980332 -937986 -999868 -1056810 -998892 -1022661 -1025263 -1040543 -1007430 -965749 -957703 -991302
$$ packed form
2022a080436o860R752N6522m384M3826k943Q607p457n4678Q6560j6468k6236l6131
2009a030326l9011n7176O6638L7637o5091M4116N217q8370L2801j6052j3523M4014
1997a079126o4058k1557R4574J4886K443J7514K4868n8600M8223J7068k8797M962
1985a027600M2429o4787l914M8258l4140P3120O2264k8473l3545k7392q4822j434
1973a080036K0180q581K0021m4173L0521k3227K2197L2616L6063o771P3214r817
1961i37793J677o2540k7339L9604l0222j3827K1529J5094l1839J982q129l1154
1949a062957J4967M9088N895p388k7602Q75j8530M2443J9525j0206o865O36K9344
1936i70775r557M2346o1882n6942N7918k3769k602j5280L3113M1681Q046l3599
$$ plain form
1924 -991302 -977999 -962827 -972676 -967818 -974211 -926905 -961882 -957925 -941738 -922613 -907931 -946882
1912 -946882 -948316 -939241 -954885 -980214 -1002707 -1006797 -972265 -1034176 -1032874 -1043789 -956528 -1009778
1900 -1009778 -923620 -995526 -1020042 -980622 -1082414 -1051423 -1018857 -1026936 -1010792 -993723 -1006183
1889 -1006183 -952096 -952266 -965723 -978635 -946322 -969057 -921443 -971238 -975518 -954303 -947956 -964853
1877 -964853 -960129 -918782 -952978 -1002712 -977887 -1016452 -993584 -971040 -1013290 -958867 -941056 -961332
1865 -961332 -972085 -944587 -980069 -959503 -989846 -903212 -984863 -991562 -919113 -951225 -909638 -891462
1853 -891462 -898940 -883195 -877790 -877888 -938526 -948930 -955509 -976444 -979435 -962262 -936993 -919078 -874562
1840 -874562 -848165 -819467 -908350 -921657 -851666 -862167 -907065 -926402 -973771 -925073 -866166 -898306
$$ packed form
1924i91302J3303J5172r849M858o393M7306l4977L957J6187J9125J4682l8951
1912i46882j434R075j5644k5329k2493m090L4532o1911J302j0915Q7261n3250
1900a009778Q6158p1906k4516L9420j01792L0991L2566q079J6144J7069j2460
1889a006183N4087j70j3457j2912L2313k2735M7614m9795m280K1215O347j6897
1877i64853M724M1347l4196m9734K4825l8565K2868K2544m2250N4423J7811k0276
1865i61332j0753K7498l5482K0566l0343Q6634q1651o699P2449l2112M1587J8176
1853h91462p478J5745N405r8o0638j0404o579k0935k991J7173K5269J7915M4516
1840h74562K6397K8698q8883j3307O9991j0501m4898j9337m7369M8698N8907l2140
$$ plain form
1828 -898306 -896047 -877602 -935696 -969064 -889119 -939742 -991121 -944331 -926820 -864055 -942506 -939252
1816 -939252 -950534 -976703 -950297 -929496 -907983 -890129 -911072 -924534 -961592 -978259 -915386 -950683
1804 -950683 -926947 -957369 -978519 -930801 -921848 -907052 -929846 -959195 -993385 -949817 -925298 -913082
1792 -913082 -950622 -962487 -930197 -956811 -914993 -910583 -986290 -939667 -860054 -869339 -917013 -934561
1780 -934561 -909921 -925824 -935148 -942287 -971930 -956622 -899290 -881869 -889484 -899063 -927780 -912673
1768 -912673 -879848 -869653 -898977 -982150 -1020419 -965673 -938235 -913577 -914634 -929492 -944223 -1002641
1756 -1002641 -965898 -1000138 -927160 -927598 -930189 -843567 -908570 -903536 -890582 -916199 -938265 -960637
1744 -960637 -938651 -912031 -926982 -938129 -885896 -913927 -1005446 -1011737 -992628 -928884 -897423 -840865
$$ packed form
1828h98306K259J8445n8094l3368P9945n0623n1379M6790J7511O2765p8451L254
1816i39252j1282k6169K6406K0801K1513J7854k0943j3462l7058j6667O2873l5297
1804i50683K3736l0422k1150M7718Q953J4796k2794k9349l4190M3568K4519J2216
1792i13082l7540j1865L2290k6614M1818M410p5707M6623P9613r285m7674j7548
1780i34561K4640j5903r324p139k9643J5308N7332J7421p615r579k8717J5107
1768i12673L2825J0195k9324q3173l8269N4746K7438K4658j057j4858j4731n8418
1756a002641L6743l4240P2978m38k591Q6622o5003N034J2954k5617k2066k2372
1744i60637K1986K6620j4951j1147N2233k8031r1519o291J9109O3744L1461N6558
$$ plain form
1732 -840865 -881624 -904684 -836269 -806087 -828093 -845286 -868533 -819440 -840989 -887858 -949713 -923298
1720 -923298 -871301 -834777 -838746 -898149 -907217 -904402 -802043 -825632 -903068 -930189 -867646 -849809
1708 -849809 -851125 -945645 -928010 -965045 -980490 -965028 -925693 -806665 -783338 -862374 -889667 -891008
1696 -891008 -891663 -893844 -1004169 -930177 -927656 -869175 -866606 -906381 -872349 -926739 -893673 -893664 -940853
1683 -940853 -870195 -844695 -876330 -922657 -903728 -935441 -912459 -846042 -833228 -801147 -790287 -799693
1671 -799693 -809186 -818891 -862514 -882966 -894833 -877123 -855108 -835979 -820020 -836678 -895121 -847816
1659 -847816 -785255 -784766 -840021 -890262 -911758 -841693 -855477 -895907 -876815 -868372 -853196 -842493
1647 -842493 -855089 -848288 -842825 -837870 -896191 -856502 -882136 -864893 -856628 -853217 -879000 -935103 -871975
$$ packed form
1732h40865m0759k3060O8415L0182k2006j7193k3247M9093k1549m6869o1855K6415
1720i23298N1997L6524l969n9403r068K815J02359k3589p7436k7121O2543J7837
1708h49809j316r4520J7635l7035j5445J5462L9335J19028K3327p9036k7293j341
1696h91008o55k181j10325P3992K521N8481K569l9775L4032n4390L3066Rm7189
1683i40853P0658K5500l1635m6327J8929l1713K2982O6417J2814L2081J0860r406
1671g99693r493r705m3623k0452j1867J7710K2015J9129J5959j6658n8443M7305
1659h47816O2561M89n5255n0241k1496P0065j3784m0430J9092Q443J5176J0703
1647h42493j2596O801N463M955n8321L9689k5634J7243Q265L411k5783n6103O3128
$$ plain form
1634 -871975 -888294 -920050 -864587 -792225 -792236 -838786 -923657 -904773 -867601 -868762 -917834 -897629
1622 -897629 -917779 -962157 -962752 -906826 -895652 -845929 -774791 -787821 -829273 -865529 -786629 -785674
1610 -785674 -829439 -870452 -899865 -893719 -913783 -871839 -862743 -860628 -923019 -1003440 -981493 -945663
1598 -945663 -913272 -832062 -901419 -847627 -860854 -844974 -848754 -885736 -869536 -892856 -962906 -882161
1586 -882161 -897279 -957212 -898694 -810767 -808832 -837183 -811677 -825918 -854110 -860772 -808656 -805783
1574 -805783 -827399 -837372 -849647 -917218 -847354 -832893 -870157 -889960 -896847 -892602 -829318 -846851
1562 -846851 -780341 -796056 -764537 -806570 -881777 -879124 -882287 -892816 -881766 -855205 -912948 -890006
1550 -890006 -815180 -854533 -883283 -840722 -851594 -854795 -862904 -818426 -761413 -817498 -889861 -942088
$$ packed form
1634h71975j6319l1756N5463P2362j1m6550q4871J8884L7172j161m9072K0205
1622h97629k0150m4378n95N5926J1174M9723P1138j3030m1452l6256P8900R55
1610g85674m3765m1013k9413O146k0064M1944R096K115o2391q0421K1947L5830
1598i45663L2391Q1210o9357N3792j3227J5880l780l6982J6200k3320p0050Q0745
1586h82161j5118n9933N8518Q7927J935k8351K5506j4241k8192o662N2116K873
1574h05783k1616r973j2275o7571O9864J4461l7264j9803o887M245O3284j7533
1562h46851O6510j5715L1519m2033p5207K653l163j0529J1050K6561n7743K2942
1550h90006P4826l9353k8750M2561j0872l201q109M4478N7013n6085p2363n2227
$$ plain form
1538 -942088 -894776 -838960 -781586 -747438 -739787 -774678 -780204 -803324 -788767 -766421 -774425 -783229
1526 -783229 -750166 -741941 -777566 -706582 -666796 -754983 -821697 -813446 -819070 -829075 -797971 -793849
1514 -793849 -834556 -878527 -834294 -804903 -790903 -797251 -758141 -769587 -812155 -776755 -804336 -838794
1502 -838794 -814054 -797819 -766417 -690077 -727058 -764130 -816062 -850979 -874951 -800338 -817578 -833527
1490 -833527 -847023 -817480 -823286 -784062 -774910 -798858 -805162 -829739 -854518 -885766 -876210 -864403
1478 -864403 -888957 -856147 -918131 -826642 -816940 -838596 -779489 -753134 -813343 -805115 -757273 -770510
1466 -770510 -794634 -745274 -703674 -737204 -684851 -778841 -788123 -692079 -707539 -817036 -821071 -784528
1454 -784528 -753172 -862057 -836012 -812257 -810397 -795284 -786358 -865017 -853162 -868138 -854553 -788578
$$ packed form
1538i42088M7312N5816N7374L4148P651l4891n526k3120J4557K2346q004q804
1526g83229L3063Q225l5625P0984L9786q8187o6714Q251n624j0005L1104M122
1514g93849m0707m3971M4233K9391J4000o348L9110j1446m2568L5400k7581l4458
1502h38794K4740J6235L1402P6340l6981l7072n1932l4917k3972P4613j7240j5949
1490h33527j3496K9543n806L9224R152k3948o304k4577k4779l1248R556J1807
1478h64403k4554L2810o1984R1489R702k1656N9107K6355o0209Q228M7842j3237
1466g70510k4124M9360M1600l3530N2353r3990r282R6044j5460j09497m035L6543
1454g84528L1356j08885K6045K3755J860J5113Q926p8659J1855j4976J3585O5975
$$ plain form
1442 -788578 -801073 -730633 -783415 -780892 -713252 -738002 -751198 -764329 -862175 -877707 -858719 -835891
1430 -835891 -893383 -854668 -820967 -838762 -878139 -813547 -804014 -780302 -712575 -811079 -747247 -744407
1418 -744407 -745603 -772926 -807805 -796063 -777950 -744070 -764340 -738095 -765417 -846147 -818109 -800683
1406 -800683 -775652 -795181 -775381 -797902 -780490 -803845 -846868 -803997 -786180 -848206 -855529 -861430
1394 -861430 -854765 -817186 -847819 -835145 -759759 -760738 -728160 -758729 -794218 -797912 -827766 -817894 -829150
1381 -829150 -781253 -837967 -817952 -787126 -798500 -837951 -820903 -774117 -784312 -812765 -826675 -831542
1369 -831542 -809107 -777024 -784296 -839994 -799918 -789792 -790594 -869066 -825760 -841275 -877003 -836371
1357 -836371 -843045 -832935 -794678 -764599 -816085 -816425 -775298 -750544 -801591 -816908 -802726 -793773
$$ packed form
1442g88578j2495P0440n2782K523O7640k4750j3196j3131r7846j5532J8988K2828
1430h35891n7492L8715L3701j7795l9377O4592R533K3712O7727r8504O3832K840
1418g44407j196k7323l4879J1742J8113L3880k0270K6245k7322q0730K8038J7426
1406h00683K5031j9529J9800k2521J7412k3355m3023M2871J7817o2026p323n901
1394h61430O665L7579l0633J2674P5386r79L2578l0569l5489l694k9854R872j1256
1381h29150M7897n6714K0015L0826j1374l9451J7048M6786j0195k8453j3910m867
1369h31542K2435L2083p272n5698M0076J0126q02p8472M3306j5515l5728M0632
1357h36371o674J0110L8257L0079n1486l40M1127K4754n1047j5317J4182Q953
$$ plain form
1345 -793773 -755665 -739220 -751565 -744077 -770394 -734455 -727193 -740386 -720111 -691411 -711479 -755489
1333 -755489 -814533 -770138 -665431 -683768 -723044 -808548 -833321 -851340 -861746 -759807 -755713
1322 -755713 -749588 -736499 -756878 -754193 -785071 -821288 -884892 -842323 -803143 -862836 -798171 -812788
1310 -812788 -775281 -753793 -813538 -827402 -839723 -779571 -713213 -720617 -777038 -776197 -742792 -740467
1298 -740467 -757907 -754780 -710355 -668319 -719124 -819561 -799914 -813294 -817748 -828504 -752164 -700002
1286 -700002 -725170 -735255 -787169 -788228 -786397 -806269 -843705 -837898 -801430 -764169 -772614 -730054
1274 -730054 -750379 -745898 -725480 -757742 -743204 -718150 -722828 -791308 -748652 -737478 -799447 -769214
1262 -769214 -751337 -817608 -795825 -775659 -717255 -717222 -708972 -682644 -746475 -755210 -773477 -750646 -763921
$$ packed form
1345g93773L8108J6445j2345P488k6317L5939P262j3193K0275K8700k0068m4010
1333g55489n9044M4395J04707j8337l9276q5504k4773j8019j0406J01939M094
1322g55713O125J3089k0379K685l0878l6217o3604M2569L9180n9693O4665j4617
1310h12788L7507K1488n9745j3864j2321O0152O6358p404n6421Q41L3405K325
1298g40467j7440L127M4425M2036n0805j00437J9647j3380m454j0756P6340N2162
1286g00002k5168j0085n1914j059J831j9872l7436N807L6468L7261q445M2560
1274g30054k0325M481K0418l2262J4538K5054m678o8480M2656J1174o1969L0233
1262g69214J7877o6271K1783K0166N8404L3Q250K6328o3831q735j8267K2831j3275
$$ plain form
1249 -763921 -716002 -729174 -769359 -773394 -790326 -749640 -733773 -687005 -679989 -694548 -711468 -746923
1237 -746923 -746037 -806610 -771953 -848589 -800606 -788304 -804248 -784345 -782195 -755735 -766596 -766413 -756844
1224 -756844 -715742 -780678 -750208 -699409 -790930 -845186 -784840 -780920 -813279 -886599 -788529 -687102
1212 -687102 -695228 -719706 -717608 -661220 -691450 -735306 -736863 -754903 -751583 -749028 -748738 -759644 -803649
1199 -803649 -772469 -784681 -858442 -858996 -807535 -780914 -703193 -731405 -743286 -745043 -766496 -717387
1187 -717387 -727380 -780775 -799719 -760085 -790909 -752908 -752666 -722825 -756794 -733691 -712318 -706543
1175 -706543 -763781 -780892 -775001 -777809 -695340 -718548 -805080 -798009 -757290 -809709 -790218 -715205
1163 -715205 -720641 -801864 -789007 -803975 -711402 -699623 -706483 -777762 -771606 -761851 -806490 -797855 -791285
$$ packed form
1249g63921M7919j3172m0185m035j6932M0686J5867M6768P016j4559j6920l5455
1237g46923Q86o0573L4657p6636M7983J2302j5944J9903K150K6460j0861J83R569
1224g56844M1102o4936L0470N0799r1521n4256O0346L920l2359p3320R8070J01427
1212f87102q126k4478K098N6388l0230m3856j557j8040L320K555K90j0906m4005
1199h03649L1180j2212p3761n54N1461K6621P7721k8212j1881j757k1453M9109
1187g17387r993n3395j8944L9634l0824L8001K42K9841l3969K3103K1373N775
1175g06543n7238j7111N891k808Q2469k3208q6532P071M0719n2419J9491P5013
1163g15205n436q1223J2857j4968R2573J1779o860p1279O156R755m4639Q635O570
$$ plain form
1150 -791285 -731709 -741142 -753775 -774551 -712335 -691239 -740164 -660378 -697881 -678311 -668812 -703712
1138 -703712 -690170 -614133 -682696 -775436 -762128 -691969 -685394 -689917 -738919 -711911 -733855 -710060
1126 -710060 -715303 -749887 -750367 -771616 -738963 -742189 -735255 -784847 -752682 -797851 -737435 -707479 -708946
1113 -708946 -684102 -681240 -779106 -762781 -753636 -748038 -728627 -750749 -822094 -800477 -816959 -790290
1101 -790290 -757905 -741096 -746229 -748615 -769314 -797856 -721689 -689906 -703035 -667356 -656642 -667255
1089 -667255 -664675 -669659 -698627 -638352 -703083 -676986 -689614 -776192 -798117 -727843 -715370 -718544
1077 -718544 -735593 -728467 -777232 -788142 -715862 -720697 -690509 -694250 -689451 -703302 -686822 -646087
1065 -646087 -659013 -710341 -679339 -693906 -670408 -726527 -743917 -758970 -817046 -764506 -772250 -776831
$$ packed form
1150g91285N9576r433j2633k0776O2216K1096m8925P9786l7503J9570R499l4900
1138g03712J3542P6037o8563r2740J3308P0159O575m523m9002K7008k1944K3795
1126g10060n243l4584m80k1249L2653l226O934m9592L2165m5169O0416K9956j467
1113g08946K4844K862r7866J6325R145N598J9411k2122p1345K1617j6482K6669
1101g90290L2385J6809n133k386k0699k8542P6167L1783j3129L5679J0714j0613
1089f67255K580m984k8968O0275o4731K6097j2628q6578k1925P0274J2473l174
1077g18544j7049P126m8765j0910P2280m835L0188l741M799j3851J6480M0735
1065f46087j2926n1328L1002j4567K3498n6119j7390j5053n8076N2540p744m581
$$ plain form
1053 -776831 -753443 -745581 -745752 -745163 -696355 -684255 -666916 -672958 -706531 -745755 -747479 -716374 -732545
1040 -732545 -762314 -745211 -764800 -717670 -754691 -748672 -749883 -715225 -750080 -812946 -814589 -719348
1028 -719348 -695774 -711488 -735525 -742309 -709027 -725690 -718987 -638166 -624964 -637816 -676488 -732303
1016 -732303 -646270 -612784 -709687 -721406 -713334 -697113 -689743 -579455 -612985 -655167 -686352 -723014
1004 -723014 -723742 -687689 -687889 -714961 -641412 -733765 -786727 -751495 -677723 -653855 -701009 -689049
992 -689049 -680812 -736636 -736082 -772725 -769910 -807317 -761619 -713181 -697686 -651634 -680906 -740045 -746215
979 -746215 -784238 -761917 -757002 -722437 -689120 -673423 -691550 -727379 -748377 -743792 -707396 -638650
967 -638650 -660828 -718519 -709200 -693644 -685468 -712555 -722481 -741053 -711829 -683244 -666122 -692592
$$ packed form
1053g76831K3388P862j71N89M8808J2100J7339o042l3573l9224j724L1105j6171
1040g32545k9769J7103j9589M7130l7021O019j211L4658l4855o2866j643R5241
1028g19348K3574j5714k4037o784L3282j6663O703Q0821J3202j2852l8672n5815
1016g32303Q6033L3486r6903j1719Q072J6221P370J10288l3530m2182l1185l6662
1004g23014p28L6053k00k7072P3549r2353n2962L5232P3772K3868m7154J1960
992f89049Q237n5824N54l6643K815l7407M5698M8438J5495M6052k9272n9139o170
979g46215l8023K2321M915L4565L3317J5697j8127l5829k0998M585L6396O8746
967f38650k2178n7691R319J5556Q176k7087r926j8572K9224K8585J7122k6470
$$ plain form
955 -692592 -641803 -702958 -695494 -739808 -755011 -716159 -814922 -780264 -767587 -715083 -670430 -648323
943 -648323 -593811 -639127 -695885 -659690 -674815 -679888 -680473 -651895 -604389 -573427 -658815 -665776 -680905
930 -680905 -705968 -715708 -736160 -760818 -730368 -702196 -705671 -622548 -601354 -571555 -607326 -707938
918 -707938 -658189 -654245 -683442 -648307 -700529 -685392 -666247 -658822 -651473 -714250 -706694 -677552 -734268
905 -734268 -693221 -720699 -715057 -663666 -700838 -732770 -707282 -721283 -686852 -666254 -662808 -665036
893 -665036 -682602 -614862 -679653 -686013 -700286 -709559 -705395 -682293 -696514 -718789 -716308 -760071 -702385
880 -702385 -642538 -683114 -692162 -718116 -698738 -637482 -722024 -687970 -668791 -678586 -656434 -710862
868 -710862 -746328 -698664 -733290 -679677 -606291 -597082 -635888 -712870 -670873 -645788 -651323 -664593
$$ packed form
955f92592N0789o1155P464m4314j5203L8852r8763L4658J2677N2504M4653K2107
943f48323N4512m5316n6758L6195j5125n073n85K8578M7506L0962q5388o961j5129
930f80905k5063r740k0452k4658L0450K8172l475Q3123K1194K9799l5771j00612
918g07938M9749L944k9197L5135n2222J5137J9145P425P349o2777P556K9142n6716
905g34268M1047k7478N642N1391l7172l1932K5488j4001L4431K0598L446k228
893f65036j7566O7740o4791o360j4273r273M164K3102j4221k2275K481m3763N7686
880g02385N9847m0576r048k5954J9378O1256q4542L4054J9179r795K2152n4428
868g10862l5466M7664l4626N3613P3386R209l8806p6982M1997K5085n535j3270
$$ plain form
856 -664593 -680974 -652822 -683467 -645981 -628467 -631627 -651553 -730070 -671796 -721197 -680542 -670948
844 -670948 -662097 -704683 -705645 -759649 -743588 -783923 -719422 -632348 -629591 -637142 -590998 -628538 -699869
831 -699869 -683176 -698918 -657909 -622498 -617971 -597048 -625998 -729134 -692332 -673724 -595501 -648632
819 -648632 -641602 -652861 -660081 -660399 -654616 -655324 -673230 -730339 -661937 -636238 -712308 -736500 -684628
806 -684628 -745161 -734218 -657900 -712962 -731150 -682034 -715037 -702645 -651058 -664581 -695591 -706746
794 -706746 -723331 -717413 -684035 -619523 -642697 -626870 -656045 -684414 -663636 -682534 -666911 -623291
782 -623291 -714830 -716406 -673037 -665619 -645932 -673766 -634666 -559233 -555550 -658407 -653028 -609893
770 -609893 -614475 -673521 -676904 -688114 -691055 -714561 -669643 -701016 -672897 -600974 -621444 -620500 -617656
$$ packed form
856f64593j6381K8152l0645L7486J7514l160j9926p8517N8274m9401M0655R594
844f70948Q851m2586r62n4004J6061m0335O4501Q7074K757p551M6144l7540p1331
831f99869J6693j5742M1009L5411M527K0923k8950j03136L6802J8608P8223n3131
819f48632P030j1259p220l18N783p08j7906n7109O8402K5699p6070k4192N1872
806f84628o0533J0943P6318n5062j8188M9116l3003J2392N1587j3523l1010j1155
794g06746j6585N918L3378O4512k3174J5827k9175k8369K0778j8898J5623M3620
782f23291r1539j576M3369P418J9687k7834L9100P5433L683j02857N379M3135
770f09893m582n9046l383j1210k941k3506M4918l1373K8119P1923k0470R44K844
$$ plain form
757 -617656 -682576 -703106 -663147 -638383 -667909 -642644 -669363 -693602 -721629 -699803 -691357 -667215
745 -667215 -689656 -713311 -720660 -640774 -607412 -631703 -631925 -686087 -644342 -539651 -665428 -659243
733 -659243 -586553 -625747 -582397 -643966 -657611 -636394 -615718 -646646 -648085 -600110 -658881 -644930
721 -644930 -625056 -673419 -633091 -616484 -591188 -700717 -718838 -699184 -712876 -736492 -740109 -676531
709 -676531 -649113 -645215 -677099 -710308 -738566 -774833 -759398 -683168 -696007 -731967 -625240 -629388
697 -629388 -633181 -598995 -622640 -604661 -646960 -697287 -701282 -679848 -726384 -676005 -614458 -610968
685 -610968 -656341 -702798 -711811 -712714 -692378 -703707 -676797 -685635 -648325 -698669 -658157 -667285 -627455
672 -627455 -626846 -621100 -557772 -634323 -634939 -634305 -649061 -607783 -600827 -638858 -595915 -624093 -699493
$$ packed form
757f17656o4920k0530L9959K4764k9526K5265k6719k4239k8027K1826Q446K4142
745f67215k2441k3655p349P9886L3362k4291k22n4162M1745J04691j25777O185
733f59243P2690l9194M3350o1569j3645K1217K0676l0928j439M7975n8771J3951
721f44930J9874m8363M0328J6607K5296j09529j8121J9654j3692k3616l617O3578
709f76531K7418L898l1884l3209k8258l6267J5435P6230j2839l5960J06727m148
697f29388l793L4186k3645J7979m2299n0327l995K1434m6536N0379O1547L490
685f10968m5373m6457r013r03K0336j1329K6910q838L7310n0344M0512r128L9830
672f27455O09N746O3328p6551o16O34j4756M1278O956l8031M2943k8178p5400
$$ plain form
659 -699493 -738343 -671519 -663015 -671800 -668814 -610751 -557655 -614796 -603427 -538372 -652945 -678476
647 -678476 -604847 -651267 -596712 -598667 -666666 -640760 -634540 -625566 -612040 -619267 -602209 -595845 -542948
634 -542948 -533900 -558178 -665540 -684708 -580420 -586925 -567336 -609734 -657402 -615164 -593489 -611129
622 -611129 -636064 -621627 -578687 -629701 -647090 -646632 -644460 -665433 -648563 -650843 -631247 -578605 -641878
609 -641878 -694139 -702511 -673215 -688248 -651972 -687287 -732074 -677447 -646551 -706968 -677896 -604548
597 -604548 -600244 -576196 -535509 -579754 -631134 -573834 -653379 -669041 -633728 -695467 -724237 -661400
585 -661400 -651261 -593643 -614355 -651550 -659730 -618686 -575478 -643382 -638119 -586888 -603196 -620776
573 -620776 -593436 -605726 -588972 -633193 -681207 -664421 -683571 -672440 -669185 -659830 -649458 -632343
$$ packed form
659f99493l8850O6824Q504q785K986N8063N3096n7141J1369O5055j14573k5531
647f78476P3629m6420N4555j955o7999K5906O220Q974J3526p227J7058O364N2897
634e42948R048k4278j07362j9168J04288o505J9589m2398m7668M2238K1675j7640
622f11129k4935J4437M2940n1014j7389M58K172k0973J6870k280J9596N2642o3273
609f41878n2261q372K9296j5033L6276l5315m4787N4627L0896o0417K9072P3348
597f04548M304K4048M0687m4245n1380N7300p9545j5662L5313o1739k8770O2837
585f61400J0139N7618k0712l7195q180M1044M3208o7904N263N1231j6308j7580
573f20776K7340j2290J6754m4221m8014J6786j9150J1131L255R355J0372J7115
$$ plain form
561 -632343 -617724 -671234 -668068 -689459 -659031 -632214 -645973 -680997 -673678 -677127 -634538 -627940 -638576
548 -638576 -678697 -716203 -637957 -599632 -662527 -712041 -685825 -661706 -652307 -588454 -569121 -610600
536 -610600 -651196 -637865 -645917 -669880 -631815 -716827 -656636 -587401 -626368 -551586 -547679 -598975
524 -598975 -598936 -593738 -631320 -641610 -723806 -691300 -663692 -705864 -668401 -639247 -607410 -563774 -591635
511 -591635 -592763 -602381 -563524 -576785 -597469 -575713 -581348 -557819 -607496 -601401 -687477 -635285 -611136
498 -611136 -643688 -611481 -622889 -691951 -651880 -656135 -690139 -648301 -605451 -577640 -600195 -625685
486 -625685 -660069 -674346 -710798 -684189 -693778 -649096 -638498 -736913 -744433 -681477 -621698 -631057
474 -631057 -561275 -532199 -572310 -554831 -545830 -633430 -668428 -650934 -601471 -583751 -617865 -604748
$$ packed form
561f32343J4619n3510L166k1391L0428K6817j3759l5024P319l449M2589O598j0636
548f38576m0121l7506P8246L8325o2895m9514K6216K4119R399O3853J9333m1479
536f10600m0596J3331q052k3963L8065q5012O0191O9235l8967P4782L907n1296
524e98975L9N198l7582j0290q2196L2506K7608m2172L7463K9154L1837M3636k7861
511e91635j128r618L8857j3261k0684K1756n635K3529m9677O095q6076N2192K4149
498f11136l2552L2207j1408o9062M0071m255l4004M1838M2850K7811k2555k5490
486f25685l4384j4277l6452K6609r589M4682J0598r8415p520O2956N9779r359
474f31057O9782K9076m0111J7479R001q7600l4998J7494M9463J7720l4114J3117
$$ plain form
462 -604748 -620166 -563519 -548682 -587338 -631334 -621203 -649935 -610612 -612334 -650691 -650162 -630433
450 -630433 -676146 -616578 -555339 -547010 -561026 -635220 -611082 -610677 -588354 -672546 -674694 -674797 -703286
437 -703286 -715443 -708748 -654649 -661615 -672913 -648422 -620600 -610412 -597005 -636048 -684247 -628585
425 -628585 -634247 -598327 -615637 -641178 -672085 -642008 -691901 -713042 -665967 -619335 -612223 -644985
413 -644985 -678547 -648552 -666141 -685882 -632988 -621125 -616432 -635840 -608126 -540731 -582443 -543761
401 -543761 -475247 -508926 -525171 -550530 -572081 -635928 -600043 -546418 -487028 -577665 -637359 -671434
389 -671434 -608929 -568885 -542941 -603455 -612703 -583813 -579487 -557197 -622143 -624179 -578820 -616479
377 -616479 -566677 -545375 -617801 -666082 -629121 -603762 -608770 -603500 -535819 -536198 -585696 -526297 -453503
$$ packed form
462f04748j5418N6647J4837l8656m3996J0131k8732L9323j722l8357N29J9729
450f30433m5713N9568O1239Q329j4016p4194K4138M05K2323q4192k148j03k8489
437g03286j2157O695N4099o966j1298K4491K7822J0188J3407l9043m8199N5662
425f28585n662L5920j7310k5541l0907L0077m9893k1141M7075M6632P112l2762
413f44985l3562K9995j7589j9741N2894J1863M693j9408K7714O7395m1712L8682
401e43761O8514l3679j6245k5359k1551o3847L5885N3625N9390r0637n9694l4075
389f71434O2505M0044K5944o0514r248K8890M326K2290o4946k036M5359l7659
377f16479M9802K1302p2426m8281L6961K5359n008N270O7681l79m9498N9399P2794
$$ plain form
364 -453503 -540625 -608126 -593518 -561252 -594637 -612238 -587513 -617497 -605117 -648468 -690948 -722670
352 -722670 -591005 -609289 -570921 -580838 -597826 -612191 -636407 -650269 -620834 -583924 -597965 -626668
340 -626668 -609617 -586317 -571735 -614033 -617118 -580688 -566944 -552501 -493869 -485859 -545817 -533547
328 -533547 -572710 -553768 -558722 -549381 -589718 -618360 -652270 -619532 -552216 -559836 -588157 -598992
316 -598992 -612164 -618759 -573331 -556140 -574029 -566660 -594495 -587367 -585257 -565853 -542357 -565168 -627301
303 -627301 -621437 -598321 -585255 -602223 -591032 -617704 -606839 -562312 -657713 -746863 -713485 -662107
291 -662107 -624460 -572907 -572999 -570473 -610206 -580833 -661957 -587959 -562716 -540464 -514025 -594311 -624110
278 -624110 -587937 -563717 -548887 -561409 -577363 -549270 -615835 -573866 -555058 -505044 -559314 -633282
$$ packed form
364d53503q7122o7501J4608L2266l3385j7601K4725k9984J2380m3351m2480l1722
352g22670J31665j8284L8368r917j6988j4365k4216j3862K9435L6910j4041k8703
340f26668J7051K3300J4582m2298l085L6430J3744J4443N8632Q010n9958J2270
328e33547l9163J8942m954R341m0337k8642l3910L2738O7316p620k8321j0835
316e98992j3172o595M5428J7191j7889P369k7835P128K110J9404K3496k2811o2133
303f27301N864K3116J3066j6968J1191k6672J0865M4527r5401q9150L3378N1378
291f62107L7647N1553r2K526l9733K9373q1124P3998K5243K2252K6439q0286k9799
278f24110L6173K4220J4830j2522j5954K8093o6565M1969J8808N0014n4270p3968
$$ plain form
266 -633282 -646826 -665593 -678275 -679610 -674322 -583944 -541832 -655778 -632938 -577236 -619762 -603497
254 -603497 -635711 -601071 -570541 -569804 -635171 -624801 -599238 -555743 -569311 -579394 -546513 -612487
242 -612487 -664066 -645769 -538136 -495530 -442798 -498534 -614555 -632289 -633612 -665459 -605080 -622311
230 -622311 -637948 -612298 -574645 -547757 -556162 -538944 -561366 -623499 -587872 -570590 -545301 -540613
218 -540613 -609006 -590651 -569011 -574836 -521921 -543368 -542823 -537515 -500401 -509416 -600351 -566109 -572335
205 -572335 -545046 -516693 -570433 -533990 -553082 -583061 -584504 -642378 -640003 -599250 -574931 -552363
193 -552363 -584234 -554834 -574281 -560464 -548196 -540008 -512816 -536588 -586305 -586130 -622229 -663072
181 -663072 -619453 -620177 -593557 -579588 -600637 -628732 -601995 -570434 -516629 -536493 -572695 -627591
$$ packed form
266f33282j3544j8767j2682j335N288R0378M2112j13946K2840N5702m2526J6265
254f03497l2214L4640L0530P37o5367J0370K5563M3495j3568j0083L2881o5974
242f12487n1579J8297J07633M2606N2732n5736j16021j7734j323l1847O0379j7231
230f22311j5637K5650L7653K6888q405J7218k2422o2133L5627J7282K5289M688
218e40613o8393J8355K1640n825N2915k1447N45N308L7114r015r0935L4242o226
205e72335K7289K8353n3740L6443j9092k9979j443n7874K375M0753K4319K2568
193e52363l1871K9400j9447J3817J2268Q188K7192k3772m9717J75l6099m0843
181f63072M3619p24K6620J3969k1049k8095K6737L1561N3805j9864l6202n4896
$$ plain form
169 -627591 -562622 -588060 -616051 -580734 -504140 -503329 -502862 -494042 -499670 -505545 -525254 -548796 -582418
156 -582418 -564322 -595750 -589161 -614635 -544680 -498262 -518365 -558640 -515753 -529898 -510454 -516049
144 -516049 -515683 -518206 -576054 -614724 -565882 -549071 -568509 -605558 -590424 -592355 -592003 -521943 -537510
131 -537510 -564991 -599711 -573403 -625339 -581099 -556902 -559480 -602383 -567544 -511367 -516158 -554545
$$ packed form
169f27591O4969k5438k7991L5317P6594Q11M67Q820n628n875j9709k3542l3622
156e82418J8096l1428O589k5474O9955M6418k0103m0275M2887j4145J9444n595
144e16049L66k523n7848l8670M8842J6811j9438l7049J5134j931L52P0060j5567
131e37510k7481l4720K6308n1936M4240K4197k578m2903L4839N6177m791l8387
$$ [...]
##END NTUPLES=NMR SPECTRUM
##END=
