##TITLE=1H_DE-80H_X3
 200.13MHz, d2o
 8 sc
 
 19ns.26.2.2025
##JCAMPDX= 6.0         $$ Bruker NMR JCAMP-DX V2.0
##DATA TYPE= NMR SPECTRUM
##DATA CLASS= NTUPLES
##ORIGIN= UXNMR, Bruker Analytische Messtechnik GmbH
##OWNER= pz
$$ XWIN-NMR		Version 3.5
$$ Wed Apr 15 10:05:39 2026 Russian Standard Time (UT+4h)  Yarkov@DPX200
##.OBSERVE FREQUENCY= 200.1313
##.OBSERVE NUCLEUS= ^1H
##.ACQUISITION MODE= SIMULTANEOUS
##.ACQUISITION SCHEME= undefined
##.AVERAGES= 8
##.DIGITISER RES= 18
##SPECTROMETER/DATA SYSTEM= spect
##.PULSE SEQUENCE= zg30
##.SOLVENT NAME= CDCl3
##.SHIFT REFERENCE= (INTERNAL, CDCl3, 0, 15.4891)
##AUDIT TRAIL= $$ (NUMBER, WHEN, WHO, WHERE, WHAT)
$$ ##TITLE= Audit trail, XWIN-NMR		Version 3.5
$$ ##JCAMPDX= 5.01
$$ ##ORIGIN= Bruker BioSpin GmbH
$$ ##OWNER= Yarkov
$$ C:/Bruker/XWIN-NMR/data/yarkov2/nmr/H-C/1/pdata/1/auditp.txt
$$ ##AUDIT TRAIL=  $$ (NUMBER, WHEN, WHO, WHERE, WHAT)
(   1,<2026-04-15 10:04:43.59 +0400>,<Yarkov>,<DPX200>,
      <created by zg, POWCHK disabled, PULCHK disabled
       configuration hash MD5:
       00 E9 B6 7A A2 85 ED C7 34 08 36 98 17 FE 4E 26
       data hash MD5: 16K
       E2 AB 2E 9D B1 59 6D 39 AA FA 84 40 67 49 BC 8A>)
(   2,<2026-04-15 10:04:46.18 +0400>,<Yarkov>,<DPX200>,
      <Start of raw data processing
       efp BC_mod = 2 LB = 0.25 FT_mod = 6 PKNL = 1 PHC0 = -5301.948 PHC1 = 6.821927 SI = 16K 
       data hash MD5: 16K
       70 7E 5D 90 05 A8 65 62 AE AF 79 C1 53 51 B8 65>)
(   3,<2026-04-15 10:04:58.76 +0400>,<Yarkov>,<DPX200>,
      <abs ABSG = 5 
       data hash MD5: 16K
       DA E7 7A 39 C4 D2 55 F2 31 8A C0 A3 3F F1 DF 53>)
$$ ##END=
$$ 
$$ hash MD5
$$ 2F 17 40 5B 2E 84 10 AD 60 1E 2E 63 D9 BF C5 F2
##$RELAX= 
##$RELAX= 
##$RELAX= 
##$RELAX= 
##$RELAX= 
##$RELAX= 
$$ Bruker specific parameters
$$ --------------------------
##$DU= <C:/Bruker/XWIN-NMR>
##$EXPNO= 1
##$NAME= <H-C>
##$PROCNO= 1
##$TYPE= <nmr>
##$USER= <yarkov2>
##$AMP= (0..31)
100 100 100 100 100 100 100 100 100 100 100 100 100 100 100 100 100 100 
100 100 100 100 100 100 100 100 100 100 100 100 100 100 
##$AQSEQ= 0
##$AQ_mod= 1
##$AUNM= <au_zg>
##$AUTOPOS= <>
##$BF1= 200.13
##$BF2= 200.13
##$BF3= 200.13
##$BF4= 200.13
##$BF5= 200.13
##$BF6= 200.13
##$BF7= 200.13
##$BF8= 200.13
##$BYTORDA= 1
##$CFDGTYP= 0
##$CFRGTYP= 5
##$CHEMSTR= <none>
##$CNST= (0..31)
1 1 145 1 1 1 1 1 1 1 1 1 1 1 1 1 1 1 1 1 1 1 1 1 1 1 1 1 1 1 1 1 
##$CPDPRG= <>
##$CPDPRG1= <>
##$CPDPRG2= <>
##$CPDPRG3= <>
##$CPDPRG4= <mlev>
##$CPDPRG5= <mlev>
##$CPDPRG6= <mlev>
##$CPDPRG7= <mlev>
##$CPDPRG8= <mlev>
##$CPDPRGB= <>
##$CPDPRGT= <>
##$D= (0..31)
0 0.7 0 0 0 0 0 0 0 0 0 0.03 0 0 0 0 0 0 0 0 0 0 0 0 0 0 0 0 0 0 0 0 
##$DATE= 1776233083
##$DBL= (0..7)
120 120 120 120 120 120 120 120 
##$DBP= (0..7)
150 150 150 150 150 150 150 150 
##$DBP07= 0
##$DBPNAM0= <>
##$DBPNAM1= <>
##$DBPNAM2= <>
##$DBPNAM3= <>
##$DBPNAM4= <>
##$DBPNAM5= <>
##$DBPNAM6= <>
##$DBPNAM7= <>
##$DBPOAL= (0..7)
0.5 0.5 0.5 0.5 0.5 0.5 0.5 0.5 
##$DBPOFFS= (0..7)
0 0 0 0 0 0 0 0 
##$DE= 6
$$ [...]
##$SUBNAM3= <"">
##$SUBNAM4= <"">
##$SUBNAM5= <"">
##$SUBNAM6= <"">
##$SUBNAM7= <"">
##$SUBNAM8= <"">
##$SUBNAM9= <"">
##$SW= 18.0517328524113
##$SWIBOX= (0..15)
0 0 2 0 0 0 0 0 0 0 0 0 0 0 0 0 
##$SW_h= 3612.71676300578
##$TD= 16384
##$TD0= 1
##$TE= 0
##$TE2= 300
##$TE3= 300
##$TEG= 300
##$TL= (0..7)
0 120 120 120 120 120 120 120 
##$TP= (0..7)
150 150 150 150 150 150 150 150 
##$TP07= 0
##$TPNAME0= <>
##$TPNAME1= <>
##$TPNAME2= <>
##$TPNAME3= <>
##$TPNAME4= <>
##$TPNAME5= <>
##$TPNAME6= <>
##$TPNAME7= <>
##$TPOAL= (0..7)
0.5 0.5 0.5 0.5 0.5 0.5 0.5 0.5 
##$TPOFFS= (0..7)
0 0 0 0 0 0 0 0 
##$TUNHIN= 0
##$TUNHOUT= 0
##$TUNXOUT= 0
##$USERA1= <user>
##$USERA2= <user>
##$USERA3= <user>
##$USERA4= <user>
##$USERA5= <user>
##$V9= 5
##$VALIST= <valist>
##$VCLIST= <CCCCCCCCCCCCCCC>
##$VD= 0
##$VDLIST= <DDDDDDDDDDDDDDD>
##$VPLIST= <PPPPPPPPPPPPPPP>
##$VTLIST= <TTTTTTTTTTTTTTT>
##$WBST= 1024
##$WBSW= 4
##$XGAIN= (0..3)
0 0 0 0 
##$XL= 0
##$YL= 0
##$YMAX_a= 175910
##$YMIN_a= -159393
##$ZGOPTNS= <>
##$ZL1= 120
##$ZL2= 120
##$ZL3= 120
##$ZL4= 120
##$ABSF1= 15.48907
##$ABSF2= -2.562779
##$ABSG= 5
##$ABSL= 3
##$ALPHA= 0
##$AQORDER= 0
##$ASSFAC= 0
##$ASSFACI= 0
##$ASSFACX= 0
##$ASSWID= 0
##$AUNMP= <proc_1d>
##$AZFE= 0.1
##$AZFW= 0.1
##$BCFW= 0
##$BC_mod= 2
##$BYTORDP= 0
##$COROFFS= 0
##$CY= -3
##$DATMOD= 1
##$DC= 0
##$DFILT= <>
##$DTYPP= 0
##$F1P= 0
##$F2P= 0
##$FCOR= 1
##$FTSIZE= 16384
##$FT_mod= 6
##$GAMMA= 0
##$GB= 0
##$INTBC= 1
##$INTSCL= 3.241238e-09
##$ISEN= 128
##$LB= 0.25
##$LEV0= 0
##$LPBIN= 0
##$MAXI= 10000
##$MC2= 0
##$MEAN= 0
##$ME_mod= 0
##$MI= 1.114404
##$NCOEF= 0
##$NC_proc= -8
##$NLEV= 6
##$NOISF1= 3.799351
##$NOISF2= 2.8
##$NSP= 0
##$NTH_PI= 0
##$NZP= 0
##$OFFSET= 15.48907
##$PC= 1
##$PHC0= -5301.948
##$PHC1= 6.821927
##$PH_mod= 1
##$PKNL= yes
##$PPARMOD= 0
##$PSCAL= 0
##$PSIGN= 0
##$REVERSE= no
##$SF= 200.130006531354
##$SI= 16384
##$SIGF1= 3
##$SIGF2= 2
##$SINO= 0.751879
##$SIOLD= 32768
##$SREGLST= <19F.Aceton>
##$SSB= 0
##$STSI= 16384
##$STSR= 0
##$SW_p= 3612.71676300578
##$SYMM= 0
##$S_DEV= 0
##$TDeff= 16384
##$TDoff= 0
##$TI= <>
##$TILT= no
##$TM1= 0
##$TM2= 0
##$TOPLEV= 0
##$USERP1= <user>
##$USERP2= <user>
##$USERP3= <user>
##$USERP4= <user>
##$USERP5= <user>
##$WDW= 1
##$XDIM= 16384
##$YMAX_p= 450761666
##$YMIN_p= -7131127
$$ End of Bruker specific parameters
$$ ---------------------------------
##NTUPLES= NMR SPECTRUM
##VAR_NAME=  FREQUENCY,     SPECTRUM/REAL,   SPECTRUM/IMAG
##SYMBOL=    X,             R,               I
##VAR_TYPE=  INDEPENDENT,   DEPENDENT,       DEPENDENT
##VAR_FORM=  AFFN,          ASDF,            ASDF
##VAR_DIM=   16384,         16384,           16384
##UNITS=     HZ,            ARBITRARY UNITS, ARBITRARY UNITS
##FACTOR=    0.220516191357247, 1,           1
##FIRST=     3099.82766798856, 0,            0
##LAST=      -512.889095017222, 0,           0
##MIN=       -512.889095017222, -7131127,    0
##MAX=       3099.82766798856, 450761666,    0
$$ Real data points
##PAGE= N=1
##DATA TABLE= (X++(R..R)), XYDATA
$$ [...]
5043D097511l59842j76858K17603L64846k76145m32135k82562N42592M01984J59586
$$ 4097511 3737669 3560811 3778414 4143260 3867115 3434980 3152418 3695010 4096994 4256580
5033D256580n88683m01094R298N24929L98663l92136j99989q7830M72080K34099
$$ 4256580 3667897 3266803 3276101 3801030 4199693 3807557 3607568 3519738 3991818 4225917
5023D225917M12842k85655j22841P249O41120O0370J44323m27254K53425L35420
$$ 4225917 4638759 4353104 4230263 4237512 4878632 4939002 5083325 4656071 4909496 5244916
5013E244916N22883L6403K23929K49855J054790J375631J355097J473950K145116
$$ 5244916 5767799 5804202 6028131 6277986 7332776 8708407 10063504 11537454 13682570
5004A3682570J894681J436957O11817o17632j644369j312206j458121j111017
$$ 13682570 15577251 17014208 17626025 17008393 15364024 14051818 12593697 11482680
4996A1482680n34544p70066n56962k02671k3552L37575N24003P18981J240155
$$ 11482680 10948136 10178070 9621108 9418437 9394885 9732460 10256463 10975444 12215599
4987A2215599J912297K121719J656155L01836p46661j491833j329705j504957
$$ 12215599 14127896 16249615 17905770 18207606 17460945 15969112 14639407 13134450
4979A3134450r94107j340019r36311q03844k90159k33373J03768k75493j86122
$$ 13134450 12140343 10800324 9864013 9060169 8770010 8536637 8640405 8364912 8178790
4970H178790j27798o4026m04444J47774K0276L16375Q9206K43663j00876J91276
$$ 8178790 8050992 7986966 7582522 7730296 7750572 8066947 8156153 8399816 8298940 8490216
4960H490216K13296L10394L92751O00611P15446P98088J348336J003156J461469
$$ 8490216 8703512 9013906 9406657 10007268 10722714 11520802 12869138 13872294 15333763
4951A5333763J817317K774006K793621K685459N97058l98301j765735j552261
$$ 15333763 17151080 19925086 22718707 25404166 26001224 25602923 23837188 22284927
4943B2284927j712739j515221j968338r25650q46573J2714L79902M24697K60314
$$ 22284927 20572188 19056967 17088629 16162979 15316406 15329120 15709022 16133719 16394033
4934A6394033Q06533J265514K613525K175463J997675Q59995n24247j561103j700211
$$ 16394033 17200566 18466080 21079605 23255068 25252743 26112738 25588491 24027388 22327177
4925B2327177j991478j408593j460313q01644q33105n18271m52558L4334j65681
$$ 22327177 20335699 18927106 17466793 16665149 15832044 15313773 14861215 14895549 14729868
4916A4729868O65452k9367k43117p84849j76635l99562j28977m66813n03007k22308
$$ 14729868 15395320 15365953 15122836 14337987 14161352 13761790 13632813 13166000 12662993 12440685
4906A2440685l6153L37476L45442N99217k04649J67406O25154O77468O21903M31662
$$ 12440685 12404532 12742008 13087450 13686667 13482018 13649424 14274578 14952046 15573949 16005611
4896A6005611n6543M77983N37191O30415J55600N17482M83647Q38760J012302
$$ 16005611 15949068 16427051 16964242 17594657 17750257 18267739 18751386 19590146 20602448
4887B0602448O56529P23707R63964J342891J775605J310852J249117R25074J773101
$$ 20602448 21258977 21982684 22946648 24289539 26065144 27375996 28625113 29550187 31323288
4878C1323288K872216M983917N608235P964001P998944P159555K623446j201386
$$ 31323288 34195504 39179421 44787656 52751657 60750601 67910156 70533602 69332216
4870F9332216l272685k159192j725682n22270k49629J00929L26200P96554J022801
$$ 69332216 66059531 63900339 62174657 61652387 61402758 61503687 61829887 62626441 63649242
4861F3649242J526512K047916L212779N589648P153304Q247986P190402N756614
$$ 63649242 65175754 67223670 70436449 76026097 83179401 91427387 98617789 104374403
4853A04374403M750345M271434J684472j103284l983300l654529k109898m94700
$$ 104374403 109124748 113396182 115080654 113977370 109994070 106339541 104229643 103734943
4845A03734943P69091J497731K140779K883361K717141K465859K681653K983464
$$ 103734943 104504034 106001765 108142544 111025905 113743046 116208905 118890558 121874022
4837A21874022L458373N130846N722982N102784J695909k176596n287307n911132
$$ 121874022 125332395 130463241 136186223 141289007 142984916 140808320 135521013 129609881
4829A29609881n611251m609185m286486l301590l010511k358288j897972n17483
$$ 129609881 123998630 119389445 115102959 111801369 108790858 106432570 104534598 104017115
4821A04017115p31847n91558j019278j253200o87059l37132N16248Q77603J760957
$$ 104017115 103285268 102693710 101674432 100421232 99734173 99397041 99913289 100790892 102551849
4812A02551849K167640L161871L401087L411857K412122K629846K157129K548857
$$ 102551849 104719489 107881360 111282447 114694304 117106426 119736272 121893401 124442258
4804A24442258J895352J142253K47435J7910l14006J93459M15962m06565j201293
$$ 124442258 126337610 127479863 127727298 127745208 127431202 127624661 128040623 127634058 126432765
4795A26432765j534929j517101p96977M1938o1852J88579n6442L27535J565043
$$ 126432765 124897836 123380735 122583758 122625696 122563844 122752423 122695981 123023516 124588559
4786A24588559L229549M102277M092149L132993J728661L32951j632477j755152
$$ 124588559 127818108 131920385 136012534 139145527 140874188 141207139 139574662 137819510
4778A37819510k078634j586781j448390L08570J190361K489160L618548M981183
$$ 137819510 135740876 134154095 132705705 133014275 134204636 136693796 140312344 145293527
4770A45293527N598125P182688P437295Q035891P908553P120406M332839J0235
$$ 145293527 150891652 158074340 165511635 173547526 181456079 188576485 192909324 192919559
4762A92919559l128503n246172n109059m547796m562934o131104o869494q358404
$$ 192919559 189791056 184544884 179435825 174888029 170325095 164193991 157324497 148966093
4754A48966093p786191p590294o497728o150235m817475m100281k502538k550648
$$ 148966093 141179902 133589608 127091880 120941645 116124170 112023889 109521351 106970703
4746A06970703j811508k103045j325479o08455J22749L66645O03981K22457L62684
$$ 106970703 105159195 103056150 101730671 101122216 101244965 101611610 102215591 102438048 102800732
4737A02800732k98614j137255k335563l241837k821454k412785k122829k823225
$$ 102800732 102502118 101364863 99029300 95787463 92966009 90553224 88430395 85607170
4729H5607170l764604l847475k825253k086688j164642j899734k660546m186468
$$ 85607170 81842566 77995091 75169838 73083150 71918508 70018774 67358228 63171760
4721F3171760m492726n458516m869553m629129l719311k989084j903602j656168
$$ 63171760 58679034 53220518 48350965 43721836 40002525 37013441 35109839 33453671
4713C3453671j285757j945805j169813j292277r04876j502601j148054j317671
$$ 33453671 32167914 30222109 29052296 27760019 26855143 25352542 24204488 22886817
4705B2886817q80627o13349n60745j88212j95366n21417o03193k3448K50713Q74819
$$ 22886817 22006190 21392841 20832096 20643884 20448518 19927101 19323908 19300460 19551173 20425992
4695B0425992L96935J008983P90781K127865K458764K891105K069989J686593
$$ 20425992 20822927 21831910 22622691 24750556 27209320 30100425 32170414 33857007
4687C3857007J41235j165085k366095j887925k140474j404134j514451q86639
$$ 33857007 33998242 32833157 30467062 28579137 26438663 25034529 23520078 22633439
4679B2633439q34508k45736p53496L9528n0360r9185p99296o43115j13704L70974
$$ 22633439 21798931 21553195 20799699 20839227 20788867 20689682 19890386 19247271 19133567 19504541
4669A9504541J107941R37460M78230l46714r10346j207440p15269j008816o17033
$$ 19504541 20612482 21549942 22028172 21681458 20771112 19563672 18848403 17839587 17222554
4660A7222554n55126K2943J05258P61485J376221K147080J571659K092884J701301
$$ 17222554 16667428 16690371 16795629 17557114 18933335 21080415 22652074 24744958 26446259
4651B6446259J040631n29332q07519j772285k072356j882757j212870r73760j017351
$$ 26446259 27486890 26957558 26150039 24377754 22305398 20422641 19209771 18236011 17218660
4642A7218660j083421p16742l74615l60928j40009m86624K40032J147311J641074
$$ 17218660 16135239 15418497 15043882 14682954 14542945 14056321 14296353 15443664 17084738
4633A7084738J119154J36859k95677n82597q1951j170451o74014q15065j45238
$$ 17084738 18203892 18340751 18045074 17462477 17380526 16210075 15536061 14720996 14575758
4624A4575758m0281N62099R32750Q91244N66438J200684J731099J767212R38703
$$ 14575758 14535477 15097576 16030326 16921570 17488008 18688692 20419791 22187003 23125706
4615B3125706L37485q40138j225029j876865k184538j792169j434715p27868o00752
$$ 23125706 23463191 22623053 21398024 19521159 17336621 15544452 14109737 13381869 12781117
4606A2781117m67402r60478m65239J59448O83818N35156J159721R19430J635574
$$ 12781117 12313715 11353237 10887998 11047446 11731264 12266420 13426141 14345571 15981145
4597A5981145J078709J502554K05426l37176j188095j367293j507566q66195r06004
$$ 15981145 17059854 18562408 18767834 18430658 17242563 15875270 14367704 13501509 12595505
4588A2595505j88654o07481m77564n90135k94689l14041K89153J08301j31038
$$ 12595505 12406851 11799370 11321806 10731671 10436982 10122941 10412094 10520395 10389357
4579A0389357N43460M40337O93793Q70324J980602L262252N374090O729679O357865
$$ 10389357 10932817 11373154 12066947 12937271 14917873 18180125 23554215 30283894 36641759
4570C6641759L606802K62419k932049l479524l101076k154341j116471J376943
$$ 36641759 40248561 40510980 37578931 34099407 30998331 28843990 27727519 29104462
4562B9104462L517114N689047N975640M690825J544372k397197m882962n788067
$$ 29104462 32621576 38310623 44286263 48977088 50521460 48124263 43241301 37453234
4554C7453234m957172k975796o01275K065851L818425L187897J362149j982633
$$ 37453234 32496062 29520266 28918991 30984842 34803267 37991164 39353313 37370680
4546C7370680l800749m459314l926686l540595j821366L13776K102542L177098
$$ 37370680 33569931 29110617 25183931 21643336 19821970 20135746 22238288 25415386
4538B5415386M410581K895406Q10888j985825l835703m760408m389144l358129
$$ 25415386 29825967 32721373 33532261 31546436 27710733 22950325 18561181 15203052
4530A5203052k215749j423784j161514r64066j344503q98792k63486k21048n29457
$$ 15203052 12987303 11563519 10402005 9437939 8093436 7194644 6931158 6710110 6180653
4521F180653k52686o9178J75854k79150Q9513k17922j4081K84627L52771p03748
$$ 6180653 5927967 5858789 6034643 5755493 5845006 5627084 5613003 5897630 6250401 5546653
4511E546653n08680p08085R116Q8015M23129l00561l86808j22438J45223m07879
$$ 5546653 5037973 4329888 4339004 4427019 4850148 4549587 4162779 4040341 4185564 3777685
4501C777685j38791k81732K41794N62j5089j53877j2878k19623M55838k13031
$$ 3777685 3638894 3357162 3598956 3599518 3584429 3430552 3417674 3198051 3653889 3440858
4491C440858l77749j17325K98647K85470r3033j75704k32219M1797L68719R8940
$$ 3440858 3063109 2945784 3244431 3529901 3436868 3261164 3028945 3070742 3439461 3538401
4481C538401k07985r1707J63499K21466k24885J70353l59712l05849J89173O09196
$$ 3538401 3330416 3238709 3402208 3623674 3398789 3569142 3209430 2903581 3092754 3701950
4471C701950j25424j73953n63289O6423N21396J97329l90812l81269l27248K77945
$$ 3701950 3576526 3402573 2839284 2905707 3427103 3624432 3233620 2852351 2525103 2803048
4461B803048K73380K23734m93869l00209j06460K59594M01141K83806n64505R1277
$$ 2803048 3076428 3300162 2806293 2506084 2399624 2659218 3060359 3344165 2779660 2870937
4451B870937J94809K25413r9505j47927n76451K75214J21348N1022l11776l72733
$$ 2870937 3065746 3291159 3191654 3043727 2467276 2742490 2863838 2914860 2603084 2230351
4441B230351K2707M16896M36221j91065l09514l31058k80857M72730K40156J37027
$$ 2230351 2253058 2669954 3106175 2915110 2605596 2274538 1993681 2466411 2706567 2843594
4431B843594m82113k05673m88683M58373O28839K21176n31362l26893k42275N52512
$$ 2843594 2361481 2155808 1667125 2125498 2754337 2975513 2444151 2117258 1874983 2427495
4421B427495K86382l41592k07016K6555M26138K99198j5535n34457k12236O34760
$$ 2427495 2713877 2372285 2165269 2191824 2617962 2917160 2901625 2367168 2154932 2789692
4411B789692Q57010J05079k30302q47579J75113N46583P53175l62221l40993K09935
$$ 2789692 3646702 3751781 3521479 2673900 2849013 3395596 4148771 3786550 3445557 3655492
4401C655492J618263J914843J736431o30676j204640j050271P5815m45791p94447
$$ 3655492 5273755 7188598 8925029 8294353 7089713 6039442 6115257 5669466 4875019
4392D875019j122115j38790j48066O93826k72093l58040p20769J88116N21369
$$ 4875019 3752904 3614114 3466048 4159874 3887781 3529741 2808972 2997088 3518457
4383C518457L72602n18868m89735k59536R23130K13767k09063n33583m91232K63958
$$ 3518457 3891059 3372191 2882456 2622920 3546050 3759817 3550754 3017171 2525939 2789897
4373B789897M97072J00195l72089r0399j35242M26511l4309L26841l89807J87073
$$ 2789897 3286969 3387164 3015075 2924676 2789434 3215945 3181636 3508477 3118670 3305743
4363C305743j44523J74835l82990L35698k07508M02097k78219j22437j59971M46488
$$ 3305743 3161220 3336055 2953065 3288763 3081255 3483352 3205133 3082696 2922725 3369213
4353C369213j32937L27160m85864q1717J49097L43362J8510k61245k85888J70495
$$ 3369213 3236276 3563436 3077572 2995855 3144952 3488314 3506824 3245579 2959691 3130186
4343C130186N48761L50039l33478l90398L34798J94685L85855n34020k42065n19177
$$ 3130186 3678947 4028986 3695508 3305110 3639908 3834593 4220448 3686428 3444363 2925186
4333B925186O09392O81617K22670m84735o08164J50810N69951K53349J98378l59778
$$ 2925186 3534578 4216195 4438865 3954130 3345966 3496776 4066727 4320076 4518454 4158676
4323D158676l10255K50544J14596j39547j03168m3237K89069P79312O14351l23967
$$ 4158676 3848421 4098965 4213561 4074014 3970846 3927609 4216678 4995990 5610341 5286374
4313E286374j69723O8827K66837J67838l36786n37594J88953P09082O67298L97892
$$ 5286374 5116651 5185478 5452315 5620153 5283367 4745773 4934726 5643808 6311106 6708998
4303F708998o17988j17140K13390O59815J53408J33953R7096L38618Q7404K75558
$$ 6708998 6091010 5973870 6187260 6847075 7000483 7134436 7231532 7570150 7657554 7933112
4293G933112k83010K33322O11398O06985N28317P5192j25467r9946M80489J3046
$$ 7933112 7650102 7883424 8494822 9101807 9630124 9705316 9579849 9479903 9960392 9973438
4283I973438p614j57006j09548N6651N00634k69837j45158J4968L56236L08183
$$ 9973438 9965824 9808818 9699270 9755921 10256555 9986718 9841560 9856528 10212764 10520947
4273A0520947p9270o72730o5223k11397K09052j82088j72470m61996m0085L47104
$$ 10520947 10441677 9768947 9703724 9492327 9701379 9519291 9346821 8884825 8844740 9191844
4263I191844L77346j63333n01478K1856N21403Q12505j9348M54557j1051J71166
$$ 9191844 9569190 9405857 8904379 8926235 9447638 10260143 10240795 10695352 10684301 10855467
4253A0855467M28477R91058P81532O40416N18913J376715J420898J689384J869675
$$ 10855467 11283944 12275002 13056534 13696950 14215863 15592578 17013476 18702860 20572535
4244B0572535K285561L130284L959203M728974N464575N270508M854584M610686
$$ 20572535 22858096 25988380 29947583 34676557 40141132 45411640 50266224 54876910
4236E4876910K430695K014990K333098L969945N161701N701314L909030J419257
$$ 54876910 57307605 59322595 61655693 65625638 70787339 76488653 80397683 81816940
4228H1816940j916636m370891m637495m090364l553351k519770k166185k309782
$$ 81816940 79900304 75529413 70891918 66801554 63248203 60728433 58562248 56252466
4220E6252466m167430n261723n333263n296927m301408l638368l265505k932408
$$ 56252466 52085036 46823313 41490050 36193123 31891715 28253347 24987842 22055434
4212B2055434k224301j626241p51835j220418j306513j245646n64897l08899k19336
$$ 22055434 19831133 18204892 17453057 16232639 14926126 13680480 13115583 12806684 12587348
4203A2587348l06521m80879k77480J45325j55154j62549j27907q0855l28353P3323
$$ 12587348 12280827 11799948 11522468 11667793 11512639 11350090 11222183 11141328 10812975 10886298
4193A0886298m14474k65977M4214J63855r7976o2531p0698K02310J43363J53873
$$ 10886298 10471824 10205847 10250061 10413916 10315940 10253409 10182711 10385021 10528384 10682257
4183A0682257J74959N6981p0995j09136L55610L68337j39097n3807L89853M94850
$$ 10682257 10857216 10914197 10843202 10734066 11089676 11458013 11318916 11265109 11654962 12149812
4173A2149812J98632K78426L67020M46020M63600J88030m38872L28295M60049
$$ 12149812 12348444 12626870 12993890 13439910 13903510 14091540 13652668 13980963 14441012
4164A4441012J159667M52339N76528N89601Q04658J274591Q58224P32588L40580
$$ 14441012 15600679 16053018 16629546 17219147 18023805 19298396 20156620 20889208 21229788
4155B1229788L67711O52335J137612P11456M38581N947R61181O67810P98853O97921
$$ 21229788 21597499 22249834 23387446 24098902 24537483 24543430 25504611 26172421 26971274 27669195
4145B7669195J136972J162806J842039J434609P69976J06881R33085J283403J938530
$$ 27669195 28806167 29968973 31811012 33245621 34015597 34122478 35055563 36338966 38277496
4136C8277496J853384R28294R64912J402760J552949Q35300R75906L99646R66016
$$ 38277496 40130880 41059174 42024086 43426846 44979795 45815095 46791001 47190647 48156663
4127D8156663J136555J710752R89013O82292J82778M46266P70738J372862K013927
$$ 48156663 49293218 51003970 51992983 52675275 52858053 53304319 54075057 55447919 57461846
4118E7461846K855846L150315K900385K808079J989477R29489L05192J273589
$$ 57461846 60317692 63468007 66368392 69176471 71165948 72095437 72400629 73674218
4110G3674218J544135K913563K560393K018739R30487Q43243K51575R05629P54140
$$ 73674218 75218353 78131916 80692309 82711048 83641535 84484778 84736353 85641982 86396122
4101H6396122O86128J58655J33167j72215m024l33115r57764l04694J89276J315061
$$ 86396122 87082250 87240905 87374072 87201857 87197833 86864718 85906954 85602260 85791536 87106597
4091H7106597J771974J894064K362411K700821K570616K194908J979797J889495
$$ 87106597 88878571 90772635 93135046 95835867 98406483 100601391 102581188 104470683
4083A04470683K912711L835900M999383M368841L498498K814196K392915K498934
$$ 104470683 107383394 111219294 116218677 120587518 124086016 126900212 129293127 131792061
4075A31792061K877672K154275P89383k84580J03073K27819N91311Q40901R20738
$$ 131792061 134669733 136824008 137613391 137328811 137431884 137659703 138251014 139091915 140012653
4066A40012653M37042O19429Q06565R93803Q26675J506756J577201J228350Q01579
$$ 140012653 140449695 141069124 141875689 142869492 143696167 145202923 146780124 148008474 148810053
4057A48810053n45798j060149k167804j734438j717617j533395j269462r33913
$$ 148810053 148264255 147204106 145036302 143301864 141584247 140050852 138781390 137847477
4049A37847477j72460J285100J610650J765811J208458P54669M69782Q03421R05203
$$ 137847477 137675017 138960117 140570767 142336578 143545036 144299705 144769487 145572908 146478111
4040A46478111K45777j132159j916106k718647k423541k136170j648243k684422
$$ 146478111 146723888 145591729 143675623 140956976 138533435 136397265 134749022 132064600
4032A32064600m028442n392796n733497o778161o596952n657870k645629j382882
$$ 132064600 128036158 122643362 116909865 110131704 103534752 97876882 95231253 93848371
4024I3848371L77994k3739Q10270M17695J730426J438067J312267J10225J98219
$$ 93848371 94226365 94202626 95012896 95430591 97161017 98599084 99911351 100021576 100219795
4015A00219795l6550Q7638j185040k338007k764991k179477q24601M90462J167976
$$ 100219795 100183245 100270883 99085843 96747836 93982845 91803368 90978767 91469229 92637205
4006I2637205J122577K27428q26583k282501m444220n288917n399839l445671
$$ 92637205 93759782 93987210 93160627 90878126 86433906 81144989 75745150 72299479
3998G2299479k849516j385540j154191j165528p30879l62432r84960j370277j828174
$$ 72299479 69449963 68064423 66910232 65744704 65013825 64651393 63666433 62296156 60467982
3989F0467982j985806j779855q71649m97810j053583j585118j667129q58080k83340
$$ 60467982 58482176 56702321 55830672 55332862 54279279 52694161 51027032 50168952 49885612
3980D9885612o35986q08034j581886j701565k543920k017870k628535j843464
$$ 49885612 49249626 48441592 46859706 45158141 42614221 40596351 37967816 36124352
3972C6124352k235317r81931j437215j88947q23937j08410j296493l42214j198748
$$ 36124352 33889035 32907104 31469889 31280942 30457005 30348595 29052102 28709888 27511140
3963B7511140n47258m48704K94359n90512m974p56916m19974r80520r48335r89002
$$ 27511140 26963882 26515178 26809537 26219025 26214051 25457135 25037161 24056641 23108306 22119304
3953B2119304p11579K55066k34889k12572q17829q23952r81991M50757o15372
$$ 22119304 21407725 21662791 21427902 21215330 20397501 19573549 18591558 19042315 18426943
3944A8426943M01649o62689M27629J34258L60067q69752n98493j098585l18384
$$ 18426943 18828592 18165903 18593532 18727790 19087857 18218105 17619612 16521027 16202643
3935A6202643m83308j47993l83469m87108Q7975O40508j06015l77206j2826l54733
$$ 16202643 15719335 15571342 15187873 14700765 14788740 15429248 15323233 14946027 14933201 14578468
3925A4578468m5211k42793r9794o31573k42078j50276j16929j40875l05009j28493
$$ 14578468 14533257 14290464 14190670 13559097 13317019 13166743 13049814 12908939 12603930 12475437
3915A2475437r7672l25703q26875l60578l16423M3051k75962k69164l96832m28056
$$ 12475437 12377765 12052062 11225187 10864609 10548186 10591237 10315275 10046111 9649279 9221223
3905I221223K70975L96825J02705j61990q9472N7005O38791m32654k45031m82027
$$ 9221223 9492198 9889023 9991728 9829738 9740266 9797271 10436062 10003408 9758377 9276350
3895I276350K56465J034695Q08324m96849n60552n95011N75625M58967k53736
$$ 9276350 9532815 10567510 11375834 10878985 10318433 9723422 10299047 10758014 10504278
3886A0504278j055601o35447L57453Q14812N12368o99950l35043p4434P97040
$$ 10504278 9448677 8813230 9170683 9985495 10497863 9797913 9462870 9388436 10185476
3877A0185476N27638J65862l77115k01448O5085K88619k55855o65329n31843n0023
$$ 10185476 10713114 10878976 10501861 10300413 10365498 10654117 10398262 9732933 9201090 9151067
3867I151067R06833O20863L5852o66031k84537P56847R28779J68679p16050l36773
$$ 9151067 10057900 10678763 10714615 10048584 9764047 10520894 11449673 11618352 10902302 10565529
3857A0565529k66931N43735K30151L13522k83231J81402K0235P64906J59609O26546
$$ 10565529 10298598 10842333 11072484 11386006 11102775 11284177 11304412 12069318 12228927 12855473
3847A2855473J24843K34571M1846L22047q1699k8841L23048M44358P63253J71487
$$ 12855473 12980316 13214887 13256733 13578780 13497081 13468240 13791288 14235646 14998899 15170386
3837A5170386Q09426O12015J027608Q05871J847417P84609J372243Q21406J493635
$$ 15170386 15979812 16591827 17619435 18425306 20272723 21057332 22429575 23250981 24744616
3828B4744616J547105K291959K305064K002046J681021J806914K293499K501990
$$ 24744616 26291721 28583680 30888744 32890790 34571811 36378725 38672224 41174214
3820D1174214K451571J139977J536854R39081K217351J649856K368799J565146
$$ 41174214 43625785 44765762 46302616 47241697 49459048 51108904 53477703 55042849
3812E5042849K100772J709996K060465J405147J927945J612449J180564M47862
$$ 55042849 57143621 58853617 60914082 62319229 64247174 65859623 67040187 67488049
3804F7488049K03761l50026p04506m18376j000307r36217j400375j196778j698342
$$ 67488049 67691810 67341784 66637278 66218902 65218595 64282378 62882003 61685225 59986883
3795E9986883j022293j463023o45760j601943j408535k240800k164453k168152
$$ 59986883 58964590 57501567 56855807 55253864 53845329 51604529 49440076 47271924
3787D7271924j518227j248422j998920k436376k598964j653290j304088j410946
$$ 47271924 45753697 44505275 42506355 40069979 37471015 35817725 34513637 33102691
3779C3102691j668219j478073j049659n95176J63912k11196l83886K32418J583238
$$ 33102691 31434472 29956399 28906740 28311564 28475476 28264280 27880394 28112812 29696050
3770B9696050J257783J324052Q12470J008159J389246J974632J578047N67075
$$ 29696050 30953833 32277885 33090355 34098514 35487760 37462392 39040439 39607514
3762C9607514J74303L55106J778003J447085J073573p1018K69497P62392J213562
$$ 39607514 39781817 40136923 41914926 43362011 44435584 44364566 44634063 45396455 46610017
3753D6610017M13953j96053m43814K04127N96963N5868q37136j533223j305947
$$ 46610017 47023970 46827917 46384103 46588230 47185193 47241061 46403925 44870702 43564755
3744D3564755o74011n11699j548440j858557j880888p21364p39796p01279j799228
$$ 43564755 42890744 42379045 40830605 38972048 37091160 36369796 35630000 34928721 33129493
3735C3129493j672632q46651M46852q6222k35108j307780q98524L4866j02450
$$ 33129493 31456861 30610210 31057062 30970840 30735732 29427952 28529428 28564294 28461844
3726B8461844p55056p68152j69471N51054Q17606L85320J014K99360R59972J294159
$$ 28461844 27706788 26938636 26769165 27320219 28137825 28523145 28524159 28823519 29783491 31077650
3716C1077650J185193M36794L22609P89217J494701J736638J089434J60790J84141
$$ 31077650 32262843 32699637 33022246 33811463 35306164 37042802 38132236 38293026 38477167
3707C8477167L83111O52671k2581R1039M29000J251698J266299J199368J174790
$$ 38477167 38860278 39512949 39490368 39581407 40010407 41262105 42528404 43727772 44902562
3698D4902562J207696R28076Q99958J71885o64783j133700m58003j60635l06394
$$ 44902562 46110258 47038334 47938292 48110177 47445394 46311694 45853691 45693056 45386662
3689D5386662o15221j530769j469360j120828j242241j382696j343728j470028
$$ 45386662 44771441 43240672 41771312 40650484 39408243 38025547 36681819 35211791
3681C5211791q66384q71610j023827j485347p89674j025110p93703j290264j706794
$$ 35211791 34345407 33473797 32449970 30964623 30174949 29149839 28356136 27065872 25359078
3672B5359078j479969m11112K52481J92229r1170j98723L64528Q22932R47981
$$ 25359078 23879109 23467997 23720478 23912707 23821537 23622814 23987342 24810274 25758255
3663B5758255P5989K55397Q5264R82254Q64123J766293J839511K015085K301395
$$ 25758255 25834244 26089641 26174905 27157159 28021282 29787575 31627086 33642171 35943566
3654C5943566K711078K300057J392444J124552J436385K189149J583225R09198
$$ 35943566 38654644 40954701 42347145 43471697 44908082 47097231 48680456 49589654
3646D9589654J18098N17057N10524Q02495j41776n10473j488772j259324p85671
$$ 49589654 49707752 50224809 50735333 51537828 51396052 50885579 49396807 48137483 47351812
3637D7351812j53378R7813M65684Q0609m18164q5691m31264p66361j169721r53499
$$ 47351812 47198434 47296247 47761931 47842540 47424376 47338685 46907421 46141060 44971339 44017840
3627D4017840j677863q84125p87263m4966q0266j9678j146937j268846k435940
$$ 44017840 42339977 41455852 40668589 40623623 40543357 40523679 39376742 38107896 35671956
3618C5671956j661894k208588j255929j233146J47835q30766l91775p53509J37057
$$ 35671956 34010062 31801474 30545545 29312399 29460234 28629468 28237693 27484184 27621241
3609B7621241L30039O56365O51732P57794K29610J059816J343897J191920N6342
$$ 27621241 27951280 28607645 29259377 30017171 30246781 31306597 32650494 33842414 33898756
3600C3898756k37963l5814R63820J433558J461723J214422N63984J157348O08639
$$ 33898756 33660793 33624979 34588799 36022357 37484080 38698502 39262486 40419834 41028473
3591D1028473J36500k81462q94149j010319k07158j036116j277857j740844j132811
$$ 41028473 41164973 40883511 39989362 38979043 38771885 37735769 36457912 34717068 33584257
3582C3584257o23785M30111M90783O84847M11251J618661J898760J983012R15060
$$ 33584257 32960472 33390583 33881366 34566213 34977464 36596125 38494885 40477897 41392957
3573D1392957M61191k69158R26772O29528J680583P45115J144422J24218j2481
$$ 41392957 41854148 41584990 42511762 43141290 44821873 45566988 46711410 46835628 46823147
3564D6823147j607315j983263k890329j467912j840226j315840j638325n16618
$$ 46823147 45215832 43232569 40342240 38874328 37034102 35718262 34079937 33563319
3556C3563319k11923J032084J062801J820047J659016J978739J463799O11435
$$ 33563319 33351396 34383480 35446281 37266328 38925344 40904083 42367882 42979317
3548D2979317j89351q32321j375158k064152j892313k153181j524095j199859
$$ 42979317 42789966 41957645 40582487 38518335 36626022 34472841 32948746 31748887
3540C1748887M8094J33103j78017m11504L10729J27652J46078p18615j193468
$$ 31748887 31796981 31930084 31752067 31340563 31651292 31778944 31925022 31206407 30012939
3531C0012939r49392r9850K44691O254m12144O3452L62296J063631J199694P13169
$$ 30012939 29063547 28963697 29208388 29214642 28802498 28865950 29228246 30291877 31491571 32204740
3521C2204740P52767J241176J706186K016548R93349J030085R00524K085506J852872
$$ 32204740 32957507 34198683 35904869 37921417 38914766 39944851 40845375 42930881 44783753
3512D4783753K035253O81841M72955L32344J180259J029485J264804J298855K606079
$$ 44783753 46819006 47500847 47973802 48306146 49486405 50515890 51780694 53079549 55685628
3503E5685628L570938L946599M178317M198026N229471N472423N563990L918418
$$ 55685628 59256566 63203165 67381482 71579508 76808979 82281402 87845392 91763810
3495I1763810K030845N1637p62634k047716l862993m585545m638038l721222k488542
$$ 91763810 93794655 93846292 93083658 91035942 87172949 82587404 77949366 74228144 71739602
3486G1739602k198160k451288l016469l062621k582978l245051k772188k959181
$$ 71739602 69541442 67090154 64073685 61011064 58428086 55183035 52410847 49451666
3478D9451666k103811j889929j732297k517487k371124j660973j101256r83271
$$ 49451666 47347855 45457926 43725629 41208142 38837018 37176045 36074789 35091518
3470C5091518j351384j953145j671111o47208l96454k75195n27727p00910q5238
$$ 35091518 33740134 31786989 30115878 29468670 29072216 28797021 28269294 27568384 27483146
3461B7483146L28263K64200J83270j69018j31231L20106j68599p24784l51466
$$ 27483146 27811409 28075609 28258879 28089861 27958630 28278736 28110137 27385353 27033887
3452B7033887J17293J13261L66467m06613o72646o28185K61196O51600L15311
$$ 27033887 27151180 27264441 27630908 27224295 26551649 25923464 26184660 26836260 27151571
3443B7151571m53093n46801K37389J567558J222834N55261l66687m364N71762
$$ 27151571 26698478 26151677 26389066 27956624 29179458 29734719 29368032 29363668 29935430
3434B9935430N58042N13052K42483Q44516J379139J366767N4303q55926j491866
$$ 29935430 30493472 31006524 31249007 32093523 33472662 34839429 34893732 34037806 32545940
3425C2545940m46804N38772K36198p23200p59757k79214K25068P47912K70412
$$ 32545940 32099136 32637908 32874106 32150906 31391149 31111935 31337003 32084915 32355327
3416C2355327J1514p1382L84656M37666q54415r62273j028879l55705M01058Q17560
$$ 32355327 32366841 32295459 32680115 33117781 32263366 31301093 30272214 29916509 30317567 31135127
3406C1135127M38011Q54592N32888J692410P01525P08627J2976N83652O35930
$$ 31135127 31573138 32427730 32960618 34653028 35354553 36063180 36076156 36659808 37295738
3397C7295738J582180M17000M06605l98190p6550K36083N28623N03808K95620
$$ 37295738 38877918 39294918 39701523 39303333 39226783 39462866 39991489 40495297 40790917
3388D0790917R4240J441054K588250N061057P941578Q898867P526541J737862
$$ 40790917 40885157 42326211 44914461 49975518 57917096 66815963 74342504 76080366
3380G6080366l358992p407517q014738p389204n153294l973804k303454k022311
$$ 76080366 72721374 65313857 57299119 49909915 44756621 40782817 38479363 36457052
3372C6457052j213107j435730o68750q08844j78220j50091l5951O9957L04501
$$ 36457052 35243945 33808215 33139465 32330621 32152401 32002310 31966359 32036316 32340817
3363C2340817L39152L97311J88701K34466k9096k89425M51572K21120L30729o7848
$$ 32340817 32679969 33077280 33265981 33500447 33471351 33181926 33633498 33854618 34185347 34117499
3353C4117499N58793J06802N93663R67081J777386K145392K951116L202527L255890
$$ 34117499 34676292 34783094 35376757 36343838 38121224 40266616 43217732 46420259 49676149
3344D9676149K759370J945064J746637R52993J624128K908646L943043L801461
$$ 49676149 52435519 54380583 56127220 57080213 58704341 61612987 65556030 69357491
3336F9357491L001451L85143j356369l254588k064231k132421j186422j274843
$$ 69357491 72358942 72744085 71387716 68133128 66068897 63936476 62750054 61475211
3328F1475211j384970k543751k538012l227113k985540k725595j544483n41461
$$ 61475211 60090241 57546490 55008478 51781365 48795825 46070230 44525747 43984286
3320D3984286k4390K73169J93604J051669J524073K926869K502113K313375R30948
$$ 43984286 43959896 44233065 44426669 45478338 47002411 49929280 52431393 54744768 55675716
3311E5675716J489036J837701L154224K932775M768107N158069P634710J0202740
$$ 55675716 57164752 59002453 62156677 65089452 69857559 75015628 82650338 92853078
3303I2853078J5280001K1780273L0828427L7094364L6360434K4062027M720182
$$ 92853078 108133079 129913352 160741779 197836143 234196577 258258604 262978786
3296B62978786j2302034k1674091k1774930j7763281j3238777j1294394r187112
$$ 262978786 250676752 229002661 207227731 189464450 176225673 164931279 155744167
3289A55744167p926086m276183l26896O976066J4510082K0374822J7329597O940019
$$ 155744167 147818081 143541898 143215002 150191068 164701150 185075972 202405569 209345588
3281B09345588p757123j4692324j4120425q018573r35359Q244268J7903368K7496062
$$ 209345588 201588465 186896141 172775716 164757143 163821784 172066052 189969420 217465482
3273B17465482L1644627K6387668J0961263q864190k4222326l0501171k8540076
$$ 217465482 249110109 275497777 286459040 277594850 253372524 222871353 194331277
3266A94331277k3878790j7772216j2582307q435501o508255m039351k731645k78443
$$ 194331277 170452487 152680271 140097964 131662463 125154208 121114857 118383212 118104769
3258A18104769O63679J953068P45336P2500j138644M68732P29153J654369P5241
$$ 118104769 118768448 120721516 121466852 121539352 120400708 120869440 121598593 123252962 123328203
3249A23328203j970497m723655n187460n370014l788455l192384j229527p9969
$$ 123328203 121357706 116634051 111446591 106076577 102288122 99095738 97866211 97786242
3241I7786242K130092L564699O232451P499300Q592439J0252998J1889417J4732339
$$ 97786242 99916334 103481033 109713484 117212784 125805223 136058221 147947638 162679977
3233A62679977J9221778K5818973L1914016L4226293K8875072J8120682N776060
$$ 162679977 181901755 207720728 239634744 273861037 302736109 320856791 326632851
3226C26632851l30979j504103Q77666j471338q330507j9910401k8233448l2485584
$$ 326632851 326301872 324797769 325675435 324204097 315873590 295963189 267729741 235244157
3218B35244157l0822562k8512334k3664591j9872816j5814601j2452277r112555
$$ 235244157 204421595 175909261 152244670 132371854 116557253 104104976 94992421
3211I4992421p751088o732511o309901n535347n087722m273555l965539l404104
$$ 94992421 87241333 80508822 74198921 68663574 63575852 59302297 55336758 51932654
3203E1932654l010319k547624k035943j514695j405118j138823r65684n88915
$$ 51932654 48922335 46374711 44338768 42824073 41418955 40280132 39314448 38725533
3195C8725533j13938n80755j91464K00638L22486O65522L84422P6021l16910J51238
$$ 38725533 38611595 38030840 37839376 38040014 38362500 39028022 39412444 39488465 39171555 39322793
3185C9322793P37964P51437N46574R15272J190313J319188J512595J184777P12203
$$ 39322793 40060757 40812194 41358768 42274040 43464353 44783541 46296136 47480913 48193116
3176D8193116r1129k02608n75609l31135p42522l66438m74864l91987r89909l82061
$$ 48193116 48101987 47899379 47323770 46992635 46250113 45883675 45408811 45016824 44026915 43644854
3166D3644854q15232l00218n3788K65801m26738m95726L5664j3196l87007Q8948
$$ 43644854 42829622 42529404 42475616 42741417 42314679 41818953 41854617 41841421 41454414 41543362
3156D1543362O4009L84600R38591J236008K671771M058334O463822P686825O664092
$$ 41543362 41607371 41991971 42930562 44166570 46838341 50896675 57360497 65047322 71711414
3147G1711414J565622l653193o106732o246274n274512m003884l705379k960513
$$ 71711414 73277036 69623843 63517111 57270837 51996325 47992441 44287062 41326549
3139D1326549k326283j340294n36344m19149k08225l68384j8524R70972J915790
$$ 41326549 39000266 37659972 37123628 36704479 36496254 36127870 36109346 37080318 38996108
3130C8996108K231150L277231M722948O784026R060179R814095Q655950M792949
$$ 38996108 41227258 44504489 49227437 56011463 65071642 74885737 83541687 88334636
3122H8334636J088618l609945n901428o846157p028686o641759n422687m912663
$$ 88334636 89423254 85813309 79911881 73065724 66037038 59395279 53972592 49059929
3114D9059929m499648l933291m306775k949459k305316j327134k149750j854848
$$ 49059929 44560281 40626990 36320215 33370756 31065440 29738306 27588556 25733708
3106B5733708k117436q02312n81055k12521j012439o48559n89085L20363K53558
$$ 25733708 23616272 22813960 22232905 22020384 21007945 20359386 19770301 20090664 20344222
3097B0344222J44618n24707o52723p5313M69702L29487l79290L5402r9886R53631
$$ 20344222 20488840 19964133 19311410 19236097 19705799 20035286 19655996 19691398 19591512 20545143
3087B0545143N55222P82432k22524N41085K72489J128745O28733Q90631M50302
$$ 20545143 21100365 21882797 21660273 22201358 22473847 23602592 24231325 25121956 25572258
3078B5572258R93950J416168J588216J926953J505322K011139K472584L887614
$$ 25572258 26566208 27982376 29570592 31497545 33002867 35014006 37486590 41374204
3070D1374204L830069M607680N037321P057529Q796785J2071388J5633213K0653633
$$ 41374204 45204273 49811953 54849274 61906803 70703588 82774976 98408189 119061822
3062A19061822K4597650K6020734K2467121J5148731M834845m641770j0035343
$$ 119061822 143659472 169680206 192147327 207296058 212130903 207489133 197453790
3055A97453790j1033175o514867P93127Q486171J4334430J5344059J0301837R38334
$$ 197453790 186420615 179905748 180698875 189185046 203519476 218863535 229165372 230103706
3047B30103706j0652553j9406066k4466057k5265717k2929147j9554528j6219377
$$ 230103706 219451153 200045087 175579030 150313313 127384166 107829638 91610261
3040I1610261j2987107j0507593q833284p210878o049115m731789m559344l432914
$$ 91610261 78623154 68115561 59282277 52071399 46022284 41290495 36731151 33298237
3032C3298237k780221k078790j421253j140900j121706j458615j088539q60469
$$ 33298237 30518016 28439226 27017973 25877073 24755367 23296752 22208213 21347744
3024B1347744m61696p7144o82621j183132j191538n08564k26967m97128j204441
$$ 21347744 20886048 20808904 20126283 18943151 17751613 17243049 17016082 16518954 15314513
3015A5314513p54710o06193l57161p18985m72406p24296l80047j56692o7548k26744
$$ 15314513 14559803 13953610 13596449 12877464 12405058 11680762 11300715 11144023 11076475 10849731
3005A0849731o62328m11429m7148K24034o45499j91680q05204L44165m20817L23771
$$ 10849731 10187403 9775974 9728826 9952860 9307361 9115681 8310477 8654642 8233825 8557596
2995H557596o72059K54395l93602M16161k2154P49914r18197K66096m02522j6747
$$ 8557596 7885537 8139932 7746330 8162491 8140337 8890251 7972054 8238150 7835628 7818881
2985G818881o17160k19237m39562k9528J45770l23398m29512n63373N2656l40886
$$ 7818881 7201721 6982484 6542922 6513394 6659164 6335766 5906254 5342881 5395537 5054651
2975E054651P09137p31479k95317m43359M79388j45443m3265o03355N2287Q1985
$$ 5054651 5763788 5032309 4736992 4293633 4773021 4627578 4584313 3980958 4033245 4115230
2965D115230N12468m3266k01480o99173j54551L36421K97085j47296n33288q7045
$$ 4115230 4627698 4584432 4382952 3683779 3529228 3865649 4162734 4015438 3482150 3395105
2955C395105M5943N24339j57478j11443m6280L32475J08571J22056o27566J7427
$$ 3395105 3441048 3965387 3807909 3696466 3650186 3982661 4091232 4213288 3585722 3603149
2945C603149M2654J38123O09982J14997l24901k15545K89878n6825j15758o09235
$$ 3603149 3645803 3783926 4393908 4508905 4184004 3968459 4258337 4201512 4085754 3476519
2935C476519l05829o7552J21376k67967K25619l37431K99965J31756j27275n89311
$$ 3476519 3170690 3103138 3224514 2956547 3182166 2844735 3144700 3276456 3149181 2559870
2925B559870O9700k78589J72505m72461j6841m83212j06267j3417L97723P2440
$$ 2559870 2629570 2350981 2523486 2051025 2034184 1550972 1444705 1431288 1829011 1901451
2915A901451j70853j42178K59630q8130J21155K0456l4393J44790p8985k65538
$$ 1901451 1730598 1588420 1848050 1759920 1881075 1901531 1867138 2011928 1932943 1667405
2905A667405k11357Q7612K60923O44174p59800k88423j90952Q3855L07687N52177
$$ 1667405 1456048 1543660 1804583 2448757 1688957 1400534 1209582 1293437 1601124 2153301
2895B153301k06369o38468m01337K90704N14507J71501k36400l46633r055J20136
$$ 2153301 1946932 1308464 907127 1197831 1712338 1883839 1647439 1300806 1291751 1411887
2885A411887L44647k45461k35072Q5413M06790J54306n77880j96923J43851L27713
$$ 1411887 1756534 1511073 1276001 1361414 1768204 1922510 1344630 1147707 1291558 1619271
2875A619271j1101q0500p70943m55524P01209N64290M20846l64110m61631j68644
$$ 1619271 1608170 1527670 756727 301203 1002412 1566702 1987548 1623438 1161807 993163
2865I93163L02896K07534K5721j00977J56568j14894K0489p1901m1487k23796
$$ 993163 1296059 1503593 1529314 1428337 1584905 1470011 1490500 1418599 1377112 1153316
2855A153316L07099J71416j89635l70907n50932M68630K40952K95850k10560j27837
$$ 1153316 1460415 1631831 1442196 1071289 520357 988987 1229939 1525789 1315229 1187392
2845A187392o67824K90558J65044M50946n50882L20725k94259K59988k35960M99224
$$ 1187392 519568 810126 975170 1426116 875234 1195959 901700 1161688 925728 1424952
2835A424952O5158L83577m32250m25776l86960n7127K11820K36083j391n07783
$$ 1424952 1490110 1873687 1441437 1015661 628701 571574 783394 1019477 1018086 510303
2825E10303J90764l36012O74494J30596L89592o64269K32542o71681K65162k78667
$$ 510303 701067 365055 1039549 1170145 1559737 895468 1128010 456329 721491 442824
2815D42824M93662j65608J81161m89009P816k22868L16221M73182J76217l02882
$$ 442824 936486 770878 952039 463030 470846 247978 564199 1037381 1213598 910716
2805I10716o02771J8350P801M97575k64698k4914k48369O8742k67488N60322j13946
$$ 910716 307945 326295 334096 831671 566973 542059 293690 362432 94944 655266 541320
2794E41320J74717m19283Q9866j31922j3378m25496L68126J56515K87794n285
$$ 541320 716037 296754 386620 254698 241320 -184176 183950 340465 628259 622974
2784F22974m61524K12260K61105P14485N51j97346n15526m6484L68471M92194
$$ 622974 161450 373710 634815 1349300 1349851 1152505 636979 590495 958966 1451160
2774A451160J98771K89734m06526m51265L10805M53133J40692n0330j58965k43424
$$ 1451160 1649931 1939665 1533139 1081874 1392679 1845812 1986504 1936174 1777209 1533785
2764A533785j10877j8645J39581m23120L36970n13548l7526n75091K08033m4594
$$ 1533785 1422908 1404263 1543844 1120724 1457694 944146 906620 331529 539562 494968
2754D94968N09100k06378J4822o00746k69679n0914L83526K78991Q2123q0264
$$ 494968 1004068 797690 812512 211766 -57913 -108827 274699 553690 635813 555549
2744E55549l53304m8337P4852P26329q5778m07114o88345N0638K03716L50129
$$ 555549 202245 153908 228760 955089 869311 462197 -226148 -175510 28206 378335
2734C78335k10912j31903k9570N15352j12585J30407n5801O7816l1601O6787m83315
$$ 378335 167423 35520 5950 521302 408717 539124 483323 551139 519538 586325 103010
2723A03010j35359l18676M25079J92362K01459l16116j59362K33330L61147o1474
$$ 103010 -32349 -351025 74054 266416 467875 151759 -7603 225727 586874 525400
2713E25400K34423n54604k57526l86260M46312J61750R1758j55283M52182J5825
$$ 525400 759823 205219 -52307 -438567 7745 169495 261253 105970 558152 573977
2703E73977L6295j66101l8039J84229j10870J05748n28478m09435j38655O58340
$$ 573977 610272 444171 406132 590361 479491 585239 56761 -352674 -491329 167011
2693A67011L21185K54663p29902l97096L5472Q93462L10268J33891r59307j13778
$$ 167011 488196 742859 12957 -384139 -348667 544795 855063 988954 29647 -84131
2683h4131N0115L84007K37947m32602j26471j26764M35613p679o0187n02583M84871
$$ -84131 -34016 349991 587938 155336 28865 -97899 337714 330035 269848 -232735 252136
2672B52136J42084J62208n31375p8736k38193O35428K40049N0863n16357j13456
$$ 252136 394220 556428 25053 -53683 -291876 343552 583601 634464 118107 4651
2662D651J93381N81775l17616l43624k76428J9831L91820M01646K5064m95048
$$ 4651 198032 779807 462191 118567 -157861 -138030 253790 655436 680500 185452
2652A85452Q4857J59343R9433j1773j11116m69351N78975J69413k06216n03648
$$ 185452 270309 429652 529085 517312 406196 -63155 515820 685233 479017 -24631
2642b4631j71726N9385P27335K79651k52928m51232l12052Q5681M78134j97407
$$ -24631 -196357 -136972 590363 870014 617086 165854 -146198 -60517 417617 220210
2632B20210o4095q0793M81363j30926K27084j04499q2442k00965J54222J44987
$$ 220210 156115 75322 556685 425759 652843 548344 465902 264937 419159 564146
2622E64146K44842k45633K05972m0928M59164o5433O39587K95965K30206J78049
$$ 564146 808988 563355 769327 728399 1187563 1122130 1761717 2057682 2287888 2465937
2612B465937L09206m97164m98241r06890j93986j25859M50649l98018J68630o16913
$$ 2465937 2775143 2277979 1779738 872848 678862 553003 1003652 605634 774264 157351
2602A57351K28660R6214J72563j78821k86462j51064K79441K93020R7300m17506
$$ 157351 386011 482225 654788 475967 189505 38441 317882 610902 708202 290696
2592B90696m78366N21817J32274J25839n9935j14026j49026O23611j85942L426
$$ 290696 -187670 334147 466421 592260 532325 418299 269273 892884 706942 710368
2582G10368q56946J32686O1343R06580k59443j89399o84658L35332K30121M62716
$$ 710368 -146578 -13892 47451 954031 694588 505189 -179469 155863 385984 848700
2572H48700k42246o03059j31562M12961r2063R341k43769J92517L16170J53984
$$ 848700 606454 3395 -128167 284794 192731 202072 -41697 150820 466990 620974
2562F20974j59919J09672l10379n2256k65683J6190k18956M41437K12127L93475
$$ 620974 461055 570727 260348 208092 -57591 -41401 -260357 181080 393207 786682
2552G86682n14193j36279k42427J5124M97697K64651l82093l01136R8170J66743
$$ 786682 272489 136210 -106217 -91093 406604 671255 289162 -11974 86196 252939
2542B52939j57592k56545l3497j7447O68031j73348Q5424n23470Q1832N67499
$$ 252939 95347 -161198 -194695 -212142 455889 282541 367965 -155505 -73673 493826
2532D93826L57742j12223o71115n00994N86140N82281J69747l17041N7650k09814
$$ 493826 851568 739345 68230 -432764 153376 735657 905404 588363 646013 436199
2522D36199L55591K38981j50924l39879l5991J50089J13665k41975k58094o6314
$$ 436199 791790 1030771 879847 539968 503977 654066 767731 525756 267662 201348
2512B01348L98152R6870N1145n51828K04365M65772K25416j37326k84645l83807
$$ 201348 599500 696370 747515 195687 400052 865824 1091240 953914 669269 285462
2502B85462K568J68250J17603K16519k45227p6161J4346L03491k62660M09678
$$ 285462 288030 456280 573883 790402 545175 469014 483360 786851 524191 933869
2492I33869J07353q3285n76027K16688m26282M73430J55023M21561n55888j55627
$$ 933869 1041222 957937 381910 598598 172316 645746 800769 1222330 666442 510815
2482E10815l63172N44106L41947K49633l54359p8694K5070K66284P800m9228j70298
$$ 510815 147643 691749 1033696 1283329 928970 850276 875346 1141630 1149430 1100202 929904
2471I29904K5251K84019N1006l44200m60430M95882K61475N74845j038033K0234
$$ 929904 955155 1239174 1290180 945980 485550 981432 1242907 1817752 779719 799953
2461G99953n13749P36774K26636N34359q37729K59683k65388N36134l07187O39177
$$ 799953 286204 1022978 1249614 1783973 946244 1205927 940539 1476673 1169486 1808663
2451A808663o11525n583j66797L53844J62426K92686j48947K4926l1492j8273
$$ 1808663 1197138 1191555 1024758 1378602 1541028 1833714 1684767 1709693 1678201 1659928
2441A659928j67806k17270M64554R0863o2198k31651K1565j60513L31650J0707
$$ 1659928 1492122 1274852 1739406 1830269 1768071 1536420 1557985 1397472 1729122 1739829
2431A739829K95731l436L1338k15405r2945k09932N03660K07573l5032n56282
$$ 1739829 2035560 2032124 2063462 1848057 1755112 1545180 2048840 2256413 2221381 1665099
2421A665099r4177k6244O07700K57002M83922l75075l62201m22008L04501O25742
$$ 1665099 1570922 1544678 2152378 2409380 2893302 2518227 2156026 1734018 2038519 2664261
2411B664261M43189k38495l75000m53538L99495N91060J95474l62363J9198n1170
$$ 2664261 3107450 2868955 2493955 2040417 2439912 3030972 3226446 2864083 2883281 2832111
2401B832111J30975L93247k75048N6219L9134O84508J14601J34327l76365K16664
$$ 2832111 2963086 3356333 3081285 3137504 3176638 3861146 3975747 4110074 3733709 3950373
2391C950373M96675J345659L88726r54031m84002Q1993P00720O63367J07328n10366
$$ 3950373 4447048 5792707 6181433 5227402 4743400 4825393 5526113 6189480 6296808 5786442
2381E786442l21954L49549J363141N04780k0139j77268Q14394P27103R52301O53307
$$ 5786442 5464488 5814037 7177178 7681958 7661819 7484551 8298945 9026048 9978349 10631656
2371A0631656P34188O41756J162048J049007J069284J010565J998766L771202
$$ 10631656 11365844 12007600 13169648 14218655 15287939 16298504 18297270 22068472
2363B2068472M790894L887081J946195k29958K86165J656114K905651L469771
$$ 22068472 26859366 30746447 32692642 32462684 32748849 34404963 37310614 40780385
2355D0780385M588696O267157R220397J2616694K1541048M5461231Q7082954J13219628
$$ 40780385 45369081 51636238 60856635 73473329 95014377 140475608 227558562 340778190
2347C40778190R3438198J6545278p5036780r3142935o9681455n0687585l5702430
$$ 340778190 434216388 450761666 375724886 282581951 212900496 162212911 126510481
2340A26510481k7924082k0154336j5577856j1076583r639536n563460k726185
$$ 126510481 98586399 78432063 62854207 51777624 42138088 36574628 33848443
2333C3848443m99654o38425k185837m112903l503106k504246k346509j977962
$$ 33848443 33348789 32710364 30524527 26411624 22908518 20404272 18057763 16079801
2325A6079801k031478r38848q71483o21130j363096n70847q49365M42707l02606
$$ 16079801 14048323 13109475 12237992 11616862 10253766 9682919 8833554 9276261 8973655
2316H973655J72576r31107k49956n14029L90462j60931j15308j251153L7096n67341
$$ 8973655 9146231 8215124 7965168 7451139 7841601 7680670 7565362 6314209 6351305 5783964
2306E783964L8819o54697J23998m35536L60132k61133m28582l77714M3378L81625
$$ 5783964 5822783 5168086 5292084 4856548 5216680 4955547 4526965 4149251 4192629 4574254
2296D574254K6142l45789p42998K1974m4115M73243l74589r8745n13618L49415
$$ 4574254 4600396 4254607 3511609 3533583 3489468 3962711 3588122 3489377 2975759 3325174
2286C325174k15091O09821o25737r0839o19678Q88941j78905m34368q28316J42207
$$ 3325174 3110083 3719904 3094167 3003328 2383650 3272591 3093686 2659318 1831002 1973209
2276A973209J83770N04550l60595m55907m85190M7490P77092K320o5007p71346
$$ 1973209 2156979 2661529 2300934 1845027 1359837 1407327 2184419 2186739 2121732 1350386
2266A350386o065j85920P88657k14028j74872o95797K30004N1021N87082l61768
$$ 1350386 1344321 1158401 1947058 1733030 1558158 862361 1092365 1143386 1730468 1368700
2256A368700l78177k93783M37142n8132r2062q9366k81767K3363K83549K03616
$$ 1368700 990523 696740 1133882 1075750 983688 894322 612555 635918 919467 1123083
2246A123083l82412j16954j69145M72617l2215P8371m37407l45064l55695M18552
$$ 1123083 740671 623717 454572 927189 894974 973345 535938 190874 -164821 253731
2236B53731J74332M98781m61382J73214k48610K96876J9919K12258o06055j07125
$$ 253731 428063 926844 465462 638676 390066 686942 706861 919119 313064 205939
2226B05939q4083J67031J60102P2784K0611O1188k52154K73623j49897n2320j10102
$$ 205939 121856 288887 448989 521773 542384 603572 351418 625041 475144 422824 312722
2215C12722j61839Q5548L53984l53940n53079j80286M66132M16953K11218k41910
$$ 312722 150883 236431 590415 236475 -316604 -496890 -30758 386195 597413 355503
2205C55503n12726l62359N83404N86461Q284k98878n03259j29655L11764L98713
$$ 355503 -157223 -519582 63822 650283 658567 359689 -143570 -273225 38539 437252
2195D37252p4484j56401j34005K40039k12966N99529m35317k40112k59147M50719
$$ 437252 362768 206367 72362 312401 99435 698964 263647 23535 -235612 215107
2185B15107j01101n8270o75853Q8298J20966J054820m05142J37603o55488M13311
$$ 215107 114006 55736 -620117 -531819 -410853 643967 238825 376428 -279060 134251
2175A34251J0219M31109k21328k98335q69124O07953K53472J59039j18521m750
$$ 134251 144470 575579 354251 55916 -813208 -205255 48217 207256 88735 83985
2165H3985j02470L99826j54850J935j14139j37735J00856k45263l5094j86885
$$ 83985 -18485 381341 226491 228426 114287 -23448 77408 -167855 -202949 -389834
2155c89834K17098J21964r728L6038j18034m1199M31338m04850j2748j84147L47520
$$ -389834 -172736 -50772 -60500 -24462 -142496 -183695 247643 -157207 -169955 -354102 -6582
2144f582N9849J75654l78789K43330k31004M24740l17285J90492n13122m4960
$$ -6582 53267 228921 -149868 93462 -137542 287198 -30087 160405 -352717 -397677
2134c97677j76081Q14683j74970J17086o16711K01786k44678O27582l38541j98296
$$ -397677 -573758 240925 65955 183041 -433670 -231884 -476562 151020 -187521 -385817
2124c85817l78959N45204R5562J19295j79941q7099j5411N610R7128k73450L31497
$$ -385817 -764776 -219572 -124010 -4715 -184656 -271755 -287166 -281556 -184428 -457878 -126381
2113a26381k97830K00499k42180J35466p3416J76455k6535R8910j73053j6845
$$ -126381 -424211 -223712 -465892 -330426 -403842 -227387 -253922 -155012 -328065 -344910
2103c44910J40498k09164Q276j1769M28924j01789k74338Q971K03008J14550K93126
$$ -344910 -204412 -413576 -405300 -417069 11855 -89934 -364272 -355301 -152293 -37743 255383
2092B55383k69208j86278j83488J22273J74223L7388N4956o3357J81323k18394
$$ 255383 -13825 -200103 -383591 -261318 -87095 -49707 5249 -58108 123215 -95179
2082i5179L34935r2013P37372J51886P80550j65085N62431o10305k65968p44581
$$ -95179 239756 147743 885115 1037001 1817551 1652466 2214897 1604592 1338624 594043
2072E94043L10490k95188O12258p06357l70738m65459M85738O543j9448l47956
$$ 594043 904533 609345 1221603 515246 144508 -320951 164787 171330 151882 -196074
2062a96074q3926J43840J58536O4728j17292n6989p39104P32982n3091L17681
$$ -196074 -280000 -136160 22376 87104 -30188 -87177 -826281 -93299 -146390 171291
2052A71291p31233L05210m02927O51431m81926M99758n41432M82414m73128L32124
$$ 171291 -559942 -254732 -657659 -6228 -488154 11604 -529828 -47414 -520542 -188418
2042a88418M9211K48129k28464L5383l45089J467M3232J17825o216n23711M31965
$$ -188418 -139207 108922 -119542 -84159 -429248 -427781 -384549 -266724 -272940 -796651 -364686
2031c64686J40538L70859k13759j41752k51703L54632j69453K92156o45114R7201
$$ -364686 -224148 146711 -67048 -208800 -460503 -105871 -275324 16832 -628282 -531081
2021e31081m0320O07663J90270N9073r02308j01990P22232M27014l96735n55700
$$ -531081 -571401 36262 226532 285605 -616703 -718693 3539 430553 33818 -521882
2011e21882l38738O06437M91321L23227l84595o54144k9164K06899L67922K12
$$ -521882 -860620 -254183 237138 560365 175770 -478374 -507538 -300639 67283 67495
2001F7495l81607j60304L89662M04815j93872k84629o16132N01252J95930Q8831
$$ 67495 -314112 -474416 -84754 320061 126189 -158440 -774572 -273320 -77390 11441
1991A1441j05774k92589m5756L81723N78357m68781q39826p5162N94975K64053
$$ 11441 -94333 -386922 -432678 -50955 527402 58621 -781205 -856367 -261392 2661
1981B661M8664o03588j50670J61210O82447l5750N0814m57130J6230j48269O204
$$ 2661 51325 -552263 -702933 -541723 140724 104974 155788 -301342 -285112 -433381 -427177
1970d27177j80988j27496j7837N06240M12974m18919k76118l17197N12130K21854
$$ -427177 -608165 -735661 -753498 -247258 165716 -253203 -529321 -846518 -334388 -112534
1960a12534M80871p26563j03643j77210N34452r5514J70050n56054J66039q2254
$$ -112534 368337 -358226 -461869 -639079 -104627 -200141 -30091 -586145 -420106 -502360
1950e02360L60860L20216j85364j63105r7059K42153l68228q92k80927N37392
$$ -502360 -141500 178716 -6648 -169753 -266812 -24659 -392887 -393779 -674706 -137314
1940a37314k06157O63236m03000J58902l50040N84280j82170K39811q59288K64776
$$ -137314 -343471 319765 -83235 75667 -274373 309907 127737 367548 -491740 -226964
1930b26964k57555J36991j04927M17075J71265j84643J66569p4668j04386q5234
$$ -226964 -484519 -347528 -452455 -35380 135885 -48758 117811 43143 -61243 -146477
1920a46477L35391k50138k20069o60846R9259N8556N38302J95555m788K4975K0809
$$ -146477 188914 -61224 -281293 -942139 -842880 -784324 -246022 -50467 -55255 -30280 -9471
1909i471J56634o1402K0165p08539L88902j88163M82481o64285K88628j78594
$$ -9471 147163 85761 105926 -602613 -213711 -401874 80607 -583678 -295050 -473644
1899d73644O31330k26548J70039o18237L52426m5830O46787j93447m90174m03721
$$ -473644 157686 -68862 101177 -517060 -164634 -210464 436323 242876 -247298 -651019
1889f51019j96553P35320J1193L82647n64698r84l56915J113054o22775L55133
$$ -651019 -847572 -112252 -101059 281588 -283110 -284094 -641009 472045 -150730 204403
1879B04403q71619N55935o88194R57106o14887L30908n68601J168715o30368P72143
$$ 204403 -667216 -111281 -799475 157631 -457256 -126348 -694949 473766 -156602 615541
1869F15541p40546J72056o03430L29820k00059L11285m97377n6867q5645N97069
$$ 615541 -125005 47051 -556379 -226559 -426618 -115333 -612710 -669577 -755222 -158153
1859a58153K63916Q9117m95370k14424J84271R3337N00327n13602k52521n54865
$$ -158153 105763 194880 -300490 -514914 -330643 -237306 263021 -250581 -503102 -1057967
1849a057967P50689r9134P00391m14822J70429q39671J011129J22213N5087j002762
$$ -1057967 -307278 -406412 293979 -120843 49586 -790085 221044 343257 398344 -604418
1839f04418J54905l56436P00163k67048J67006n16778m7690L26270P73129j94048
$$ -604418 -449513 -805949 -105786 -372834 -205828 -722606 -770296 -444026 329103 135055
1829A35055m31632m22604q7125P89260N55223k37346p45415j04967N8916M99844
$$ 135055 -296577 -719181 -806306 -17046 538177 300831 -444584 -549551 -490635 9209
1819I209M29873l22726n09074r054M47129l4721Q3603o70535o3078K41069P86659
$$ 9209 439082 116356 -392718 -401772 45357 10636 94239 -576296 -639374 -398305 388354
1808C88354l06090j20597p21270N89623L61306K44687r49023k99986J80605P78324
$$ 388354 82264 -38333 -759603 -169980 191326 436013 -513010 -812996 -632391 145933
1798A45933k2731j27785n66632m52258L76560N62789J42540m55501j54114r8383
$$ 145933 123202 -4583 -571215 -1023473 -646913 -84124 58416 -397085 -551199 -649582
1788f49582O94338l81050j42793k99741P03388k54283M52866m44644L38189p9132
$$ -649582 44756 -336294 -479087 -778828 -75440 -329723 123143 -321501 16688 -62444
1778f2444L38992j03597j86511n09145Q5464k2754K56708k32374j0485L4778L31228
$$ -62444 276548 172951 -13560 -522705 -437241 -459995 -203287 -435661 -446146 -411368 -80140
1767h0140L25716j4339o8132j80622l4748L5002j42503k58068o7197J79680N19319
$$ -80140 245576 231237 163105 -17517 -52265 -17263 -159766 -417834 -485031 -305351 213968
1756B13968p5609k11964n03153R0604L74067M21182l2910m09247m54814J65876
$$ 213968 138359 -73605 -576758 -486154 -112087 309095 276185 -133062 -587876 -422000
1746d22000R5166M65530k8041k45554k01490J11351j06692K66991k81221m1562
$$ -422000 -326834 138696 110655 -134899 -336389 -225038 -331730 -64739 -345960 -387522
1736c87522j5206L70049j1295j07848j62113j6047M19091J22567O7474o34400
$$ -387522 -402728 -32679 -43974 -151822 -313935 -329982 89109 211676 279150 -355250
1726c55250k5941L15628P14956m56205m30230p32876L54009J42676O82464m95697
$$ -355250 -381191 -65563 649393 193188 -237042 -969918 -615909 -473233 209231 -286466
1716b86466N9114o91225L98175k3730P73008l86951J12273p16277N61152m3188
$$ -286466 -227352 -918577 -520402 -544132 228876 -158075 -45802 -762079 -200927 -244115
1706b44115R8107k25524J85136n2488J68490J27927n9960j30529j91857M11919
$$ -244115 -146008 -371532 -186396 -238884 -70394 57533 -2427 -132956 -324813 87106
1696H7106K12715J82036p47184K49325j96450J96119Q5802M22930n92568p1651
$$ 87106 299821 481857 -265327 -16002 -212452 -16333 69469 492399 -100169 -171820
1686a71820k61297O21720m50262M48443q56811j65845k07173P80297K3566K87391
$$ -171820 -433117 188603 -261659 186784 -670027 -835872 -1043045 -262748 -239182 48209
1676D8209n19839j20811J81581R7331Q914j54865O1444K27799p5866m29464r7816
$$ 48209 -471630 -592441 -410860 -313529 -304615 -459480 -398036 -170237 -246103 -675567 -773383
1665g73383L9414N03454K61294k15961l97217m71109L50555O87915N69031n37737
$$ -773383 -733969 -230515 30779 -185182 -582399 -1053508 -702953 -15038 553993 16256
1655A6256J31289l12065K9831k943L81408l76879J75462j60867N9750l29111j47644
$$ 16256 147545 -164520 -134689 -137632 243776 -133103 42359 -118508 -58758 -387869 -535513
1644e35513J96276J77856p5605Q5625l39689r4242K77104P18562J29193m35645
$$ -535513 -339237 -161381 -236986 -151361 -491050 -585292 -308188 410374 539567 103922
1634A03922k94874n4286L12591M99328R3131o35905o18112o2263M26024M57440
$$ 103922 -190952 -245238 67353 566681 659812 23907 -594205 -656468 -230444 226996
1624B26996l95752j84748M02101L71789Q467m13282l33330k98453O15634l5546
$$ 226996 -168756 -353504 48597 420386 428853 15571 -317759 -616212 -578 -36124
1614c6124N5735o73419K4051m2217P88421J64413K20799o73575k06439j61346
$$ -36124 19611 -653808 -629757 -671974 116447 280860 501659 -171916 -378355 -539701
1604e39701O58663J47669O4714o21661q949p3636K92793J01923j8823j76910J62268
$$ -539701 118962 266631 331345 -290316 -299265 -372901 -80108 21815 2992 -173918 -11650
1593a1650k49103j43073l45428K30304R2559L26195r3347k32715j05253J62282
$$ -11650 -260753 -403826 -749254 -518950 -426391 -100196 -193543 -426258 -531511 -369229
1583c69229K0638L91456M266K59016n28043k83577L309M54411J55863k55647k88328
$$ -369229 -348591 42865 47131 306147 -221896 -505473 -502164 -47753 108110 -147537 -435865
1572d35865j22502M30046J82738R9759l55972k85231m2935M14097J28562o6861
$$ -435865 -558367 -128321 54417 154176 -201796 -487027 -529962 -115865 12697 -54164
1562e4164m36397j6897L77521N5115l15421J04080M5987M44972Q7198k08636k29862
$$ -54164 -490561 -507458 -129937 -74822 -390243 -286163 -240176 204796 291994 83358 -146504
1551a46504N738K85624l4114K46653m21341M0694k29736J28717m485j9722n5473
$$ -146504 -140766 144858 110744 357397 -63944 -23250 -252986 -124269 -128754 -148476 -203949
1540b03949K23909K74413k8206m50507m91373J78987O4145L06067l52371N5341
$$ -203949 19960 294373 266167 -184340 -675713 -496726 -432581 -126514 -478885 -423544
1530d23544O534M32463M4766K47436n80275J62116l5633O93294q08786j45216
$$ -423544 -417010 15453 60219 307655 -272620 -110504 -146137 547157 -261629 -406845
1520d06845n23892Q66668K41503M43364r20742l90703O264R96791M64704l31271
$$ -406845 -930737 -64069 177434 620798 -299944 -690647 -684383 312408 777112 445841
1510D45841j101358k80233P39888M62212m0765q75340m21037J54722J000544K27309
$$ 445841 -655517 -935750 -195862 266350 225585 -649755 -1070792 -916070 84474 311783
1500C11783l29183q59629J54031L38169P91033k39044l00496o29179N50896M20897
$$ 311783 -17400 -877029 -722998 -384829 406204 167160 -133336 -762515 -211619 209278
1490B09278K50480n94355j09861Q2127O56013L37655n90956n93987k37889J37799
$$ 209278 459758 -134597 -244458 -162331 493682 831337 240381 -353606 -591495 -453696
1480d53696M48488J07264m53710r5932j324K42543k92255M26622j06212O7468
$$ -453696 -5208 102056 -351654 -447586 -448910 -206367 -498622 -72000 -178212 -110744
1470a10744j77136M78465l83289J65512k63312L65726J52280k46061o6772l3939
$$ -110744 -287880 190585 -192704 -27192 -290504 75222 227502 -18559 -85331 -119270
1460a19270J55370k7277L69191j90164l8304k11685K572n34262L65250J28743
$$ -119270 36100 8823 378014 187850 149546 -62139 -59567 -593829 -228579 -99836
1450i9836K66770m05138j9429k15035l7420K59421L78157m86567l36771j39160
$$ -99836 166934 -238204 -257633 -472668 -510088 -250667 127490 -359077 -695848 -835008
1440h35008M27024K59384L31149k84587k28403j35484M71628L98951J80820m62166
$$ -835008 -407984 -148600 182549 -102038 -330441 -465925 5703 404654 585474 123308
1430A23308m23492J28842N65723m540n03671m08431J02781L08952L02715j04975
$$ 123308 -300184 -171342 394381 389841 -113830 -522261 -419480 -110528 192187 87212
1420H7212l83830k67019L71820M30037K58997j60658o87937q4974N1803O9542
$$ 87212 -296618 -563637 -191817 238220 497217 336559 -351378 -436352 -384549 -315007
1410c15007J09600k79470j94465K86837L05861M16426J04432k98342l47848R1232
$$ -315007 -205407 -484877 -679342 -392505 -86644 329782 434214 135872 -211976 -120744
1400a20744J22271l93370k90467J41974O2470J62882M10446j00245n66793r5213
$$ -120744 1527 -391843 -682310 -540336 -477866 -314984 95462 -4783 -571576 -666789
1390f66789J11233O63752J6763K93964q52529j35981K19199O01190j00640L4876
$$ -666789 -555556 108196 124959 418923 -433606 -569587 -350388 250802 150162 185038
1380A85038o57545j98383L27584M69836P7300j31323p35802k8615M22747M04063
$$ 185038 -472507 -670890 -343306 126530 203830 72507 -663295 -691910 -269163 134900
1370A34900M49008o17998l81796k61843L17620K02185J75306j6359L2378M00238
$$ 134900 583908 -34090 -415886 -677729 -360109 -157924 17382 1023 33401 433639
1360D33639J89895o16446n27712p1649N63000N41784o2818o93749l89350J66423
$$ 433639 623534 7088 -520624 -592273 -29273 512511 449693 -244056 -633406 -466983
1350d66983M40612N49891J10724o62594l28982j29702N25206K4438p1900j34055
$$ -466983 -26371 523520 634244 -28350 -357332 -487034 38172 62610 -9290 -143345
1340a43345q0681J40190L43550J67680j06209J56664J84792r4791n79154l19444
$$ -143345 -224026 -83836 259714 427394 321185 477849 662641 567850 -11304 -330748
1330c30748m8728L75883N9587k63789m39836N2137M10662N23159j26951k918K64512
$$ -330748 -379476 -3593 55994 -207795 -647631 -595494 -184832 338327 211376 208458 472970
1319D72970k0034k72512k98183k98304M4967N42674j63824j20408p33133o325
$$ 472970 452936 180424 -117759 -416063 -371096 171578 7754 -112654 -845787 -852112
1309h52112N06715J138421j75723l57960j005185K99235K91878K68262k86439
$$ -852112 -345397 793024 617301 259341 -745844 -446609 -154731 113531 -172908
1300a72908l19176J1735N35546Q7959l41631J6636j11768L73224q9797q9550p00945
$$ -172908 -492084 -480349 55197 143156 -198475 -181839 -293607 79617 -10180 -99730 -800675
1289h00675K73309K49286J085766j15314o32128j065251P92554P01585M49927
$$ -800675 -527366 -278080 807686 692372 60244 -1005007 -212453 489132 939059
1280I39059o03566n32128j79893j3769N10860l1064M001l62371L80470K81578
$$ 939059 335493 -196635 -376528 -390297 120563 89499 93500 -268871 111599 393177
1270C93177k49986p17955M11517L97575M7537l13807j91331m03067K1016L68539
$$ 393177 143191 -574764 -163247 234328 281865 -31942 -223273 -626340 -605324 -236785
1260b36785K71057J57796o16180O3135J72512N14339J6030K38057k66748k99304
$$ -236785 34272 192068 -424112 -360977 -188465 325874 341904 579961 313213 13909
1250A3909j17065j53025M8024P5502K04721K76620m23790l74289J21137J36984
$$ 13909 -103156 -256181 -208157 -132655 72066 348686 -75104 -449393 -328256 -191272
1240a91272N53988K14819k97099l98294j01456J54466N6741K18980j55972K31329
$$ -191272 362716 577535 280436 -117858 -219314 -64848 -8107 210873 54901 286230
1230B86230o5261l18952l48658K11924l41217N03382k20971j00395j72458J21892
$$ 286230 220969 -97983 -446641 -234717 -575934 -72552 -293523 -393918 -566376 -444484
1220d44484J55041J93034p5764j8435N6718j29507L29253m91959P6576N4771K14010
$$ -444484 -289443 -96409 -172173 -190608 -133890 -263397 65856 -426103 -349527 -294756 -80746
1209h0746q2231P574n50378N79306J58941K84381p38200j49500j17129M76734
$$ -80746 -162977 -155403 -705781 -126475 32466 316847 -421353 -570853 -687982 -211248
1199b11248K16225M2798l98782N5663J66945M66189M0525o49065k55503L47028
$$ -211248 4977 47775 -351007 -295344 -128399 337790 378315 -270750 -526253 -179225
1189a79225Q87396n5215o20640q19151K94434M61329M39680l50723o92035l9809
$$ -179225 708171 652956 32316 -786835 -492401 -31072 408608 57885 -634150 -673959
1179f73959J76810P19520j16699P7846m37701R4614J01442M67357l50593m1476
$$ -673959 -497149 222371 105672 183518 -254183 -159569 -58127 409230 58637 17161
1169A7161j49853J67510j92355j00935m3341J18153N94177J83901l08106m49813
$$ 17161 -132692 34818 -157537 -258472 -301813 -183660 410517 594418 286312 -163501
1159a63501j18466J86439J24704r8581J63424l60357J61201J35107J40881N6624
$$ -163501 -281967 -95528 29176 -69405 94019 -266338 -105137 29970 170851 227475
1149B27475m6938m77753M09179k19855l62742k29237N96984K74161J86837n09514
$$ 227475 180537 -297216 111963 -107892 -470634 -699871 -102887 171274 358111 -151403
1139a51403l51030K71671L32731L16049o1136J10541n73419m7872j28489L80990
$$ -151403 -502433 -230762 101969 418018 356882 467423 -105996 -153868 -282357 98633
1129I8633n7345j37396P633J70405j69288l7346k6795J30565L74901N2409l67740
$$ 98633 41288 -96108 -88475 81930 -87358 -124704 -151499 -20934 353967 406376 38636
1118C8636o24476J47061O4006N56051L53586l2956q22280P4095k95994R15643
$$ 38636 -585840 -438779 -374773 181278 534864 501908 -320372 -246277 -542271 373372
1108C73372K4665j34689q60663p90p0109Q68487N8726K36188m99941R520p0021
$$ 373372 398037 263348 -597315 -598105 -668214 200273 258999 495187 -4754 4766 -65255
1097f5255J06459l98424J01631M2331J79925Q8499k70096k99251k62235O73476
$$ -65255 41204 -357220 -255589 -213258 -33333 55166 -214930 -514181 -776416 -102940
1087a02940O03553Q805q40138m23135P7928L89357J012492J03203p00675m41727
$$ -102940 500613 509418 -330720 -753855 -675927 -286570 725922 829125 128450 -313277
1077c13277j48721K63865L10434J18319K13517J10008j35064j76758M9090N8288
$$ -313277 -461998 -198133 112301 230620 444137 554145 419081 242323 291413 349701
1067C49701o4055O2558k11024n919o17388l6472K15729N66847k17462o5917j79966
$$ 349701 285646 348204 137180 131261 -486127 -522599 -306870 259977 42515 -23402 -203368
1056b03368J49138k27087P86138k44006q4873p26096L60682l63904J59676K99729
$$ -203368 -54230 -281317 504821 260815 175942 -550154 -189472 -553376 -393700 -93971
1046i3971L59964j01244L57861o59503k59159J39199M68052L40084j13994p54901
$$ -93971 265993 164749 522610 -136893 -396052 -256853 211199 551283 437289 -317612
1036c17612k98181J08917O85296L00198J03512n08205J34412n36366M99642J06774
$$ -317612 -615793 -506876 178420 478618 582130 73925 208337 -328029 171613 278387
1026B78387J04788k42361R8197l10918P6439k95056M33777O8719J93879n7456
$$ 278387 383175 140814 239011 -71907 4532 -290524 143253 211972 405851 348395
1016C48395q29690N2487J2889O30770K06066L72492r07584k03498l84087O61198
$$ 348395 -481295 -428808 -415919 214851 420917 793409 -114175 -317673 -701760 -40562
1006d0562N64449K74308q66446J82592m62931L18466l4739J17506k67138L64212
$$ -40562 523887 798195 -68251 114341 -348590 -30124 -64863 52643 -214495 149717
996A49717K71776k50891m81604j21233L57473M40156m8961p30844l11367p8420
$$ 149717 421493 170602 -311002 -432235 -74762 365394 316433 -414411 -725778 -804198
986h04198O37972N71899m4975q52852j35523K37439M80417M3073R6577j99781
$$ -804198 -166226 405673 360698 -492154 -627677 -390238 90179 133252 229829 30048
976C0048k29927J38699K87223K1602l327K20286L5727J98819q53346N6936j67830
$$ 30048 -199879 -61180 226043 247645 244318 464604 500331 699150 -154196 -97260 -265090
965b65090K16158m4058J91691l07005J17742l30705L89906L0218N57362k99388
$$ -265090 -48932 -92990 98701 -208304 -90562 -421267 -31361 -1143 556219 256831
955B56831K7921m78611J87177k0384L27125R3621p6855q29178j69773J99103M04361
$$ 256831 284752 -193859 -6682 -27066 300059 393680 316825 -512353 -682126 -483023 -78662
944g8662K28373K94272m49978q7880k8208J78332K36476J9757r6700j10624k58335
$$ -78662 149711 443983 -5995 -93875 -122083 56249 292725 312482 215782 105158 -153177
933a53177n1793J69680J91623j13057q1172L66864K9938k36603j21848K50383
$$ -153177 -204970 -35290 156333 43276 -37896 328968 358906 122303 455 250838
923B50838j16335j75415j24933k48427j46014K38585M53548M48735p6581k06454
$$ 250838 134503 -40912 -165845 -414272 -560286 -321701 131847 580582 504001 297547
913B97547k90133K07551O5135R9304o48181K47665k19763P4979k22098Q60283
$$ 297547 7414 214965 280100 379404 -268777 -21112 -240875 -165896 -387994 472289
903D72289j28055m7973m12717L94307n41084N62750l67320J82671l92867m6193
$$ 472289 344234 296261 -116456 277851 -263233 299517 -67803 114868 -277999 -324192
893c24192j08852L03897j5372Q7788L7776o0370K33011j45927j29441r7903J80876
$$ -324192 -433044 -129147 -144519 -56731 -18955 -79325 153686 7759 -121682 -219585 -38709
882c8709l24164J31443K8434j679M7654K28205k0065J07851k50095K71170L4424
$$ -38709 -362873 -231430 -202996 -204675 -157021 71184 51119 158970 -91125 180045 214469
871B14469r5050N3050j29394p96j88415J96623n13360M31153k6187O16926l50913
$$ 214469 119419 172469 43075 42279 -146136 50487 -462873 -31720 -57907 559019 208106
860B08106l0852k15733L10088r7449O4052m12671K36728k74119J57184Q0355J20602
$$ 208106 177254 -38479 271609 174160 238212 -174459 62269 -211850 -54666 25689 146291
849A46291k93202R5264J53548K18906k55783l60460K83532j48206M6156J72787
$$ 146291 -146911 -51647 101901 320807 65024 -295436 -11904 -160110 -113954 58833
839E8833k9605j60687K95751j02252J50049k80994J55679k86765P4828j81492
$$ 58833 29228 -131459 164292 62040 212089 -68905 86774 -199991 -125163 -306655
829c06655K02859j55023M8690K07967Q2230j43631p1081m6388L62406j43902Q0554
$$ -306655 -103796 -258819 -210129 -2162 80068 -63563 -134644 -181032 181374 37472 118026
818A18026q537q1516l86311J83813j62383N34369k18579N2275m04990N35967j47575
$$ 118026 109489 27973 -358338 -174525 -336908 197461 -21118 31157 -373833 162134 14559
807A4559O45286o36663L11530n15494M51300o19592N08849n03298L45031l74874
$$ 14559 659845 23182 334712 -180782 270518 -349074 159775 -343523 1508 -373366
797c73366N00837j00541K38056j56354K35674L7188p3542l93738k44620J08016
$$ -373366 127471 26930 264986 108632 344306 381494 307952 -85786 -330406 -222390
787b22390J45143O8653J79116r6143l92231M25919K80230K71671o24939K97384
$$ -222390 -77247 -8594 170522 74379 -317852 108067 388297 659968 35029 332413
777C32413k73876R3047p57683L25836m84612O39150K41544K65373o90102J57450
$$ 332413 58537 151584 -606099 -280263 -764875 -125725 115819 381192 -308910 -151460
767a51460N1596O70394r6811k19554p29813j38400K01584O71036N7037r9441k06111
$$ -151460 -99864 570530 473719 254165 -475648 -614048 -412464 258572 315609 216168 10057
756A0057J0538J91397K33925k18575o3523l15842K26852K08838k70152m84565
$$ 10057 20595 211992 445917 227342 163819 -152023 74829 283667 13515 -471050
746d71050J52583N28375L42392k51874l30066k14539j3386L92407J92323n78448
$$ -471050 -318467 209908 552300 300426 -29640 -244179 -257565 134842 327165 -251283
736b51283m37477K71555L40671N3235J12956n37079K7781j74080M30569M32888
$$ -251283 -688760 -417205 -76534 -23299 89657 -447422 -419641 -593721 -163152 269736
726B69736J77318n9805k04858o6460R121j99978j39298K37023K06260K68024m26839
$$ 269736 447054 387249 182391 115931 125052 -74926 -214224 22799 229059 497083 70244
715G0244j41936k0809L14567K45760K68231k30025k97620m70235M6126J08433
$$ 70244 -71692 -92501 222066 467826 736057 506032 208412 -261823 -215697 -107264
705a07264L09379J99083j5644j00068j92100j60964Q5128L34145j03462q5674
$$ -107264 202115 401198 385554 285486 93386 -67578 17550 351695 248233 162559
695A62559l18530M9525j04772J91261K79669K27206k20261j09244r1667K35565
$$ 162559 -155971 -106446 -211218 -19957 259712 486918 266657 157413 65746 301311
685C01311M838K18509k06221l67472p6793K65948R8194L07388R8859k80870K7830
$$ 301311 306149 524658 318437 -49035 -125828 140120 238314 545702 644561 363691 391521
674C91521k3446k56609j57066K09125R4828j828N6250k77633q9932J76891M09226
$$ 391521 368075 111466 -45600 163525 258353 256525 312775 35142 -54790 122101 531327
663E31327M36521m43498o64942k28180M44979L10097M85939n98884l60436m30352
$$ 531327 967848 524350 -140592 -368772 76207 386304 872243 273359 -87077 -517429
653e17429O26804O6973N06589m53256M8844j65898L73879k41406K57513m38086
$$ -517429 109375 176348 682937 229681 278525 112627 486506 245100 502613 64527
643F4527K43323k99559l6327n54557J30696K62914Q06321j47966K35666o31067
$$ 64527 307850 8291 -28036 -582593 -451897 -188983 617338 469372 705038 73971
633G3971n46848P5547M85982M07778k75997j32558l55490K46797J0943O19423
$$ 73971 -472877 -397330 88652 496430 220433 87875 -267615 -20818 -9875 609548
623F09548j36244K99483m17980k56720o95441N45979k8235K13200n11196P1673
$$ 609548 473304 772787 354807 98087 -597354 -51375 -79610 133590 -377606 -305933
613c05933k22081P14158K77534K32821k52793K2979l72626p1478l26665M78003
$$ -305933 -528014 186144 463678 696499 443706 466685 94059 22581 -304084 173919
603A73919r0678L26425j91604q4932l36623L7926L73913N43839j95322o30516
$$ 173919 83241 409666 218062 133130 -203493 -165567 208346 752185 556863 -73653
593g3653m17064p3730N77841M34868J04296k32028k04352j26350J14760k00873
$$ -73653 -490717 -564447 13394 448262 552558 320530 116178 -10172 104588 -96285
583i6285O09460O5547N8086o36754m31145j4605O24072J88806J78292o64250l43896
$$ -96285 513175 578722 636808 54 -431091 -445696 178376 367182 545474 -118776 -462672
572d62672P7902P15083R336R9178j67554k30105l36922M28456k31670J6917J72123
$$ -462672 -384770 330313 339649 438827 271273 41168 -295754 132702 -98968 -82051 90072
561I0072K86860L9629j31629l46018m11668P66013N23336J96538j083272o05874
$$ 90072 376932 416561 284932 -61086 -472754 293259 816595 1013133 -70139 -676013
551f76013l58813Q79202O03472K84880o70617l10545J2747M96085L62102o2200
$$ -676013 -1034826 -155624 447848 732728 62111 -248434 -235687 260398 622500 560300
541E60300k36785l07206K9320l5658j09751j35809L35018j9943M66558p6742j49667
$$ 560300 323515 16309 45629 9971 -99780 -235589 99429 79486 546044 469302 319635
530C19635k21554J91346L59003o9919m58155o76646J38633P58156M61459J15413
$$ 319635 98081 289427 648430 578511 120356 -556290 -417657 340499 801958 917371
520I17371j91692m39216r1893M7869K75215k18876l4846p06120O6424K7185O0303
$$ 917371 725679 286463 194570 242439 517654 298778 263932 -442188 -375764 -348579 -288276
509b88276K28822N41115N36298n52721j38959l97242M23747K68756K98947q95553
$$ -288276 -59454 481661 1017959 465238 326279 -70963 352784 621540 920487 24934
499B4934j43196l15524J61253L0920M03325j5503K48570J20239k83061l98982
$$ 24934 -118262 -433786 -272533 -241613 161712 146209 394779 515018 231957 -167025
489a67025k46866L20563L4104L48520k52602l81414l97621N49233P91007M46044
$$ -167025 -413891 -93328 -59224 289296 36694 -344720 -742341 -193108 597899 1043943
479A043943n98147o89902l00491M74859N74868k0075p92416l39156j43378O57345
$$ 1043943 445796 -244106 -544597 -69738 505130 485055 -307361 -646517 -789895 -132550
469a32550L59756L4333q1093K06484P4241J34758m38141k74951k42327K97953
$$ -132550 227206 261539 180446 386930 461171 595929 157788 -117163 -359490 -61537
459f1537L95930J57477k96910M153j24584L59885J48881r6490m11065j19517n6052
$$ -61537 334393 491870 194960 199113 74529 434414 583295 486805 75740 -43777 -99829
448i9829Q5179L54476k2675l24692o08628K99989M02077P05062m26399J40170
$$ -99829 -14650 339826 317151 -7541 -616169 -316180 85897 790959 364560 504730
438E04730n14388K16427K23926K97689n17484l63384m65113O97562J05453J37046
$$ 504730 -9658 206769 430695 728384 210900 -152484 -617597 79965 185418 322464
428C22464k20872j05173J73788O16897k43188p02980o02074K61637M75138K50432
$$ 322464 101592 -3581 170207 787104 543916 -159064 -761138 -499501 -24363 226069
418B26069j1136o45991l519L88713M01630J68584k65672n00551J58259N73124
$$ 226069 214933 -431058 -434577 -45864 355766 524350 258678 -241873 -83614 489510
408D89510j53779m87024r6946P3385N23976K08806O1047j86178j01833Q6306N13630
$$ 489510 335731 -151293 -248239 -174854 349122 557928 618975 432797 330964 417270 930900
397I30900k64571Q107n03718J26257j50971M20207l52963J60646l08905J40173
$$ 930900 666329 674436 170718 296975 146004 566211 213248 373894 64989 205162
387B05162l09625K29206Q017J13766m9830R0148j14672j44818j25388M28877J41074
$$ 205162 -104463 124743 132760 246526 196696 286844 172172 27354 -98034 330843 471917
376D71917L17665j08102k81108p6674J11789o7880j70308j20242J45171J10987
$$ 471917 789582 681480 400372 323698 435487 367607 197299 77057 222228 333215
366C33215O704l61857J11052J96217L48437l3908n8379m74585J84045l0445k5902
$$ 333215 339919 -21938 89114 285331 633768 599860 541481 66896 250941 220496 194594
355A94594j02135q5281n8228J68887m7017j2339N55743J3969J32654m63773J44880
$$ 194594 92459 7178 -51050 117837 70820 58481 614224 628193 760847 297074 441954
344D41954n93739L54780j69080M91982m45504K97756m01836K26867J4660Q78779
$$ 441954 -151785 202995 33915 525897 80393 378149 -23687 203180 217840 1096619
334A096619o66232J27213n56798K15074m8866N76378k89517J00899j39499j13505
$$ 1096619 430387 557600 802 215876 167010 743388 453871 554770 415271 301766
324C01766r8955L09987K02015K8921k28744k21366l31321m2903L18475K74926
$$ 301766 202811 512798 714813 743734 514990 293624 -37697 -80600 237875 512801
314E12801J84498k78976j55825k40646O3026J68596M48729k24323j69735o0663
$$ 512801 697299 418323 262498 21852 84878 253474 702203 477880 308145 247482
304B47482Q6724n36649L1496J92145L32152k21654k18991j99941L40204J54687
$$ 247482 334206 -202443 -170947 21198 353350 131696 -87295 -287236 52968 207655
294B07655L56255J0925r2559m02390k00440P6042M93616j20541J95104l79015
$$ 207655 563910 574835 482276 79886 -120554 -44512 449104 328563 523667 144652
284A44652Q5820N8264L15417j93056J30440j01748r2347j47222j11929N3224L52711
$$ 144652 230472 288736 604153 411097 541537 439789 347442 200220 88291 141515 494226
273D94226q8094k943m77301o1878J47834N18196M08100j90547r1563n10558j91349
$$ 494226 406132 403189 -74112 -135990 11844 530040 938140 747593 656030 145472 -45877
262d5877K46612M30190j85113j0197L1528j01665m26106K76072J08938J30825
$$ -45877 200735 630925 445812 435615 467143 365478 -60628 215444 324382 455207
252D55207k58882j08019R4984R3420J58084o6520J29806m0688q5486r1575L53653
$$ 455207 196325 88306 183290 276710 434794 368274 498080 457392 371906 280331 633984
241F33984l0694O3167l97620k4996k59621J14834j17497K98343l4738J95416K09860
$$ 633984 603290 666457 268837 243841 -15780 99054 -18443 279900 245162 440578 650438
230F50438r2247o30375r556M04338P5478j42325m40315j71606L58870L42892M3089
$$ 650438 558191 -72184 -81740 322598 398076 255751 -184564 -356170 2700 345592 388681
219C88681O7282l26315m5029K0618K64368Q5518j0024j0503J04232k20263J21512
$$ 388681 455963 129648 84619 105237 369605 455123 445099 434596 538828 318565 440077
208D40077j83157j63557m4952K75034M3455j78592j43902J74077O1762K63540
$$ 440077 256920 93363 48411 323445 366900 188308 44406 218483 280245 543785
198E43785L5265j31127l75131P6682K71244K44779J57758l11227l52609J8804
$$ 543785 579050 447923 72792 149474 420718 665497 823255 512028 159419 178223
188A78223j46159K72357K33154n0825j81036P2478J26545K15711m72827J90540
$$ 178223 32064 304421 537575 486750 305714 378192 504737 720448 247621 438161
178D38161j11352Q9973l58449p8938m24153L79578L56255R0369j00893j77381
$$ 438161 326809 416782 58333 -20605 -444758 -65180 291075 381444 280551 103170
168A03170J15172J27903l9459L3451j73035m5732K11701j04304j735L5106J61048
$$ 103170 218342 346245 306786 340237 167202 121470 333171 228867 227132 262238 423286
157D23286p6760m1250j61115K09861K05112J09512N3992k32184l58217J73093
$$ 423286 346526 305276 144161 354022 559134 668646 722638 490454 132237 305330
147C05330p6923K18511j40743n25769j18837M13331M51170J42513k30697p7379
$$ 305330 228407 446918 306175 -219594 -338431 74900 526070 668583 437886 360507
137C60507j32520J08772K15360J19834m83221j37291J82784K46735k0613l57345
$$ 360507 227987 336759 552119 671953 188732 51441 234225 480960 460347 103002
127A03002k06948L16961N37120K85662m92597m97949k84645M48170K55338q4851
$$ 103002 -103946 213015 750135 1035797 543200 45251 -239394 208776 464114 379263
117C79263o36256l1389N5356O70406K76773J26799q03436M152K46144N43705l80149
$$ 379263 -256993 -288382 -233026 437380 714153 840952 37516 41668 287812 831517 451368
106D51368l94001n72424L85061K33303L25136k26474L8578N6987K36892J79982
$$ 451368 57367 -515057 -129996 103307 428443 201969 240547 297534 534426 714408
96G14408k39236l99598J02480L16492P5617K05346p43616j33120j01248N58685
$$ 714408 475172 75574 178054 494546 570163 775509 31893 -101227 -202475 356210
86C56210J05323K44619n00967j13296j39973N39835j98006K72719j89733N5584
$$ 356210 461533 706152 205185 91889 -48084 491751 293745 566464 376731 432315
76D32315k43908J655J6643M85742k16859j53873j39134J64656K124L52882j4771
$$ 432315 188407 190062 206705 692447 475588 321715 182581 347237 349361 702243 687472
65F87472l53137l46856J72979L0104J59326l67197J68046J57098L54139K285n7960
$$ 687472 334335 -12521 160458 190562 349888 -17309 150737 307835 661974 664259 606299
54F06299m96571J07241L22902J27119k23192l31967l44489r071N15078L58055
$$ 606299 109728 216969 539871 666990 443798 111831 -232658 -241729 273349 631404
44F31404j59276m33960M9920J83452M93021K7671j84071p41778J25910P6155K21768
$$ 631404 472128 38168 88088 271540 764561 792232 608161 -133617 -7707 68448 290216
33B90216k47310L1703l86377L80371M20188L07059j33631l58929J6321K50666
$$ 290216 42906 74609 -311768 68603 488791 795850 662219 303290 319611 570277
23E70277m7152m02823l21668r7480M47564N85916j17925m76867l58701K85491
$$ 570277 523125 120302 -201366 -298846 148718 734634 616709 139842 -218859 66632
13F6632N42562L21349k46284l76156k46568L40208r1411J67645m45750J28757
$$ 66632 609194 930543 684259 308103 61535 401743 310332 477977 32227 160984
3A60984o8769K20509K74219
$$ 160984 92215 312724 586943
0E86943
$$ 586943
$$ Imaginary data points
##PAGE= N=2
##DATA TABLE= (X++(I..I)), XYDATA
16383c297339J37844L81048l76159R6286k63468M01828J961L14715j24609J19822
$$ -3297339 -3159495 -2778447 -3154606 -3058320 -3321788 -2919960 -2917999 -2603284 -2727893 -2608071
16373b608071l57240L14720K12450Q6041j84559l32231M3453J65532L12740K0960
$$ -2608071 -2965311 -2650591 -2438141 -2352100 -2536659 -2868890 -2825437 -2659905 -2347165 -2326205
16363b326205K84335k29147J08275p4333L42948p6097J11006k3204M855k18521
$$ -2326205 -2041870 -2271017 -2162742 -2237075 -1894127 -1970224 -1859218 -1882422 -1877567 -2096088
16353b096088L75021j5587M2688P3313j36678J76471r4087J27110O178J64270
$$ -2096088 -1721067 -1736654 -1693966 -1620653 -1757331 -1580860 -1674947 -1547837 -1541659 -1377389
16343a377389J76938L62987j46143j57413l68067K82079K97326J71259j69162
$$ -1377389 -1200451 -837464 -983607 -1141020 -1509087 -1227008 -929682 -758423 -927585
16334i27585J2284k79857K67387J93294l4906k8393K15833l23542M8072K32388
$$ -927585 -915301 -1195158 -927771 -734477 -769383 -797776 -581943 -905485 -857413 -625025
16324f25025k2642n5560J00771M7569L75608r5363q4937j56398L45141o3642K10523
$$ -625025 -647667 -703227 -602456 -554887 -179279 -274642 -359579 -515977 -170836 -234478 -23955
16313b3955j59782j31565k33701K99671J22319J43429l09086O2282R5068L90969
$$ -23955 -183737 -315302 -549003 -249332 -127013 16416 -292670 -230388 -135320 255649
16303B55649l6392O7644j34273k23020M36738l0754p9748j35421K73926R3665
$$ 255649 219257 286901 152628 -70392 366346 335592 255844 120423 394349 488014
16293D88014L77669m74712J10198j62775N43990M2065J22364l00001J31201k40265
$$ 488014 865683 390971 501169 338394 882384 924449 1046813 746812 878013 637748
16283F37748N53109j25735j4585n07557R2931J61494L54418N1918j6834L4054
$$ 637748 1190857 1065122 1050537 542980 635911 797405 1151823 1203741 1186907 1220961
16273A220961j79342J50186K20720j1058J09991o7809J39198L36307n01364k52417
$$ 1220961 1041619 1191805 1412525 1401467 1511458 1443649 1582847 1919154 1417790 1165373
16263A165373N3365J60859L27705Q3062k36950o61382L36884L06017L89964k11067
$$ 1165373 1218738 1379597 1707302 1790364 1553414 892032 1228916 1534933 1924897 1713830
16253A713830m6862l00401J52247J27368N48891J8530n1542k40523j3748K00992
$$ 1713830 1666968 1366567 1518814 1646182 2195073 2213603 2162061 1921538 1907790 2108782
16243B108782M5684J73509k5353j02479k4157K11196r3189J00964l10818N86840
$$ 2108782 2154466 2327975 2302622 2200143 2175986 2387182 2293993 2394957 2084139 2670979
16233B670979k30976L69064k27331j45144o79284M52398J58456O92593n17496
$$ 2670979 2440003 2809067 2581736 2436592 1757308 2209706 2368162 3060755 2543259
16224B543259o38217l52411Q23015L37702M14221m57317m97900L00776N60812
$$ 2543259 1905042 1552631 2375646 2713348 3127569 2670252 2172352 2473128 3033940
16215C033940P6414n04390m44542k9554L00721N50689k68295j40995j20506O18344
$$ 3033940 3110354 2605964 2161422 2131868 2432589 2983278 2714983 2573988 2453482 3071826
16205C071826N80317m0659o67294m97194n1425P31642M54340l18602l95016m53399
$$ 3071826 3652143 3611484 2944190 2446996 2395571 3127213 3581553 3262951 2867935 2414536
16195B414536R5392M95331O00860n82080p7607j64821Q41909k53000J04839r50860
$$ 2414536 2509928 3005259 3606119 3024039 2946432 2781611 3623520 3370520 3475359 2524499
16185B524499K71778m9543O44199j50713K83380o51042p2338J58699L86562J29472
$$ 2524499 2796277 2746734 3390933 3240220 3523600 2872558 2800220 2958919 3345481 3474953
16175C474953j76712l08275J45857J19964j40089L45235n1245k62927j73253N05036
$$ 3474953 3298241 2989966 3135823 3255787 3115698 3460933 3409688 3146761 2973508 3478544
16165C478544K17900K94329m76497l04194l42582K81587J84872J05688l18589
$$ 3478544 3696444 3990773 3514276 3210082 2867500 3149087 3333959 3439647 3121058
16156C121058k65316M71761L44004J44548m08146k15334j9593N57396R1253J572
$$ 3121058 2855742 3327503 3671507 3816055 3407909 3192575 3172982 3730378 3821631 3823203
16146C823203m20038k78353J26808M09072K08680l62114J6598j12243J89347J19307
$$ 3823203 3403165 3124812 3251620 3660692 3869372 3507258 3523856 3411613 3600960 3720267
16136C720267K99396m81577K03217k92011K53035m68345p3282L4074N43188P1502
$$ 3720267 4019663 3538086 3741303 3449292 3702327 3233982 3160700 3194774 3737962 3809464
16126C809464q7573k44660l6807L88076N85912j26411p28217l00484R7617M0028
$$ 3809464 3721891 3477231 3440424 3828500 4414412 4288001 3559784 3259300 3356917 3396945
16116C396945K07347p3614k5385K15158M01445j61818p985k12730L60605L6204
$$ 3396945 3604292 3530678 3505293 3720451 4121896 3960078 3952093 3739363 4099968 4136172
16106D136172n3933q30131q3549K49520R04005J68178k34062q66710p8427K61334
$$ 4136172 4082239 3252108 3168559 3418079 4322084 4490262 4256200 3389490 3311063 3572397
16096C572397M83593J48700j94119j68994l10773M14229l72067J22172k61604
$$ 3572397 4055990 4204690 4010571 3841577 3530804 3945033 3572966 3695138 3433534
16087C433534O00609l92172M46382n27906J23136j80459O68343j25230J1250p12824
$$ 3433534 4034143 3641971 4088353 3560447 3683583 3503124 4171467 4046237 4057487 3344663
16077C344663j10254k21432Q15762O2814J46612l36473k06494l1134K59561M01354
$$ 3344663 3234409 3012977 3828739 3891553 4038165 3701692 3495198 3464064 3723625 4124979
16067D124979k88950j48771r2797j36416j97847L76463L56228R7283n4267J88769
$$ 4124979 3836029 3687258 3594461 3458045 3260198 3636661 3992889 4090172 4035905 4224674
16057D224674j83121l58434Q4638L43134N69592k23215o68629l40122M35089O9268
$$ 4224674 4041553 3683119 3767757 4110891 4680483 4457268 3788639 3448517 3883606 3952874
16047C952874O05323l15925l24992k06223L72506j31132L09660r8112j29189L4363
$$ 3952874 4558197 4242272 3917280 3711057 4083563 3952431 4262091 4163979 4034790 4069153
16037D069153k40643J88241m62922K26971q0926N39914m26626K6372p07076N90653
$$ 4069153 3828510 4016751 3553829 3780800 3699874 4239788 3813162 3839534 3132458 3723111
16027C723111J13146R49785o82827o6653p51791L63043L6886N24848j90713j32399
$$ 3723111 3836257 4786042 4103215 4036562 3284771 3647814 3684700 4209548 4018835 3886436
16017C886436l54201O82125J83612m95060M6787J43060J40359m7962q6598q86407
$$ 3886436 3532235 4214360 4397972 3902912 3949699 4092759 4233118 4185156 4098558 3212151
16007C212151K1842M24837N93128j60400l47280n78093N38795L54294M26270k48222
$$ 3212151 3233993 3658830 4251958 4091558 3744278 3166185 3704980 4059274 4485544 4237322
15997D237322k91563k96430j33182L48572o7037Q9429r524K95055l27902j49961
$$ 4237322 3945759 3649329 3516147 3864719 3797682 3887111 3877587 4172642 3844740 3694779
15987C694779q0992L40877J81171M5403n3831l29408j91520k72484K27365M20693
$$ 3694779 3613787 3954664 4135835 4181238 4127407 3797999 3606479 3333995 3561360 3982053
15977C982053J85234k76496J60539k95018J91341j74336L94420P8815J30836n37788
$$ 3982053 4167287 3890791 4051330 3756312 3947653 3773317 4167737 4246552 4377388 3839600
15967C839600k44972m5194M22841M67568j93624m9215n30307j59999M64833L41177
$$ 3839600 3594628 3549434 3972275 4439843 4246219 4197004 3666697 3506698 3971531 4312708
15957D312708l02159l38414j42162J45734L4867M5956J11613L28639J77962k23787
$$ 4312708 4010549 3672135 3529973 3675707 3710574 3756530 3868143 4196782 4374744 4150957
15947D150957n5760n37144L8029l7018O94636j91075L35913o86152k4615J26789
$$ 4150957 4095197 3558053 3596082 3559064 4253700 4062625 4398538 3712386 3687771 3814560
15937C814560M36563k27801r2277j90726j02002m5960M88863J63359l25603j41933
$$ 3814560 4251123 4023322 3931045 3740319 3638317 3592357 4081220 4244579 3918976 3777043
15927C777043r7804K13076J7963J39141j06200j56877l03284K53489Q9921K17712
$$ 3777043 3679239 3892315 3910278 4049419 3943219 3786342 3483058 3736547 3826468 4044180
15917D044180k35106J09739l23083K70324k53293K58987O1378M06000O0128K10577
$$ 4044180 3809074 3918813 3595730 3866054 3612761 3871748 3933126 4339126 4399254 4609831
15907D609831n40196l37467m12721J58677N73177m8586m26786m5333J31416K64495
$$ 4609831 4069635 3732168 3319447 3478124 4051301 4002715 3575929 3530596 3662012 3926507
15897C926507L60645k96157j60692p7541J59540j3581N7483j05444j52420P5896
$$ 3926507 4287152 3990995 3830303 3752762 3912302 3898721 3956204 3850760 3698340 3774236
15887C774236J63874k99022k519J35575L21639k42251P510k58672j79569L24168
$$ 3774236 3938110 3639088 3636569 3772144 4093783 3851532 3859042 3600370 3420801 3744969
15877C744969Q1836J68525m10879K39435J39737L15554l73276M2479J72763M52051
$$ 3744969 3826805 3995330 3584451 3823886 3963623 4279177 3905901 3948380 4121143 4573194
15867D573194q4106R9163o60681k75221Q8908M98394R0779l66723m72642o8395
$$ 4573194 4489088 4588251 3927570 3652349 3741257 4239651 4330430 3963707 3491065 3422670
15857C422670L44230N49305o1246k73375k65770J36890P05089l20898k03352o30438
$$ 3422670 3766900 4316205 4254959 3981584 3715814 3852704 4557793 4236895 4033543 3403105
15847C403105K35122M84070L01017l74129l47440m28543P65383K02072j53083
$$ 3403105 3638227 4122297 4423314 4049185 3701745 3273202 4038585 4240657 4087574
15838D087574o09819k04920K65311R40497J66343l19766n58601j46185N4215L66243
$$ 4087574 3477755 3272835 3538146 4478643 4644986 4325220 3766619 3620434 3674649 4040892
15828D040892K5604l35948m5755N44637k9851J71047m79946k18354L01954J22553
$$ 4040892 4066496 3730548 3684793 4229430 4199579 4370626 3890680 3672326 3974280 4096833
15818D096833L40495k47208m25817k06917N04264L91269O5770p62311m08115L4270
$$ 4096833 4437328 4190120 3764303 3557386 4061650 4452919 4518689 3756378 3348263 3382533
15808C382533N49649R7137P5530k24532K52917K574J9564m09305J2430J14305
$$ 3382533 3932182 4029319 4104849 3880317 4133234 4135808 4155372 3746067 3758497 3872802
15798C872802K89890L8491m52630l32251L31921J61902J75628k35831j97505O5590
$$ 3872802 4162692 4201183 3748553 3416302 3748223 3910125 4085753 3849922 3652417 3718007
15788C718007q1733J57357j28468l03769J44039M32680K55964j89716j76910j03495
$$ 3718007 3636274 3793631 3665163 3361394 3505433 3938113 4194077 4004361 3827451 3723956
15778C723956M25814K92724n21022j4269j65681M30924L21208P1199m48617l78964
$$ 3723956 4149770 4442494 3921472 3907203 3741522 4172446 4493654 4564853 4116236 3737272
15768C737272j10823M50474J05281J5127m55578K2857J9707O10106l58874k95222
$$ 3737272 3626449 4076923 4182204 4197331 3741753 3764610 3784317 4394423 4035549 3740327
$$ [...]
##END NTUPLES=NMR SPECTRUM
##END=
