##TITLE=1H_DE-80H_X3
 200.13MHz, d2o
 8 sc
 
 19ns.26.2.2025
##JCAMPDX= 6.0         $$ Bruker NMR JCAMP-DX V2.0
##DATA TYPE= NMR SPECTRUM
##DATA CLASS= NTUPLES
##ORIGIN= UXNMR, Bruker Analytische Messtechnik GmbH
##OWNER= pz
$$ XWIN-NMR		Version 3.5
$$ Mon Apr 20 10:43:26 2026 Russian Standard Time (UT+4h)  Yarkov@DPX200
##.OBSERVE FREQUENCY= 200.1313
##.OBSERVE NUCLEUS= ^1H
##.ACQUISITION MODE= SIMULTANEOUS
##.ACQUISITION SCHEME= undefined
##.AVERAGES= 8
##.DIGITISER RES= 18
##SPECTROMETER/DATA SYSTEM= spect
##.PULSE SEQUENCE= zg30
##.SOLVENT NAME= DMSO
##.SHIFT REFERENCE= (INTERNAL, DMSO, 0, 15.4957)
##AUDIT TRAIL= $$ (NUMBER, WHEN, WHO, WHERE, WHAT)
$$ ##TITLE= Audit trail, XWIN-NMR		Version 3.5
$$ ##JCAMPDX= 5.01
$$ ##ORIGIN= Bruker BioSpin GmbH
$$ ##OWNER= Yarkov
$$ C:/Bruker/XWIN-NMR/data/yarkov2/nmr/H-C/1/pdata/1/auditp.txt
$$ ##AUDIT TRAIL=  $$ (NUMBER, WHEN, WHO, WHERE, WHAT)
(   1,<2026-04-20 10:42:07.95 +0400>,<Yarkov>,<DPX200>,
      <created by zg, POWCHK disabled, PULCHK disabled
       configuration hash MD5:
       00 E9 B6 7A A2 85 ED C7 34 08 36 98 17 FE 4E 26
       data hash MD5: 16K
       43 4D 60 60 49 A7 31 48 ED 93 FF 4C 98 11 E1 3D>)
(   2,<2026-04-20 10:42:17.29 +0400>,<Yarkov>,<DPX200>,
      <Start of raw data processing
       efp BC_mod = 2 LB = 0.25 FT_mod = 6 PKNL = 1 PHC0 = -5302.316 PHC1 = 11.42193 SI = 16K 
       data hash MD5: 16K
       E1 80 CF 5D 66 12 5B E8 B2 67 E9 12 5D 3F C5 E3>)
$$ ##END=
$$ 
$$ hash MD5
$$ 31 09 EC C3 18 2A A0 A0 86 AF 25 CB 9F 51 8E 9D
##$RELAX= 
##$RELAX= 
##$RELAX= 
##$RELAX= 
##$RELAX= 
##$RELAX= 
$$ Bruker specific parameters
$$ --------------------------
##$DU= <C:/Bruker/XWIN-NMR>
##$EXPNO= 1
##$NAME= <H-C>
##$PROCNO= 1
##$TYPE= <nmr>
##$USER= <yarkov2>
##$AMP= (0..31)
100 100 100 100 100 100 100 100 100 100 100 100 100 100 100 100 100 100 
100 100 100 100 100 100 100 100 100 100 100 100 100 100 
##$AQSEQ= 0
##$AQ_mod= 1
##$AUNM= <au_zg>
##$AUTOPOS= <>
##$BF1= 200.13
##$BF2= 200.13
##$BF3= 200.13
##$BF4= 200.13
##$BF5= 200.13
##$BF6= 200.13
##$BF7= 200.13
##$BF8= 200.13
##$BYTORDA= 1
##$CFDGTYP= 0
##$CFRGTYP= 5
##$CHEMSTR= <none>
##$CNST= (0..31)
1 1 145 1 1 1 1 1 1 1 1 1 1 1 1 1 1 1 1 1 1 1 1 1 1 1 1 1 1 1 1 1 
##$CPDPRG= <>
##$CPDPRG1= <>
##$CPDPRG2= <>
##$CPDPRG3= <>
##$CPDPRG4= <mlev>
##$CPDPRG5= <mlev>
##$CPDPRG6= <mlev>
##$CPDPRG7= <mlev>
##$CPDPRG8= <mlev>
##$CPDPRGB= <>
##$CPDPRGT= <>
##$D= (0..31)
0 0.7 0 0 0 0 0 0 0 0 0 0.03 0 0 0 0 0 0 0 0 0 0 0 0 0 0 0 0 0 0 0 0 
##$DATE= 1776667327
##$DBL= (0..7)
120 120 120 120 120 120 120 120 
##$DBP= (0..7)
150 150 150 150 150 150 150 150 
##$DBP07= 0
##$DBPNAM0= <>
##$DBPNAM1= <>
##$DBPNAM2= <>
##$DBPNAM3= <>
##$DBPNAM4= <>
##$DBPNAM5= <>
##$DBPNAM6= <>
##$DBPNAM7= <>
##$DBPOAL= (0..7)
0.5 0.5 0.5 0.5 0.5 0.5 0.5 0.5 
##$DBPOFFS= (0..7)
0 0 0 0 0 0 0 0 
##$DE= 6
##$DECBNUC= <off>
##$DECIM= 32
##$DECNUC= <off>
##$DECSTAT= 4
##$DIGMOD= 1
##$DIGTYP= 9
##$DL= (0..7)
0 120 120 120 120 120 120 120 
##$DP= (0..7)
$$ [...]
##$SUBNAM2= <"">
##$SUBNAM3= <"">
##$SUBNAM4= <"">
##$SUBNAM5= <"">
##$SUBNAM6= <"">
##$SUBNAM7= <"">
##$SUBNAM8= <"">
##$SUBNAM9= <"">
##$SW= 18.0517328524113
##$SWIBOX= (0..15)
0 0 2 0 0 0 0 0 0 0 0 0 0 0 0 0 
##$SW_h= 3612.71676300578
##$TD= 16384
##$TD0= 1
##$TE= 0
##$TE2= 300
##$TE3= 300
##$TEG= 300
##$TL= (0..7)
0 120 120 120 120 120 120 120 
##$TP= (0..7)
150 150 150 150 150 150 150 150 
##$TP07= 0
##$TPNAME0= <>
##$TPNAME1= <>
##$TPNAME2= <>
##$TPNAME3= <>
##$TPNAME4= <>
##$TPNAME5= <>
##$TPNAME6= <>
##$TPNAME7= <>
##$TPOAL= (0..7)
0.5 0.5 0.5 0.5 0.5 0.5 0.5 0.5 
##$TPOFFS= (0..7)
0 0 0 0 0 0 0 0 
##$TUNHIN= 0
##$TUNHOUT= 0
##$TUNXOUT= 0
##$USERA1= <user>
##$USERA2= <user>
##$USERA3= <user>
##$USERA4= <user>
##$USERA5= <user>
##$V9= 5
##$VALIST= <valist>
##$VCLIST= <CCCCCCCCCCCCCCC>
##$VD= 0
##$VDLIST= <DDDDDDDDDDDDDDD>
##$VPLIST= <PPPPPPPPPPPPPPP>
##$VTLIST= <TTTTTTTTTTTTTTT>
##$WBST= 1024
##$WBSW= 4
##$XGAIN= (0..3)
0 0 0 0 
##$XL= 0
##$YL= 0
##$YMAX_a= 129774
##$YMIN_a= -115214
##$ZGOPTNS= <>
##$ZL1= 120
##$ZL2= 120
##$ZL3= 120
##$ZL4= 120
##$ABSF1= 0
##$ABSF2= 0
##$ABSG= 0
##$ABSL= 0
##$ALPHA= 0
##$AQORDER= 0
##$ASSFAC= 0
##$ASSFACI= 0
##$ASSFACX= 0
##$ASSWID= 0
##$AUNMP= <proc_1d>
##$AZFE= 0.1
##$AZFW= 0.1
##$BCFW= 0
##$BC_mod= 2
##$BYTORDP= 0
##$COROFFS= 0
##$CY= -3
##$DATMOD= 1
##$DC= 0
##$DFILT= <>
##$DTYPP= 0
##$F1P= 0
##$F2P= 0
##$FCOR= 1
##$FTSIZE= 16384
##$FT_mod= 6
##$GAMMA= 0
##$GB= 0
##$INTBC= 1
##$INTSCL= 3.241238e-09
##$ISEN= 128
##$LB= 0.25
##$LEV0= 0
##$LPBIN= 0
##$MAXI= 10000
##$MC2= 0
##$MEAN= 0
##$ME_mod= 0
##$MI= 1.114404
##$NCOEF= 0
##$NC_proc= -8
##$NLEV= 6
##$NOISF1= 3.799351
##$NOISF2= 2.8
##$NSP= 0
##$NTH_PI= 0
##$NZP= 0
##$OFFSET= 15.4957
##$PC= 1
##$PHC0= -5302.316
##$PHC1= 11.42193
##$PH_mod= 1
##$PKNL= yes
##$PPARMOD= 0
##$PSCAL= 0
##$PSIGN= 0
##$REVERSE= no
##$SF= 200.130005203497
##$SI= 16384
##$SIGF1= 3
##$SIGF2= 2
##$SINO= 0.751879
##$SIOLD= 32768
##$SREGLST= <19F.Aceton>
##$SSB= 0
##$STSI= 16384
##$STSR= 0
##$SW_p= 3612.71676300578
##$SYMM= 0
##$S_DEV= 0
##$TDeff= 16384
##$TDoff= 0
##$TI= <>
##$TILT= no
##$TM1= 0
##$TM2= 0
##$TOPLEV= 0
##$USERP1= <user>
##$USERP2= <user>
##$USERP3= <user>
##$USERP4= <user>
##$USERP5= <user>
##$WDW= 1
##$XDIM= 16384
##$YMAX_p= 418985475
##$YMIN_p= -2956802
$$ End of Bruker specific parameters
$$ ---------------------------------
##NTUPLES= NMR SPECTRUM
##VAR_NAME=  FREQUENCY,     SPECTRUM/REAL,   SPECTRUM/IMAG
##SYMBOL=    X,             R,               I
##VAR_TYPE=  INDEPENDENT,   DEPENDENT,       DEPENDENT
##VAR_FORM=  AFFN,          ASDF,            ASDF
##VAR_DIM=   16384,         16384,           16384
##UNITS=     HZ,            ARBITRARY UNITS, ARBITRARY UNITS
##FACTOR=    0.220516191357247, 1,           1
##FIRST=     3101.15449811802, 0,            0
##LAST=      -511.562264887762, 0,           0
##MIN=       -511.562264887762, -2956802,    0
##MAX=       3101.15449811802, 418985475,    0
$$ Real data points
##PAGE= N=1
##DATA TABLE= (X++(R..R)), XYDATA
$$ [...]
$$ plain form
8185 -594330 275609 913446 198373 548279 204630 -759819 -1010025 1085440 253807 -185896
8175 -185896 289827 1816911 792193 -1121224 -489157 -856034 34173 1318028 1626113
8166 1626113 1050766 208750 290478 285145 -1288470 -2097750 -919170 468005 87989 -87905
8156 -87905 1399130 1086927 -688077 -72286 -447949 -383084 485139 2126846 1115335
8147 1115335 -812346 -36148 252416 -76156 -270489 -190365 617957 240038 803261 1327313
8137 1327313 877125 212293 207706 153480 547515 166337 1228157 1180378 112800 430119
8127 430119 659689 778926 -634175 -337270 -417894 -1165427 -818794 -664845 -568661 389095
8117 389095 578395 1347880 584413 -214025 -346173 -373637 -419134 -927171 -617345 134847
$$ packed form
8185e94330Q69939O37837p15073L49906l43649r64449k50206K095465q31633m39703
8175a85896M75723J527084j024718j913417O32067l66877Q90207J283855L08085
8166A626113n75347q42016Q1728n333j573615q09280J178580J387175l80016j75894
8156h7905J487035l12203j775004O15791l75663O4865Q68223J641707j011511
8147A115335j927681P76198K88564l28572j94333Q0124Q08322l77919N63223N24052
8137A327313m50188o64832m587n4226L94035l81178J061820m7779j067578L17319
8127D30119K29570J19237j413101K96905q0624p47533L46633J53949R6184R57756
8117C89095J89300P69485p63467p98438j32148k7464m5497n08037L09826P52192
$$ plain form
8107 134847 -62651 839914 520445 -286246 -489682 -354138 -939035 -821178 -474393 -148036
8097 -148036 -884052 -837837 -592871 -617183 -190557 -379636 19335 -469360 206783 455158
8087 455158 -655232 -1029229 -1008244 -696870 301067 487750 1102214 641035 498219 752016
8077 752016 -298467 -562718 -154175 -105079 191830 36700 888233 110402 -95365 -418893
8067 -418893 -716700 -466026 -95910 -114606 -280412 -949021 -742152 -84563 -154099 -606847
8057 -606847 -478232 367025 196284 -119866 5757 -446380 -255030 -147597 51970 177926
8047 177926 159812 98194 150351 -646019 -1171018 -1514494 -138438 -61059 283809 756248
8037 756248 -145140 -475875 -497204 -381321 -1021130 -649243 396376 385116 -414092 -420268
$$ packed form
8107A34847j97498R02565l19469q06691k03436J35544n84897J17857L46785L26357
8097a48036p36016M6215K44966k4312M26626j89079L98971m88695O76143K48375
8087D55158j110390l73997K0985L11374R97937J86683O14464m61179j42816K53797
8077G52016j050483k64251M08543M9096K96909j55130Q51533p77831k05767l23528
8067d18893k97807K50674L70116j8696j65806o68609K06869O57589o9536m52748
8057f06847J28615Q45257j70741l16150J25623m52137J91350J07433J99567J25956
8047A77926j8114o1618N2157p96370n24999l43476J376056P7379L44868M72439
8037G56248r01388l30735k1329J15883o39809L71887J045619j1260p99208o176
$$ plain form
8027 -420268 -596541 -726897 -477133 -646150 -592916 -671502 367436 144890 -912302 -1053586
8017 -1053586 -1309720 -234908 -476804 237581 -297269 8471 -442214 -581016 -1206295
8008 -1206295 -1411915 -1617898 -1027663 -554783 -800734 -284639 -77591 -697783 -1100729 -1511136
7998 -1511136 -965965 -996511 -82988 -56160 -96450 -274790 -592947 -648163 -1520636 -2062215
7988 -2062215 -1396079 -1443141 -1097365 -941039 225131 -431558 -436607 4843 -837798 -861181
7978 -861181 -409619 496298 -318487 -198940 816445 461051 -165658 -932959 170893
7969 170893 -742678 -866179 -874587 -512526 -1301652 -1276536 -250488 -559021 -644543 -541384
7959 -541384 391139 -737027 -1012314 -520227 -724149 -1514881 -1463959 -263376 -557862 -990121
$$ packed form
8027d20268j76273j30356K49764j69017N3234p8586J038938k22546j057192j41284
8017a053586k56134J074812k41896P14385n34850L05740m50685j38802o25279
8008a206295k05620k05983N90235M72880k45951N16095K07048o20192m02946m10407
7998a511136N45171l0546R13523K6828m0290j78340l18157n5216q72473n41579
7988b062215O66136m7062L45776J56326J166170o56689n049M41450q42641k3383
7978h61181M51562R05917q14785J19547J015385l55394o26709p67301J103852
7969A70893r13571j23501q408L62061p89126K5116J026048l08533q5522J03159
7959e41384R32523j128166k75287M92087k03922p90732N0922J200583k94486m32259
$$ plain form
7949 -990121 -1202326 -565710 -1432919 -1391038 -501449 -155604 -295877 -1200214 1092331 -497476
7939 -497476 -594366 -1087687 -92543 -1094779 -1381494 246617 -520071 -793250 -319300 -259140
7929 -259140 -855467 -1717136 -708060 -807759 -706217 -819194 265460 1027658 889868 64514
7919 64514 681439 -331336 -470314 229044 404751 -289176 -292650 1016460 138893 -504690
7909 -504690 -224707 -176968 -84533 -263758 -366947 -242141 548629 123609 425154 561930
7899 561930 219715 310699 397285 239719 -1250580 -229548 179932 -555853 20881 -34013
7889 -34013 1418026 1046840 1183415 58861 -838537 593730 367366 308593 112972 451339
7879 451339 1772250 2022197 2360294 497906 -391972 -185120 -325597 -11775 430307
$$ packed form
7949i90121k12205O36616q67209M1881Q89589L45845j40273r04337K292545j589807
7939d97476r6890m93321R95144j002236k86715J628111p66688k73179M73950O0160
7929b59140n96327q61669J009076r9699J01542j12977J084654P62198j37790q25354
7919F4514O16925j012775j38978O99358J75707o93927l474J309110q77567o43583
7909e04690K79983M7739R2435j79225j03189J24806P90770m25020L01545J36776
7899E61930l42215R0984Q6586j57566j490299J021032M09480p35785N76734n4894
7889c4013J452039l71186J36575j124554q97398J432267k26364n8773j95621L38367
7879D51339J320911K49947L38097j862388q89878K06852j40477L13822M42082
$$ plain form
7870 430307 1427098 2029812 1750771 1267185 1472124 1499044 1371621 1013385 1050543 262490
7860 262490 893599 1715948 1267919 102895 920911 1095927 1341131 1350232 1560561 925971
7850 925971 670571 353002 614343 177325 877510 1043617 2459964 1550151 1548010 1603138
7840 1603138 1858580 1420888 897846 1440467 1584261 1234335 1645313 1910903 1774204 1360424
7830 1360424 1531820 1926279 617180 997677 1839814 1942474 1179342 1640718 2185882
7821 2185882 1975240 1815461 2530171 2361940 2717406 2398774 3690334 3601540 3412243 3207560
7811 3207560 3730318 3821949 4879370 5083230 4053021 4693772 5229375 6247578 6805850
7802 6805850 7734248 8125351 9266700 10196329 11844817 13311553 15311868 15849644 16842909
$$ packed form
7870D30307R96791O02714k79041m83586K04939K6920j27423l58236L7158p88053
7860B62490O31109Q22349m48029j165024Q18016J75016K45204R101K10329o34590
7850I25971k55400l17569K61341m37018P00185J66107J416347r09813k141N5128
7840A603138K55442m37692n23042N42621J43794l49926M10978K65590j36699m13780
7830A360424J71396L94459j309099L80497Q42137J02660p63132M61376N45164
7821B185882k10642j59779P14710j68231L55466l18632J291560q8794j89297k04683
7811C207560N22758R1631J057421K03860j030209O40751N35603J018203N58272
7802F805850R28398L91103J141349R29629J648488J466736K000315N37776R93265
$$ plain form
7793 16842909 17863347 18852176 18262865 18277197 18057852 17393831 17035368 17217562 16886237
7784 16886237 17113292 16999000 17463708 17118769 18187376 18312278 18593782 19863360 21042784
7775 21042784 22754675 23901032 25563283 27039734 27893186 28302204 28310308 27905806 27371198
7766 27371198 26320226 26454431 25437679 24795422 24015118 23137252 21015644 19982514 19111942
7757 19111942 17903458 16822695 17172857 17571029 17328676 17143050 17162595 16997236 16838385
7748 16838385 16873075 17896529 17751998 18449944 18157066 17953766 17053439 15941142 16069464
7739 16069464 14403535 13176312 12192738 12996370 12294243 11089086 10149504 9460654 8409182
7730 8409182 8275683 8245688 7597215 7453805 7348260 7635921 6568573 5496945 5343532
$$ packed form
7793A6842909J020438R88829n89311J4332k19345o64021l58463J82194l31325
7784A6886237K27055j14292M64708l44939J068607J24902K81504J269578J179424
7775B1042784J711891J146357J662251J476451Q53452M09018Q104m04502n34608
7766B7371198j050972J34205j016752o42257p80304q77866k121608j033130q70572
7757A9111942j208484j080763L50162L98172k42353j85626J9545j65359j58851
7748A6838385L4690J023454j44531O97946k92878k03300r00327j112297J28322
7739A6069464j665929j227223r83574Q03632p02127j205157r39582o88850j051472
7730H409182j33499k9995o48473j43410j05545K87661j067348j071628j53413
$$ plain form
7721 5343532 4943104 4909936 4011199 4196732 4484725 3920445 4456084 3858769 3478905 3484295
7711 3484295 4206555 4238127 3824678 3058421 2960806 2600525 3382913 2620672 3002570 3267421
7701 3267421 2593673 2466254 1929095 1181825 1507504 902844 2437607 2257088 3005061
7692 3005061 2558311 2538099 2346221 816078 990977 1203725 1554229 1988601 2454731 2954779
7682 2954779 2536630 2075127 1837096 2180336 1878759 2764300 3506619 4393010 4426492 4544848
7672 4544848 5388785 3243304 2777202 2686755 3946408 4323981 4426998 4557557 4382659
7663 4382659 3473004 3267441 3124160 2481162 2315354 2890991 4355433 3924854 4252621
7654 4252621 4732680 3994423 3588305 2777146 4052155 3439224 3894419 4336330 4327095 4448682
$$ packed form
7721E343532m00428l3168q98737J85533K87993n64280N35639n97315l79864N390
7711C484295P22260L1572m13449p66257r7615l60281P82388p62241L81898K64851
7701C267421o73748j27419n37159p47270L25679o04660J534763j80519P47973
7692C005061m46750k0212j91878j530143J74899K12748L50504M34372M66130N00048
7682B954779m18149m61503k38031L43240l01577Q85541P42319Q86391L3482J18356
7672D544848Q43937k145481m66102r0447J259653L77573J03017J30559j74898
7663D382659r09655k05563j43281o42998j65808N75637J464442m30579L27767
7654D252621M80059p38257m06118q11159J275009o12931M55195M41911r235J21587
$$ plain form
7644 4448682 3415439 4213623 4210475 3403853 3208563 2758487 2662563 2032469 2266389 2378603
7634 2378603 1609852 1362007 1888937 1851182 1467174 1103029 1341611 598380 1123176 721831
7624 721831 1504254 1625887 1524712 1346901 1143729 1248592 600655 1548613 937970 -21857
7614 -21857 -261266 6626 695975 62713 687659 801006 610253 754835 400138 305009
7604 305009 276208 240717 848911 882209 648001 818519 1644810 1507464 504956 421213
7594 421213 31896 -214659 4493 336406 373232 166933 457297 195626 854237 529569
7584 529569 -84699 184862 -360921 -257384 -111315 453135 525807 224557 460656 -106970
7574 -106970 62665 23246 -76074 -245120 -847408 -424699 69539 239272 498553 405053
$$ packed form
7644D448682j033243P98184l148q06622j95290m50076r5924o30094K33920J12214
7634B378603p68751k47845N26930l7755l84008l64145K38582p43231N24796m01345
7624G21831P82423J21633j01175j77811k03172J04863o47937R47958o10643r59827
7614b1857k39409K67892O89349o33262O24946J13347j90753J44582l54697r5129
7604C05009k8801l5491O08194L3298k34208J70518Q26291j37346j002508q3743
7594D21213l89317k46555K19152L31913L6826k06299K90364k61671O58611l24668
7584E29569o14268K69561n45783J03537J46069N64450P2672l01250K36099n67626
7574a06970J69635l9419r9320j69046o02288M22709M94238J69733K59281r3500
$$ plain form
7564 405053 115201 -698543 -872661 -527612 -519698 -314782 -489150 -88955 297344 331419
7554 331419 -129919 -343317 -575364 -185983 80827 435323 486234 338272 538094 438808
7544 438808 207277 13319 -129791 278814 103988 -131006 27028 -771228 -712449 -179478
7534 -179478 -228611 -497110 -94079 136283 348553 111531 197555 -680445 283164 388057
7524 388057 428534 1000180 925495 943319 480679 800530 412915 104416 453473 599543
7514 599543 727374 1051944 1289967 1132206 210556 -44833 -125310 80530 -156531 171685
7504 171685 404239 551250 -238987 323085 483126 25013 -121213 877954 356094 872837
7494 872837 538337 636354 295816 441639 434140 436042 971870 -385947 -536524 39195
$$ packed form
7564D05053k89852q13744j74118L45049P914K04916j74368M00195L86299L4075
7554C31419m61338k13398k32047L89381K66810L54496N0911j47962J99822r9286
7544D38808k31531j93958j43110M08605j74826k34994J58034p98256N8779N32971
7534a79478m9133k68499M03031K30362K12270k37022Q6024q78000R63609J04893
7524C88057M0477N71646p4685J7824m62640L19851l87615l08499L49057J46070
7514E99543J27831L24570K38023j57761r21650k55389q0477K05840k37061L28216
7504A71685K32554J47011p90237N62072J60041m58113j46226R99167n21860N16743
7494H72837l34500R8017l40538J45823p499J902N35828j357817j50577N75719
$$ plain form
7484 39195 -107202 172211 128276 762983 -216858 891579 665272 -630654 -1512428 -1438090
7474 -1438090 -256417 431774 304363 44030 177283 24417 -471820 -5422 -202801
7465 -202801 -655134 493995 1555397 1056926 669821 715727 245391 -664124 -274838 361547
7455 361547 1062291 849533 654186 450331 -72493 -340355 -759754 108669 -759186 -429281
7445 -429281 1446743 1735013 774243 -27056 679689 246628 152501 1270922 1290686 867570
7435 867570 889495 1870045 943138 819330 696420 747179 19913 247704 594714 1164519
7425 1164519 910288 30528 249828 93190 345752 735598 822782 862784 847554 1174554
7415 1174554 583898 435919 258152 1418716 1645734 1964786 1375346 1975751 2016577 1903348
$$ packed form
7484C9195j46397K79413m3935O34707r79841J108437k26307j295926q81774P4338
7474a438090J181673O88191j27411k60333J33253j52866m96237M66398j97379
7465b02801m52333J149129J061402m98471l87105M5906m70336r09515L89286O36385
7455C61547P00744k12758j95347k03855n22824k67862m19399Q68423q67855L29905
7445d29281J876024K88270r60770q01299P06745m33061r4127J118421J9764m23116
7435H67570K1925R80550r26907j23808j22910N0759p27266K27791L47010N69805
7425A164519k54231q79760K19300j56638K52562L89846Q7184M0002j5230L27000
7415A174554n90656j47979j77767J160564K27018L19052n89440O00405M0826j13229
$$ plain form
7405 1903348 739675 659594 36915 881859 1500123 1832018 1321166 1773347 2233962 2376068
7395 2376068 2299626 2400721 1861146 3201297 2936093 4232697 4484414 6820611 7709082
7386 7709082 8719890 10487852 11860770 15102438 16936647 19907219 21921664 23273375
7378 23273375 23562438 23409617 21899889 19212814 17562801 16610476 14888324 13663723 13527088
7369 13527088 14170724 13489594 13912424 13759606 14132079 14037840 15354012 17054859 17985808
7360 17985808 18322582 21019448 22258198 23188559 22545185 22084141 20518225 17327168 15909160
7351 15909160 14466558 12834047 9754319 8129938 7267881 5315306 5884081 5814950 4974913
7342 4974913 3403491 4120875 5259179 3991650 3248249 3378740 3054158 2464546 2022088
$$ packed form
7405A903348j163673q0081o22679Q44944O18264L31895n10852M52181M60615J42106
7395B376068p6442J01095n39575J340151k65204J296604K51717K336197Q88471
7386G709082J010808J767962J372918L241668J834209K970572K014445J351711
7378B3273375K89063j52821j509728k687075j650013r52325j722152j224601j36635
7369A3527088O43636o81130M22830j52818L72473r4239J316172J700847R30949
7360A7985808L36774K696866J238750R30361o43374m61044j565916l191057j418008
7351A5909160j442602j632511l079728j624381q62057j952575N68775o9131q40037
7342D974913j571422P17384J138304j267529p43401J30491l24582n89612m42458
$$ plain form
7333 2022088 3119091 2951280 2212104 2788745 3179184 1826172 2274378 2578532 2301439
7324 2301439 360009 729610 1615391 1424942 1191866 1580896 1562516 1776075 1578033 2344655
7314 2344655 1318404 -27900 -41495 1106248 680234 522510 1141079 2049531 2019421
7305 2019421 2126495 2191423 1259238 739388 1088275 1995855 2152584 1247177 1608505 1301053
7295 1301053 1029636 1964008 1276592 1068788 -231892 476531 825679 239603 510237
7286 510237 327682 585878 715598 464197 1493526 525747 1200746 838384 1414202 1136647
7276 1136647 1608264 1917348 1007038 450446 518105 484017 828046 949076 804415 634179
7266 634179 1335343 792950 1057332 49993 -266237 50435 144887 694032 789608 866492
$$ packed form
7333B022088J097003j67811p39176N76641L90439j353012M48206L04154k77093
7324B301439j941430L69601Q85781j90449k33076L89030j8380K13559j98042P66622
7314B344655j026251j346304j3595J147743m26014j57724O18569R08452l0110
7305B019421J07074O4928r32185n19850L48887R07580J56729r05407L61328l07452
7295A301053k71417R34372o87416k07804j300680P08423L49148n86076K70634
7286E10237j82555K58196J29720k51401J029329r67779O74999l62362N75818k77555
7276A136647M71617L09084r10310n56592O7659l4088L44029J21030j44661j70236
7266F34179P01164n42393K64382j007339l16230L16672R4452N49145R5576P6884
$$ plain form
7256 866492 608973 595873 1096319 114739 -2522 360854 564554 1043715 939938 940325
7246 940325 448469 270340 383886 730282 354953 -142678 -401543 422547 -89949 481056
7236 481056 -13488 -722271 -437885 639871 914135 391991 -136329 -511226 60424 168350
7226 168350 -285458 -543703 -256095 -139623 -33882 147610 -498205 -879107 -183642 -422160
7216 -422160 -633974 -822515 -199492 106791 396629 375785 210747 -178482 100159 -539644
7206 -539644 -235019 -1395630 -1092158 -490845 -197575 324256 -167013 350484 -144559 27847
7196 27847 76940 -349094 -465342 -663974 -373868 -73149 132014 -334521 -257849 66335
7186 66335 -290172 -1013694 -1552734 -1490366 -1341215 129768 214119 -363428 -586585 -458516
$$ packed form
7256H66492k57519j3100N00446r81580j17261L63376K03700M79161j03777L87
7246I40325m91856j78129J13546L46396l75329m97631k58865Q24090n12496N71005
7236D81056m94544p08783K84386J077756K74264n22144n28320l74897N71650J07926
7226A68350m53808k58245K87608J16472J05741J81492o45815l80902O95465k38518
7216d22160k11814j88541O23023L06283K89838k0844j65038l89229K78641o39803
7206e39644L04625j160611L03472O01313K93270N21831m91269N17497m95043J72406
7196B7847M9093m26034j16248j98632K90106L00719K05163m66535P6672L24184
7186F6335l56507p23522n39040O2368J49151J470983Q4351n77547k23157J28069
$$ plain form
7176 -458516 -590500 -515124 -1002411 -738773 -178336 741366 981466 -374025 -765317 -1793227
7166 -1793227 -842593 -35728 -47783 489282 572551 728500 -140611 -170310 -931044 -1000045
7156 -1000045 -411253 -316054 80989 703433 599559 -294476 -701922 -865487 -1030465 -365349
7146 -365349 -653458 -424555 -532160 485399 -176828 618293 843917 665653 982278 1391548
7136 1391548 285417 -759608 -862776 -998222 -577598 -601822 -371495 -505626 207171
7127 207171 748748 -159948 -106545 -1621530 -1976859 -1438797 -860611 -94971 46986 1185061
7117 1185061 763915 1068987 600025 -432204 -1634798 -1781929 -1560280 -626118 451589
7108 451589 466484 875951 572865 550246 570792 847383 -313160 -685316 -24518 247244
$$ packed form
7176d58516j31984P5376m87287K63638N60437R19702K40100j355491l91292j027910
7166a793227R50634Q06865j2055N37065Q3269J55949q69111k9699p60734o9001
7156a000045N88792R5199L97043O22444j03874q94035m07446j63565j64978O65116
7146c65349k88109K28903j07605J017559o62227P95121K25624j78264L16625M09270
7136A391548j106131j045025j03168j35446M20624k4224K30327j34131P12797
7127B07171N41577r08696N3403j514985l55329N38062N78186P65640J41957J138075
7117A185061m21146L05072m68962j032229j202594j47131K21649R34162J077707
7108D51589J4895M09467l03086k2619K0546K76591j160543l72156O60798K71762
$$ plain form
7098 247244 530 -341206 -738211 -1256972 -116102 382876 578293 -83033 -60593 183833
7088 183833 -737806 385383 -129879 261189 393278 942087 1591629 408355 124684
7079 124684 -659162 -67413 -322282 -36635 168634 648350 -838694 -809161 -233331 -467572
7069 -467572 -257140 -7758 -56182 49011 688771 1081519 -698662 -952099 -1299133 -608322
7059 -608322 -185824 231241 286288 434759 -535770 -66007 -11289 -624727 -872705 -659152
7049 -659152 324174 317825 1249391 1391209 -63681 -886140 -822661 2661 -421344 -381137
7039 -381137 -119533 118046 74766 841476 272458 -346191 -1103902 -840281 155554 -176839
7029 -176839 935028 144492 44194 272297 -485408 -698846 -1484704 -1198094 -405881 -72308
$$ packed form
7098B47244k46714l41736l97005n18761J140870M98978J95417o61326K2440K44426
7088A83833r21639J123189n15262L91068J32089N48809O49542j183274k83671
7079A24684p83846N91749k54869K85647K05269M79716j487044K9533N75830k34241
7069d67572K10432K49382m8424J05193O39760L92748j780181k53437l47034O90811
7059f08322M22498M17065N5047J48471r70529M69763N4718o13438k47978K13553
7049f59152R83326o349R31566J41818j454890q22459O3479Q25322m24005M0207
7039c81137K61604K37579m3280P66710n69018o18649p57711K63621R95835l32393
7029a76839J111867p90536j00298K28103p57705k13438p85858K86610P92213L33573
$$ plain form
7019 -72308 26981 -419618 -558558 -791205 -663423 -277292 -459085 -1186208 -332809 -649392
7009 -649392 -68708 -255070 -325801 -522254 -507273 -609321 -401205 -534146 -153308 -923100
6999 -923100 -932869 -493994 -382344 312896 -723345 -1396648 -1130049 -722074 -144347 -687100
6989 -687100 -189596 -1213500 -1371901 -745568 -822311 -1070470 -664839 -773321 -539784 -422133
6979 -422133 162733 -165128 -1274775 -1188933 -1252886 -727773 -265714 -395223 -297291 -892215
6969 -892215 -634806 -1049685 -1996507 -2226673 -1771283 -1152673 -494795 -710139 -586427 -1225370
6959 -1225370 -1444573 -1253172 -1367833 -2139270 -1838482 -1158663 -329541 -26463 89312 -374576
6949 -374576 -1842960 -1304147 -1073490 -753807 -729117 -425666 378563 -127881 340816 100301
$$ packed form
7019g2308R9289m46599j38940k32647J27782L86131j81793p27123Q53399l16583
7009f49392N80684j86362p0731j96453J4981j02048K08116j32941L80838p69792
6999i23100r769M38875J11650O95240j036241o73303K66599M07975N77727n42753
6989f87100M97504j023904j58401O26333p6743k48159M05631j08482K33537J17651
6979d22133N84866l27861j109647Q5842o3953N25113M62059j29509R7932n94924
6969h92215K57409m14879r46822k30166M55390O18610O57878k15344J23712o38943
6959a225370k19203J91401j14661p71437L00788O79819Q29122L03078J15775m63888
6949c74576j468384N38813K30657L19683K4690L03451Q04229n06444M68697k40515
$$ plain form
6939 100301 -924505 -1396981 -1900164 -926827 -813440 -195261 -104066 -232007 -1417407 -627810
6929 -627810 -697286 -571854 -1547741 -990416 -517576 -516834 258926 70032 -521940 -787177
6919 -787177 -464754 -80336 -246731 -1113902 -632585 -637825 -714827 -1309795 -1295688 -977669
6909 -977669 -1297060 -419653 -144116 -348422 -427695 -159510 -441898 -1303249 -1348740 -1188364
6899 -1188364 -1039918 -1080758 -256587 -724945 62014 218776 -248143 -540359 -1926980 -435851
6889 -435851 -486358 684523 -154038 -124332 400035 -105166 -540438 -1155364 -1418446 -944846
6879 -944846 -263504 855165 869711 -515366 -635777 -1172382 -1057002 -1009871 -1189970 -150386
6869 -150386 -255372 552343 328130 195603 -1147614 -1817683 -1379259 -1752579 -981607 -755388
$$ packed form
6939A00301j024806m72476n03183R73337J13387O18179R1195j27941j185400P89597
6929f27810o9476J25432r75887N57325M72840P42P75760j88894n91972k65237
6919g87177L22423L84418j66395q67171M81317n240p7002n94968J4107L18019
6909i77669l19391Q77407K75537k04306p9273K68185k82388q61351m5491J60376
6899a188364J48446m0840Q24171m68358P86959J56762m66919k92216j386621J491129
6889d35851n0507J170881q38561K9706N24367n05201m35272o14926k63082M73600
6879i44846O81342J118669J4546j385077j20411n36605J15380M7131j80099J039584
6869a50386j04986Q07715k24213j32527j343217o70069M38424l73320P70972K26219
$$ plain form
6859 -755388 -8241 -888869 -378325 -864999 -709430 -739739 -1300938 -1103742 -1234347 -485845
6849 -485845 -625401 -967565 -605544 -1206258 -11696 -407258 -844383 -918672 -1013245 -13479
6839 -13479 -213553 -583463 -567419 -1055169 -380917 -935514 -801325 -693609 -620750 110855
6829 110855 -539252 -575204 -730007 -318760 -559383 -1023070 -998574 -594665 -768347 -348561
6819 -348561 -334635 -34082 134454 760039 471951 -69868 -883720 -388641 -340299 -441738
6809 -441738 -487486 -767985 5213 -464194 -550916 -864812 -1288049 -842493 -889107 -231956
6799 -231956 -811575 -1149236 -1233911 -1640621 -1627467 -1110039 -437002 246140 -113996 37790
6789 37790 113044 -660579 348441 -481710 -396271 -1041695 414492 931097 42824 -91035
$$ packed form
6859g55388P47147q80628N10544m86674J55569l0309n61199J97196j30605P48502
6849d85845j39556l42164L62021o00714J194562l95562m37125p4289r4573R99766
6839a3479k00074l69910J6044m87750O74252n54597J34189J07716P2859P31605
6829A10855o50107l5952j54803M11247k40623m63687K4496M03909j73682M19786
6819c48561J3926L00553J68536O25585k88088n41819q13852M95079M8342j01439
6809d41738m5748k80499P73198m69407q6722l13896m23237M45556m6614O57151
6799b31956n79619l37661q4675m06710J3154N17428O73037O83142l60136J51786
6789C7790P5254p73623J009020q30151Q5439o45424J456187N16605q88273j33859
$$ plain form
6779 -91035 -392925 -347240 -448330 -184671 -544893 -660905 -387461 -427778 -687210 -947686
6769 -947686 -495142 -949662 -906769 -886163 -554788 -127782 -316581 -582617 -800866 -1327569
6759 -1327569 -1117947 -760845 -1027540 -1373130 -886748 -336890 -795672 -545487 -1258783 -1131016
6749 -1131016 -1207135 -1444056 -1534885 -2612978 -1676205 -1910395 -780290 -1205724 -1711105 -1642200
6739 -1642200 -2014079 -1845721 -1277831 -901931 -1392219 -1965841 -810406 -971464 -1120620
6730 -1120620 -1195716 -560524 -693248 -707620 -63353 -392510 -923573 -1342929 -1067131 -1713503
6720 -1713503 -2208426 -740224 -175428 -263541 -815774 -757672 -923064 -1508045 -543638 -947566
6710 -947566 -686159 -1349704 -53188 -148317 -1353538 -1220075 -749945 -839809 -1161859 -539396
$$ packed form
6779i1035l01890M5685j01090K63659l60222j16012K73444m0317k59432k60476
6769i47686M52544m54520M2893K0606L31375M27006j88799k66036k18249n26703
6759a327569K09622L57102k66695l45590M86382N49858m58782K50185p13296J27767
6749a131016p6119k36921r0829j078093R36773k34190J130105m25434n05381O8905
6739a642200l71879J68358N67890L75900m90288n73622J155435j61058j49156
6730a120620p5096O35192j32724j4372O44267l29157n31063m19356K75798o46372
6720a713503m94923J468202N64796q8113n52233N8102j65392n84981R64407m03928
6710i47566K61407o63545J296516r5129j205221J33463M70130q9864l22050O22463
$$ plain form
6700 -539396 463128 -255591 -20838 92621 -880087 -1854772 -1578073 -626546 -326170 -508553
6690 -508553 239458 407009 364369 -157995 278150 -312780 -1828325 -1629169 -235183 243758
6680 243758 89355 1562845 1331262 26626 -145398 511218 -139705 -1508285 -834787
6671 -834787 -488187 -610275 -232256 375076 280997 -987864 -818484 -591927 -671841 -345689
6661 -345689 -174878 1022833 269910 526068 309270 -177494 -1109031 -928773 -281343 -169438
6651 -169438 -26905 250646 42941 -333572 -609035 -1043077 -1565784 -1455700 -1432094 -525068
6641 -525068 -236523 -628647 -1372584 -769776 -528208 -1369019 -1357235 -1373549 -1164069 -1202351
6631 -1202351 -433836 -965380 -587939 -771056 -563222 -459606 62062 -50847 221151 949233
$$ packed form
6700e39396J002524p18719K34753J13459r72708r74685K76699R51527L00376j82383
6690e08553P48011J67551m2640n22364M36145n90930j515545J99156J393986M78941
6680B43758j54403J473490k31583j304636j72024O56616o50923j368580O73498
6671h34787L46600j22088L78019O07332r4079j268861J69380K26557p9914L26152
6661c45689J70811J197711p52923K56158k16798m86764r31537J80258O47430J11905
6651a69438J42533K77551k07705l76513k75463m34042n22707J10084K3606R07026
6641e25068K88545l92124p43937O02808K41568q40811J1784j6314K09480l8282
6631a202351P68515n31544L77441j83117K07834J03616N21668j12909K71998P28082
$$ plain form
6621 949233 271718 182892 -529329 -1462196 -1981643 -2114599 -781071 -742653 -538689 -193458
6611 -193458 168039 -879656 -1294090 -1783064 -2170542 -1935881 -1060798 878675 -35272
6602 -35272 -254748 -478091 351693 -269652 -1156442 -758600 -363016 -555243 -100306 187270
6592 187270 -818348 -1424339 -1126596 -1051593 -1620597 -949013 -438360 -494121 58725 -1119664
6582 -1119664 -1563309 -1324764 -1401296 -1338096 -1188419 -680250 -1376183 19796 195008 -1020017
6572 -1020017 -1390963 -329791 -840232 -142902 -293881 213554 134435 82563 60368 -516436
6562 -516436 -587167 -1147223 62942 537271 342225 -536569 -405729 -871533 -1475000 -777454
6552 -777454 -545424 -68570 -632251 681900 754506 530352 177964 -1152397 -623595 -1203293
$$ packed form
6621I49233o77515q8826p12221r32867n19447j32956J333528L8418K03964L45231
6611a93458L61497j047695m14434m88974l87478K34661Q75083J939473r13947
6602c5272k19476k23343Q29784o21345q86790L97842L95584j92227M54937K87576
6592A87270j005618o05991K97743P5003n69004O71584N10653n5761N52846j178389
6582a119664m43645K38545p6532O3200J49677N08169o95933J395979J75212j215025
6572a020017l70946J061172n10441O97330j50979N07435p9119n1872k2195n76804
6562e16436p0731n60056J210165M74329j95046q78794J30840m65804o03467O97546
6552g77454K32030M76854n63681J314151P2606k24154l52388j330361N28802n79698
$$ plain form
6542 -1203293 -62950 373879 157408 -199392 -1410332 -326426 -890534 -1273418 -169364
6533 -169364 -74905 -286234 -165905 294167 157541 -1818490 -916533 -1028472 -180537 314814
6523 314814 514231 485521 -493114 -283467 -103562 -214358 -1267748 -788108 -11583 432070
6513 432070 796735 162135 395211 -776451 68082 191714 89289 -323914 -1008989 -98312
6503 -98312 54980 139603 -176358 -945521 -602966 -587186 249989 556612 -246123 420541
6493 420541 -82432 124637 -359304 -155942 587170 -276685 -20506 54226 157404 69729
6483 69729 -521875 -681386 -1787954 -1242220 -1141910 -554106 -502684 -414125 -804607 -156399
6473 -156399 329779 526889 -238550 -186434 74643 383895 698004 821692 226648 -51751
$$ packed form
6542a203293J140343M36829k16471l56800j210940J083906n64108l82884J104054
6533a69364R4459k11329J20329M60072j36626j976031R01957j11939Q47935M95351
6523C14814J99417k8710r78635K09647J79905j10796j053390M79640P76525M43653
6513D32070L64665o34600K33076j171662Q44533J23632j02425m13203o85075R10677
6503i8312J53292Q4623l15961p69163L42555J5780Q37175L06623q02735O66664
6493D20541n02973K07069m83941K03362P43112q63855K56179P4732J03178q7675
6483F9729n91604j59511j106568N45734J00310N87804N1422Q8559l90482O48208
6473a56399M86178J97110p65439N2116K61077L09252L14109J23688n95044k78399
$$ plain form
6463 -51751 553376 538769 396154 -93590 246444 428851 376879 958847 -258810 98928
6453 98928 -942710 -335553 188978 225041 787945 224610 700045 757754 550799 940422
6443 940422 -99076 -164417 -480947 891628 1688691 1880530 1379095 1074617 809306 851412
6433 851412 89869 242597 -501821 81977 460315 445106 401724 20544 -4152 -592124
6423 -592124 -872678 66684 427516 643717 135677 743063 -2595 55784 104631 195313
6413 195313 203201 -494072 1301943 995515 1725104 233458 294455 336907 26353 401341
6403 401341 -153937 615871 1260310 1416659 2239749 573800 1651009 1249688 1869816
6394 1869816 1101739 1672552 1779302 1815800 2035430 1826898 1574536 1823411 2191632 2361193
$$ packed form
6463e1751O05127j4607j42615m89744L40034J82407n1972N81968j217657L57738
6453I8928j041638O07157N24531L6063N62904n63335M75435N7709k06955L89623
6443I40422j039498o5341l16530J372575P97063J91839n01435l04478k65311M2106
6433H51412p61543J52728p44418N83798L78338j5209m3382l81180k4696n87972
6423e92124k80554R39362L60832K16201n08040O07386p45658N8379M8847R0682
6413A95313P888o97273J796015l06428P29589j491646O0997M2452l10554L74988
6403D01341n55278P69808O44439J56349Q23090j665949J077209m01321O20128
6394A869816p68077N70813J06750L6498K19630k08532k52362K48875L68221J69561
$$ plain form
6384 2361193 1844415 1879394 2014346 1603271 876946 703696 909134 1168203 1362589 1302511
6374 1302511 260196 309310 747670 1111841 1322308 780256 859472 619879 552370 -47079
6364 -47079 455853 104120 919425 1302347 1240151 1829544 1689442 1533627 328527 660909
6354 660909 765498 822732 1033706 1004431 685614 955342 802951 460605 304135 835893
6344 835893 702320 907190 1064412 1174980 1031432 1817009 941493 642333 439982 1633146
6334 1633146 1960005 2510378 2416599 2058913 1711635 1656108 834875 86919 77233 1038693
6324 1038693 1955314 2130764 2492825 1992715 2229506 1281077 1086640 290995 318560 714941
6314 714941 1717673 2210144 2760357 2510412 3144232 2349993 2704530 2086628 2974205 3202007
$$ packed form
6384B361193n16778L4979J34952m11075p26325j73250K05438K59069J94386o0078
6374A302511j042315M9114M38360L64171K10467n42052P9216k39593o7509n99449
6364d7079N02932l51733Q15305L82922o2196N89393j40102j55815j205100L32382
6354F60909J04589N7234K10974k9275l18817K69728j52391l42346j56470N31758
6344H35893j33573K04870J57222J10568j43548P85577q75516k99160k02351J193164
6334A633146L26859N50373r3779l57686l47278n5527q21233p47956r686R61460
6324A038693R16621J75450L62061n00110K36791r48429j94437p95645K7565L96381
6314G14941J002732M92471N50213k49945O33820p94239L54537o17902Q87577K27802
$$ plain form
6304 3202007 3209228 3266390 4243441 4303261 3975970 3426400 3594572 3502208 3699903 4636813
6294 4636813 4416305 3975285 4108095 4884127 4759592 4287994 3940920 4621616 5166908 5942855
6284 5942855 6611226 6826034 6795238 6205864 6267681 6152016 5861758 6396405 6654537 7602123
6274 7602123 7950504 8389393 9037123 7853182 7751619 7650685 8783596 9557647 9985689
6265 9985689 10068293 10002976 9850206 10767980 9807652 10109461 10098542 11360931 12587257 12397339
6255 12397339 12307619 12001407 11807397 11998262 11985496 12823781 12733688 13056401 13943744 14182049
6245 14182049 14004367 13787864 14025602 13904677 14364690 14187188 15395692 15388238 15846182 15204861
6235 15204861 15598971 15887889 15716511 16477270 17292939 17206655 17561448 17332492 17903242 16276825
$$ packed form
6304C202007P221N7162R77051N9820l27291n49570J68172r2364J97695R36910
6294D636813k20508m41020J32810P76032j24535m71598l47074O80696N45292P75947
6284E942855O68371K14808l0796n89374O1817j15665k90258N34647K58132R47586
6274G602123L48381M38889O47730j183941j01563j00934J132911P74051M28042
6265I985689Q2604o5317j52770R17774r60328L01809j0919J262389J226326j89918
6255A2397339q9720l06212j94010J90865j2766Q38285r0093L22713Q87343K38305
6245A4182049j77682k16503K37738j20925M60013j77502J208504p454M57944o41321
6235A5204861L94110K88918j71378P60759Q15669q6284L54793k28956N70750j626417
$$ plain form
6225 16276825 15925113 15949189 15932272 16735344 16985164 18239954 18448349 18337722 18834825 18286719
6215 18286719 17934978 17366496 17542250 18265051 17477374 18453631 19392674 19201713 18353559
6206 18353559 18209374 18575800 17641807 16900537 16391769 16218432 15662597 16548288 16996642
6197 16996642 16536272 17034838 17020038 18086224 16012383 14882153 14831700 13758965 13788632
6188 13788632 13601036 15208156 14903419 15066597 16113627 15629202 14662599 14231675 14143535
6179 14143535 13891352 13028743 14023162 14432855 14438355 15148109 14710845 14938243 14062682 13866611
6169 13866611 13839256 13213377 13949929 13840395 14741964 14738422 15712789 16399019 17204600 17633289
6159 17633289 18219033 19187937 19158349 20721210 20889834 21551713 21361487 21350286 22434750
$$ packed form
6225A6276825l51712K4076j6917Q03072K49820J254790K08395j10627M97103n48106
6215A8286719l51741n68482J75754P22801p87677R76257R39043j90961q48154
6206A8353559j44185L66426r33993p41270n08768j73337n55835Q85691M48354
6197A6996642m60370M98566j4800J066186k073841j130230n0453j072735K9667
6188A3788632j87596J607120l04737J63178J047030m84425r66603m30924q8140
6179A4143535k52183q62609R94419M09693N500P09754m37264K27398q75561j96071
6169A3866611k7355o25879P36552j09534R01569l542R74367O86230Q05581M28689
6159A7633289N85744R68904k9588J562861J68624O61879j90226j1201J084464
$$ plain form
6150 22434750 22185661 23634860 23556642 23104143 23113251 22422132 22467401 20704138 20318034 19996152
6140 19996152 18838846 18664198 18391839 17385806 15827919 14708750 14252516 13197752 13509002
6131 13509002 14669674 15364608 14730348 14276598 14151922 13249275 11698324 11165316 10977748
6122 10977748 10904122 11323366 12513571 12822934 11337371 10737676 10875049 10837362 9965548
6113 9965548 10729011 10562385 11506481 12125142 13698235 14330728 13888236 15023679 15871079
6104 15871079 17501240 18730893 20353929 22669066 24170022 26031350 28814321 31096615
6096 31096615 31858361 32843406 34162987 35076485 36237076 38159422 39321766 39062688 40918058
6087 40918058 42138369 43816387 43950299 45077852 45665972 45652121 45164681 44551970 43317384
$$ packed form
6150B2434750k49089J449199p8218m52499R108o91119M5269j763263l86104l21882
6140A9996152j157306j74648k72359j006033j557887j119169m56234j054764L11250
6131A3509002J160672O94934o34260m53750j24676r02647j550951n33008j87568
6122A0977748p3626M19244J190205L09363j485563n99695J37373l7687q71814
6113I965548P63463j66626R44096O18661J573093O32493m42492J135443Q47400
6104A5871079J630161J229653J623036K315137J500956J861328K782971K282294
6096C1096615P61746R85045J319581R13498J160591J922346J162344k59078J855370
6087D0918058J220311J678018J33912J127553N88120j3851m87440o12711j234586
$$ plain form
6078 43317384 41640288 40458139 39492083 38938698 38690676 38721041 39224636 39428755 39491206
6069 39491206 40611929 41194590 41460607 41641943 41975166 42641988 43438063 44518328 44839014
6060 44839014 44873761 44518082 43646916 44061363 43424828 43344554 42482394 43019523 43428325 43444726
6050 43444726 43668870 41829717 40431248 38991868 38395560 37888260 36563787 35500304 34277606
6041 34277606 33388530 31630236 28782317 26935815 25527522 24752556 24203329 25088867 24395476
6032 24395476 24084371 23701221 23098217 21772301 21787989 22075706 22143551 21935997 21948364 22682148
6022 22682148 23841695 24180385 24908181 24945968 24680998 25749102 26767818 26698944 25949040
6013 25949040 25738583 26031032 25797044 25032289 24872387 23201395 22728435 22434867 22409223
$$ packed form
6078D3317384j677096j182149r66056n53385k48022L0365N03595K04119O2451
6069C9491206J120723N82661K66017J81336L33223O66822P96075J080265L20686
6060D4839014L4747l55679q71166M14447o36535q0274q62160N37129M08802J6401
6050D3444726K24144j839153j398469j439380n96308n07300j324473j063483j222698
6041C4277606q89076j758294k847919j846502j408293p74966n49227Q85538o93391
6032B4395476l11105l83150o03004j325916J5688K87717O7845k07554J2367P33784
6022B2682148J159547L38690P27796L7787k64970J068104J018716o8874p49904
6013B5949040k10457K92449k33988p64755j59902j670992m72960k93568k5644
$$ plain form
6004 22409223 22173817 22272190 23850978 23902451 23551482 23558480 23181770 23132776 20415269 19258087
5994 19258087 18512244 18529760 17826790 17182717 16657206 15986979 16024855 16688890 15998946 15243599
5984 15243599 15428770 16339995 15783376 15731407 16288172 16212293 15003228 15118444 15109660 15526891
5974 15526891 15539445 16838124 16900786 17852186 19123865 21025705 22289035 22766082 25064213
5965 25064213 26398055 28190977 26593388 25293327 23130907 20660829 19519379 17364085
5957 17364085 17042667 15781603 15605764 16502166 14800383 14737001 13251441 12775146 12087513
5948 12087513 11963514 12565431 12292635 12739227 12172653 11947928 11494828 10356062 10318124
5939 10318124 9780402 9130319 8460459 9483810 9706739 9558152 9984997 9816671 9996667
$$ packed form
6004B2409223k35406R8373J578788N1473l50969O998l76710m8994k717507j157182
5994A9258087p45843J7516p02970o44073n25511o70227L7876O64035o89944p55347
5984A5243599J85171R11225n56619n1969N56765p5879j209065J15216q784M17231
5974A5526891J2554J298679O2662R51400J271679J901840J263330M77047K298131
5965B5064213J333842J792922j597589j300061k162420k470078j141450k155294
5957A7364085l21418j261064j75839Q96402j701783o3382j485560m76295o87633
5948A2087513j23999O01917k72796M46592n66574k24725m53100j138766l7938
5939A0318124n37722o50083o69860J023351K22929j48587M26845j68326J79996
$$ plain form
5930 9996667 10089119 10778517 10115295 10205724 11577704 11162001 11588480 12129654 12767808 13349889
5920 13349889 14121182 15011626 14630389 15464944 17047162 17261868 18609547 19549623 21609826
5911 21609826 23658212 24207929 25438500 25652103 26162003 26036578 25734731 25309813 24407502
5902 24407502 25056418 24285273 23093219 22200524 22544172 21407838 20965608 19549714 18350346
5893 18350346 17439858 15885686 15429266 14890057 14204855 13360832 13262072 14100069 13615978
5884 13615978 13589345 13510240 13170713 12432157 12843555 12419463 11967261 11629924 12234984 12443326
5874 12443326 11469564 11300875 10269728 10115464 8685562 8368622 8181544 8007852 8711746
5865 8711746 8480942 9036108 8535657 8545631 8982828 7739938 8006812 7960317 8970001 8598788
$$ packed form
5930I996667R2452O89398o63222R0429J371980m15703M26479N41174O38154N82081
5920A3349889P71293Q90444l81237Q34555J582218K14706J347679R40076K060203
5911B1609826K048386N49717J230571K13603N09900j25425l01847m24918r02311
5902B4407502O48916p71145j192054q92695L43648j136334m42230j415894j199368
5893A8350346r10488j554172m56420n39209o85202q44023r8760Q37997m84091
5884A3615978k6633p9105l39527p38556M11398m24092m52202l37337O05060K08342
5874A2443326r73762j68689j031147j54264j429902l16940j87078j73692P03894
5865H711746k30804N55166n00451R974M37197j242890K66874m6495J009684l71213
$$ plain form
5855 8598788 8526290 7708056 7381629 7207476 6983642 6492195 6055443 6250760 6088462 6846231
5845 6846231 6528519 5436955 5644549 5176864 5239191 5440751 5440838 5235722 4808094 4408554
5835 4408554 3728834 3467749 3766501 3275698 2776698 2943573 2785467 3441361 2551301 2274424
5825 2274424 1216103 1991618 3016462 3143717 3306414 2115510 2521814 2605598 1918835
5816 1918835 814693 725144 1085724 1868399 2469199 1988145 1330655 1032958 1168905 615997
5806 615997 203724 1070440 560019 1679910 1195097 1487942 1182466 1104180 1199052 671812
5796 671812 950501 1488247 1139751 1429432 847016 -175487 -23021 327569 970577 101345
5786 101345 829411 723775 455015 619310 493166 756033 356375 918899 1461470 622648
$$ packed form
5855H598788p2498q18234l26427j74153k23834m91447m36752J95317j62298P57769
5845F846231l17712j091564K07594m67685O2327K01560Q7k05116m27628l99540
5835D408554o79720k61085K98752m90803m99000J66875j58106O55894q90060k76877
5825B274424j058321P75515J024844J27255J62697j190904M06304Q3784o86763
5816A918835j104142q9549L60580P82675O00800m81054o57490k97697J35947n52908
5806F15997m12273Q66716n10421J119891m84813K92845l05476p8286R4872n27240
5796F71812K78689N37746l48496K89681n82416j022503J52466L50590O43008q69232
5786A01345P28066j05636k68760J64295j26144K62867l99658N62524N42571q38822
$$ plain form
5776 622648 577337 316072 196137 -557652 277999 456411 686013 192184 731223 1109650
5766 1109650 -297442 -125941 -815006 348229 341289 1403421 1877524 706727 809208
5757 809208 1016880 653359 900452 459941 1365932 1587596 1384103 715969 71375 39122
5747 39122 -120345 525410 1764086 1727910 2088575 1859768 1040722 -194601 -657271 -65446
5737 -65446 -160013 950766 2381985 3217243 2442375 1806096 133156 187672 102800 806166
5727 806166 1043952 1751277 2769964 2529093 1829599 1651265 261064 463059 192183
5718 192183 1536790 1688541 1692822 2106027 993340 289557 234889 131973 1389478 965448
5708 965448 2000084 1872463 1558848 1948303 2101432 1613287 617682 1453696 2643377
$$ packed form
5776F22648m5311k61265j19935p53789Q35651J78412K29602m93829N39039L78427
5766A109650j407092J71501o89065J163235o940J062132M74103j170797J02481
5757H09208K07672l63521K47093m40511R05991K21664k03493o68134o44594l2253
5747C9122j59467O45755J238676l6176L60665k28807q19046j235323m62670N91825
5737f5446r4567J110779J431219Q35258p74868o36279j672940N4516q4872P03366
5727H06166K37786P07325J018687k40871o99494j78334j390201K01995k70876
5718A92183J344607J51751M281M13205j112687p03783n4668j02916J257505m24030
5708I65448J034636j27621l13615L89455J53129m88145r95605Q36014J189681
$$ plain form
5699 2643377 3141063 2889907 2518616 2039290 2096428 2402821 2213085 2115815 1677601 1972238
5689 1972238 2551389 3342147 3360517 3452569 4213279 5049850 5212009 6162640 5968392 4877383
5679 4877383 4831650 4296071 4824606 3757511 4674583 4292976 3090722 3514392 3013225
5670 3013225 3882179 2739732 3143280 3915885 4304627 5545045 4997279 5610755 5436260
5661 5436260 5332986 5575207 4846837 4154153 4491866 4554716 4302248 4162656 3643880 3057486
5651 3057486 4209505 4464883 4168081 4189346 5278618 4945212 5252334 6627493 7041752
5642 7041752 7996731 9323144 9546449 10541608 11557746 14152973 15538621 17544978 19124291
5633 19124291 21703955 23438908 23684580 22801751 22787081 21900456 22074435 21452790 21621737
$$ packed form
5699B643377M97686k51156l71291m79326N7138L06393j89736r7270m38214K94637
5689A972238N79151P90758J8370R2052P60710Q36571J62159R50631j94248j091009
5679D877383m5733n35579N28535j067095R17072l81607j202254M23670n01167
5670C013225Q68954j142447M03548P72605L88742J240418n47766O13476j74495
5661E436260j03274K42221p28370o92684L37713O2850k52468j39592n18776n86394
5651C057486J152019K55378k96802K1265J089272l33406L07122J375159M14259
5642G041752R54979J326413K23305R95159J016138K595227J385648K006357J579313
5633A9124291K579664J734953K45672q82829j4670q86625J73979o21645J68947
$$ plain form
5624 21621737 21083093 21370963 23343775 23962951 24487151 26656058 29714344 33576803 36001042
5615 36001042 38659336 39392583 39468072 39405956 38270413 35776601 32573006 31064809 29593516
5606 29593516 27274699 24025649 22514919 20201085 17925095 17150898 17032915 16705392 17630466
5597 17630466 18750795 19124458 19123398 21214428 23094984 23237708 22951611 22802687 22622959
5588 22622959 21042684 19075457 17281605 14873113 14104835 12706689 12018675 9803007
5580 9803007 8446108 8494752 7324415 6155756 5546630 6335760 5986640 5908280 6346354
5571 6346354 6476951 6411459 6012046 6463552 5680332 5602430 6129218 7720457 7481864 7294687
5561 7294687 7328788 7408938 5746239 5293652 4816744 3763489 3111399 4053200 4578654 3778248
$$ packed form
5624B1621737n38644K87870J972812O19176N24200K168907L058286L862459K424239
5615C6001042K658294P33247P5489o2116j135543k493812l203595j508197j471293
5606B9593516k318817l249050j510730k313834k275990p74197j17983l27523R25074
5597A7630466J120329L73663j060K091030J880556J42724k86097j48924j79728
5588B2622959j580275j967227j793852k408492p68278j398146o88014k215668
5580I803007j356899M8644j170337j168659o09126P89130l49120p8360M38074
5571F346354J30597o5492l99413M51506p83220p7902N26788J591239k38593j87177
5561G294687L4101Q0150j662699m52587m76908j053255o52090R41801N25454q00406
$$ plain form
5551 3778248 3371864 4255385 3820059 3923396 3789567 4481858 3416769 3470792 4432204 4805617
5541 4805617 4808081 4446776 4433859 3847364 3693162 3791328 3847600 2906505 2315627 2094969
5531 2094969 2858507 2564258 2379858 2011328 1998331 1586494 2144540 2175292 1404434 631601
5521 631601 698771 1058518 1112750 1240624 1206115 685002 943773 503657 1100258 696388
5511 696388 580965 584029 765994 916372 511602 760635 214619 507853 200464 831498
5501 831498 448400 830880 764690 575068 474797 -47767 332858 31121 659281 179245
5491 179245 875761 1928081 1305554 1089399 637987 1114464 17677 339775 588008
5482 588008 615814 1036124 1297397 1066779 612924 875299 297364 1048717 -373895 242340
$$ packed form
5551C778248m06384Q83521m35326J03337j33829O92291j065089N4023R61412L73413
5541D805617K464l61305j2917n86495j54202R8166N6272r41095n90878k20658
5531B094969P63538k94249j84400l68530j2997m11837N58046L0752p70858p72833
5521F31601O7170L59747N4232J27874l4509n21113K58771m40116N96601m03870
5511F96388j15423L064J81965J50378m04770K49033n46016K93234l07389O31034
5501H31498l83098L82480o6190j89622j00271n22564L80625l01737O28160m80036
5491A79245O96516J052320o22527k16155m51412M76477j096787L22098K48233
5482E88008K7806M20310K61273k30618m53855K62375n77935P51353j422612O16235
$$ plain form
5472 242340 558737 1635639 1971253 1664314 2234289 1481916 1700309 1927157 1658582 912604
5462 912604 553343 1238069 1625783 2107472 1873369 1869664 1545220 2164612 1713224 2372918
5452 2372918 1666139 1011788 2045237 2235368 2468446 1464156 2194560 1522230 1627808
5443 1627808 2308265 2419826 2069803 2207487 2669863 2647283 2813436 2324147 2819044 2932215
5433 2932215 3608539 4238355 4430576 4689143 3822693 4035213 4091469 3738969 4067525 4129064
5423 4129064 4460858 4205363 4615446 4861778 5021988 5753100 5782780 6219333 7450192 8361804
5413 8361804 9005285 8977687 9446741 9564747 10379407 11896803 12637301 14002036 15822036
5404 15822036 17847717 20429367 23074845 24709510 26628317 29177317 32642391 36380735
$$ packed form
5472B42340L16397J076902L35614l06939N69975p52373K18393K26848k68575p45978
5462I12604l59261O84726L87714M81689k34103l705l24444O19392m51388O59694
5452B372918p06779o54351J033449J90131K33078j004290P30404o72330J05578
5443A627808O80457J11561l50023J37684M62376k2580J66153m89289M94897J13171
5433B932215O76324O29816J92221K58567q66450K12520N6256l52500L28556O1539
5423D129064L31794k55495M10083K46332J60210P31112K9680M36553J230859R11612
5413H361804O43481k7598M69054J18006Q14660J517396P40498J364735J820000
5404A5822036K025681K581650K645478J634665J918807K549000L465074L738344
$$ plain form
5396 36380735 42047388 47869244 55390622 67180770 83633475 106650486 144152176 200852646
5388 200852646 274455140 349730683 404081193 418985475 387535317 329663009 268966411
5381 268966411 216635833 174859882 140989692 115967717 95540063 80208835 68593901
5374 68593901 60387555 52987521 46250165 41512003 37025492 33330057 30233094 28464442
5366 28464442 25704005 23213810 22410103 22428829 20997247 18746156 17599481 16848971 16339542
5357 16339542 16198705 15941934 15400111 14173312 13861466 13986633 12683131 11439661 10824346
5348 10824346 11033517 10885988 10930091 11394796 10150646 9431073 8576213 9204660 9059012
5339 9059012 8689332 9281067 9210630 8939452 8770921 8743781 7180553 6236752 6317448 6847811
$$ packed form
5396C6380735N666653N821856P521378J1790148J6452705K3017011L7501690N6700470
5388B00852646P3602494P5275543N4350510J4904282l1450158n7872308o0696598
5381B68966411n2330578m1775951l3870190k5021975k0427654j5331228j1614934
5374F8593901q206346p400034o737356m738162m486511l695435l096963j768652
5366B8464442k760437k490195q03707J8726j431582k251091j146675p50510n09429
5357A6339542j40837k56771n41823j226799l11846J25167j303502j243470o15315
5348A0824346K09171j47529M4103M64705j244150p19573q54860O28447j45648
5339I059012l69680N91735p0437k71178j68531k7140j563228r43801Q0696N30363
$$ plain form
5329 6847811 7254087 6975323 7429230 6661139 6612157 6749363 6703661 5908921 5211902 5411772
5319 5411772 5829025 5845257 6155376 6337192 5453398 5007253 5265379 4599749 3920177 3764107
5309 3764107 4173406 3845711 4624683 4821667 4282429 3922056 4064111 4552407 5217282 5200355
5299 5200355 5263097 4429892 4091275 3842132 3527848 3039369 2638182 3319823 3645166 3731367
5289 3731367 3670093 3537190 3270695 2667216 2721551 3667860 3286160 3448751 3873404 4114376
5279 4114376 3474914 4011506 4018814 4018988 2943994 3618823 4330965 4210144 4474928 4534587
5269 4534587 4617356 4673697 3993114 4966160 3637618 4536938 4797921 5037966 5288484 5268755
5259 5268755 5539507 4149802 3745166 3302585 2843698 3680269 3925121 5529345 5899343
$$ packed form
5329F847811M06276k78764M53907p68091m8982J37206m5702p94740o97019J99870
5319E411772M17253J6232L10119J81816q83794m46145K58126o65630o79572j56070
5309C764107M09299l27695P78972J96984n39238l60373J42055M88296O64875j6927
5299E200355O2742q33205l38617k49143l14284m88479m01187O81641L25343Q6201
5289C731367o1274j32903k66495o03479N4335R46309l81700J62591M24653K40972
5279D114376o39462N36592P308J74j074994O74829P12142j20821K64784N9659
5269D534587Q2769N6341o80583R73046j328542Q99320K60983K40045K50518j9729
5259E268755K70752j389705m04636m42581m58887Q36571K44852J604224L69998
$$ plain form
5250 5899343 5654597 5623507 4950396 4535779 4203699 4614979 4864861 5612071 6215648 6801748
5240 6801748 6553796 6707455 6653154 6293937 6846248 6567279 6192696 6448645 5975282 6763476
5230 6763476 6723107 6999061 7205792 6973053 8107377 7506429 7740916 6802012 6697409 7120967
5220 7120967 7422666 7662579 7261609 7413481 8346204 8140960 7448297 7197952 6826119 7382464
5210 7382464 7862934 7962701 7704870 7122196 7534620 7837378 7301360 7430458 6968983 8340238
5200 8340238 7829957 8421569 8078654 7816714 7628802 7269399 6898409 7372729 7384615 8445270
5190 8445270 8407930 8600542 8295201 8688729 8495641 8291121 8038281 8410658 8262982 8155025
5180 8155025 7764493 8344770 8928194 9233863 9066036 9496564 9340369 9333399 9472334 8889398
$$ packed form
5250E899343k44746l1090o73111m14617l32080M11280K49882P47210O03577N86100
5240F801748k47952J53659n4301l59217N52311k78969l74583K55949m73363P88194
5230F763476m0369K75954K06731k32739J134324o00948K34487r38904j04603M23558
5220G120967L01699K39913m00970J51872R32723k05244o92663k50345l71833N56345
5210G382464M80470R9767k57831n82674M12424L02758n36018J29098m61475J371255
5200H340238n10281N91612l42915k61940j87912l59403l70990M74320J1886J060655
5190H445270l7340J92612l05341L93528j93088k04520k52840L72377j47676j07957
5180H155025l90532N80277N83424L05669j67827M30528j56195o970J38935n82936
$$ plain form
5170 8889398 8324155 7859124 9311694 8939231 8779321 8951569 8456688 8940163 8552282
5161 8552282 8907532 7986687 7620490 8221879 7324083 7760848 6633545 7104881 7337360
5152 7337360 7291292 6581498 7311924 7691816 7478893 7254993 6979914 7034208 6693856 7239571
5142 7239571 6784061 6671920 7196864 8089611 8323108 6877554 6071149 6316618 7323509
5133 7323509 7037532 7095477 6577101 6695390 6959108 7256669 7009178 6088509 7198116 7268285
5123 7268285 8052074 7946755 7452617 7956103 7503939 7766517 7234016 8050268 8252179 9041708
5113 9041708 9370014 9623389 9967936 10311715 9449802 9471665 9357552 9304659 10527273 11185885
5103 11185885 11029356 10373528 10852733 11023688 11203537 11301085 11297257 11669370 11794021 12108635
$$ packed form
5170H889398n65243m65031J452570l72463j59910J72248m94881M83475l87881
5161H552282L55250r20845l66197O01389q97796M36765j127303M71336K32479
5152G337360m6068p09794P30426L79892k12923k23900k75079N4294l40352N45715
5142G239571m55510j12141N24944Q92747K33497j445554q06405K45469J006891
5133G323509k85977N7945n18376J18289K63718K97561k47491r20669J109607P0169
5123G268285P83789j05319m94138N03486m52164K62578n32501Q16252K01911P89529
5113I041708L28306K53375L44547L43779q61913K1863j14113n2893J222614O58612
5103A1185885j56529o55828M79205J70955J79849R7548l828L72113J24651L14614
$$ plain form
5093 12108635 12508054 12955595 12476147 13320045 14285380 14331305 15220247 15608194 16614736
5084 16614736 15436998 16216635 16408601 16395226 16826374 16721347 17398019 17497645 17939361 18888360
5074 18888360 18971336 18569266 19881132 20852337 21037324 20285475 20524348 20954566 20815529
5065 20815529 21346278 22029072 22485410 22485855 23309474 24326446 23355339 23281472 23578037 23192713
5055 23192713 22739831 23431287 23954594 24496094 24496660 24667133 24481095 24059423 24488795 24197363
5045 24197363 23963299 22873054 23517072 24357181 23791523 23383304 23110390 22812558 22960556
5036 22960556 23645616 23845351 22691892 22552579 22870747 22422525 21980966 21062640 21135854
5027 21135854 20630738 20844573 21084669 20726134 20436764 19503962 18862728 18719093 18095768
$$ packed form
5093A2108635L99419M47541m79448Q43898R65335M5925Q88942L87947J006542
5084A6614736j177738P79637J91966j3375M31148j05027O76672R9626M41716R48999
5074A8888360Q2976m02070J311866R71205J84987p51849K38873M30218j39037
5065B0815529N30749O82794M56338M45Q23619J016972r71107p3867K96565l85324
5055B3192713m52882O91456N23307N41500N66J70473j86038m21672M29372k91432
5045B4197363k34064j090245O44018Q40109n65658m08219k72914k97832J47998
5036B2960556O85060J99735j153459j39313L18168m48222m41559r18326P3214
5027B1135854n05116K13835K40096l58535k89370r32802o41234j43635o23325
$$ plain form
5018 18095768 18733867 18860117 18768914 18151661 19013632 18637370 18643059 18020550 18309341 18247238
5008 18247238 18354370 18733152 17962127 17287442 16711511 17578818 17128139 17634245 17656331 17791046
4998 17791046 17523289 17396039 17601030 17855547 16977107 16549104 17041475 17517399 17057675
4989 17057675 17411929 17180400 17845941 17501465 19065600 18612802 18770398 17936477 18440026
4980 18440026 18250121 18083099 19003488 18911134 19563324 19349221 20181628 20557028 20164879 19735111
4970 19735111 19586975 19845969 19527123 20578716 21690901 21241998 21162891 21708485 22168704
4961 22168704 21680396 22323633 22431857 22624031 22559657 23308930 22677109 22161436 21536922 21620085
4951 21620085 22010538 21752533 22170800 22148523 22317378 21479733 21785844 21219609 20350254 20028696
$$ packed form
5018A8095768O38099J26250r1203o17253Q61971l76262N689o22509K88791o2103
5008A8247238J07132L78782p71025o74685n75931Q67307m50679N06106K2086J34715
4998A7791046k67757j27250K04991K54517q78440m28003M92371M75924m59724
4989A7057675L54254k31529O65541l44476J564135m52798J57596q33921N03549
4980A8440026j89905j67022R20389r2354O52190k14103Q32407L75400l92149m29768
4970A9735111j48136K58994l18846J051593J112185m48903p9107N45594M60219
4961B2168704m88308O43237J08224J92174o4374P49273o31821n15673o24514Q3163
4951B1620085L90453k58005M18267k2277J68855q37645L06111n66235q69355l21558
$$ plain form
4941 20028696 20490680 20940262 20813449 21075192 19869175 19564797 19660880 19504784 20079464
4932 20079464 19326921 20310923 19570110 20113365 19457891 18732897 18774132 18489132 19502922
4923 19502922 19637582 19829714 19292465 18526081 18545281 17942798 17645216 17963378 18436901 19084634
4913 19084634 18796756 18764563 17932889 17742926 17352317 16931534 16911078 17253704 17159314 17016459
4903 17016459 16166079 15177515 14073688 14635838 14372205 15292467 15045718 15896856 16332968
4894 16332968 16357465 15876432 14111423 14215647 14208788 14911762 16693888 16640376 17777182 17658870
4884 17658870 18026091 17022869 16654953 17564057 17237961 18466899 19459782 20282064 20659662
4875 20659662 20134620 21120097 21050509 22050791 22986908 23941384 25136670 25094368 25897275
$$ packed form
4941B0028696M61984M49582j26813K61743j206017l04378R6083j56096N74680
4932B0079464p52543R84002p40813N43255o55474p24994M1235k85000J013790
4923A9502922J34660J92132n37249p66384J9200o02483k97582L18162M73523O47733
4913A9084634k87878l2193q31674j89963l90609m20783k0456L42626r4390j42855
4903A7016459q50380r88564j103827N62150k63633R20262k46749Q51138M36112
4894A6332968K4497m81033j765009J04224o859P02974J782126n3512J136806j18312
4884A7658870L67221j003222l67916R09104l26096J228938R92883Q22282L77598
4875B0659662n25042R85477o9588J000282R36117R54476J195286m2302Q02907
$$ plain form
4866 25897275 26042987 26736530 26827835 28299359 29875124 31120002 31954691 32320433 33221269
4857 33221269 32253516 32597300 34241344 35154294 36424026 37582750 39368438 39459652 39837396
4848 39837396 40952545 40950997 41689375 42772269 45383260 47877596 48827014 50657354 50959329
4839 50959329 51261925 51536389 52297273 53698875 53481072 55068215 56313345 56809568 56588783
4830 56588783 54953282 54408721 53301939 53336785 53792880 54895659 54616661 54816594 55492764
4821 55492764 55736768 55738885 55644878 56173603 56120544 56161859 56966089 58444913 58861037 59358017
4811 59358017 61078133 60698092 60351088 60826225 61703220 61411367 60155272 60824217 59969209
4802 59969209 58784807 58349010 57575999 56024855 54906060 55018083 54202882 52543559 51211391
$$ packed form
4866B5897275J45712O93543R1305J471524J575765J244878Q34689L65742R00836
4857C3221269r67753L43784J644044R12950J269732J158724J785688R1214L77744
4848C9837396J115149j548P38378J082894K610991K494336R49418J830340L01975
4839E0959329L02596K74464P60884J401602k17803J587143J245130M96223k20785
4830E6588783j635501n44561j106782L4846M56095J102779k78998J99933O76170
4821E5492764K44004K117r4007N28725n3059M1315Q04230J478824M16124M96980
4811E9358017J720116l80041l47004M75137Q76995k91853j256095O68945q55008
4802E9969209j184402m35797p73011j551144j118795J12023q15201j659323j332168
$$ plain form
4793 51211391 50568325 50415925 49971949 49338279 48734156 48765459 48377848 48039925 48260434 47064868
4783 47064868 47067966 47117872 47864669 46109445 45803725 45437934 44094677 43211477 41292407
4774 41292407 40082062 39336853 37954828 37390949 35955436 35063840 33704764 33351482 32070175
4765 32070175 29382118 29057506 28723258 28378679 27896915 27651925 27568069 27037420 27631230
4756 27631230 26843177 25636153 25398962 25076622 25654085 25088170 25531130 24595278 24836970
4747 24836970 24466734 23472174 22409968 22480889 21982774 21118409 20669514 20479093 20460562 20918259
4737 20918259 21393575 20733033 20848343 21556643 22782574 22602661 22428826 22830485 23784598
4728 23784598 24078807 23399977 23306678 22880891 23105083 23173044 22672526 22855128 22648060 24604443
$$ packed form
4793E1211391o43066j52400m43976o33670o04123L1303l87611l37923K20509j195566
4783D7064868L098M9906P46797j755224l05720l65791j343257q83200j919070
4774D1292407j210345p45209j382025n63879j435513q91596j359076l53282j281307
4765C2070175k688057l24612l34248l44579m81764k44990q3856n30649N93810
4756B7631230p88053j207024k37191l22340N77463n65915M42960r35852K41692
4747B4836970l70236r94560j062206P0921m98115q64365m48895j90421j8531M57697
4737B0918259M75316o60542J15310P08300J225931j79913j73835M01659R54113
4728B3784598K94209o78830r3299m25787K24192O7961n00518J82602k07068J956383
$$ plain form
4718 24604443 24206387 24843417 24582148 25303777 26949956 27259920 27934096 28751766 31050457
4709 31050457 31845336 33213116 33787811 35409260 36378912 39053966 40622572 42118069 43952402
4700 43952402 46134680 48056530 49235048 50389714 51674077 53522803 55592556 56515754
4692 56515754 58875869 59024125 60601880 61273693 62013698 62174289 63200364 65210772 65899828
4683 65899828 67416524 68723024 70979036 73051065 75179346 75897660 78255149 81342550
4675 81342550 84239441 86909042 88857361 91065508 93782548 96400323 98597482 98802704
4667 98802704 100559948 101394200 101290526 101280939 100108950 99479135 98055314 96836405 94552554
4658 94552554 92373729 91579127 89749423 87694067 85137890 82633817 81470862 79409013
$$ packed form
4718B4604443l98056O37030k61269P21629J646179L09964O74176Q17670K298691
4709C1050457P94879J367780N74695J621449R69652K675054J568606J495497J834333
4700D3952402K182278J921850J178518J154666J284363J848726K069753R23198
4692E6515754K360115J48256J577755O71813P40005J60591J026075K010408O89056
4683F5899828J516696J306500K256012K072029K128281P18314K357489L087401
4675H1342550K896891K669601J948319K208147K717040K617775K197159K05222
4667I8802704J757244Q34252j03674r587j171989o29815j423821j218909k283851
4658I4552554k178825p94602j829704k055356k556177k504073j162955k061849
$$ plain form
4650 79409013 77729961 75889929 74260633 73660837 72561897 71213763 70096278 68408581
4642 68408581 68008206 66405052 64422251 62726519 60048662 58667598 57342462 55959737
4634 55959737 54113232 52182374 50390421 47345299 44188426 42184017 39428762 38413857
4626 38413857 38124371 37466626 36779437 35892383 34345961 33055585 31283780 31700344 31172638
4617 31172638 33103950 34294339 35413412 36587732 37681392 40217297 42763619 47458505
4609 47458505 54727747 63430881 73378666 80488768 85216268 88316650 90954401 96519472
4601 96519472 105784194 118755263 133692914 145820319 153814711 154153292 151578590 150644246
4593 150644246 154992373 165745407 179965154 193064718 199625508 197024491 186932746
$$ packed form
4650G9409013j679052j840032j629296n99796j098940j348134j117485j687697
4642F8408581m00375j603154j982801j695732k677857j381064j325136j382725
4634E5959737j846505j930858j791953l045122l156873k004409k755255j014905
4626C8413857k89486o57745o87189q87054j546422j290376j771805M16564n27706
4617C1172638J931312J190389J119073J174320J093660K535905K546322M694886
4609D7458505P269242Q703134R947785P110102M727500L100382K637751N565071
4601I6519472R264722J2971069J4937651J2127405P994392L38581k574702r34344
4593A50644246M348127J0753034J4219747J3099564O560790k601017j0091745
$$ plain form
4586 186932746 174665122 164228558 159667640 159224307 161107764 161615497 156303956 147265267
4578 147265267 133471364 120671190 110056536 103174773 98780986 93811094 89454682 81833788
4570 81833788 73352925 64735820 56736045 49014137 42948360 38378524 35662355 32844413
4562 32844413 30958091 28148619 25368941 24193873 21996510 21268139 20763299 20349159 20894690
4553 20894690 20106877 19825250 18290386 17905297 16057282 15073468 13992883 15129206 15074552
4544 15074552 15238650 15178490 14228009 14011532 13274694 13180864 12532134 11991142 11987816 11166082
4534 11166082 11939885 11069861 11420817 11254798 10986825 10914384 10229274 9806138 9421186 8721345
4524 8721345 8626728 9095532 9431918 9670529 9294749 9431550 8761748 8326726 8529959 7585816
$$ packed form
4586A86932746j2267624j0436564m560918m43333J883457N07733n311541r038689
4578A47265267j3793903j2800174j0614654o881763m393787m969892m356412p620894
4570H1833788q480863q617105p999775p721908o065777m569836k716169k817942
4562C2844413j886322k809472k779678j175068k197363p28371n04840m14140N45531
4553B0894690p87813k81627j534864l85089j848015r83814j080585J136323n4654
4544A5074552J64098o0160r50481k16477p36838r3830o48730n40992l326q21734
4534A1166082P73803q70024L50956j66019k67973p2441o85110m23136l84952o99841
4524H721345r4617M68804L36386K38611l75780J36801o69802m35022K03233r44143
$$ plain form
4514 7585816 7715809 7697335 8189223 8088546 7184037 7107386 6550676 6785844 6003862 6445007
4504 6445007 6564893 6824179 6604075 7106502 7220372 6978650 7064928 5992584 5470474 5047184
4494 5047184 5764555 5832462 5356958 5707296 5227675 5676668 5603349 5238259 4549829 4373649
4484 4373649 4777416 5148363 5149913 4738768 5645840 5635297 5490650 4584617 5038247 4919245
4474 4919245 4325525 4973403 4036919 4587591 3694894 4485399 4244241 4141780 4434445 4222601
4464 4222601 4537630 3822896 3944167 4543139 4617856 4737348 4237589 4533656 4027221 4607302
4454 4607302 3460767 3071650 2575703 3316411 4126339 3802031 3966103 4184394 4341365
4445 4341365 3810851 3320062 3069867 3045109 3326237 3303539 3606333 4064805 3879122 4105795
$$ packed form
4514G585816J29993j8474M91888j00677r04509p6651n56710K35168p81982M41145
4504F445007J19886K59286k20104N02427J13870k41722Q6278j072344n22110m23290
4494E047184P17371O7907m75504L50338m79621M48993p3319l65090o88430j76180
4484D373649M03767L70947J550m11145R07072j0543j44647r06033M53630j19002
4474D919245n93720O47878r36484N50672q92697P90505k41158j02461K92665k11844
4464D222601L15029p14734J21271N98972P4717J19492m99759K96067n06435N80081
4454D607302j146535l89117m95947P40708Q09928l24308J64072K18291J56971
4445D341365n30514m90789k50195k4758K81128k2698L02794M58472j85683K26673
$$ plain form
4435 4105795 3965439 2958965 2387985 2387798 2473883 2436022 1926589 2869718 3089072 3628032
4425 3628032 3037552 2795744 2810970 2829500 4022912 3355446 2810808 2511726 3055839 3115501
4415 3115501 2183568 2467137 2820148 3572492 3631677 3405064 3522197 2545519 2873218 2503652
4405 2503652 3263294 2223352 2963941 3369488 3376787 3510257 2835130 3146903 1913277 2760560
4395 2760560 2951498 3632316 3299467 2801640 2654736 2608810 2678024 2694870 3281274 2977357
4385 2977357 3229453 3736888 2802791 2863484 2672275 3396355 3058867 3410992 2929856 3558602
4375 3558602 2767572 2088595 1774716 2447172 2474927 2728003 3899389 3366411 2974687 2871487
4365 2871487 2951162 1897526 1873683 2551848 2702444 3256165 3019262 3478022 3405125 3120479
$$ packed form
4435D105795j40356j006474n70980j87Q6085l7861n09433R43129K19354N38960
4425C628032n90480k41808J5226J8530J193412o67466n44638k99082N44113N9662
4415C115501r31933K83569L53011P52344N9185k26613J17133r76678L27699l69566
4405B503652P59642j039942P40589M05547P299J33470o75127L11773j233626Q47283
4395B760560J90938O80818l32849m97827j46904m5926O9214J6846N86404l03917
4385B977357K52096N07435r34097O0693j91209P24080l37488L52125m81136O28746
4375C558602p91030o78977l13879O72456K7755K53076J171386n32978l91724j03200
4365B871487P9675j053636k3843O78165J50596N53721k36903M58760p2897k84646
$$ plain form
4355 3120479 2979857 2325715 1877637 1294535 2816721 2492221 2316369 2096309 3259481
4346 3259481 2915305 1908510 2290603 2006868 2300366 2670385 2928339 3410383 2639074
4337 2639074 2764917 2130042 1795555 1506475 1765635 2549748 2699916 2399154 2803889 2767522
4327 2767522 1779230 2379776 2454298 2751881 2214821 3839648 4405349 4578338 5099231 5299994
4317 5299994 4631815 3792523 3518280 3460172 3311761 2774314 2459350 2939042 2759184 3304904
4307 3304904 3051567 2783377 2183407 3213230 3168340 2546927 1879477 1415526 2401226 2521228
4297 2521228 2776184 2258399 2190674 2626953 3021731 2707941 1914486 1153735 2216093 2672976
4287 2672976 3638845 4262039 3786393 4771029 3877058 4055267 3347923 2043958 2775757
$$ packed form
4355C120479j40622o54142m48078n83102J522186l24500j75852k20060J163172
4346C259481l44176j006795L82093k83735K93498L70019K57954M82044p71309
4337B639074J25843o34875l34487k89080K59160P84113J50168l00762M04735l6367
4327B767522r88292O00546P4522K97583n37060J624827N65701J72989N20893K00763
4317E299994o68179q39292k74243n8108j48411n37447l14964M79692j79858N45720
4307C304904k53337k68190n99970J029823m4890o21413o67450m63951R85700J20002
4297B521228K54956n17785o7725M36279L94778l13790p93455p60751J062358M56883
4287B672976R65869O23194m75646R84636q93971J78209p07344j303965P31799
$$ plain form
4278 2775757 2872225 4042063 3700728 4483763 4008919 3585225 3319962 2810803 2733657 3428480
4268 3428480 4722394 4194771 4510345 4692261 5481061 5214344 4561247 4017748 3652241
4259 3652241 3849609 3851494 3292604 2639432 2701687 3372413 3952884 4638965 4770048 4340270
4249 4340270 4110297 3772343 2895199 3285689 3258060 3883082 3933400 4630342 4547686 4229826
4239 4229826 3827299 2371294 1952276 1944848 2741744 3505969 4218240 4240149 4593592 4448552
4229 4448552 4638266 3639237 3651670 3652850 3716572 3639130 4043742 3897701 4565085 4075148
4219 4075148 4502369 3845605 3655072 3383407 3582887 3498127 3480234 3733875 4596456 4070752
4209 4070752 4564801 4433794 4966343 3836797 4207012 3615947 3109991 3442541 4402641
$$ packed form
4278B775757R6468J169838l41335P83035m74844m23694k65263n09159p7146O94823
4268C428480J293914n27623L15574J81916P88800k66717o53097n43499l65507
4259C652241J97368J885n58890o53172O2255O70726N80471O86081J31083m29778
4249D340270k29973l37954q77144L90490k7629O25022N0318O96942q2656l17860
4239D229826m02527j456005m19018p428P96896P64225P12271K1909L53443j45040
4229D448552J89714r99029J2433J180O3722p7442M04612j46041O67384m89937
4219D075148M27221o56764j90533k71665J99480q4760j7893K53641Q62581n25704
4209D070752M94049j31007N32549j129546L70215n91065n05956L32550R60100
$$ plain form
4200 4402641 4390706 3193243 3686945 3937223 4172171 3528145 4385846 4217046 4445453 5063629
4190 5063629 5459974 4869983 4196853 4444747 4741430 4651599 4633273 4650490 5317241 4270871
4180 4270871 4223835 3574015 3309212 3345614 4305432 4788175 4926069 4746209 5211359 4356369
4170 4356369 3169054 2498577 2425944 2879149 3190740 4106976 3663457 2988312 2512817 2252331
4160 2252331 1722282 1854871 2606944 3204572 3636888 3241980 3771028 3042777 3075136 3120897
4150 3120897 2930743 3280617 3792470 5035573 4154543 3752779 3751119 2629952 2686808 2977858
4140 2977858 4905541 4646086 4772400 5016507 4390044 4000150 3949363 3752464 3551114 3581096
4130 3581096 4961132 5208751 4714666 4040519 3486730 2728077 2271253 2479853 3426914
$$ packed form
4200D402641j1935j197463M93702K50278K34948o44026Q57701j68800K28407O18176
4190E063629L96345n89991o73130K47894K96683q9831j8326J7217O66751j046370
4180D270871m7036o49820k64803L6402R59818M82743J37894j79860M65150q54990
4170D356369j187315o70477p2633M53205L11591R16236m43519o75145m75495k60486
4160B252331n30049J32589P52073N97628M32316l94908N29048p28251L2359M5761
4150C120897j90154L49874N11853J243103q81030m01764j660j121167N6856K91050
4140B977858J927683k59455J26314K44107o26463l89894n0787j96899k01350K9982
4130C581096J380036K47619m94085o74147n53789p58653m56824K08600R47061
$$ plain form
4121 3426914 3549425 3367202 3675142 3415504 2988879 2521475 2759921 2555063 1777900 2438679
4111 2438679 3438565 3009116 3030085 3139476 3665263 3142606 3000938 3485969 2697531 2655661
4101 2655661 2332933 2967326 2772819 2612612 3751891 4000778 3984932 3829214 4190413 3871332
4091 3871332 3381592 3611861 3719741 3624628 3697909 4393087 4596350 5218557 5419438 5346395
4081 5346395 4703121 3950150 4352125 4576442 5295671 4799087 5166873 6349296 6936021
4072 6936021 7520307 7999953 8112149 7563766 7686943 7846016 7528321 7806182 8910456
4063 8910456 9530202 9791526 10486589 10759777 11516590 11489949 11426500 12271564 13064587 14189986
4053 14189986 15090477 15860650 15438915 16493011 17769177 18436255 18563084 19385986 20216847
$$ packed form
4121C426914J22511j82223L07940k59638m26625m67404K38446k04858p77163O60779
4111B438679R99886m29449K0969J09391N25787n22657j41668M85031p88438m1870
4101B655661l22728O34393j94507j60207J139279K48887j5846j55718L61199l19081
4091C871332m89740K30269J07880r5113P3281O95178K03263O22207K00881p3043
4081E346395o43274p52971M01975K24317P19229m96584L67786J182423N86725
4072F936021N84286M79646J12196n48383J23177J59073l17695K77861J104274
4063H910456O19746K61324O95063K73188P56813k6641o3449Q45064P93023J125399
4053A4189986R00491P70173m21735J054096J276166O67078J26829Q22902Q30861
$$ plain form
4044 20216847 20768336 21714689 22097482 22677434 23593895 24615357 25639406 26663377 27265305
4035 27265305 27573995 28757640 29685768 30852375 32483341 34094953 34454252 35419056 36559586
4026 36559586 37477177 38219073 38769848 40086330 41054158 43930511 45582297 46595383 46693343
4017 46693343 48563823 49847303 50642120 50711912 51169277 52077108 53115367 55320443 56058884
4008 56058884 56531090 57729011 58537578 60868683 60280781 61993552 61872407 62794540 63513223
3999 63513223 65626871 67199914 69065240 70909425 72812926 73011959 74455661 75534962
3991 75534962 76890579 77465828 78634771 80851235 83724247 84946685 86410538 87341907
3983 87341907 88684628 88824030 90582512 92078525 93006550 94585030 96840528 98904950
$$ packed form
4044B0216847N51489R46353L82793N79952R16461J021462J024049J023971O01928
4035B7265305L08690J183645R28128J166607J630966J611612L59299R64804J140530
4026C6559586R17591P41896N50775J316482R67828K876353J651786J013086R7960
4017D6693343J870480J283480P94817O9792M57365R07831J038259K205076P38441
4008E6058884M72206J197921Q08567K331105n87902J712771j21145R22133P18683
3999F3513223K113648J573043J865326J844185J903501J99033J443702J079301
3991G5534962J355617N75249J168943K216464K873012J222438J463853R31369
3983H7341907J342721J39402J758482J496013R28025J578480K255498K064422
$$ plain form
3975 98904950 99850525 101705439 103750023 105000587 105383754 107573375 108887054 109350787 109559295
3966 109559295 110619088 110519977 111105338 111359562 112328185 110861228 112184945 113049036 113869967
3957 113869967 111817320 110710149 111277200 111863105 112440602 112532033 111707646 111476664 110352004
3948 110352004 111405842 110359875 109815912 109659659 110437892 110889912 110673573 110358522 109683291
3939 109683291 107755783 106548104 105795165 104839767 103701412 102403390 101766302 100139870
3931 100139870 98207859 97286786 94834147 92388775 89808745 88993442 87552759 86070951
3923 86070951 84505111 84077499 82111392 81571054 80509561 79668877 78807329 78049741 77820034
3914 77820034 77394530 76366103 76143572 75200533 74578983 73745955 73291898 72865463 72261443
$$ packed form
3975I8904950R45575J854914K044584J250564L83167K189621J313679M63733K08508
3966A09559295J059793r9111N85361K54224R68623j466957J323717Q64091Q20931
3957A13869967k052647j107171N67051N85905N77497R1431q24387k30982j124660
3948A10352004J053838j045967n43963j56253P78233M52020k16339l15051o75231
3939A09683291j927508j207679p52939r55398j138355j298022o37088j626432
3931A00139870j932011r21073k452639k445372k580030q15303j440683j481808
3923H6070951j565840m27612j966107n40338j061493q40684q61548p57588k29707
3914G7820034m25504j028427k22531r43039o21550q33028m54057m26435o04020
$$ plain form
3905 72261443 70768388 69513287 68586042 68688796 67199145 66245094 64444041 63516987 63180512
3896 63180512 62046619 61574028 58838631 58287570 57600373 56796576 55133972 53330711 52414236
3887 52414236 51310459 51239749 50598655 49159927 48209769 47217746 47491333 46670613 46276537
3878 46276537 44977241 45193982 43834323 43484058 42465650 41968242 41404205 40370320 39838535
3869 39838535 39496650 39127280 39081753 38224737 37665079 36458534 37102377 36328255 35452671
3860 35452671 34145762 33686758 33393953 33141440 32973724 33436136 33107176 32335353 32155910
3851 32155910 31726623 30709962 30397268 30234911 30505159 30633279 32004148 32255586 32886791
3842 32886791 32725352 33127455 33681902 34420580 34213637 34579921 36011299 37514640 38962004
$$ packed form
3905G2261443j493055j255101r27245J02754j489651r54051j801053r27054l36475
3896F3180512j133893m72591k735397n51061o87197q03797j662604j803261r16475
3887E2414236j103777p0710o41094j438728r50158r92023K73587q20720l94076
3878D6276537j299296K16741j359659l50265j018408m97408n64037j033885n31785
3869C9838535l41885l69370m5527q57016n59658j206545O43843p74122q75584
3860C5452671j306909m59004k92805k52513j67716M62412l28960p71823j79443
3851C2155910m29287j016661l12694j62357K70248J28120J370869K51438O31205
3842C2886791j61439M02103N54447P38678k06943L66284J431378J503341J447364
$$ plain form
3833 38962004 40101154 41742455 42823582 44623717 46559865 48540037 50121676 51748343
3825 51748343 54315045 56539544 58162547 60220287 62129999 64151354 65920168 68683805
3817 68683805 69727791 70643975 71155679 71859942 72050683 72219411 72559436 72492531 72425325 71848821
3807 71848821 71967441 71436017 70546435 69754566 69390225 68872904 67607066 66983449 66401279
3798 66401279 65661033 65079221 63238595 62478854 61474612 61513533 60950760 59738601 58178039
3789 58178039 57876078 57800814 58177099 58268648 58092667 58493643 59459318 60995729 62010006
3780 62010006 62293712 62358481 62459278 62795449 62992389 63868917 64584354 65292334 66397219
3771 66397219 67541325 68304393 68416270 68976484 67874858 67063683 65914173 65607870 63531971
$$ packed form
3833C8962004J139150J641301J081127J800135J936148J980172J581639J626667
3825E1748343K566702K224499J623003K057740J909712K021355J768814K763637
3817F8683805J043986R16184N11704P04263J90741J68728L40025o6905o7206n76504
3807G1848821J18620n31424q89582p91869l64341n17321j265838o23617n82170
3798F6401279p40246n81812j840626p59741j004242L8921n62773j212159j560562
3789E8178039l01961p5264L76285R1549j75981M00976R65675J536411J014277
3780F2010006K83706O4769J00797L36171J96940Q76528P15437P07980J104885
3771F6397219J144106P63068J11877N60214j101626q11175j149510l06303k075899
$$ plain form
3762 63531971 61894964 59902292 58319256 55860452 53261743 50748354 47825968 45249159
3754 45249159 43190940 41372429 39059181 37140153 36792759 35287759 33992074 32666853
3746 32666853 31700430 29839630 29076782 27974263 27590796 26640511 25879520 25654637 24465283
3737 24465283 24041697 22982762 23418641 22083008 21610700 21385028 20922758 20648879 19863446
3728 19863446 19698713 18325805 18309522 17892499 19078255 19093460 18546867 18506555 17336028
3719 17336028 17172969 16538903 17803421 17518814 17296083 17868615 18535758 18874006 17997776
3710 17997776 18090394 16565790 16672559 16767283 17130337 16205370 16408968 16342577 16437826 16439548
3700 16439548 16163755 15548996 14859046 15131038 15098475 14605473 15050288 14982635 15013342 14458548
$$ packed form
3762F3531971j637007j992672j583036k458804k598709k513389k922386k576809
3754D5249159k058219j818511k313248j919028l47394j505000j295685j325221
3746C2666853r66423j860800p62848j102519l83467r50285p60991k24883j189354
3737B4465283m23586j058935M35879j335633m72308k25672m62270k73879p85433
3728A9863446j64733j372908j6283m17023J185756J5205n46593m0312j170527
3719A7336028j63059o34066J264518k84607k22731N72532O67143L38248q76230
3710A7997776R2618j524604J06769R4724L63054r24967K03598o6391R5249J722
3700A6439548k75793o14759o89950K71992l2563m93002M44815o7653L0707n54794
$$ plain form
3690 14458548 14812325 14419846 14880291 14958980 15749699 16100780 16241632 16167313 15398128 14991935
3680 14991935 14921919 15443938 15728067 15898531 16274766 16964765 16490174 16170129 15721588 16007405
3670 16007405 15392416 15508074 16159678 16724071 17090291 17073322 16729730 16908610 16500555 16544130
3660 16544130 16900371 16783337 16316549 17494869 17457784 17455082 17061969 17795305 17399123 17514052
3650 17514052 18151685 18189420 17163267 17478474 17999101 17849511 17839237 18521848 19236441 18651168
3640 18651168 18889159 18958173 18750849 18625380 18202411 18398905 18839023 19810835 20338568 20813181
3630 20813181 20952131 21493032 20920448 20505347 19649198 19417347 19707984 20444302 20933939
3621 20933939 21202560 21835569 21289702 21464322 21043107 20231141 20075075 19325522 20046372
$$ packed form
3690A4458548L53777l92479M60445P8689P90719L51081J40852p4319p69185m06193
3680A4991935p0016N22019K84129J70464L76235O89999m74591l20045m48541K85817
3670A6007405o14989J15658O51604N64393L66220j6969l43592J78880m08055M3575
3660A6544130L56241j17034m66788J178320l7085k702l93113P33336l96182J14929
3650A7514052O37633L7735j026153L15207N20627j49590j0274O82611P14593n85273
3640A8651168K37991O9014k07324j25469m22969J96494M40118R71812N27733M74613
3630B0813181J38950N40901n72584m15101q56149k31851K90637P36318M89637
3621B0933939K68621O33009n45867J74620m21215q11966j56066p49553P20850
$$ plain form
3612 20046372 20481333 20473777 20499892 21025515 19883390 19800821 19141426 19427827 18871136 18718985
3602 18718985 18757077 18061906 18623288 17944025 17570418 16539709 17281578 18261569 18163294 17858000
3592 17858000 17423145 17627217 16492929 16437863 15383128 15561123 16328381 17305220 17757202
3583 17757202 16754685 17376269 16572096 16770183 15862949 14761993 15974945 16754089 17232613
3574 17232613 16583633 16570270 16177990 15785935 16602523 16131031 15198798 16423428 17231506
3565 17231506 17192871 15451718 15486294 15413773 14883042 15520500 15969764 16716973 16357737 16680821
3555 16680821 16758773 14723660 14259583 14262845 14360996 13170349 13714679 15056204 14976187 14341419
3545 14341419 12845737 13612134 12458873 13737090 13293706 12873768 12937735 13851681 14288316
$$ packed form
3612B0046372M34961p556K6115N25623j142125q2569o59395K86401n56691j52151
3602A8718985L8092o95171N61382o79263l73607j030709P41869R79991r8275l05294
3592A7858000m34855K04072j134288n5066j054735J77995P67258R76839M51982
3583A7757202j002517O21584q04173J98087r07234j100956J212952P79144M78524
3574A7232613o48980j3363l92280l92055Q16588m71492r32233J224630Q08078
3565A7231506l8635j741153L4576p2521n30731O37458M49264P47209l59236L23084
3555A6680821P7952k035113m64077L262R8151j190647N44330J341525q0017o34768
3545A4341419j495682P66397j153261J278217m43384m19938O3967R13946M36635
$$ plain form
3536 14288316 13480148 13119386 13288356 13563468 14606389 13499523 13987419 14048208 14423240
3527 14423240 14314532 14930985 14642308 14971808 15579670 16457133 14767491 14802810 15060897
3518 15060897 15541367 15568831 15164711 15783372 15501550 15873442 14512109 13639040 13262670
3509 13262670 13087710 13983792 13404270 13753042 13831378 14703611 13780208 13525405 13114701 12505439
3499 12505439 13078264 13508061 13298931 12837623 13656804 13557303 13105719 12920525 12912451 13178393
3489 13178393 13428924 14564470 13127559 13430710 13801824 14281208 14137574 14440700 15100459
3480 15100459 15952984 16591114 16718780 16083556 15283828 15652203 15375051 16499011 17023384
3471 17023384 18088915 18893160 19677516 20335013 20387327 21072205 21629911 21996791 22948427
$$ packed form
3536A4288316q08168l60762J68970K75112J042921j106866M87896O0789L75032
3527A4423240j08708O16453k88677L29500O07862Q77463j689642L5319K58087
3518A5060897M80470K7464m04120O18661k81822L71892j361333q73069l76370
3509A3262670j74960Q96082n79522L48772P8336Q72233r23403k54803m10704o09262
3499A2505439N72825M29797k09130m61308Q19181r9501m51584j85194q074K65942
3489A3178393K50531J135546j436911L03151L71114M79384j43634L03126O59759
3480A5100459Q52525O38130J27666o35224p99728L68375k77152J123960N24373
3471A7023384J065531Q04245P84356O57497N2314O84878N57706L66880R51636
$$ plain form
3462 22948427 23539045 24651315 25818588 26949875 28435933 30674985 31371672 33843610
3454 33843610 35001708 37577272 39403598 42595818 45846170 49510150 55310919 60313579
3446 60313579 66074393 73136445 79814245 88673415 97319300 106291822 113742738 119012352
3438 119012352 122066575 122454544 120119546 117414907 112141458 109044058 105647191 103169041
3430 103169041 101005902 99954409 99804902 100121183 101949669 106732528 111567941 119007421
3422 119007421 126409236 135157242 142597364 148486407 152917033 152937677 149782796 145137018
3414 145137018 137133126 128684781 119085163 110700369 101865166 93721723 86961118 81567386
3406 81567386 75983876 71296221 68609400 65478363 63423019 60558104 60381204 57360473
$$ packed form
3462B2948427N90618J112270J167273J131287J486058K239052O96687K471938
3454C3843610J158098K575564J826326L192220L250352L663980N800769N002660
3446F0313579N760814P062052O677800Q859170Q645885Q972522P450916N269614
3438A19012352L054223L87969k334998k704639n273449l097400l396867k478150
3430A03169041k163139j051493j49507L16281J828486M782859M835413P439480
3422A19007421P401815Q748006P440122N889043M430626K0644l154881m645778
3414A45137018q003892q448345r599618q384794q835203q143443o760605n393732
3406H1567386n583510m687655k686821l131037k055344k864915j76900l020731
$$ plain form
3398 57360473 56655566 56413012 56301481 57067085 57064830 59194089 59012840 60312063 62337150
3389 62337150 63529542 65580965 66367529 68745420 70827155 71719311 73972875 76306810
3381 76306810 77967102 80658985 83321928 86965375 88828384 92172425 96578473 100292199
3373 100292199 105232037 109786760 116326858 119778216 123938636 127472131 130599685 131706367
3365 131706367 131898311 131931538 129149556 126934314 123271302 120358550 114023768 108776709
3357 108776709 104489678 100604760 96435364 92189971 88896747 85126040 81054380 79083725
3349 79083725 75777237 73746436 71503430 71707601 71281271 70653198 70504512 70659780 68800889
3340 68800889 68953666 67516768 68517761 67121087 67384101 66638414 65318716 64914288 64487003
$$ packed form
3398E7360473p04907k42554j11531P65604k255K129259j81249J299223K025087
3389F2337150J192392K051423P86564K377891K081735Q92156K253564K333935
3381G6306810J660292K691883K662943L643447J863009L344041M406048L713726
3373A00292199M939838M554723O540098L451358M160420L533495L127554J106682
3365A31706367J91944L3227k781982k215242l663012k912752o334782n247059
3357A08776709m287031l884918m169396m245393l293224l770707m071660j970655
3349G9083725l306488k030801k243006K04171m26330o28073j48686J55268j858891
3340F8800889J52777j436898J000993j396674K63014p45687j319698m04428m27285
$$ plain form
3331 64487003 64775363 64193645 64148918 65009479 65508548 65108884 64729345 64312239 64036362 64511305
3321 64511305 65551990 67153267 67764064 69166054 69650716 69718154 70625813 71518810 72938381
3312 72938381 74713822 78298227 81608496 85675604 90188201 95362287 99654308 106500360
3304 106500360 114193890 121792802 128996563 135188136 141765117 143966915 145014235 143595031
3296 143595031 138657776 131975293 124987501 118265228 110131987 101864949 94895062 87871833
3288 87871833 81999564 76379403 71577108 67140336 62881984 60369620 58634575 56041082
3280 56041082 54147551 53032521 52263371 50700338 49561301 49520445 47955460 47706808 47285940
3271 47285940 47990407 46748080 47506936 48696502 49579882 50743583 53074836 56471000 59461981
$$ packed form
3331F4487003K88360n81718m4727Q60561M99069l99664l79539m17106k75877M74943
3321F4511305J040685J601277O10797J401990M84662O7438R07659Q92997J419571
3312G2938381J775441L584405L310269M067108M512597N174086M292021O846052
3304A06500360P693530P598912P203761O191573O576981K201798J047320j419204
3296A43595031m937255o682483o987792o722273q133241q267038o969887p023229
3288H7871833n872269n620161m802295m436772m258352k512364j735045k593493
3280E6041082j893531j115030p69150j563033j139037m0856j564985k48652m20868
3271D7285940P04467j242327P58856J189566Q83380J163701K331253L396164K990981
$$ plain form
3262 59461981 61754043 63911838 64350819 65337605 65468962 68435070 68761502 71654030 75092179
3253 75092179 79944278 83864765 88969309 95279352 102054757 111344248 122045154 132719499
3245 132719499 144262159 156114792 167068860 174680956 179678913 180033303 177212794 170541023
3237 170541023 162672912 152742382 142501645 132340515 122095588 113030893 103934445 96724404
3229 96724404 89540365 83601978 77981599 73929182 69699894 65216633 61136613 57317198
3221 57317198 53718205 50535473 48859661 47194491 45412490 43620826 42828648 41046895
3213 41046895 39038008 37871592 36829204 34750387 33602550 32824275 32240764 31928029 31355236
3204 31355236 31724584 31158855 29660608 30173098 29849456 28653394 26484544 27117153 27022148
$$ packed form
3262E9461981K292062K157795M38981R86786J31357K966108L26432K892528L438149
3253G5092179M852099L920487N104544O310043O775405R289491J0700906J0674345
3245A32719499J1542660J1852633J0954068P612096M997957L54390k820509o671771
3237A70541023p868111r930530j0240737j0161130j0244927r064695r096448p210041
3229I6724404p184039n938387n620379m052417m229288m483261m080020l819415
3221E7317198l598993l182732j675812j665170j782001j791664p92178j781753
3213D1046895k008887j166416j042388k078817j147837p78275n83511l12735n72793
3204C1355236L69348n65729j498247N12490l23642j196062k168850O32609r5005
$$ plain form
3195 27022148 26378193 27187521 26806448 26497983 25675731 25976073 25426027 23925806 23656203
3186 23656203 24066528 24927937 25871338 26798937 29354359 30291008 31169552 29745146 29054962
3177 29054962 26399666 25164664 24042189 23400139 22813026 22593119 24559189 25443364 26484640
3168 26484640 28089250 27478608 26357068 23291616 22643358 19720947 17735560 16939249 15996632
3159 15996632 16000705 16001819 16072233 15907347 14513048 14373211 13730954 12755991 12777300 12316969
3149 12316969 13428343 13214284 12999782 13327896 12526792 12203101 11141076 11288070 10792843
3140 10792843 11743966 12049616 12223799 11770023 11697914 11074675 10509536 10529821 10105870 10386697
3130 10386697 10785085 10800335 10920201 10245460 10677137 9781963 10252023 9558519 9164842 9277374
$$ packed form
3195B7022148o43955Q09328l81073l08465q22252L00342n50046j500221k69603
3186B3656203M10325Q61409R43401R27599K555422R36649Q78544j424406o90184
3177B9054962k655296j235002j122475o42050n87113k19907J966070Q84175J041276
3168B6484640J604610o10642j121540l065452o48258k922411j985387p96311r42617
3159A5996632M073J114P0414j64886j394299j39837o42257r74963K1309m60331
3149A2316969J111374k14059k14502L28114q01104l23691j062025J46994m95227
3140A0792843R51123L05650J74183m53776p2109o23239n65139K0285m23951K80827
3130A0386697L98388J5250J19866o74741M31677q95174M70060o93504l93677J12532
$$ plain form
3120 9277374 9790153 9360284 9404523 8601442 9045365 9323975 9673955 10122949 8888573 9779356
3110 9779356 8959091 8792628 7881579 8351043 8588742 8060485 8182979 8524567 8901656 8859872
3100 8859872 8619603 8188803 7757724 7700356 8042083 8544068 7248556 8270744 8284607 9292443
3090 9292443 8645295 8387883 7813088 7411916 7907005 7724173 7402723 7104448 7738400 7729173
3080 7729173 7065157 6460572 6810350 7089732 6426892 6287492 6206141 6598582 6509937 6837896
3070 6837896 6747288 5908410 6365050 7139562 7131617 6445577 5578613 6303180 5793928 6000238
3060 6000238 5840741 6101555 6069635 6422540 6927645 6348802 5749029 5593907 5244478 5163749
3050 5163749 4870772 5503013 5351765 5602073 5281004 5689193 5269735 5009350 4413656 4036186
$$ packed form
3120I277374N12779m29869M4239q03081M43923K78610L49980M48994j234376Q90783
3110I779356q20265j66463r11049M69464K37699n28257J22494L41588L77089m1784
3100H859872k40269m30800m31079n7368L41727N01985j295512J022188J3863J007836
3090I292443o47148k57412n74795m01172M95089j82832l21450k98275O33952r227
3080G729173o64016o04585L49778K79382o62840j39400q1351L92441q8645L27959
3070F837896r0608q38878M56640P74512p945o86040q66964P24567n09252K06310
3060F000238j59497K60814l1920L52905N05105n78843n99773j55122l49429q0729
3050E163749k92977O32241j51248K50308l21069M08189m19458k60385n95694l77470
$$ plain form
3040 4036186 4483110 5374079 5573028 5243763 5112735 5028622 4695082 4823273 4579866 3676001
3030 3676001 3759303 4240351 4303831 3654099 3007032 3703359 3455040 3919939 4154755 4214597
3020 4214597 4168736 4140732 3931310 3189959 3264158 3623660 4133895 3784771 4166492 4720999
3010 4720999 5349364 4804083 4273983 4139091 3474898 3218346 3658606 3989268 3635192 4251621
3000 4251621 5300872 5085332 4489108 3255991 3050173 2784088 2627165 2432701 3403925
2991 3403925 4165663 4198089 4869886 4717175 3865347 3390133 3699165 3285164 2960614 3886372
2981 3886372 4363830 4226931 5046630 4171534 4376268 3804973 3628322 3010104 3201689 4075528
2971 4075528 3441829 4368680 4037459 4086324 3924979 4017634 3981175 3889829 4411643 4247853
$$ packed form
3040D036186M46924Q90969J98949l29265j31028q4113l33540J28191k43407r03865
3030C676001Q3302M81048O3480o49732o47067O96327k48319M64899K34816N9842
3020D214597m5861k8004k09422p41351P4199L59502N10235l49124L81721N54507
3010D720999O28365n45281n30100j34892o64193k56552M40260L30662l54076O16429
3000D251621J049251k15540n96224j233117k05818k66085j56923j94464R71224
2991C403925P61738L2426O71797j52711q51828m75214L09032m14001l24550R25758
2981C886372M77458j36899Q19699q75096K04734n71295j76651o18218J91585Q73839
2971D075528o33699R26851l31221M8865j61345R2655l6459r1346N21814j63790
$$ plain form
2961 4247853 4825590 4587585 4255883 4870112 4187202 4332084 3425628 4467595 4413534 5389632
2951 5389632 5284252 5143665 4193363 4734349 5168648 5069794 3781911 4314300 3971048 4077764
2941 4077764 3655522 3620424 3597740 3419036 3807417 3820055 3641201 3759207 3550553 3622779
2931 3622779 2968660 2489166 3330659 3859358 4043475 3215554 3488956 3577556 3266846 2397176
2921 2397176 1690120 1519093 1860160 2952890 2999389 2524342 2665708 3073758 3617849 3045910
2911 3045910 2665727 2414593 2322248 3099092 2471544 2371115 2030565 3195889 3587895 3216382
2901 3216382 2479350 2061320 2447111 2772533 2971626 3245165 2961756 3311895 2743033 2609581
2891 2609581 2759480 2656314 3093045 2326563 2685878 2627758 3020266 3522007 3312826 2104904
$$ packed form
2961D247853N77737k38005l31702O14229o82910J44882r06456J041967n4061R76098
2951E389632j05380j40587r50302N40986M34299r8854j287883N32389l43252J06716
2941D077764m22242l5098k2684j78704L88381J2638j78854J18006k08654P2226
2931C622779o54119m79494Q41493N28699J84117q27921K73402Q8600l10710q69670
2921B397176p07056j71027L41067J092730M6499m75047J41366M08050N44091n71939
2911C045910l80183k51134r2345P76844o27548j00429l40550J165324L92006l71513
2901C216382p37032m18030L85791L25422J99093K73539k83409L50139n68862j33452
2891B609581J49899j03166M36731p66482L59315n8120L92508N01741k09181j207922
$$ plain form
2881 2104904 1818775 2611074 3065456 2915358 3611181 3263982 3302832 3229032 3394718 2141966
2871 2141966 2383544 2643089 2828884 2282895 2431253 2811867 2604216 1867707 1540092 2352484
2861 2352484 2534807 2647042 3143215 2697770 2794509 3625752 3421816 2339026 2000339 2808096
2851 2808096 3027352 3440419 3112290 2668399 2595830 2982866 2787393 2189358 1760268 1851780
2841 1851780 2988673 2713596 2348707 2092314 2761471 2291464 2523638 2856416 2774862 1845141
2831 1845141 2567618 2337982 1858151 1320136 2460463 2362514 1775949 1956967 2407630 2524616
2821 2524616 2548549 2255341 2714595 1889081 2355204 2335582 1649387 622246 1174610 2304750
2811 2304750 1543566 1771157 2625062 2925462 1787942 1669296 1789629 1171449 1148914 1556487
$$ packed form
2881B104904k86129P92299M54382j50098O95823l47199L8850p3800J65686j252752
2871B141966K41578K59545J85795n45989J48358L80614k07651p36509l27615Q12392
2861B352484J82323J12235M96173m45445R6739Q31243k03936j082790l38687Q07757
2851B808096K19256M13067l28129m43891p2569L87036j95473n98035m29090R1512
2841A851780J136893k75077l64889k56393O69157m70007K32174L32778q1554r29721
2831A845141P22477k29636m79831n38015J140327r7949n86565J81018M50663J16986
2821B524616K3933k93208M59254q25514M66123j9622o86195j027141N52364J130140
2811B304750p61184K27591Q53905L00400j137520j18646J20333o18180k2535M07573
$$ plain form
2801 1556487 2292717 2619382 3099585 2820522 2720122 2081732 1563738 1918703 2383849 1639444
2791 1639444 2399257 3388821 3084230 2208419 2374320 2792069 1474397 2314803 3233273
2782 3233273 2706252 2886752 2867570 3117574 1435726 1569616 1961631 2335710 2271351 1688177
2772 1688177 3441210 2955341 2117708 1704883 2153506 1756953 1825958 3312521 2625592
2763 2625592 1584781 2283495 2620726 1967916 880349 1452790 1820701 2794968 3006690
2754 3006690 2903010 2523238 2253688 2046768 2271916 1987237 1689832 2292870 3537943
2745 3537943 2223962 2507301 3046493 3310486 1623407 1326518 1671886 1817960 2079125
2736 2079125 3084407 3034551 3212156 2772940 3442935 2231278 1694142 1444159 2562621
$$ packed form
2801A556487P36230L26665M80203k79063j00400o38390n17994L54965M65146p44405
2791A639444P59813R89564l04591q75811J65901M17749j317672Q40406R18470
2782C233273n27021J80500j9182K50004j681848J33890L92015L74079o4359n83174
2772A688177J753033m85869q37633m12825M48623l96553O9005J486563o86929
2763B625592j040811O98714L37231o52810j087567N72441L67911R74267K11722
2754C006690j03680l79772k69550k06920K25148k84679k97405O03038J245073
2745C537943j313981K83339N39192K63993j687079k96889L45368J46074K61165
2736B079125J005282m9856J77605m39216O69995j211657n37136k49983J118462
$$ plain form
2727 2562621 2506292 2239223 1909059 3065372 2340420 2159047 1282105 1696870 1800488 2888380
2717 2888380 3044395 2779282 1954335 2607495 2381591 1827134 1150485 2383871 2546082
2708 2546082 2740224 2433336 1696545 1293655 1836613 2141361 1736397 1391702 2081371 3193905
2698 3193905 3578893 2879743 2706644 2923473 2608426 2346815 1833808 2128129 1946171 3608260
2688 3608260 3148563 2761576 2479220 3209811 2163172 1918323 2101582 3009753 2898668
$$ packed form
2727B562621n6329k67069l30164J156313p24952j81373q76942M14765J03618J087892
2717B888380J56015k65113q24947O53160k25904n54457o76649J233386J62211
2708B546082J94142l06888p36791m02890N42958L04748m04964l44695O89669J112534
2698C193905L84988o99150j73099K16829l15047k61611n13007K94321j81958J662089
2688C608260m59697l86987k82356P30591j046639k44849J83259R08171j11085
$$ [...]
##END NTUPLES=NMR SPECTRUM
##END=
