##TITLE=1H_DE-80H_X3
 200.13MHz, d2o
 8 sc
 
 19ns.26.2.2025
##JCAMPDX= 6.0         $$ Bruker NMR JCAMP-DX V2.0
##DATA TYPE= NMR SPECTRUM
##DATA CLASS= NTUPLES
##ORIGIN= UXNMR, Bruker Analytische Messtechnik GmbH
##OWNER= pz
$$ XWIN-NMR		Version 3.5
$$ Fri Apr 17 09:53:05 2026 Russian Standard Time (UT+4h)  Yarkov@DPX200
##.OBSERVE FREQUENCY= 200.1313
##.OBSERVE NUCLEUS= ^1H
##.ACQUISITION MODE= SIMULTANEOUS
##.ACQUISITION SCHEME= undefined
##.AVERAGES= 8
##.DIGITISER RES= 18
##SPECTROMETER/DATA SYSTEM= spect
##.PULSE SEQUENCE= zg30
##.SOLVENT NAME= DMSO
##.SHIFT REFERENCE= (INTERNAL, DMSO, 0, 15.4772)
##AUDIT TRAIL= $$ (NUMBER, WHEN, WHO, WHERE, WHAT)
$$ ##TITLE= Audit trail, XWIN-NMR		Version 3.5
$$ ##JCAMPDX= 5.01
$$ ##ORIGIN= Bruker BioSpin GmbH
$$ ##OWNER= Yarkov
$$ C:/Bruker/XWIN-NMR/data/yarkov2/nmr/H-C/1/pdata/1/auditp.txt
$$ ##AUDIT TRAIL=  $$ (NUMBER, WHEN, WHO, WHERE, WHAT)
(   1,<2026-04-17 09:52:10.93 +0400>,<Yarkov>,<DPX200>,
      <created by zg, POWCHK disabled, PULCHK disabled
       configuration hash MD5:
       00 E9 B6 7A A2 85 ED C7 34 08 36 98 17 FE 4E 26
       data hash MD5: 16K
       F7 82 FC D7 6F AF 41 F5 25 B3 41 14 B8 C6 62 FC>)
(   2,<2026-04-17 09:52:17.62 +0400>,<Yarkov>,<DPX200>,
      <Start of raw data processing
       efp BC_mod = 2 LB = 0.25 FT_mod = 6 PKNL = 1 PHC0 = -5301.948 PHC1 = 6.821927 SI = 16K 
       data hash MD5: 16K
       02 A1 4C 38 A0 B7 3C CB 60 3F 3D 74 E2 33 88 D6>)
$$ ##END=
$$ 
$$ hash MD5
$$ 1B 34 3E 65 2A 1A 86 73 A0 DF E0 4C A1 78 6D C5
##$RELAX= 
##$RELAX= 
##$RELAX= 
##$RELAX= 
##$RELAX= 
##$RELAX= 
$$ Bruker specific parameters
$$ --------------------------
##$DU= <C:/Bruker/XWIN-NMR>
##$EXPNO= 1
##$NAME= <H-C>
##$PROCNO= 1
##$TYPE= <nmr>
##$USER= <yarkov2>
##$AMP= (0..31)
100 100 100 100 100 100 100 100 100 100 100 100 100 100 100 100 100 100 
100 100 100 100 100 100 100 100 100 100 100 100 100 100 
##$AQSEQ= 0
##$AQ_mod= 1
##$AUNM= <au_zg>
##$AUTOPOS= <>
##$BF1= 200.13
##$BF2= 200.13
##$BF3= 200.13
##$BF4= 200.13
##$BF5= 200.13
##$BF6= 200.13
##$BF7= 200.13
##$BF8= 200.13
##$BYTORDA= 1
##$CFDGTYP= 0
##$CFRGTYP= 5
##$CHEMSTR= <none>
##$CNST= (0..31)
1 1 145 1 1 1 1 1 1 1 1 1 1 1 1 1 1 1 1 1 1 1 1 1 1 1 1 1 1 1 1 1 
##$CPDPRG= <>
##$CPDPRG1= <>
##$CPDPRG2= <>
##$CPDPRG3= <>
##$CPDPRG4= <mlev>
##$CPDPRG5= <mlev>
##$CPDPRG6= <mlev>
##$CPDPRG7= <mlev>
##$CPDPRG8= <mlev>
##$CPDPRGB= <>
##$CPDPRGT= <>
##$D= (0..31)
0 0.7 0 0 0 0 0 0 0 0 0 0.03 0 0 0 0 0 0 0 0 0 0 0 0 0 0 0 0 0 0 0 0 
##$DATE= 1776405130
##$DBL= (0..7)
120 120 120 120 120 120 120 120 
##$DBP= (0..7)
150 150 150 150 150 150 150 150 
##$DBP07= 0
##$DBPNAM0= <>
##$DBPNAM1= <>
##$DBPNAM2= <>
##$DBPNAM3= <>
##$DBPNAM4= <>
##$DBPNAM5= <>
##$DBPNAM6= <>
##$DBPNAM7= <>
##$DBPOAL= (0..7)
0.5 0.5 0.5 0.5 0.5 0.5 0.5 0.5 
##$DBPOFFS= (0..7)
0 0 0 0 0 0 0 0 
##$DE= 6
##$DECBNUC= <off>
##$DECIM= 32
##$DECNUC= <off>
##$DECSTAT= 4
##$DIGMOD= 1
##$DIGTYP= 9
##$DL= (0..7)
0 120 120 120 120 120 120 120 
##$DP= (0..7)
$$ [...]
##$SUBNAM2= <"">
##$SUBNAM3= <"">
##$SUBNAM4= <"">
##$SUBNAM5= <"">
##$SUBNAM6= <"">
##$SUBNAM7= <"">
##$SUBNAM8= <"">
##$SUBNAM9= <"">
##$SW= 18.0517328524113
##$SWIBOX= (0..15)
0 0 2 0 0 0 0 0 0 0 0 0 0 0 0 0 
##$SW_h= 3612.71676300578
##$TD= 16384
##$TD0= 1
##$TE= 0
##$TE2= 300
##$TE3= 300
##$TEG= 300
##$TL= (0..7)
0 120 120 120 120 120 120 120 
##$TP= (0..7)
150 150 150 150 150 150 150 150 
##$TP07= 0
##$TPNAME0= <>
##$TPNAME1= <>
##$TPNAME2= <>
##$TPNAME3= <>
##$TPNAME4= <>
##$TPNAME5= <>
##$TPNAME6= <>
##$TPNAME7= <>
##$TPOAL= (0..7)
0.5 0.5 0.5 0.5 0.5 0.5 0.5 0.5 
##$TPOFFS= (0..7)
0 0 0 0 0 0 0 0 
##$TUNHIN= 0
##$TUNHOUT= 0
##$TUNXOUT= 0
##$USERA1= <user>
##$USERA2= <user>
##$USERA3= <user>
##$USERA4= <user>
##$USERA5= <user>
##$V9= 5
##$VALIST= <valist>
##$VCLIST= <CCCCCCCCCCCCCCC>
##$VD= 0
##$VDLIST= <DDDDDDDDDDDDDDD>
##$VPLIST= <PPPPPPPPPPPPPPP>
##$VTLIST= <TTTTTTTTTTTTTTT>
##$WBST= 1024
##$WBSW= 4
##$XGAIN= (0..3)
0 0 0 0 
##$XL= 0
##$YL= 0
##$YMAX_a= 107558
##$YMIN_a= -95387
##$ZGOPTNS= <>
##$ZL1= 120
##$ZL2= 120
##$ZL3= 120
##$ZL4= 120
##$ABSF1= 0
##$ABSF2= 0
##$ABSG= 0
##$ABSL= 0
##$ALPHA= 0
##$AQORDER= 0
##$ASSFAC= 0
##$ASSFACI= 0
##$ASSFACX= 0
##$ASSWID= 0
##$AUNMP= <proc_1d>
##$AZFE= 0.1
##$AZFW= 0.1
##$BCFW= 0
##$BC_mod= 2
##$BYTORDP= 0
##$COROFFS= 0
##$CY= -3
##$DATMOD= 1
##$DC= 0
##$DFILT= <>
##$DTYPP= 0
##$F1P= 0
##$F2P= 0
##$FCOR= 1
##$FTSIZE= 16384
##$FT_mod= 6
##$GAMMA= 0
##$GB= 0
##$INTBC= 1
##$INTSCL= 3.241238e-09
##$ISEN= 128
##$LB= 0.25
##$LEV0= 0
##$LPBIN= 0
##$MAXI= 10000
##$MC2= 0
##$MEAN= 0
##$ME_mod= 0
##$MI= 1.114404
##$NCOEF= 0
##$NC_proc= -8
##$NLEV= 6
##$NOISF1= 3.799351
##$NOISF2= 2.8
##$NSP= 0
##$NTH_PI= 0
##$NZP= 0
##$OFFSET= 15.47721
##$PC= 1
##$PHC0= -5301.948
##$PHC1= 6.821927
##$PH_mod= 1
##$PKNL= yes
##$PPARMOD= 0
##$PSCAL= 0
##$PSIGN= 0
##$REVERSE= no
##$SF= 200.130008905143
##$SI= 16384
##$SIGF1= 3
##$SIGF2= 2
##$SINO= 0.751879
##$SIOLD= 32768
##$SREGLST= <19F.Aceton>
##$SSB= 0
##$STSI= 16384
##$STSR= 0
##$SW_p= 3612.71676300578
##$SYMM= 0
##$S_DEV= 0
##$TDeff= 16384
##$TDoff= 0
##$TI= <>
##$TILT= no
##$TM1= 0
##$TM2= 0
##$TOPLEV= 0
##$USERP1= <user>
##$USERP2= <user>
##$USERP3= <user>
##$USERP4= <user>
##$USERP5= <user>
##$WDW= 1
##$XDIM= 16384
##$YMAX_p= 341412772
##$YMIN_p= -3205242
$$ End of Bruker specific parameters
$$ ---------------------------------
##NTUPLES= NMR SPECTRUM
##VAR_NAME=  FREQUENCY,     SPECTRUM/REAL,   SPECTRUM/IMAG
##SYMBOL=    X,             R,               I
##VAR_TYPE=  INDEPENDENT,   DEPENDENT,       DEPENDENT
##VAR_FORM=  AFFN,          ASDF,            ASDF
##VAR_DIM=   16384,         16384,           16384
##UNITS=     HZ,            ARBITRARY UNITS, ARBITRARY UNITS
##FACTOR=    0.220516191357247, 1,           1
##FIRST=     3097.45418410477, 0,            0
##LAST=      -515.262578901012, 0,           0
##MIN=       -515.262578901012, -3205242,    0
##MAX=       3097.45418410477, 341412772,    0
$$ Real data points
##PAGE= N=1
##DATA TABLE= (X++(R..R)), XYDATA
$$ [...]
5062A3360688l05901n16530R33458o41193R17112N93841n32839j252947J616193
5053A4171882j610570j581693J812887m36326K34844J880501O93985j830479Q61824
5044A4196855O75006J190346N89281r14003n04133J301311j80794k517548N92752
5035A4429073J185613K22933J057461J259800p76406k45893J85084K26811J402808
5026A8947284j154732j034208K80627K997j29134n953N75647q74616O85996Q57096
5016A8151004K03941j140200L00088M27684M62464L82197j674711r38546k0245
5007A6153676L13011J46771J957867j491156j7146Q16501N0278q19998M3876R80598
4997A8134278j92802P15147j568629j92236M56434J031620M93973J238959l42085
$$ y = [13360688, 13054787, 12538257, 13471715, 12830522, 13747634, 14341475, 13808636, 12555689, 14171882, 12561312, 10979619, 12792506, 12356180, 12591024, 14471525, 15165510, 13335031, 14196855, 14871861, 16062207, 16651488, 15737485, 15233352, 16534663, 16353869, 13836321, 14429073, 15614686, 15837619, 16895080, 18154880, 17378474, 17132581, 17317665, 17544476, 18947284, 17792552, 16758344, 17038971, 17041968, 16912834, 16906881, 17482528, 16607912, 17293908, 18151004, 18354945, 17214745, 17514833, 17942517, 18404981, 18787178, 17112467, 16173921, 16153676, 16466687, 16613458, 18571325, 17080169, 17063023, 17879524, 17929802, 17109804, 17153680, 18134278, 17941476, 18656623, 17087994, 16895758, 17352192, 18383812, 18877785, 20116744, 19774659]
4988A9774659M01168L29995j973321k97215N85336L0989j265387P68496M02466
4979A8757186O06702o73485M38645Q48134R382l85163k82581N68360o7350J74367
4969A9994197J639499O69040j613732q00759K23415L18313K16306N5894n76696
4960B0125477N60912P02310k81713j62423j286513j735839J260984K745181K27873
4951B2156249o30335N68812J025623L1606j216566k173882J407842J270438j421209
4942B1018578l77999J628865J01981j323772K0778m2335n67793o77392N95068
4933B0375979R9499K89051Q2212L89667M46150R9629p98719J11432J879733n10575
4923B2464058r44199Q19628J960210Q08437m919M1157J06003O59774J68854j19884
$$ y = [19774659, 20175827, 20505822, 18532501, 18235286, 18820622, 18851611, 17586224, 18354720, 18757186, 19363888, 18690403, 19129048, 19977182, 19986564, 19601401, 19318820, 19887180, 19819830, 19994197, 21633696, 22302736, 20689004, 19888245, 20111660, 20429973, 20646279, 20702173, 20125477, 20686389, 21388699, 21106986, 20944563, 19658050, 17922211, 19183195, 21928376, 22156249, 21525914, 22094726, 23120349, 23151955, 21935389, 19761507, 21169349, 22439787, 21018578, 20640579, 22269444, 22371425, 21047653, 21068431, 21026096, 20458303, 19780911, 20375979, 20475478, 20764529, 20846741, 21236408, 21682558, 21782187, 20983468, 21094900, 22974633, 22464058, 21519859, 22339487, 24299697, 25108134, 25103215, 25144372, 25250375, 25910149, 26079003, 25959119]
4913B5959119m48408J467823Q24092L60445J93251Q90788L57217Q19091J024758
4904C1448176M27119O45739J582388J540387l23705O94041Q15127J457603r1402
4895C8195473N4157P55788l56316j41512O14218K91129L2102J125839j338824
4886C9232054j340047p58021j37742K6343Q40674L15698L23887J860857J04664
4877D0468367j307748k25032J749655R3386j89995P48031N23439j086224r3400
4868D0680479K83495j97916n62142j686991j440001r81746n28826p30661J45419
4859C4981110p93882j016127k39514M25841o26681j19410J363212J019740N3574
4850C5047863k84271j211589n50268l83169J9576J000363K6493M60283M53942
$$ y = [25959119, 25510711, 26978534, 27802626, 28163071, 28356322, 29247110, 29604327, 30423418, 31448176, 31875295, 32521034, 34103422, 35643809, 35320104, 36014145, 36829272, 38286875, 38195473, 38249630, 39005418, 38649102, 38507590, 39121808, 39412937, 39445039, 40570878, 39232054, 37892007, 37133986, 36996244, 37022587, 37863261, 38178959, 38502846, 40363703, 40468367, 39160619, 38935587, 40685242, 40778628, 40588633, 41336664, 41860103, 40773879, 40680479, 40963974, 40766058, 40203916, 38516925, 37076924, 36095178, 35566352, 34835691, 34981110, 34187228, 33171101, 32931587, 33357428, 32730747, 32611337, 33974549, 34994289, 35047863, 34763592, 33552003, 33001735, 32618566, 32638142, 33638505, 33664998, 34125281, 34579223]
4841C4579223J172925M85035r78891J75909K934423J021189n78905J319812L600063
4832D3730783N839134J0536286J3566829Q383898k570953q412659q867609q095203
4824E4110506m705015l245157l340871k705019k079471p87667O84718k1093j163047
4815C6747884l34248K85591J90243j169897j182644j655582J049135J272687j143621
4806C4059548j915076p48682M23349j051388j822541j752112J13519k9775m25381
4797B6851461p52430j58914L9923O35724j160283r35580J187369J35244P75280
4788B6617794q01472j902552m40277K023283k21900j991804o23945O64283R77849
4779B4301259j133352K71580k11843M58070K08635Q7778q63268K11133L15653
$$ y = [34579223, 35752148, 36237183, 35258292, 35434201, 38368624, 39389813, 38810908, 40130720, 43730783, 49569917, 60106203, 73673032, 82056930, 79485977, 71073318, 62205709, 54110506, 49405491, 46160334, 42819463, 40114444, 38034973, 37247306, 37932024, 37910931, 36747884, 36413636, 36699227, 36889470, 35719573, 34536929, 32881347, 33930482, 35203169, 34059548, 32144472, 31395790, 31819139, 30767751, 28945210, 27193098, 27306617, 27276842, 26851461, 26099031, 25940117, 25980040, 26615764, 25455481, 24519901, 25707270, 25842514, 26617794, 25816322, 23913770, 23473493, 25496776, 25274876, 23283072, 22659127, 23323410, 24301259, 23167907, 23439487, 23227644, 23685714, 23894349, 23982127, 23118859, 23329992, 23645645]
4770B3645645p82295m24055m35845J513764N88341O68502m00618K49664J103369
4761B5726472O96785m78491j77174Q41580L52413l96320j1149R14434n1137N95268
4751B8012681J444543j36924l92695J07604J439499J439683J105953J138685J899793
4742C6058822N99439l34377J195712J588221K044706J571472J364956J673028
4734D5761979J632792R44201R51315J688951Q55350O94809Q82559K108435N10393
4725E6030784m19108o86997p00533l22431N0493J033053m32254l76896k3153R90679
4715E5143637J666174K231128L3027N86319J955489K584398K564819J756581K455075
4706G0976647K939797K353516J149711J324725K075253J054963m58845j99430
$$ y = [23645645, 22863350, 22439295, 22003450, 23517214, 24105555, 24774057, 24373439, 24623103, 25726472, 26423257, 25944766, 25767592, 26609172, 26961585, 26565265, 26554116, 27468550, 27417413, 28012681, 29457224, 29320300, 28927605, 29035209, 30474708, 31914391, 33020344, 34159029, 36058822, 36658261, 36323884, 37519596, 39107817, 41152523, 42723995, 44088951, 45761979, 47394771, 48338972, 49290287, 50979238, 51834588, 52529397, 53411956, 55520391, 56030784, 55611676, 54924679, 54224146, 53901715, 53952208, 54985261, 54553007, 54176111, 54152958, 55143637, 56809811, 59040939, 59073966, 59660285, 61615774, 64200172, 66764991, 68521572, 70976647, 73916444, 76269960, 77419671, 78744396, 80819649, 81874612, 81415767, 81216337]
4698H1216337K52534j566075k934192j464059k113981k976065j616825j908797
4690F6888877k295976l174128k466919j042735j53699r27259k567382l31188O68662
4681E4598253m93195j122365j734338k83419k49833j509247j541419j228308r71420
4672D5464709j556255k353609k851944j294152l55955l072884k536838j389344
4664C0053728j497655j783901j006923q36051k772291l059996m82277k32498l74184
4655A8007952n59068p05527l8889r07137j102425r39850M76616k61388j383484
4646A2586800o93634o6519N62860J84663j418821n77724Q27553P57825M488r74231
4636A1193260j78242O22440R76314p62437P25264N26295L30229K768702M394321
$$ y = [81216337, 81468871, 79902796, 76968604, 75504545, 73390564, 70414499, 68797674, 66888877, 64592901, 61418773, 58951854, 57909119, 57755420, 56828161, 54260779, 53929591, 54598253, 54105058, 52982693, 51248355, 50964936, 50715103, 49205856, 47664437, 46436129, 45464709, 43908454, 41554845, 38702901, 37408749, 37052794, 33979910, 31443072, 30053728, 28556073, 26772172, 25765249, 24929198, 22156907, 19096911, 18614634, 18382136, 18007952, 17448884, 16743357, 16704468, 15797331, 14694906, 13755056, 14231672, 13970284, 12586800, 11893166, 11826647, 12389507, 12574170, 11155349, 10577625, 11405178, 12163003, 12167491, 11193260, 11015018, 11637458, 12613772, 11851335, 12576599, 13102894, 13433123, 16201825, 20596146]
4627B0596146L254480q0163k084835j924026p25005k332003j748770j464693l95470
4618A3095661j222296L81219R02147M11546n64247J10357J407639J970854J630016
4609A8122896p3534J8601J18165J266642J791329J444623J395155K524645J687197
4600B8295719K46864k10025l55610L23215N94426J587217J343029K961880K160558
4591C6947273j913035k975940k52045j437489k109264n46175L70083M79961r8401
4582B8464968k215640l428527j579792k262882j236105r53465j32145j489363
4574A5167049n00544k11150j224283l010853j975862L4569r80191q53045j385173
4565E060517N63078q74710M27914l07210q01317P19475j41845o39256K25586P32540
$$ y = [20596146, 23850626, 23770463, 21685628, 19761602, 19036597, 16704594, 14955824, 13491131, 13095661, 11873365, 12254584, 13156731, 13568277, 13004030, 13114387, 14522026, 16492880, 18122896, 18049362, 18067963, 18186128, 19452770, 21244099, 22688722, 24083877, 26608522, 28295719, 28542583, 28332558, 27976948, 28300163, 28894589, 30481806, 31824835, 34786715, 36947273, 35034238, 32058298, 31806253, 30368764, 28259500, 27713325, 28083408, 28563369, 28464968, 26249328, 22820801, 21241009, 18978127, 17742022, 16788557, 16656412, 15167049, 14666505, 14455355, 13231072, 10220219, 8244357, 8278926, 7298735, 6445690, 5060517, 5623595, 4748885, 5176799, 4869589, 4068272, 4787747, 4645902, 4006646, 4232232, 4964772]
4555D964772j958930M28994R37401Q9180j128020R38441m45883k052060L07647
4546B081542L24951P88857Q07764K50420j387190J113219m03923j090218Q85255
4537C370677O2379k647070J60364K495374n0853j93042l71614k49611m08041P36542
4527B905105M81250Q0077r0513m50380N29901M9657j257093l10826K00389j53836
4517A983731M27962J089357M59170o90017m11433P21574J06910j177671j286021
4508A223562L96440J096986n9406r0717K05003j067960j211512J315358J721034
4499C528788l62021p35601j056117m9786N53483p78161k46089J235714J276954
4490C367164q64104n70709Q03606l47321j224629r05867J147264Q27466q10964
$$ y = [4964772, 3005842, 3434836, 4372237, 4461417, 3333397, 4271838, 3825955, 1773895, 2081542, 2406493, 3195350, 4003114, 4253534, 2866344, 3979563, 3575640, 2485422, 3370677, 3433056, 785986, 946350, 3441724, 3390871, 3197829, 2826215, 2576604, 2168563, 2905105, 3386355, 3466432, 3375919, 2925539, 3455440, 3505097, 2248004, 1937178, 2137567, 1983731, 2411693, 3501050, 3960220, 3270203, 2858770, 3580344, 3687254, 2509583, 1223562, 1620002, 2716988, 2657582, 2566865, 2771868, 1703908, 492396, 1807754, 3528788, 3166767, 2431166, 1375049, 1325263, 1878746, 1100585, 854496, 2090210, 3367164, 2503060, 1932351, 2735957, 2388636, 1164007, 258140, 1405404, 2232870, 1421906]
4481A421906L12695P94854p05596k71058Q08049L77501r28869q24870l29680M42712
4471A097644Q85899n72470K4516N94795l51458n78053k13952m54576l79984J237603
4461A289964K080511r32196j289508K04385l3901p59807l83525O96251M70675
4452A342849L4515j47391J55951o07895J29814J22298M79704n2220M00736J43769
4442B002130Q35111P57578j741045j019392M98239M60087o21916P19519p70568
4433A119743L5265J232642k43146j241625J075417J009813q15663L37305r11068
4424A598683j073323r0498J243495o72378J23722J183504j91781r0038j8532n82435
4414A430419p59063N91994k05534O30769J45318n86534N35240J152951m23108
$$ y = [1421906, 1734601, 2529455, 1823859, 1552801, 2360850, 2738351, 1809482, 984612, 654932, 1097644, 1983543, 1411073, 1435589, 2030384, 1678926, 1100873, 886921, 432345, 52361, 1289964, 3370475, 2438279, 1148771, 1353156, 1319255, 559448, 175923, 872174, 1342849, 1377364, 1229973, 1385924, 778029, 907843, 1030141, 1509845, 1457625, 1858361, 2002130, 2837241, 3594819, 1853774, 834382, 1332621, 1792708, 1170792, 1890311, 1119743, 1155008, 2387650, 2144504, 902879, 1978296, 2988109, 2172446, 2509751, 1598683, 525360, 434862, 1678357, 1005979, 1129701, 2313205, 2121424, 2031386, 2012854, 1430419, 671356, 1263350, 1057816, 1688585, 1833903, 1247369, 1782609, 2935560, 2512452]
4405B512452r08497Q01398K38847j27338j99152j018722m01914J101678K76098
4396B274850k59941Q11196j012197o72931P96181N21836n44513R01967j25092
4387B691356j390659P09348k13375j198531J72229J372396n08417R21081J476572
4378D032000j429741n66679N8711j79405m40746J227697p52244j061845J760260
4369B648008O35246j150568j36837J322373l20135R01178k68902n72381q71790
4360B186192J128306O09048j66087J82881j159533K52102L5689O09773j444896
4351B233475j10997J385745J749886j031269j278160M8053M3544J53389o54196
4342B539470k10410j176502Q77227M73616K56324N69277J156691m10320m86379
$$ y = [2512452, 1603955, 2405353, 2644200, 2516862, 2317710, 1298988, 897074, 1998752, 2274850, 2014909, 2826105, 1813908, 1140977, 1937158, 2458994, 1914481, 2816448, 2691356, 1300697, 2010045, 1796670, 598139, 770368, 2142764, 1634347, 2555428, 4032000, 2602259, 2035580, 2094291, 1914886, 1474140, 2701837, 1949593, 887748, 2648008, 3283254, 2132686, 1995849, 3318222, 2998087, 3899265, 3630363, 3057982, 2186192, 3314498, 3923546, 3757459, 3940340, 2780807, 3032909, 3068598, 3678371, 2233475, 2122478, 3508223, 5258109, 4226840, 2948680, 2996733, 3040277, 3193666, 2539470, 2329060, 1152558, 2029785, 2503401, 2759725, 3329002, 4485693, 4075373, 3588994]
4333C588994R16209q31557q14473L7859l4648j188753r73650N16117J286696P90488
4323C293282o76595n36327J184989R09625o00572j265702p68343Q15009N00629
4314B855995j46647R63924q78944r11856J264455J241211o39567r76745J425650
4305D197476J443528k74404j816829m98736O35399M41925l48389j47959O65559
4296D297570L76429J15847J021435L97437j56557L02384l72678j331166p77711
4287C872990k51120P02858J124494k66852p46687M14931O66580j464076m61785
4278C591333O72909J146858M84651L93311n73100j423418j16048N35531L9118
4269D751145r56590J69069P53276R34469K66347o9015l78227j81625k397j4833
$$ y = [3588994, 4505203, 3673646, 2859173, 2897032, 2862384, 1673631, 699981, 1216098, 2502794, 3293282, 2616687, 2080360, 3265349, 4174974, 3574402, 2308700, 1540357, 2355366, 2855995, 2709348, 3673272, 2794328, 1882472, 3146927, 4388138, 3748571, 2771826, 4197476, 5641004, 5366600, 3549771, 3051035, 3686434, 4128359, 3779970, 3632011, 4297570, 4673999, 4789846, 5811281, 6208718, 6052161, 6354545, 5981867, 4650701, 3872990, 3621870, 4324728, 5449222, 5182370, 4435683, 4850614, 5517194, 4053118, 3591333, 4264242, 5411100, 5895751, 6289062, 5715962, 4292544, 4176496, 4712027, 4751145, 3794555, 3963624, 4716900, 5651369, 5917716, 5848701, 5470474, 5288849, 5286452, 5271619]
4259E271619L43764j334824j517264N73538J568154M34618O8847n321m96861j63080
4249D743190R61945J300892p01570q62099L6775O01638R09476p13381j247647
4240E029219j038969M79008J190792J102976j046021n47718O43783P79632l56013
4231F236689m55179j9244r06736n73804M54870K00584j573051l69625L67488J883187
4221E245179k57216o26131N70759m48992q86026M64659J224384N19138o55821
4212E149933j475896k9094L42070k92796j379299N64724J190258j71908K3187
4203C921179J787720M17808j454977K64965r48906j075648R07009R00828j261668
4194C458310m89885R63929M13953j9262N96899r30469l20090J826471M73516o39050
$$ y = [5271619, 5615383, 4280559, 2763295, 3336833, 4904987, 5339605, 5408452, 5403131, 4906270, 4743190, 5705135, 7006027, 6304457, 5442358, 5479133, 6080771, 6990247, 6276866, 5029219, 3990250, 4469258, 5660050, 6763026, 5717005, 5169287, 5813070, 6592702, 6236689, 5781510, 5762266, 4855530, 4281726, 4736596, 4937180, 3364129, 2994504, 3361992, 5245179, 4987963, 4361832, 4932591, 4483599, 3597573, 4062232, 5286616, 5805754, 5149933, 3674037, 3644943, 3987013, 3694217, 2314918, 2879642, 4069900, 3897992, 3921179, 5708899, 6126707, 4671730, 4936695, 3987789, 2912141, 3819150, 4719978, 3458310, 2968425, 3932354, 4346307, 4327045, 4923944, 3993475, 3673385, 5499856, 5973372, 5334322]
4184E334322k92888n11329j062327R3722P16446P5989K93420J49222r37374K47250
4174D106453J364834J048997j297896J88704L6759k99747j11136n95413k8352
4165D413203Q26067N13834J48940O13260j92378j70286J57913J562354P5697j90326
4155G758278r32837p40092q07220O07350O53995O73762J623027j91237o87754
4146G957272p22255P54684J476607J15888q58240K75330J25677J007746n77807
4137I554902l4079K38012o40984N7421J173257K037498J206556p8018O0330J137397
4127A4712292Q5374q3600p13578m07745K81514K117952Q10145L52849N52476R70813
4117A8678492R24278M83377J572411l06786l55589P10133N68170n89670J025148
$$ y = [5334322, 5041434, 4530105, 3467778, 3561500, 4277946, 4353935, 4647355, 4796577, 3859203, 4106453, 5471287, 6520284, 5222388, 5411092, 5447851, 5148104, 5036968, 4441555, 4413203, 5239270, 5753104, 5902044, 6515304, 6322926, 6152640, 6310553, 7872907, 7948604, 7758278, 6825441, 6085349, 5278129, 5885479, 6539474, 7213236, 8836263, 8645026, 7957272, 7235017, 7989701, 9466308, 9582196, 8723956, 8999286, 9124963, 10132709, 9554902, 9520823, 9758835, 9117851, 9175272, 10348529, 12386027, 13592583, 13514565, 13574895, 14712292, 14797666, 14714066, 14000488, 13592743, 13874257, 15992209, 16802354, 17155203, 17707679, 18678492, 19602770, 20086147, 21658558, 21351772, 20996183, 21706316, 22274486, 21684816, 22709964]
4108B2709964O79185M56968Q93651J050764J11400J017102K510618L52492M42109
4099C0224253J465676J130359p52120Q2495p91534n99037K707012K702563n04118
4090C5665549l08850K293914J785402J012914J219288R00813K49927N15798J155764
4081D4490519K94867J375044J810953N50505L31776J283106K635509M36014j040834
4072E2167459k46577N89233J467139J645971l11439n65761R67428p944n44753
4063E5160756J436134L240677K016837K698483K930325N62875k372941l66150
4055F5306996R41437N3794R96422Q99971N81661J167040K045657J067815J800149
4046G4860942J144747O08776O3349J682746M80693k58968J485737J295019N12903
$$ y = [22709964, 23389149, 23846117, 24739768, 25790532, 25901932, 26919034, 29429652, 29782144, 30224253, 31689929, 32820288, 32068168, 32150663, 31359129, 30760092, 33467104, 36169667, 35665549, 35356699, 37650613, 39436015, 40448929, 41668217, 42569030, 42818957, 43334755, 44490519, 44785386, 46160430, 47971383, 48521888, 48853664, 50136770, 52772279, 53208293, 52167459, 51920882, 52510115, 53977254, 55623225, 55311786, 54746025, 55713453, 55705509, 55160756, 56596890, 59837567, 61854404, 64552887, 67483212, 68046087, 65673146, 65306996, 66248433, 66302227, 67298649, 68198620, 68780281, 69947321, 71992978, 73060793, 74860942, 76005689, 76614465, 76677814, 78360560, 78841253, 78582285, 80068022, 81363041, 81875944]
4037H1875944J61075Q81551p4877k61378O504O85693j81262o25759Q85336J809898
4027H5162725K145741j35094n26012J401798J459038j196524n69298N9654K45127
4018H8047155M30286n99410q3223m62317j49895j379696j244775m37210O37140
4009H4758055N17377k19993j766858q03435O98073k25095j470798j102181k37243
4000H0147902j676771j502290m18525q36113k319109j809784o29789j098133k217846
3991F7639542j308389m05621o48424q69822j93852m91434q12110q7729j894119
3982F0928042j344461O25321k89879q28884m82082r08204j48989M11264j336808
3973E6625320k107834o33563l56337n41360r63647j937701j929907j524490M97075
$$ y = [81875944, 82037019, 82918570, 82843693, 82582315, 82588819, 83274512, 83093250, 82467491, 83352827, 85162725, 87308466, 87173372, 86647360, 88049158, 89508196, 88311672, 87742374, 87802028, 88047155, 88477441, 87878031, 87794808, 87332491, 87182596, 85802900, 84558125, 84120915, 84758055, 85275432, 85055439, 83288581, 82485146, 83183219, 82958124, 81487326, 80385145, 80147902, 78471131, 76968841, 76550316, 75714203, 73395094, 71585310, 70955521, 69857388, 67639542, 66331153, 65925532, 65277108, 64407286, 64213434, 63722000, 62909890, 62822161, 60928042, 59583581, 60208902, 59919023, 59090139, 58608057, 57699853, 57550864, 57962128, 56625320, 54517486, 53883923, 53527586, 52986226, 52022579, 50084878, 48154971, 46630481, 47127556]
3964D7127556M22729j983956j978323j416351q37276K52117O0941M115l41666
3955D1309886Q64587K553030K361038r63168l187919k114195N35632j40031j832853
3946C9386007j129489J091540J038344j857899r88295M29292o2317j593677k08052
3937C6105454Q44296J068815j272461k051874l50991j07557j066770j36613L85096
3928C3417395m14773o36193o51701N07866l70287N09528J195806j39920k226005
3919C1191716j480398j348804l190327k109672O43605k77509j871423o75785o8608
3910B0812795j27136j895511q10291Q36046J131389r5748j333581p83100M6163
3901A7781026k57462m13322J247999N41690k48606j04357K09153j30631K70141
$$ y = [47127556, 47550285, 45566329, 43588006, 42171655, 41334379, 41586496, 41647437, 41651552, 41309886, 42174473, 44727503, 47088541, 46125373, 42937454, 40823259, 41358891, 41218860, 39386007, 38256518, 39348058, 40386402, 38528503, 37540208, 37969500, 37907183, 36313506, 36105454, 36949750, 38018565, 36746104, 34694230, 34343239, 34235682, 33168912, 33032299, 33417395, 33002622, 32366429, 31714728, 32222594, 31852307, 32361835, 33557641, 33417721, 31191716, 29711318, 28362514, 25172187, 23062515, 23706120, 23428611, 21557188, 20881403, 20812795, 20685659, 18790148, 17979857, 18815903, 19947292, 19851544, 18517963, 17734863, 17781026, 17523564, 17110242, 18358241, 18899931, 18651325, 18546968, 18756121, 18625490, 18895631]
3892A8895631q00914o10375Q59301P23544K66763p27089k5372L71552L57238j014394
3882A8295885J31963J636594n1229p67984r02763K31431J058942J47057j074747
3873A8705149j03497n47640P41028J287748q10036q50506N47123J362987K18001
3864B0550357N38471o20162Q6643R39828P23773J279471J744351J13374O24900
3855B5981006K007557J438141j06337K20837K475231O39734q4429J398317J500825
3846C5470882j177409q82114J082798J623021K012478L25284K72931J195787J323128
3837D1246786P97352Q98689o20065k6574J205156J258591o31148k560027j411101
3828D0157659j204066L81707j019799r24145q18015j323741j019773j114958j883392
$$ y = [18895631, 18094717, 17484342, 18343643, 19067187, 19333950, 18606861, 18581489, 18953041, 19310279, 18295885, 18427848, 20064442, 20013213, 19245229, 18342466, 18573897, 19632839, 19779896, 18705149, 18601652, 18054012, 18795040, 20082788, 19272752, 18422246, 18969369, 20332356, 20550357, 21088828, 20468666, 20555309, 21495137, 22218910, 23498381, 25242732, 25356106, 25981006, 27988563, 29426704, 29320367, 29541204, 32016435, 32656169, 32571740, 33970057, 35470882, 34293473, 33411359, 34494157, 36117178, 38129656, 38454940, 38727871, 39923658, 41246786, 42044138, 42942827, 42322762, 42296188, 43501344, 44759935, 44128787, 41568760, 40157659, 38953593, 39335300, 38315501, 37391356, 36573341, 35249600, 34229827, 33114869, 31231477]
3819C1231477l96406j50486n14966j44616j223343J89858L50736k58691r48189
3810B8135374O61715R50584j45229q24197r22212Q44344J199134K39888n88648
3801B9550753q15357J98375P70044o92957j14045O20376J209693J806730P37164
3792C3270776o2807L40862J932893J145196K91048M1116o43584J57205J68410
3783C6641115j728641j808735l6802M40562q77245j905092j548308k97353K06775
3774B9086276j471755j487211j163786J31751L13633j958393j720361p69220j190616
3765A9770318n04035p37967p13093l56821j342744r23732M1852l29569j109530
3756A3794679p45348J59966J147882P81182j366774r01695k86645j377312m21532
$$ y = [31231477, 30835071, 30684585, 30169619, 30025003, 28801660, 28991518, 29342254, 29083563, 28135374, 28797089, 29747673, 29602444, 28778247, 27856035, 28700379, 29899513, 30139401, 29550753, 28735396, 28933771, 29703815, 29010858, 28896813, 29517189, 30726882, 32533612, 33270776, 33207969, 33548831, 35481724, 36626920, 36917968, 36959084, 36315500, 36472705, 36641115, 34912474, 33103739, 33066937, 33507499, 32630254, 30725162, 29176854, 28879501, 29086276, 27614521, 26127310, 24963524, 25095275, 25408908, 23450515, 21730154, 20960934, 19770318, 19266283, 18528316, 17815223, 17458402, 16115658, 15191926, 15233778, 14904209, 13794679, 13049331, 13209297, 14357179, 15138361, 13771587, 12869892, 12583247, 11205935, 10784403]
3747A0784403K78611o94713k8277P3045Q01760J192585O4792j683214q67314J076634
3737A0998312m36862l15910K1800O17202L57446k73276l24695j08801L39845R41990
3727A1817051r1277N73854O14187m72432M07427M6771q73287m82608Q37340j43755
3717A2233271n93201J108233o1223N4360K27187k31780j38062P66178n07289j075822
3707A1781852M87861P02001l94338j60476M52982l3790L05386L83701N31146p01820
3697A3354505k78858K08399J73834J11429k80261l09851l691O57659l70250J89106
3687A3452021L68603k59944O5488J072546O45101J51314Q24648P22765R36001
3678A7978543o43070K56556M20352L6590K1163m43418m03277N12728L61191r3550
$$ y = [10784403, 11063014, 10368301, 10340024, 10413069, 11214829, 12407414, 12472206, 10788992, 9921678, 10998312, 10561450, 10245540, 10267340, 10884542, 11241988, 10968712, 10644017, 10535216, 10875061, 11817051, 11725774, 12299628, 12913815, 12441383, 12848810, 12895581, 12022294, 11539686, 12377026, 12233271, 11640070, 12748303, 12687080, 12741440, 12968627, 12736847, 12598785, 13364963, 12857674, 11781852, 12269713, 12971714, 12577376, 12416900, 12869882, 12836092, 13141478, 13525179, 14056325, 13354505, 13075647, 13284046, 13457880, 13569309, 13289048, 12979197, 12975506, 13633165, 13262915, 13452021, 13820624, 13560680, 13626168, 14698714, 15343815, 15495129, 16319777, 17042542, 17978543, 17335473, 17592029, 18012381, 18048971, 18070134, 17626716, 17223439, 17736167, 18097358, 18003808]
3668A8003808k4486j129137j419338O09275P12099p30205o51142l8355P39257
3659A6071776M01656j296267q53478P55433R08104O10543N12515n11951p82597
3650A5815734J144913m87128j419215m53442Q9226J42792M3490r04225n01463
3641A3470682N40591J50556L6911J72972Q12702j599837q92308N23240p23002
3632A2492507q00562Q36579J140899p08010o69231k80393j36398R12390n0659
3623A2737122k63020J602820M32701m95887k52670J48421n95671R9595Q97696
3614A4311107r87838o84375J072852J519293Q54284j052769m06852n4967n29512
3605A4041223O46160j206529r61231J023976O31620l29998n8612o96400j125683
$$ y = [18003808, 17979322, 16850185, 15430847, 16040122, 16752221, 16022016, 15370874, 15332519, 16071776, 16473432, 15177165, 14323687, 15079120, 15987224, 16597767, 17110282, 16598331, 15815734, 16960647, 16473519, 15054304, 14600862, 14690088, 14832880, 14876370, 13972145, 13470682, 14011273, 14161829, 14198740, 14371712, 15184414, 13584577, 12692269, 13215509, 12492507, 11691945, 12528524, 13669423, 12961413, 12292182, 12011789, 11875391, 12787781, 12737122, 12474102, 14076922, 14509623, 14013736, 13761066, 13909487, 13313816, 13413411, 14311107, 13323269, 12638894, 13711746, 15231039, 16085323, 15032554, 14625702, 14570735, 14041223, 14687383, 13480854, 12519623, 13543599, 14175219, 13845221, 13786609, 13090209, 11964526]
3596A1964526P36220Q3326p68861N84516J377023r49033j962720N17629J713687
3587A3296313q93397j520727N1947q7995N32176k57369L27700J215164K40975
3578A2904787n81036J0893J048358j465802q99821O21873R00659k8999o20663
3569A1890249o5432N55766n81604j18617K814924P32993j060821k90295K51542
3560A4128705j44129K626510M22597k002607m33156R84663O46588j38985n77747
3551A5512439l60004J219060J358598p35618o80845k91076p90316o19112N20161
3542A5133287k87387J68369R20943m66826k71277M96019l41195m29768J850363
3533A6772528K13923n55632K12791Q18854n85622K012703Q37250j838170O56288
$$ y = [11964526, 12700746, 12784072, 12015211, 12599727, 13976750, 13027717, 11064997, 11582626, 13296313, 12402916, 10882189, 10934136, 10846141, 11378317, 11120948, 11448648, 12663812, 12904787, 12323751, 12334644, 13383002, 11917200, 11017379, 11639252, 12539911, 12510912, 11890249, 11824817, 12380583, 11798979, 11680362, 14495286, 15228279, 14167458, 13877163, 14128705, 13984576, 16611086, 17033683, 15031076, 14597920, 15582583, 16229171, 16090186, 15512439, 15152435, 16371495, 17730093, 16994475, 16313630, 16022554, 15232238, 14613126, 15133287, 14845900, 15014269, 15935212, 15468386, 15197109, 15693128, 15351933, 14922165, 16772528, 16986451, 16430819, 16643610, 17462464, 16876842, 18889545, 19726795, 17888625, 18544913]
3524A8544913R82058J47485L0794J335369J10015R60534J38694O83212J295558
3515B4228632m62517K4063J022139J810777k22710O5380L03847K292182Q94875
3506B9956668M30308N05439K838530J271478k08546J830079K830162K564150J044761
3497D3063029K608675J958171K664965L722540L601168K669235M690829P210858
3489G2189470Q035303Q481442Q510853J0593848J3795141J2543423P699535O825316
3481A48674331N365995J339430j121444j130262N37779J73850K043321L570559
3473A59453559K863493L203434N381346M711200L33364m025180o922052q237331
3465A56761833j0233052j2648176j3196054j0548523q788775q561685p391939
$$ y = [18544913, 19526971, 19674456, 19705250, 21040619, 21150634, 22111168, 22249862, 22933074, 24228632, 23766115, 23790178, 24812317, 26623094, 26400384, 26465764, 26769611, 29061793, 29956668, 30386976, 30892415, 33730945, 35002423, 34793877, 36623956, 39454118, 42018268, 43063029, 45671704, 47629875, 50294840, 54017380, 57618548, 60287783, 64978612, 72189470, 80224773, 88706215, 97217068, 107810916, 121606057, 134149480, 141849015, 148674331, 154040326, 155379756, 154258312, 153128050, 153665829, 153839679, 155883000, 159453559, 162317052, 165520486, 170901832, 175613032, 175946396, 171921216, 164999164, 156761833, 146528781, 133880605, 120684551, 110136028, 101347253, 92785568, 85393629]
3458H5393629o192926m939951l516299l119073n461003m168532j661114k001502
3450E4333229k895712k299706k32318j660509j963909q7132L07902J38336M36787
3441D6076968M01606J241430J412322J023451K641712M172305L492823K834347
3433F3296964M580490M865589M996110M677378O509582P736770O708879N046743
3425A08418505L836061L543247M05949k821422l705388m205334m271608m616026
3417I6583984o228349n650527n515664n514144n220640l817723k746408l413920
3409E8476609k952059j275419j761598k292363K81698j315401k138515r64185
3401D6058767L1448k43016q15675j384337j109896N38253K7747r26077j761186
$$ y = [85393629, 79200703, 74260752, 70744453, 67625380, 62164377, 57995845, 56334731, 54333229, 51437517, 49137811, 48905493, 47244984, 45281075, 45193943, 45501845, 45640181, 46076968, 46478574, 47720004, 49132326, 50155777, 52797489, 56969794, 60462617, 63296964, 67877454, 72743043, 77739153, 82416531, 88926113, 96662883, 103371762, 108418505, 112254566, 115797813, 116203762, 113382340, 109676952, 105471618, 101200010, 96583984, 90355635, 84705108, 79189444, 73675300, 68454660, 64636937, 61890529, 58476609, 55524550, 54249131, 52487533, 50195170, 50476868, 49161467, 47022952, 46058767, 46090215, 45847199, 45031524, 43647187, 42537291, 43075544, 43103291, 42177214, 40416028]
3392D0416028k59320k20837k47431l73590k64593l85975N93205J839126k25465
3383D0871148j680557j041296J672920j83998j296932l24118j26677J35941j102278
3374C6924153q56787k42854J52481n06773O537n15444K56634p67605l97830J431813
3364C5484325P24047K88061O22574k49477p03991J239997J338552J170455N77223
3355D0491766P91158N58515Q76927O70593L82841j064617N60780Q58184Q89650
3346D5015797K720k71600R12800Q03800L76849J034632L337501L525819J869999
3337E6608317O56725M987265N261401M876869N678837O384375P525823Q184572
3329A00164184O268781L778135K212242k236424m322548o656647p211513p725389
$$ y = [40416028, 40156708, 39935871, 39688440, 39314850, 39050257, 38664282, 39257487, 41096613, 40871148, 39190591, 38149295, 39822215, 39638217, 38341285, 38017167, 37890490, 38026431, 36924153, 36067366, 35824512, 35976993, 35470220, 35476757, 34961313, 35217947, 34450342, 34052512, 35484325, 36208372, 36496433, 37119007, 36869530, 36165539, 37405536, 38744088, 39914543, 40491766, 41282924, 41841439, 42718366, 43388959, 43771800, 42707183, 43267963, 44126147, 45015797, 45018517, 44746917, 45659717, 46463517, 46840366, 47874998, 51212499, 54738318, 56608317, 57265042, 62252307, 67513708, 72390577, 78069414, 84453789, 91979612, 100164184, 106432965, 110211100, 112423342, 110186918, 105864370, 99207723, 91996210, 84270821]
3321H4270821p410726o948047o149043m981727m106781m397056n332964k819768
3313D2124709j361396r88889j281296j442509j522206j21932O60649P0057M28774
3304C6565961J388217O95343k18861r70623j846231k476405j431636j721400r68426
3295B9015939n37172k24070K1220Q16998L54753J579J82107J539757Q88331j243069
3285C0816373O99276J381723K403500J637487L13574J988155M757201K557678
3277D6554967J833045L602004M691022M548276M575398M476468L384003L063237
3269G6728420K781776K541423J533914q63312k690179j551677j035244k610002
3261G4835119k079158m64882K89091n7691k03706J919091L274935L553277N143042
$$ y = [84270821, 76860095, 69912048, 63763005, 58781278, 54674497, 50277441, 44944477, 42124709, 40763313, 39774424, 38493128, 37050619, 35528413, 35406481, 36067130, 36137187, 36565961, 37954178, 38649521, 38430660, 37460037, 35613806, 33137401, 31705765, 29984365, 29015939, 28478767, 28254697, 28275917, 29092915, 29447668, 29449247, 29631354, 31171111, 32059442, 30816373, 31515649, 32897372, 35300872, 36938359, 37251933, 39240088, 43997289, 46554967, 48388012, 51990016, 56681038, 61229314, 65804712, 70281180, 73665183, 76728420, 79510196, 82051619, 83585533, 82722221, 80032042, 78480365, 77445121, 74835119, 72755961, 72291079, 72580170, 72522479, 72318773, 74237864, 77512799, 81066076, 86209118]
3252H6209118M643001K040478J669643M94430k448497o543326q040460n330995
3244G2693392m677279o909273p836621n796453k866365k759193m393043k976708
3236C4478457j046436l410258l344309j91311j64406j679646n97804L60633j03402
3227B4301518j347332q58447m41867R49203K051476P70718K34951n13543q32166
3218B4314511p37786p76111r91533j46451J749125O30887k283194j810335l82011
3209A9567102k241778k007030r91241j100388j090974o79145o48557o13830m07746
3200I786413p37389J229840k50272j417814l64072J881338J51517j741030j496718
3191G041813J532882N28479r71479l52447M06107K4467l50788J024498l395n95921
$$ y = [86209118, 90852119, 92892597, 94562240, 95056670, 92608173, 86064847, 78024387, 72693392, 68016113, 61106840, 53270219, 47473766, 44607401, 41848208, 37455165, 34478457, 33432021, 30021763, 26677454, 26486143, 26321737, 24642091, 24044287, 24404920, 24301518, 22954186, 22095739, 21653872, 22603075, 24654551, 25425269, 25660220, 25146677, 24314511, 23576725, 22800614, 21809081, 21662630, 23411755, 24042642, 21759448, 19949113, 19567102, 17325324, 15318294, 14327053, 13226665, 12135691, 11456546, 10807989, 10194159, 9786413, 9049024, 10278864, 10028592, 8610778, 8246706, 10128044, 10279561, 8538531, 7041813, 8574695, 9103174, 8131695, 7779248, 8185355, 8209822, 7859034, 8883532, 8880137, 8284216]
3181H284216r82977J838419R41272j631997j499343J644956J040806j060988j48145
3172H426219J301818R43512k45255L41471J110581J094678l32237J226289J550925
3163A5418001P27250J373021R92579K44644k55310m50098N02708P98061N4398
3154A9405254o52804l47193p31774m25559P15715O3275n45524j030163K92641
3145A6743868O22597L39324n98081p2978M78906J461889J237995J94372J26905
3136B0534797K247184M530149M473996O528043M584559L89987l708148l754726
3128C5825841l598469m322715l567568k369916j514157j662967r70178j791460
3120A6028411k089615o78818j90879J6807m85996o02221m53688J372343k03377
$$ y = [8284216, 7301239, 9139658, 10080930, 8448933, 6949590, 8594546, 9635352, 8574364, 8426219, 9728037, 10671549, 10426294, 10767765, 11878346, 12973024, 12640787, 13867076, 15418001, 16145251, 17518272, 18510851, 18755495, 18500185, 18050087, 18552795, 19350856, 19405254, 18752450, 18405257, 17673483, 17247924, 17963639, 18026914, 17481390, 16451227, 16743868, 17366465, 17705789, 17107708, 17034730, 17513636, 18975525, 20213520, 20407892, 20534797, 22781981, 27312130, 31786126, 38314169, 42898728, 43288715, 39580567, 35825841, 32227372, 27904657, 24337089, 21967173, 20453016, 18790049, 17819871, 16028411, 13938796, 13259978, 13069099, 13085906, 12599910, 11997689, 11544001, 12916344, 12712967]
3111A2712967k14296m3633L13258N46312p95819R11754J00490J038190J049254
3102A5618477J500628j346332p68939O22724q46989q44730k30861j80913k873897
3093A0649168j323036q78774J92256j098249j511965r99726J62011j53333m77723
3084D560629J641875L1690m33247p32860Q52280o70277j191793j173898L56864
3075C241263N72120n70293n03071J04659L9034j370286O43943J178063J9844n05986
3065B849290P58083n24335j091632L05684r49036j06091J269564k20278j230755
3056A060494K24978m47001o38599K368529J312536j693377j37368P57110r56496
3047A850806n98516L2129m01919Q24074P38003o82145j363374J385674P08940
$$ y = [12712967, 12498671, 12455038, 12768296, 13314608, 12518789, 13430543, 13531033, 14569223, 15618477, 17119105, 15772773, 15003834, 15626558, 14779569, 13934839, 13703978, 13523065, 10649168, 9326132, 8447358, 8639614, 7541365, 6029400, 5029674, 5191685, 5038352, 4560629, 6202504, 6234194, 5800947, 5068087, 5920367, 5250090, 4058297, 2884399, 3241263, 3813383, 3243090, 2740019, 2844678, 2883712, 1513426, 2157369, 3335432, 3355276, 2849290, 3607373, 3083038, 1991406, 2297090, 1348054, 1241963, 2511527, 2291249, 1060494, 1285472, 838471, 199872, 2568401, 3880937, 2187560, 2050192, 2807302, 1850806, 1252290, 1284419, 882500, 1706574, 2444577, 1762432, 399058, 1784732, 2493672]
3038B493672j129589m56915Q19731M45691p71733l45514p38432O19841j68884
3029G67868L58577l02109o04162k29589P38752J121511p89145o1593n00642Q82832
3019A382300P7539p79078j061379Q97907M22775M44401P5214r33831m01595K76777
3009D01030P50387k58807J466657p96727j603331o05365J808274N48085j276365
3000D33838q1174J05384l61845l74046L83978r3436O89789K20170k25963L6028
2990G32723k66758p48120J29330J486096O00079R0821j442795m68682n70334L37301
2980a20339Q94619M40957P1272j57594L30964K36412o10200n07525n47391L67994
2970C99169J528054K00730j487601j521478N00080Q32054O46346o31745K25003
$$ y = [2493672, 1364083, 907168, 1726899, 2172590, 1400857, 1055343, 316911, 936752, 767868, 1126445, 824336, 220174, -9415, 729337, 1850848, 1061703, 1000110, 499468, 1382300, 1459839, 680761, -380618, 517289, 940064, 1384465, 1459679, 525848, 124253, 401030, 1151417, 892610, 2359267, 1562540, -40791, -646156, 1162118, 1710203, 433838, 352664, 458048, 96203, -277843, 106135, 12699, 702488, 922658, 696695, 732723, 465965, -282155, -152825, 1333271, 1933350, 2024171, 581376, 112694, -457640, -120339, 774280, 1215237, 1286509, 1128915, 1459879, 1696291, 1086091, 578566, 31175, 399169, 1927223, 2127953, 640352, -881126, -381046, 451008, 1097354, 465609, 690612]
2961F90612J197227J40789j032047k34010K58334k91403l89135o64210l36015
2952f59858O4563J231688q00758Q77420P86480j325500k43627J020463L28903
2943A279774r92764O66993n83906q74480k90340Q78943o6285M58650K39816n26715
2933A89686N26580M66916P101K09921R69962k807122o97450J730619J68981j464778
2923f99584j54783J419058j19941O90257j12327r67608M51288K93988o06628N76772
2913G70492J67633j752288j02326Q8143Q3138K8994Q16015J98929P71780M41998
2903A512508l96206m55333m09904K683n84326R62681m13079j36483k63080l61286
2893e41825J68211J382956J98409k04983L06666l07927k41302j56890m84149m92646
$$ y = [690612, 1887839, 2028628, 996581, 762571, 1020905, 729502, 340367, -323843, -659858, -595295, 636393, -164365, 713055, 1499535, 174035, -69592, 950871, 1279774, 287010, 954003, 370097, -504383, -794723, 84220, 17935, 476585, 716401, 189686, 716266, 1183182, 1190283, 1400204, 2370166, -436956, -1134406, 596213, 765194, -699584, -854367, 564691, 444750, 1135007, 1022680, 55072, 506360, 800348, 193720, 770492, 938125, -814163, -916489, -828346, -745208, -716214, 99801, 298730, 1070510, 1512508, 1116302, 660969, 251065, 253748, -330578, 632103, 219024, 82541, -180539, -541825, -373614, 1009342, 1207751, 1002768, 1309434, 1001507, 760205, 603315, 119166, -373480]
2883c73480j17237r72118K65432J030288l7697m76032P13024J059596n01069N26775
2873A117482n5757p11413K07037K72278j268897p23332O9128Q52773O31935l82697
2863H537r46982N23286J985827J08672j623139l28520Q77448j11463Q6716n21158
2853E9224n02223j17792K90405l69303J89765P33178N91024J31576p70159k9557
2843B06138L1291J87546n62353O03143m92872l34749J02108p83555l3305J171195
2833I4587R78743q40106L02687p94114P81570N42570r99903o02142J181247M79992
2823A125131j406982p0763L07630j27860k27210J406477q37700k76730L87504
2814B79497l61376n29235R51901N99692l59757P44027j190638o97612J37683l78726
$$ y = [-373480, -490717, -1462835, -1197403, -167115, -204812, -680844, 32180, 1091776, 590707, 1117482, 1061725, 350312, 557349, 829627, -439270, -1162602, -1093474, -240701, 391234, 8537, -938445, -415159, 1570668, 1679340, 56201, -272319, 605129, 493666, 580382, 59224, -442999, -560791, -270386, -639689, -449924, 283254, 874278, 1005854, 235695, 206138, 237429, 424975, -137378, 465765, -27107, -361856, -259748, -1043303, -1076608, 94587, 1073330, 233224, 535911, -258203, 523367, 1065937, 66034, -536108, 645139, 1125131, -281851, -352614, -44984, -172844, -400054, 1006423, 168723, -108007, 279497, -81879, -611114, 340787, 940479, 580722, 1324749, 134111, -563501, -425818, -804544]
2804h04544n50575J746014O29144n18020R1818N43480m65627L5237M96357j098350
2794A04934L09239l78582j68232K51311P31243k28739m46316J65395k57122m44861
2784c61730L04967J653535p64070N47o01072l12146j34285K01835q95966P82157
2774a26228J411827o54563k40521j402983J604692R24196j094357j091644Q45935
2765A76354L92954m54549l92383P4438J078886N18869j3919j644478P76905J01217
2755F14294L41826q41881p23648J00218J86461O28657m7600j93901k32121J661776
2745A494081m43410q71903O59619m31735j304131L11825J245466L02144m23334
2736E38622o74692q4138o51629M64912K05055M78053P04329r76998O85174M13701
$$ y = [-804544, -1355119, 390895, 1020039, 502019, 593837, 1137317, 671690, 706927, 1203284, 104934, 414173, 35591, -132641, 118670, 849913, 621174, 174858, 340253, 83131, -361730, -56763, 1596772, 832702, 833249, 232177, -79969, -214254, -12419, -908385, -126228, 1285599, 631036, 390515, -1012468, 592224, 1516420, 422063, -669581, 176354, 569308, 114759, -277624, -203186, 875700, 1394569, 1380650, -263828, 513077, 614294, 956120, 114239, -609409, -509191, -322730, 305927, 258327, 64426, -167695, 1494081, 1050671, 178768, 838387, 406652, -897479, -585654, 659812, 961956, 538622, -136070, -220208, -871837, -406925, -201870, 276183, 980512, 3514, 688688, 1102389]
2726A102389k04890j471016P33286N80273m62822n65260K28077M53036J087448
2717A480521q97546j614380J616209l20673r53275J349979J461850j630504L4634
2708E26815P62457r40725m45960k20567n24679O21817Q96243k90816k72625P69068
2698H81028o19280j622844J394462J262894j103039n97823N12373p73054j594881
2689b260164J121527J309933K08633M45598K9485L96854j276911j093839J07562
2680a011322P60707J85275N09119P14721r65772p54003M23793J002609M53421
2671A318548n45879j018445J101733l62194j083608n7525J436991l12712j307617
2662h30708K7638N22738j08828p04415J585534q1607k49652M7863N33144j336599
$$ y = [1102389, 897499, -573517, 159769, 740042, 277220, -288040, -59963, 393073, 1480521, 582975, -1031405, 584804, 264131, -689144, 660835, 2122685, 492181, 526815, 1289272, 348547, -97413, -317980, -842659, -220842, 675401, 384585, 111960, 881028, 261748, -1361096, 33366, 1296260, 193221, -404602, 107771, -665283, -2260164, -1138637, 171296, 379929, 825527, 855012, 1251866, -25045, -1118884, -1011322, -250615, -65340, 443779, 1158500, 192728, -561275, -137482, 865127, 1318548, 772669, -245776, 855957, 493763, -589845, -647370, 789621, 476909, -830708, -803070, -280332, -389160, -1093575, 491959, 410352, 160700, 208563, 741707, -594892]
2652e94892o80928R52563Q96786l16340q4226O19093m02340n07183o24849O31650
2642a10666L73077k63165j79286L66929O7259j00455l52254J664914K62521j532257
2632A96617j026452L55005L66971k64114L5831J281480K86977j375933L46278
2623B02660K05466O867L23182J04144k141816k97990Q65251K70408L20038J207764
2613A065974K90798q00612N70876o80889r23025J6042J246298m81681L65186M4047
2603G13014l90804q9164m93163M28550L40256J011181J08347L67606L29041n92305
2593A732559j575795O67600O75568r4000j124950j055575O08214J11332P7396
2584B2349N60364J274681j717754l26920M19752p70722m95010P71522J185632
$$ y = [-594892, -1275820, -323257, 573529, 257189, 172963, 792056, 389716, -117467, -742316, -110666, 262411, -754, -180040, 186889, 254148, 153693, -198561, 1466353, 1728874, 196617, -829835, -474830, -107859, -371973, -336142, 945338, 1232315, -143618, 202660, 408126, 414993, 738175, 842319, -1299497, -1597487, -732236, -461828, -141790, 1065974, 1356772, 556160, 1127036, 446147, -476878, -460836, 785462, 303781, 668967, 713014, 322210, 233046, -260117, 168433, 508689, 1519870, 1628217, 1995823, 2324864, 1732559, 156764, 824364, 1499932, 1405932, 280982, -774593, -166379, -55047, 22349, 582713, 1857394, 139640, -187280, 232472, -538250, -1033260, -261738, 923894]
2575I23894K53956M53684r40457n14813M086R99811r42909q0811o73619Q57478
2565C40300J173645j366896n38409J113580J694926j632610j336811k1831O50932
2556G6826R678N59587j62639K02447q0334L84639n1482o88515r55710J42220J251186
2545F87903q77023J70428L13182N3978M55424l77214n83315M64701N01689j84906
2535F24847q40275M53354P89625j8003o01122q36469j65041P21121n4071L87189
2525D61155J695383M00166j527867r88746R02593l11074q49170K4709J046652
2516H53801k13307o73430q0133m3733K27331Q8990Q29759O3134j340941k65074
2506e53603K23731L89678n3582M08546j4800N4211P42926M71360j916230j532676
$$ y = [923894, 1177850, 1631534, 691077, 176264, 180350, 1180161, 237252, 156441, -517178, 340300, 1513945, 147049, -391360, 722220, 2417146, 784536, -552275, -574106, 76826, 86504, 646091, 483452, 685899, 605565, 990204, 938722, 250207, -705503, -563283, 687903, -189120, -18692, 294490, 348468, 803892, 426678, -156637, 308064, 809753, 624847, -215428, 237926, 1027551, 1009548, 408426, -428043, -593084, 128037, 73966, 461155, 2156538, 2556704, 1028837, 40091, 942684, 631610, -217560, -192851, 853801, 640494, -32936, -113069, -156802, 70529, 159519, 989278, 1052412, -288529, -553603, -329872, 59806, 6224, 414770, 399970, 454181, 1197107, 1668467, -247763, -1780439]
2496a780439J401637J903550l65491j475643Q26893l8841J99801o67626M28877
2487D32718J72151l4608o67331L58403P55459j226589P0656P89054J057754j652853
2477E4814r1294J89147Q6092j56292P57817Q31227k17903l57650p19801k68906
2467A07251o0188O11547j39310J34443n99451M53876Q22288J01192n57542l39452
2457E34654O13297L75984l40955r52886j07816M61161N31107K97964m83960o42949
2447B85601k50838Q38709J371475M26717j277872l12528N41976N3419j397411
2438B79248l93699M89798k20702q2429O2836O3762o03688L43808Q82186O26707
2428A447827N32582M56729p97571m30318k32125m66685M00319J11112p52861o17668
$$ y = [-1780439, -378802, 1524748, 1159257, -316386, 510507, 471666, 671467, 3841, 432718, 604869, 570261, -97070, 261333, 1016792, -209797, -139141, 649913, 1707667, 54814, -36480, 152667, 238759, 82467, 840284, 1671511, 1453608, 1095958, 376157, 107251, 47063, 658610, 519300, 653743, 54292, 508168, 1330456, 1431648, 874106, 534654, 1147951, 1523935, 1182980, 230094, 122278, 583439, 1114546, 1412510, 928550, 285601, 34763, 873472, 2244947, 2671664, 1393792, 1081264, 1623240, 1676659, 279248, -114451, 375347, 154645, 72216, 135052, 198814, -404874, -61066, 821120, 1447827, 1980409, 2437138, 1639567, 1209249, 977124, 510439, 910758, 1021870, 269009, -348659]
2418c48659J375031j94366J48582L45051N91176J03977j26028N97267n28271q27395
2408A136365L6702J317224o37551r53964q90754M33258L48821R66093O33656k52261
2398B137589P17693k21891Q0349l876j14345q45384o21184k4209Q33681P02854
2388B641277n0576L79389R7120K76659L39522L76838j197380p33495N76707P65689
2378C471750o8684o63898M78955j276555K52219J181600O00608o64995M14499
2369C725499k301m99143J599680o2233o73339n16086J176279M74465N65050J94259
2359E982130N82457K29570K51015O94996N21275J84346n58817N3926P04398J864035
2349A0509331J052697J67155N24053J486555K064137L250824L593896N64199j312589
$$ y = [-348659, 1026372, 832006, 980588, 1325639, 1916815, 2020792, 1894764, 2492031, 1963760, 1136365, 1173067, 2490291, 1852740, 898776, 8022, 441280, 790101, 1756194, 2389850, 2137589, 2855282, 2633391, 2713740, 2709864, 2595519, 1750135, 1128951, 1104742, 1938423, 2641277, 2590701, 2970090, 3067210, 3343869, 3683391, 4060229, 2862849, 2129354, 2706061, 3471750, 3403066, 2739168, 3218123, 1941568, 2193787, 3375387, 3975995, 3311000, 3725499, 3723198, 3224055, 4823735, 4761502, 4088163, 3572077, 4748356, 5222821, 5787871, 5982130, 6564587, 6794157, 7045172, 7740168, 8261443, 8445789, 7886972, 7940898, 8645296, 10509331, 11562028, 11729183, 12253236, 13739791, 15803928, 19054752, 22648648, 23212847, 21900258]
2340B1900258m3640J922043K875404L576842M931795O194168R662374J6062512
2332F7081756K4766942M6527966Q1391361R0250193L1394554m0777258n6077170
2325B44558344n1272870m6996946l7494774k9352066j9298177j2007729p986183
2318D0149599o778366m520992p46097j892456k675500l83263j045994l204857
2310A8902074k543742k521295k151358j145064n64637l61247l14654j392605j616032
2301F291440K56923l65497o72547p6072K91820J74490k37235n93264k57733j12400
2291D699925N23326J6509n76409j10314J85263m79246n55621j23394N55379Q43095
2281D978513j040576j600149J432021Q68738j331960n32681L33806n39968n50396
$$ y = [21900258, 21856618, 23778661, 26654065, 30230907, 35162702, 41356870, 51019244, 67081756, 91848698, 138376664, 219768025, 310018218, 341412772, 300635514, 244558344, 193285474, 146288528, 108793754, 79441688, 60143511, 48135782, 40149599, 33371233, 28850241, 28104144, 26211688, 23536188, 23152925, 22106931, 18902074, 16358332, 13837037, 11685679, 10540615, 9975978, 9614731, 9300077, 7907472, 6291440, 6548363, 6182866, 5510319, 5434247, 5726067, 5900557, 5663322, 5070058, 4812325, 4699925, 5223251, 5239760, 4663351, 4553037, 4738300, 4259054, 3703433, 3580039, 4135418, 4978513, 3937937, 2337788, 3769809, 4638547, 3306587, 2773906, 3107712, 2567744, 2017348]
2272B017348k71034m38614M33635j80038k59959J637631K40252j450699j05341
2263A623181P22307q1614j11362j58509k17387M53267p88506r05069K72329Q24006
2253A632643O7985l25424K29951p0594p68797N47988K61236j140434K42706M12158
2243A089418r61633K81962J84882l98922P45630J215941k26901q77798j326834
2234b74255j89783K098409M47556k093303q23619J247915P51389r60101q21977
2225f17769R33392J264180k38794o16052L58075l84857l13796L07837q250j00584
2215E83382L7829j21682p89009p1780Q89643J017874j568323j063551Q64115O22535
2205D01033p30185l74717N5222J469136M58586p24331K04033j194916k36293J008173
$$ y = [2017348, 1746314, 1307700, 1741335, 1561297, 1301338, 2938969, 3179221, 1728522, 1623181, 2345488, 2263874, 2152512, 1994003, 1776616, 2229883, 1441377, 536308, 808637, 1632643, 1700628, 1375204, 1605155, 1534561, 765764, 1313752, 1574988, 434554, 677260, 1089418, 127785, 409747, 594629, 195707, 941337, 2157278, 1930377, 1052579, -274255, -464038, 1634371, 2081927, -11376, -834995, 412920, 1164309, 204208, -617769, 315623, 1579803, 1341009, 724957, 1083032, 698175, 384379, 692216, 683966, 583382, 621211, 499529, -289480, -361260, 528383, 1546257, -22066, -1085617, -221502, 401033, -329152, -703869, -648647, 820489, 1279075, 554744, 758777, -436139, -672432, 335741]
2195C35741J271795j495363K87550l60462J2332J94054J07387l42674r5663P15061
2185F29758m31602K31879j801840K70591Q48145J484343j780137l81036J048751
2176A18852L91418p45363q17261K128835l5566o84044r32809P80423k09462M9391
2166D4414j238307J457401J753382j570132j035835N42050J422521j233257N4241
2157A96478J0780N86527j128621J6592Q54647n87534K31759l03989l3116M69093
2147C12616P35430j594511P8947O68674O82196r2104j59161j615071m88801J317446
2137a54339m95858P20966J04778j74852j341940L1501N49816P67254L69000l05116
2127G1210O78111J35907q28110o82462M07941N08005l08156m03452J090022j084937
$$ y = [335741, 1607536, 112173, 399723, 39261, 51593, 245647, 353034, 10360, -85303, 629758, 198156, 430035, -1371805, -1101214, -253069, 1231274, -548863, -929899, 118852, 510270, -235093, -1052354, 1076481, 1040915, 356871, -575938, 204485, -4977, 44414, -1193893, 263508, 2016890, 446758, -589077, -47027, 1375494, 142237, 196478, 207258, 793785, -334836, -318244, 536403, -51131, 180628, -123361, -156477, 312616, 1048046, -546465, -467518, 201156, 883352, 791248, 632087, -982984, -1471785, -154339, -650197, 70769, 175547, 695, -1341245, -1309744, -759928, 7326, 376326, 71210, 749321, 885228, 57118, -625344, -217403, 290602, -17554, -421006, 669016, -415921]
2117d15921K92336M68634m82021Q26969J243718j59217l48271n33408j580324
2108f87505P6862J274042N1457q09946O53726N900J94149j253613l29039O51317
2098a72650L75186l89685N11371N99648q41810j60101M18653l62344n82668K14521
2088c89879N7140r9087J62972N94421m82081m9114M05635m89393N3226Q28193
2078E92033m68683R322K01528l84893k55112M58226j50916K10061Q27124o95439
2068C43251n74523L00191P2419M59637N59755l12246k41999r08874J6088J635315
2058A349014L31682j240893J58537Q80235L697q42636j189251j047204K2278J603023
2048B8482O65339o21670p87611M68529l149l43284k03439k85573J050411R84081
$$ y = [-415921, -123585, 345049, -136972, 689997, 1933715, 1774498, 1426227, 892819, -687505, -610643, 663399, 714856, -95090, 558636, 564536, 758685, -494928, -823967, -172650, 202536, -187149, 324222, 923870, 82060, -78041, 340612, -21732, -604400, -389879, -332739, -431826, -268854, 325567, -156514, -205628, 200007, -289386, -236160, 592033, 123350, 132672, 334200, -50693, -305805, 152421, 1505, 211566, 1038690, 343251, -231272, 68919, 141338, 600975, 1160730, 848484, 606485, -302389, -286301, 1349014, 1680696, 439803, 598340, 1478575, 1482272, 639636, -549615, -1596819, -1574541, 28482, 693821, 72151, -715460, -246931, -250080, -593364, -796803, -1082376, -31965, 952116]
2038I52116p12170r47308n2828k80802N72504J095088L42925p25663l40927K74439
2028A77374J73382j363199p24066J997657L34854j597259o6971N95640Q99523
2019D26935o56876j63130M95659L64006q26499N0478J225604p21219r92783r96631
2009a794456J047569O01392o20040o86474J213266L65263j47440k53112k33744
2000e07776O38439l56668k76925k48729R10392l37278j028734p91296R68561J869014
1990H39000n52939m23288l77937O15212j58032n77579j92049N29542J072937l78231
1980C96636n47016l66519J05965j4525P18698m20870N35685M01914q34802J66370
1970A41536q48198J010367J11762K11372p10428o20816j186530R70864K078262
$$ y = [952116, 239946, -707362, -760190, -1040992, -468488, 626600, 969525, 243862, -97065, 177374, 350756, -1012443, -1736509, 261148, 596002, -1001257, -1068228, -472588, 426935, -229941, -393071, 102588, 466594, -359905, -309427, 916177, 194958, -797825, -1794456, -746887, -145495, -765535, -1452009, -238743, 126520, -20920, -274032, -507776, 130663, -226005, -502930, -751659, 158733, -178545, -1207279, -1998575, -1030014, 839000, 286061, -137227, -515164, 100048, -57984, -635563, -827612, -298070, 774867, 396636, -150380, -516899, -410934, -425459, 293239, -127631, 408054, 809968, -24834, 141536, -706662, 303705, 415467, 626839, -83589, -704405, -1890935, -920071, 1158191]
1961A158191j471432n95357R23537J847407p47704k124191j511155J362930J035029
1952a22745j60769m28479L29322K80304l89528J86879j14544K25811N28003L23430
1942F57684j69636j154893J54518Q65315J18157l65952p10466N87606J539467
1933A521800L37538j629754l35380Q61261K26747l18335k14706J87115j208947
1924e72661r98860J150922J924456j986928n47890J185318R35576L04743j571573
1915a76897o12248J7433O29756j117565N42829R80995L41198j019539J88679O70084
1905D44725m25353M01541k64189k74216k86461J885284o64210q84453j6730J29340
1895D5278q10792J47504J267069o15849K4360J9614Q92632M19685n11554j358037
$$ y = [1158191, -313241, -908598, 14939, 1862346, 1114642, -1009549, -2520704, -1157774, -122745, -283514, -711993, -382671, -102367, -491895, -305016, -419560, -193749, 334254, 657684, 488048, -666845, -512327, 352988, 471145, 105193, -605273, -17667, 1521800, 1859338, 229584, -105796, 755465, 982212, 663877, 449171, 636286, -572661, -1571521, -420599, 1503857, -483071, -1030961, 154357, 1089933, 1394676, -176897, -789145, -771712, -141956, -1259521, -716692, 264303, 605501, -414038, -225359, 444725, 19372, 420913, 156724, -117492, -403953, 1481331, 817121, -67332, -84062, 45278, -765514, -618010, 649059, 33210, 57570, 77184, 969816, 1389501, 877947, -480090]
1885d80090L63863n08054L00680j75465R77516J055327j111090p78224K75093
1876h0444l8130j096882M58833M93219N78228o79131J85633L57433j78601j339630
1866a339472M44496J289861n77640l8543l03493J301958l09617m64475J51613
1857A54688O01171q69965r90859R86872R2614p41795m81870J530056M78021n11632
1847B47301r94754J059831P84752p35736J07599k08407l76750r42358K92578q8031
1837h53975P70868J67672p1584L15650j027963p4253J32045P90854J7232N42152
1827G08698n28106K14093j228838j183466M47909J245099Q68479r08809j55433
1818e20374N70002J202193o67203o20956q06675n07693R21540R49523n71823o89629
$$ y = [-480090, -116227, -624281, -323601, -499066, 478450, 1533777, 422687, -355537, -80444, -118574, -1215456, -756623, -263404, 314824, -364307, -178674, 178759, 158, -1339472, -894976, 394885, -182755, -221298, -524791, 777167, 467550, 3075, 154688, 755859, -114106, -1104965, -118093, -25479, -767274, -1249144, 280912, 758933, 247301, -747453, 312378, 1097130, 361394, 468993, 260586, -116164, -1058522, -765944, -853975, -83107, 84565, 12981, 328631, -699332, -773585, -641540, 149314, 166546, 708698, 180592, 394685, -834153, -2017619, -1569710, -324611, 543868, -364941, -520374, 49628, 1251821, 584618, -36338, -843013, -1350706, -429166, 520357, -51466, -741095]
1808g41095L411r4788P59715J062348r79996j593109R47918J866987L82536q84600
1798G29327j762766P4029P70914J48938r0293m63602O20874m9089o31841Q07923
1788A54414J176194j296502j474757R36305K094214k88152j293337k55687o84774
1779i32082r05119Q35518J258717j270900q45661Q71620Q63531Q37154k67198
1770D45580o07974M48081J64329p93618J4588K11739k44906m0760j37735n37145
1760a077821L91671R16375k16665O84596l17721Q05792N64855l59876j828877
1751d37671m92172P64305o01672P27530K80566m0917n51090J417408k73056k017680
1741a224449J62058J843815q79206o64711J344485J1399k04658j732259J45666
$$ y = [-741095, -737684, -832472, -72757, 989591, 9595, -1583514, -635596, 1231391, 1613927, 729327, -1033439, -959410, -188496, -39558, -129851, -593453, 27421, -21668, -653509, 154414, 1330608, 34106, -1440651, -504346, 1589868, 1301716, 8379, -247308, -932082, -1837201, -1001683, 257034, -1013866, -1859527, -987907, -124376, 712778, 445580, -162394, 285687, 450016, -343602, -329014, -117275, -362181, -402941, -540676, -1077821, -686150, 230225, 13560, 698156, 380435, 1186227, 1751082, 1391206, -437671, -929843, -165538, -767210, -39680, 240886, 199969, -351121, 1066287, 793231, -1224449, -1062391, 781424, -97782, -762493, 581992, 593391, 388733, -1343526, -1197860]
1732a197860J219758L48549j535442j11598J171406L62805k96140k40525N38478
1723B59431l10562n50393O70579J604572j102703j509905K79989L3574j70731
1714g96149Q82729M21673k71843J140749K86773j065708m86719j92995P2881j96409
1704b05018O96459j006384l78807J596622K66459j524141j37867P40644J73372
1695B21339J257311j92474j276940r70889J233577O85816j420325j667389J134767
1686i95207J648856m90648p61580N42955N44707l30604p8445o01389O03704K27079
1676C09428j145900n76517J941681l02091j023253N79629J23168q39258J042771
1667A09658K94171q92051M8798R25422L36147k21947Q50072j109816m43686J51434
$$ y = [-1197860, 21898, 370447, -1164995, -1276593, -105187, 257618, -38522, -279047, 259431, -51131, -601524, 69055, 1673627, 570924, -938981, -658992, -625418, -796149, 86580, 508253, 236410, 1377159, 1663932, 598224, 111505, -81490, -8609, -205018, 491441, -514943, -893750, 702872, 969331, -554810, -692677, 47967, 221339, 1478650, 1286176, 9236, -961653, 271924, 957740, -462585, -2129974, -995207, 653649, 163001, -598579, -55624, 489083, 158479, 80034, -521355, 82349, 309428, -836472, -1412989, 528692, 226601, -796652, -217023, -93855, -933113, 109658, 403829, -488222, -439424, 485998, 822145, 600198, 1450270, 340454, -103232, 48202]
1657D8202l14964j97858Q23760p07707k90348R26179n66336P9726R41863q40699
1647i8182m82099J426488p94584l17792M70806q78883k60538J413718O4684k003279
1637a459661O87694J352377o59196q98458P10637R26190J079451m74914j498376
1628b34256l73448M89076k15569n29165K39053R00724J068371J81027j295488
1619B30325p36477L68165J13847J2221L41970p23987P48896M08016j711210K96452
1609f51782P13359p12025n02764J057832R6924n11769n214Q91378l2358M51771
1599G95352l65702r27955j29903r5313o0741n92253M18969j36455J70619P16450
1589b06932J215292m54976j192078J085367J76877n99861o42740p2402J06798
$$ y = [48202, -266762, -464620, 359140, -348567, -638915, 287264, -279072, -199346, 742517, -98182, -580281, 846207, 51623, -266169, 204637, -674246, -934784, 478934, 543618, -1459661, -771967, 580410, -78786, -977244, -266607, 659583, 1739034, 1264120, -234256, -607704, -118628, -334197, -863362, -624309, 276415, 1344786, 1525813, 230325, -506152, -137987, -24140, -11919, 330051, -393936, 354960, 762976, -948234, -651782, 61577, -650448, -1153212, -95380, 1544, -510225, -515439, 375939, 343581, 795352, 429650, -498305, -628208, -723521, -784262, -1376515, -957546, -1094001, -923382, -206932, 1008360, 553384, -638694, 446673, 623550, 23689, -619051, -691453, -584655]
1580e84655J30207k18217k02500K46082k87290m09098R61332K293906j126657
1571H03110j641473P62352M77128o10649J40261j70141r19508J111402J53544
1562A06026l54751m10967J46243L43075J022174P60045j336563j636257m8530
1553a409505J430368M17258j120958r77473J189414J6127j095690K72203J339998
1544F1742M49767q54442O7184N73873O8615p66757n03423m4327P06293Q24778
1534E83303m08847K98620n49413m80900J330658M34042m82427k02579J75720k75365
1524D22812j72657m77554L34945K5155q43329L60476P95913Q0783j18171m08537
1514a64r59533J559823P0562r20834l15996P17423J50103q46734P73983n02804
$$ y = [-584655, -454448, -672665, -875165, -629083, -916373, -1325471, -364139, 1929767, 803110, -838363, -76011, 401117, -209532, -69271, -239412, -1158920, -47518, 106026, -248725, -659692, -513449, -170374, 851800, 1611845, 275282, -1360975, -1409505, 20863, 438121, -682837, -1660310, -470896, -454769, -1550459, -1278256, 61742, 511509, -342933, -275749, 298124, 366739, -400018, -903441, -947768, -241475, 583303, 174456, 473076, -76337, -557237, 773421, 1207463, 725036, 522457, 698177, 422812, 250155, -227399, 107546, 132701, -710628, -350152, 445761, 526544, 408373, -164, -959697, 600126, 670688, -250146, -566142, 151281, 301384, -545350, 228633, -274171]
1504b74171j62916j95617L03366M46444J04798q27603M483J240306P29548o70938
1494F97700j257351N85248m54324l75950K60843J104427l18544J39213j03570
1485B77692N44677O44124j720193J60588j52245k53821K85525k939n619L94684
1475A72473j91205o2722L53409j76295m19199n9378J429636K02229k53871j001057
1465e980q83929J212065J05906j156776o81445J307231N39674K51305j78849k94706
1455B14496L38672L76441O31762P0490j490060j001377m97978J139084J120526
1446I02056j150751p55298Q55664M06681m37918R3661N6901O03310L42846m30935
1436D86217J47870J16743j286377p11472R84222J683973j061530j883403L92545
$$ y = [-274171, -437087, -632704, -329338, 117106, 221904, -605699, -601216, 639090, 1368638, 697700, -559651, 25597, -428727, -804677, -543834, 560593, 242049, 381262, 277692, 822369, 1466493, -253700, -93112, -245357, -499178, -213653, -216592, -222211, 172473, -18732, -81454, 271955, 95660, -323539, -382917, 1046719, 1248948, 995077, -5980, -889909, 322156, 428062, -728714, -1410159, -102928, 436746, 688051, 509202, 214496, 553168, 929609, 1561371, 1631861, 141801, -859576, -1357554, -218470, 902056, -248695, -1003993, -148329, 258352, -179566, -85905, -29004, 574306, 917152, 486217, 634087, 750830, -535547, -1247019, -262797, 1421176, 359646, -1523757, -1131212]
1427a131212J468554M07463j31027O3812L6716M2153j009560k65633M56798L3296
1417b8640j066470K03338J087449q66811K26311j23226l03574M54069J00649m66891
1407g83796J781431o79747j543096N72605K75917m77126j036811O76411M24651
1398g89561O15384O63963L94902r1139J24430j081428p6827Q43451p66271j764502
1388a927598P13210Q34894j057301L12372J38190M7337J1938J161811M57704J08855
1378H01412N9023n32735k06506P9567p81273n44227q3230j358893J115026J456960
1368E124R05801n65849l93452p60095L98259J259400q04296J58239k53764R59121
1358I08488j090472p45166n27375j35460J017275L91622L58267M67553Q51433
$$ y = [-1131212, 337342, 744805, 613778, 677590, 714306, 756459, -253101, -518734, -61936, -28640, -1095110, -891772, 195677, -671134, -444823, -568049, -871623, -417554, -316905, -783796, 997635, 317888, -1225208, -652603, -376686, -853812, -1890623, -1214212, -789561, -174177, 489786, 884688, 793549, 917979, -163449, -240276, 603175, -163096, -1927598, -1214388, -379494, -1436795, -1124423, -986233, -938896, -926958, 234853, 692557, 801412, 860435, 327700, 121194, 200761, -580512, -1124739, -1207969, -2566862, -1451836, 5124, 910925, 345076, -48376, -808471, -410212, 849188, 44892, 203131, -50633, 908488, -181984, -927150, -1454525, -1589985, -572710, -181088, 177179, 644732, 1496165]
1349A496165j384872P40091q49592r23738J30275J833653o49159j553220Q90898
1340b69499K20314P24247j365302J94417m7645J335757k60625l36491j73276j39223
1330a17326P770o53387p59415J42664J101704o06045Q04916r26165J116805P41747
1320H53268p1687j220821j162489J264680J299553J94583j988388j17463N65328
1311c83436J650459j87532q54855l60665N18751j41548n44501k7865J61054L92348
1301B22210n94300M04865J8239N71398j60845m67488k63699m66516K6368P3776
1291f35992m61172M92795L91445n58818M57682J029676L22071r46996r2700J009978
1281A007969k51597j042168N42387L38019j359883m87274Q13885P3649K73659
$$ y = [1496165, 111293, 851384, 1792, -921946, -791671, 1041982, 392823, -1160397, -269499, -49185, 675062, -690240, -495823, -543468, 792289, 531664, 195173, 21897, -117326, -109556, -762943, -1522358, -1379694, -277990, -884035, -79119, -1005284, 111521, 853268, 781581, -439240, -1601729, -337049, 962504, 1157087, -831301, -948764, -383436, 1267023, 1079491, 224636, -136029, 382722, 241174, -303327, -331192, -170138, 222210, -372090, 32775, 51014, 622412, 461567, -5921, -269620, -736136, -709768, -635992, -1097164, -604369, -212924, -771742, -314060, 715616, 1037687, 90691, -2009, 1007969, 756372, -285796, 256591, 594610, -765273, -1252547, -438662, -365013, -91354]
1272i1354N48721R17624M84621p03657j018360o69064j88379M92972J82125l47278
1262c92029j29680k28980L77971L06951j11726q7141N51940K84499j72768J32162
1252E31199L87964p55389q09629j98027J23272R91238K64577o36385N09442M53473
1242H61735o15508q38570K44936J082141J22976r73311m98168O07517k35024n99006
1232h40282m54633K66686M94418k50382N1847O40770Q13070j78024j341355r39656
1222a737541P82135J146723L27001j081097o31525L25882O20575O11614j5736
1213C48031P9519k70436J5016M07281j86118j101462j71895P80769o4553L26627
1203A62779o72222m11613Q0072N98755R24425l57506n21578J08336M55339j358339
$$ y = [-91354, 457367, 1374991, 1859612, 1155955, 137595, -531469, -719848, -226876, -44751, -392029, -521709, -750689, -372718, -65767, -177493, -264634, 287306, 571805, 399037, 531199, 919163, 163774, -645855, -843882, -720610, 270628, 535205, -101180, 408262, 861735, 246227, -592343, -347407, 734734, 857710, -115601, -613769, -6252, -241276, -840282, -1294915, -1028229, -533811, -784193, -732346, -91576, 721494, 543470, -797885, -1737541, -955406, 191317, 518318, -562779, -1194304, -868422, -247847, 363767, 348031, 427550, 157114, 172130, 579411, 393293, -708169, -880064, -99295, -163848, 162779, -509443, -921056, -840984, -242229, 682196, 324690, -196888, -88552, 366787, -991552]
1193i91552J150R32920N91247q93890o89116Q24338N34923k62504q30178L98642
1183c84020O75246P1702j341602Q35023L78749j578656J62881K536790J538769
1174B894882j410702r40795p27642n51838O28166J28405j118377M47211R76823
1165C26133j67487J39969l40789k70954N85726j21599j083005O69546J770861
1156A508401j92037j119027n73046k76311j150916N83372J593841k06626l04315
1147a36664L25773J181415m76051j368762j14708R00638k12845q92006k20380
1138a013590Q91063Q40626j075012o8110M80503N42751p52200P01008P82116r90865
1128C38290q69070J037533n4406j989552K85146P89055Q42421m856p66248l55590
$$ y = [-991552, -990402, -57482, 533765, -360125, -1049241, -224903, 310020, 47516, -782662, -384020, 291226, 362928, -978674, -143651, 235098, -1343558, -1180677, 1356113, 2894882, 1484180, 543385, -184257, -736095, -107929, 20476, -1097901, -650690, 326133, 158646, 298615, -42174, -313128, 272598, 150999, -932006, -262460, 1508401, 1316364, 197337, -375709, -652020, -1802936, -1219564, 374277, 167651, -136664, 189109, 1370524, 894473, -474289, -588997, 311641, 98796, -793210, -1013590, -122527, 718099, -356913, -425023, 55480, 598231, -153969, 547039, 1329155, 338290, -530780, 506753, 452347, -1537205, -1252059, -463004, 379417, 374561, -391687, -747277]
1118g47277J402641O45116n16024j85952k86677o00104q72874J659411l21829
1109A76431j364939J41636J195481m0279K33761O61263k63781j61386r4087L04564
1099G88664n15181n76626q54104P72285N14996K88394k90295N04118o95718n82547
1089f46014K89394K23529k19739K6708J255473N60173j258142j351834R76527
1080a43925j92423j17311J33834O63448l79800J5581O83752k1788p96655m23459
1070e78746O41126J1696K1912l91190j80910J142084L2905j509880J168393J298733
1060A656123r39068j240879P89560Q44487j713171o46123J002425O81889k31276
1051B03967o55775j163582k36784R06572J240493k02577R0668L48254n02984J47236
$$ y = [-747277, 655364, 1300480, 784456, 598504, 311827, -288277, -1161151, 498260, 176431, -1188508, -1046872, 148609, 108330, 342091, 1003354, 739573, 578187, 484100, 788664, 273483, -303143, -1157247, -384962, 130034, 418428, 128133, 632251, -63467, -646014, -356620, -133091, -352830, -326122, 929351, 1489524, 231382, -1120452, -143925, -336348, -453659, -319825, 343623, -36177, -20596, 663156, 641368, -155287, -578746, 62380, 74076, 95988, -295202, -476112, 665972, 698877, -811003, 357390, 1656123, 717055, -523824, 265736, 1110223, -602948, -1249071, -246646, 435243, 203967, -451808, -1615390, -1852174, -945602, 294891, 92314, 182982, 531236, 28252, 175488]
1041A75488l27683j127499J02036J400793j457876M6970R36866M44166K07877
1032D01138J68144P40532p15608J22138q0239m75827p54387L15445M08784P32798
1022H62918J09225j383814P74605n06407n90281l32823J597548O832k57775j87439
1012I2589p6496o04508o30500M38665l13402Q79072l06216L30003m69367N56814
1002a03346M6193p022n21033m97923J202466K89325L14433j592759j64751J437315
992D02898O84641o51774k26138n6995M01463n79847j511369J252024J186151J007995
982A909049j532142r32500L35913M62692n53779j477638M55923R53236Q94592
973E15346j97329p27411j128073M03029J451553M23009j430270n39291J344384
$$ y = [175488, -152195, -1279694, -1177658, 223135, -1234741, -1187771, -250905, 193261, 401138, 569282, 1309814, 594206, 716344, 636105, 160278, -594109, -278664, 130120, 862918, 972143, -411671, 362934, -143473, -733754, -1066577, 530971, 537803, 280028, 92589, 16093, -588415, -1218915, -780250, -1093652, -214580, -520796, -190793, -660160, -103346, -57153, -64175, -585208, -1083131, 119335, 408660, 723093, -869666, -1034417, 402898, 1087539, 435765, 209627, 152632, 554095, -25752, -1537121, -285097, 901054, 1909049, 376907, -555593, -219680, 243012, -310767, -1788405, -1332482, -379246, 515346, 318017, -409394, -1537467, -1134438, 317115, 740124, -690146, -1229437, 114947]
964A14947J160026J61654j446740j8824N5781N30099j466160k03286J360629l40417
954i2291K93826N22093n74742l85805J413140j077731j291533J173725P87872
945G68554j868422j89897P14024k30296o42228l4378J203789J1776J422216m02466
935G52672k76848k11499l88620P88794j72145j147413q59832J441668Q61107m96290
925B91594j186582Q17388P24053O8891o03963K51097M89941j144340N78757R367
915B96203p71602j499819J373157P36896m89423P21632J36368L60801p37469k86573
905a59829L019o0281k97879Q0848O0280L34347J27238m22389J99183J74969K48239
894B87745l55977J146549J42102q71475n89936L73239L9069r88598P14004k78103
$$ y = [114947, 1274973, 1436627, -10113, -28937, 26844, 556943, -909217, -1112503, 248126, -92291, 201535, 723628, 148886, -236919, 1176221, 98490, -1193043, -19318, 768554, -1099868, -1289765, -575741, -806037, -1448265, -1482643, -278854, -267078, 1155138, 752672, 475824, 264325, -124295, 664499, 492354, -655059, -1514891, -73223, 787884, 291594, -894988, -77600, 646453, 715344, 111381, 362478, 852419, -291921, 286836, 296203, -475399, -1975218, -602061, 134835, -354588, 367044, 503412, 864213, 126744, -159829, -156810, -217091, -514970, -434122, -373842, -39495, 87743, -334646, -135463, 39506, 287745, -68232, 1078317, 1220419, 348944, -240992, 132247, 171316, -817282, -103278, -381381]
884c81381m20374K16838J019509j5205o11791M32236O0286l21835j52243l27755
874e01715J51097O37354n85411l28243M89879k06377k21157O0901L37782J27951
864c7939J44489L50237l40932j565967o5982K459420j97870j156489m77201J036395
854A48161p38214j076163J173583R77965j67934o38150Q19315n77021o0170j062488
844a201116K15735N56248N63336n34684O43934J027534j580047l76906J004760
835C18794m3429j690380J309343p989L8047N93961j58583q08985n33569R18680
825f4110l89325q4656N38619P85269K05668n83822j674867q5552J518670J05210
815B71104j548297J662142J524055j522380r04975O78222M61829p91924m39637
$$ y = [-381381, -801755, -584917, 434592, 419387, -192404, 239832, 300118, -21717, -173960, -501715, -350618, 286736, -298675, -626918, -137039, -343416, -564573, -503672, -165890, -37939, 106550, 456787, 115855, -1450112, -1516094, 943326, 745456, -411033, -888234, 148161, -590053, -1666216, -492633, 485332, 317398, -320752, 498563, -78458, -138628, -1201116, -985381, -429133, 134203, -400481, 243453, 1270987, -309060, -685966, 318794, 275365, -1415015, -105672, -113661, -75614, 518347, 359764, -449221, -982790, -64110, -453435, -538091, 528, 785797, 991465, 407643, -1267224, -1352776, 165894, 271104, -1277193, 384949, 1909004, 386624, -518351, 159871, 621700, -170224, -609861]
806f09861R23154N720j581609l25893J796126J603693j097726k29880k5314L16136
796G74546l27918j231739J358939Q25679j253030j748996M24925P08417j268250
787a737427L22183J790749J143469m07101o03299K34515k09135j490890l90183
778a347119J37927K234108P04914k058449j233329p5927J886185L9907J30735
769D18952l97118R71915J83764j211872r00333j98767J344308n26680O20724M18817
759G23710m83510j759333N90809K97473P89667L34810R44526p29641j190807j59201
749f41497p59338K027992M53671j697372p05014J969643K66556j363628k82874
740g31861O12068P0882J247967J0022j598878l93334M22296n7393n17558J165441
$$ y = [-609861, 313293, 319013, -1262596, -1588489, 207637, 1811330, 713604, 483724, 458410, 774546, 446628, -785111, 573828, 1399507, 146477, -1602519, -1177594, -469177, -1737427, -1415244, 375505, 1518974, 1111873, 508574, 743089, 533954, -956936, -1347119, -1209192, 1024916, 1729830, -328619, -1561948, -1637875, 248310, 288217, 418952, 21834, 993749, 1177513, -34359, -934692, -1133459, 210849, -315831, 304893, 723710, 240200, -1519133, -928324, -630851, 158816, 493626, 1438152, 708511, -482296, -641497, -1400835, 627157, 1080828, -616544, -1321558, 648085, 914641, -448987, -731861, -119793, -48911, 1199056, 1209078, -389800, -783134, -360838, -418231, -935789, 229652]
730B29652l70592r54532N32165M29958N22589L80603J51632p34389j69993j18163
720a01070r97648o0155P55648N6162M81059J26390J46115j29121n0956L74858
710F01282k78135k36001J03870J28801m5911j4532o27r33846m68060M08916N71880
699a62363J62608O24023Q91090p17311j278012n10484j0575j29866j3623L81612
689g62901O00572J421183P5183j499060o0396K86862q1256j46103K37891j98360
679a26385k87648P30991L81265r92674n88525m55157J299934J277531l87825j257412
669d05905P75941Q73729j754722M54381L99881r88008r25175N83373l54644L98647
659i42502J609807J00466j047506J165297O9812j327417K84573j98248p40800
$$ y = [229652, -140940, -1095472, -563307, -133349, 389240, 769843, 921475, 187086, 17093, -101070, -1098718, -1158873, -403225, -347063, 133996, 260386, 406501, 277380, 226424, 601282, 323147, 87146, 191016, 319817, 273906, 259374, 258747, -675099, -1143159, -734243, -162363, 245, 624268, 1515358, 798047, -479965, -990449, -1001024, -1130890, -1144513, -762901, -162329, 1258854, 1334037, -165023, -225419, 61443, -19813, -165916, 71975, -126385, -414033, 316958, 698223, -294451, -882976, -1338133, -38199, 1239332, 851507, -405905, 370036, 1243765, -510957, -56576, 343305, -644703, -1569878, -986505, -1341149, -942502, 667305, 767771, -279735, 885562, 955374, -372043, -87470, -285718, -1026518]
650a026518O8468K385999p70504r65939N04505k00454m3768L5794k83568p44144
640a040129J069369L51792l07063j38775L75374n04824K87331L84627n14925p22677
630g59900m15614J710653K49554r4041k46516M49647j561901n10798J277308m82892
620c84500J43638J614835L42432j413932l9735M03816m05898n29785k89074p06541
610a264744J371258J140690j359144N83134P91942j874925j548356J871660P44540
601D56055q03494R79621K79021q88726j13577m9140n51284N47478M99380j341705
591i86371J71375J274436L03144l56086j25789m63223K9076M12642J23967l8760
581C44411r95205r80372Q44920J840678k33274j308816J00382J570029O1595j151594
$$ y = [-1026518, -958050, 1427949, 657445, -308494, 196011, -4443, -48211, -12417, -295985, -1040129, 29240, 381032, 73969, -64806, 310568, -194256, 93075, 477702, -37223, -759900, -1175514, 535139, 784693, 690652, 444136, 893783, -668118, -1178916, 98392, -384500, -240862, 1373973, 1716405, 302473, 262738, 666554, 260656, -269129, -558203, -1264744, 106514, 1247204, -111940, 471194, 1263136, -611789, -2160145, -288485, 456055, -347439, 632182, 911203, 22477, -91100, -140240, -691524, -144046, 355334, -986371, -814996, 459440, 762584, 406498, 280709, -182514, -153438, 259204, 383171, 344411, -650794, -1631166, -786246, 1054432, 821158, -487658, -387276, 1182753, 1244348, 92754]
571I2754r65523Q0322J219464j25858j694001k16081Q79572J020050o56201r73332
561a338834O77497J543518l91152j038599J80996L24851N04032m85799l72327
552c95817o43243l01650J560126L97850l94018l42013K03450J035151K30894j675816
542c25086j479761N56061K267892j27353j766515J390434P67018j062832j021948
533h02090O89916R3464j89430K86963p02960j91516l82223O75735L23005J673882
523A474746O4041j245399M4579n37274j388508L95673K129832q29602j080400
514i72312L6957J718616m09875r7902J38845l51474j289926n44727J213735M66008
504i2055k69878l42480J376241N68538m65860j232571m44025N698L67394Q50978
$$ y = [92754, -872769, -792447, 427017, 301159, -1392842, -1608923, -729351, 290699, -365502, -1338834, -661337, 882181, 491029, -547570, -366574, -41723, 462309, -23490, -395817, -1039060, -1340710, 219416, 617266, 223248, -118765, 84685, 1119836, 1350730, -325086, -1804847, -1248786, 1019106, 891753, -874762, 515672, 1282690, 219858, -802090, -112174, -18710, -208140, 78823, -624137, -815653, -1197876, -522141, -199136, 1474746, 1538787, 293388, 337967, -199307, -1587815, -1192142, 937690, 108088, -972312, -935355, 783261, 373386, 275484, 414329, 62855, -1227071, -1771798, -558063, -92055, -361933, -704413, 671828, 1240366, 774506, -458065, -902090, -896392, -528998, 321980]
494C21980Q82829j89155j116024K0518R8976q34023q8421O29818P31180l8495
484D19183M11471o11771q09760j21369k00254R36464N71752l72686j034750J054334
474B42614n12367M16003R95325r97675j727831M48315J175982q31651J82134P81987
464A72836J902978o57396m03621n67227M7552k40621j472858q65386J092333J535190
454E43780n52006K09796N73341M99973j525301l3074J245976o91032r83973N98666
444a13854Q43560r12092J62969Q90241r65497L8744R70724j336350m24211J883707
434A037941l74861q46235N78210P62295l70939p10187l9840k1252l55380k12881
424e53129J111989L81957M36035j070171j107381P59228P83196j287238j302315
$$ y = [321980, 1204809, 1015654, -100370, -79852, 19124, -814899, -903320, -273502, 457678, 419183, 830654, 218883, -590877, -712246, -912500, 23964, 595716, 223030, -811720, 242614, -269753, 146250, 1141575, 143900, -1583931, -1135616, 40366, -791285, -609151, 172836, 2075814, 1418418, 1014797, 447570, 495122, 254501, -1218357, -2083743, -991410, 543780, -8226, 201570, 774911, 1274884, -250417, -283491, 962485, 271453, -712520, -113854, 729706, -182386, -19417, 870824, -94673, -55929, 914795, -421555, -845766, 1037941, 663080, -183155, 395055, 1157350, 786411, 76224, 36384, 15132, -340248, -553129, 558860, 940817, 1376852, 306681, -800700, -41472, 741724, -545514, -1847829]
415a847829J705638J011223m41218j276629M40604J05391k73234J87399R94796
406F06141N787R8468j007753r69938J974427M70256j358097j148131Q49082R0019
396c89739Q3141R8758m48544K46017P54046N75345L00666n87136j371073L63629
386c74890o22245J32563K49628p08077l33907R59332O28902K07076K99165j043009
376f05462J01100p4376L43668q41194q393O42778L71408K27042P86616r14572
366B8615j446667J040889J034362m36254j534816l3970J524914J787593j164304
357H00362j577176M11140J65454r37643j65577N54683K99279J605592o33971j034419
347e12276Q28774r51843m89247J37799k8142K78018J275873J81165j546000J02730
$$ y = [-1847829, -142191, 869032, 427814, -848815, -408211, -302820, -576054, -388655, 606141, 611928, 710396, -297357, -1267295, 707132, 1177388, -180709, -1328840, -479758, -389739, -306598, -207840, -656384, -410367, 343679, 919024, 1219690, 632554, -738519, -374890, -997135, -864572, -614944, -1323021, -1656928, -697596, -68694, 138382, 437547, -605462, -504362, -578738, -235070, -1076264, -1084657, -441879, -70471, 156571, 943187, 28615, -1418052, -377163, 657199, 220945, -1313871, -1347841, 177073, 1964666, 800362, -776814, -365674, -200220, -1137863, -1303440, -748757, -449478, 1156114, 522143, -512276, 316498, -635345, -1124592, -986793, -1014935, -736917, 538956, 720121, -825879, -723149]
337g23149J506366o83074j611462P40230J088725n69476q25999J477959N61090
328I61210l67513r28127k42737O33083m78590p33305L70371J309078m05841r34374
318h16745L36386J070007J95797j275005n91197J553727N61996o06608K47758
309F76116j093455R4474M50040k62190n78092J98490J50547L34786M32997m62558
299e8845N36504P04809j14181J90914p54981j368183l8781K01937k70836n51806
289a523449R07155J413622N02272R6596j152053o74506J390747L29443k334920
280a045093k83824K307846l03196r40842O53815K92926j26270K74165j156980
271c27453m84021J584301Q70423j111463J0703n29006J02803R84588r92805j863139
$$ y = [-723149, 783217, 100143, -1511319, -771089, 317636, -251840, -1077839, 400120, 961210, 593697, -334430, -577167, 55916, -422674, -1155979, -785608, 523470, 117629, -816745, -480359, 589648, 785445, -489560, -1080757, 472970, 1034966, 428358, 676116, -417339, -322865, 127175, -135015, -713107, -514617, -364070, -29284, 403713, -58845, 477659, 1182468, 1068287, 1259201, 504220, -863963, -902744, -700807, -971643, -1523449, -616294, 797328, 1299600, 1396196, 244143, -430363, 960384, 1289827, -1045093, -1328917, 978929, 675733, -265109, 388706, 681632, 555362, 829527, -327453, -811474, 772827, 1643250, 531787, 542490, 13484, 116287, 1100875, 108070, -1755069]
261a755069L67865J513385J327325m7118j359204j18944J011635K19247j803770
252f44648q69002J63624Q71881J457286L92202j526277k19895J210429r80743
243a45143p69548Q38138Q76006m10801N01899j069607m35985Q14400n55349k71079
233f27069J235508L0523j106686P92068m45053k53726M54131J051925K33042n57937
223H06726j232997p40129M49544o30989O08339J238039P18388o05853j065298
214d54230P5488L47520O43917j84272p45224p29871R78969M4823p45209n8694
204h26783M24983L96791Q18009l83280j120027J025709k84785n09217L03818P83659
194F28877o94189j249108J94497o11175Q9997J080686R06071p42898j24889J652919
$$ y = [-1755069, -1387204, 126181, 1453506, 1406388, 47184, -71760, 939875, 1159122, -644648, -1513650, -1350026, -478145, 979141, 1371343, -154934, -374829, 835600, -145143, -914691, -76553, 799453, 388652, 890551, -179056, -615041, 199359, -355990, -627069, 608439, 638962, -467724, 324344, -120709, -374435, 79696, 1131621, 1364663, 806726, -426271, -1166400, -716856, -1347845, -739506, 498533, 1216921, 611068, -454230, -378742, -31222, 612695, 428423, -316801, -1046672, -67703, -22880, -768089, -826783, -401800, -5009, 813000, 429720, -690307, 335402, 50617, -458600, -154782, 628877, -65312, -1314420, -1119923, -1731098, -1641101, -560415, 345656, -397242, -522131, 1130788]
184A130788j42123j157151m0372j30372l15894M19311p06877Q0825J135886j71801
174A02220j160922N17672J152416n68720j76037k58634P48113o2106p46400k86859
164g39257J72540M53384n55517K8354N99283k43750p15470r9326N20867J301155
154G22263j80067q77681j32294J010503p02262k334327R03529J712544l34516
145b12308o28866M85101Q22041N9056o68493q11786L06317P81994K68268j95928
135B05396k33286m2549p78346k37892M34956L75123k76785K74949q6139M24101
125E9528Q40706j107445m19046N96342J98245j190347p7972N20769J84235k86913
115f81898o03238J183259J385829j069600j086623R26187J047260M5021m36134
$$ y = [1130788, 988665, -168486, -208858, -339230, -655124, -235813, -942690, -861865, 274021, 102220, -1058702, -541030, 611386, 42666, -133371, -392005, 356108, 294002, -452398, -739257, -566717, -113333, -668850, -640496, -41213, -284963, -1000433, -1099759, -578892, 722263, 542196, -335485, -467779, 542724, -159538, -2493865, -1590336, 122208, -212308, -841174, -356073, 465968, 525024, -143469, -955255, -648938, 133056, 401324, 205396, -27890, -70439, -848785, -1086677, -651721, -276598, -553383, -278434, -364573, 59528, 900234, -207211, -626257, -29915, 168330, -1022017, -1099989, -579220, -394985, -681898, -1285136, -101877, 1283952, 214352, -872271, 53916, 1101176, 1146197, 710063]
106G10063o58256j120509M78014N52972j80042j99562J156054O2292k14613K21968
96H08381q05427q86875O44214L51131p18997Q93830N88172j75407l15743m05978
86b2699l6273J20852l49232K26207M62912j032586n7199J049939J94678o41117
76h4518o82899K48940J285492P07947j575555l40791J171098l16687j978306R75034
66e90245Q15094p64145j00330P79541K68308j9605Q44784n58581p57035j36409
56b18623k95223p34117K96588J93591M24087Q70786J11664k28105l86867j48007
46a14226m00719j48817j45340M88154K27943O1713M32166j23291q09963M93208
36c9172O24705j135793j75859N09938K69532m62946R4878m01399J96192L05360
$$ y = [710063, 51807, -1068702, -590688, -37716, -217758, -417320, 738734, 801026, 586413, 808381, 2954, -883921, -239707, 111424, -607573, 286257, 874429, 699022, 383279, -22699, -58972, 61880, -287352, -61145, 401767, -630819, -688018, 361921, 556599, -84518, -767417, -518477, 767015, 1474962, -100593, -441384, 729714, 413027, -1565279, -590245, 224849, -539296, -639626, 139915, 408223, 388618, 1233402, 674821, -82214, -218623, -513846, -1247963, -951375, -757784, -333697, 537089, 648753, 420648, 33781, -114226, -514945, -663762, -809102, -320948, -93005, -31292, 400874, 277583, -532380, -39172, 585533, -550260, -726119, -216181, 53351, -409595, -314717, -716116, -519924, -214564]
26b14564K81147k91999J78292J49935o15918P76627K04210l15418r19570j45308
16i12566l57143O59570K93996m65357N34455P19526L03545k93813m23235j205301
6a146323N34523l5930l68652K91579R13804j53117
0C5884
$$ y = [-214564, 66583, -225416, -47124, 102811, -513107, 263520, 467730, 152312, -767258, -912566, -1269709, -610139, -316143, -781500, -247045, 472481, 776026, 482213, 58978, -1146323, -611800, -647730, -1016382, -724803, 189001, 35884]
$$ Imaginary data points
##PAGE= N=2
##DATA TABLE= (X++(I..I)), XYDATA
16383b073435k1627L82599q1189K68968J56667m46680K64343q3385p4799q01676
16373b510214L19436M68824N3772o69768L91736J292449O21776r11623k42874
16364a186486L08462p68203l96748j10035Q90945k79389r00014J043606J199105
16355a98757n38794J4690N07810Q8809m29865O29996J78140j392724o65531N91218
16345a215008K30427j283915M69918J434764Q98433m36329l3150O02249Q7720
16336G55109j138093o68824M92242m6784p90015m23248J004663M56648q7281j6446
16326d62029M63259k33198j90916J134479N58963j653757n11080J572568O1434
16317G39723o01034n80473p12307K53427M91067K74327L84466J76992L90965j71517
$$ y = [-2073435, -2095062, -1712463, -1793652, -1524684, -1368017, -1814697, -1550354, -1633739, -1708538, -2510214, -2190778, -1721954, -1668182, -2337950, -1946214, -653765, -31989, -943612, -1186486, -878024, -1646227, -2042975, -2153010, -1262065, -1541454, -2441468, -1397862, -198757, -737551, -722861, -215051, -126242, -556107, 73889, 252029, -1140695, -1806226, -1215008, -984581, -2268496, -1798578, -363814, 534619, 98290, 65140, 667389, 755109, -382984, -1051808, -559566, -606350, -1396365, -1819613, -814950, -358302, -445583, -462029, 1230, -231968, -422884, 711595, 1270558, -383199, -894279, 678289, 739723, 138689, -441784, -1154091, -900664, -409597, -135270, 249196, 426188, 817153, 645636]
16307F45636p37240J35678P09726M14384K74298k7431j40531o01043p46837r50211
16297a023571q3862J253113J182499n097o2464K75688j24930J28789l01878j48328
16287A089959l61390k3871J17793K9046j75698k2633L82821N18915l19490n35884
16277F99568L77702j67184N03611L83227O05689p99162m45276k53131k61864K9682
16267F72862q47151N97193J459193o2554n67001j56530P00825O80821o79487k47438
16257A550733j71466R9675o47776k13133J329107O27164l47923r78700l91743
16248H55938M71668N95390M47279j34950l8563N6074K48941m20373j257820m18889
16238D04695K15244N85776O19046l68693K91278o84793J55017J156483o6530l42193
$$ y = [645636, -91604, 44074, 753800, 1168184, 1442482, 1415051, 1274520, 673477, -73360, -1023571, -1107433, 145680, 1328179, 1323082, 1260618, 1536306, 1411376, 1540165, 1238287, 1089959, 728569, 704698, 822491, 851537, 675839, 653206, 1036027, 1554942, 1235452, 699568, 1077270, 910086, 1413697, 1796924, 2402613, 1603451, 1158175, 905044, 643180, 672862, -174289, 422904, 1882097, 1819543, 1252542, 1096012, 1796837, 2477658, 1798171, 1550733, 1379267, 1478942, 831166, 618033, 1947140, 2574304, 2226381, 1247681, 855938, 1327606, 1922996, 2370275, 2235325, 2196762, 2252836, 2501777, 2081404, 823584, 404695, 619939, 1205715, 1824761, 1456068, 1747346, 1062553, 1217570, 2374053, 2307523, 1965330]
16228A965330n13620p78281J39542J71151K63201M55195J048533j8165n93728
16219B139158N04198j56103j094389j472812J146622K752852k00679j218017j68608
16210B232222K29499n20882j95026J71156k23598J33886K02240k291Q42407r4080
16200B775533j220060n7284q566N31303o0154k69513r89080N41544J800917K4070
16190C068710j523953r25112R00860K76675J055209K60562q80553M13331J26433
16181B772162k12650p2349m88618o11413Q25911k95981j8372Q70260N68670n40503
16171B797117l47895P30351l44041N484o63595m96530n72934J426096K25181n81524
16161B177710m86173q95356P83543J402185J041776j931331n55672J052303O34330
$$ y = [1965330, 1451710, 673429, 812971, 984122, 1247323, 1702518, 2751051, 2732886, 2139158, 2643356, 2487253, 1392864, -79948, 1066674, 3819526, 3618847, 2400830, 2232222, 2461721, 1940839, 1745813, 1916969, 1693371, 1827257, 2029497, 2027206, 2869613, 2775533, 1555473, 1498189, 1489623, 2020926, 1960772, 1691259, 702179, 1243723, 3044640, 3068710, 1544757, 619645, 1520505, 1797180, 2852389, 3112951, 2232398, 2645729, 2772162, 2559512, 2487163, 1998545, 1387132, 2213043, 1917062, 1898690, 2768950, 3337620, 2797117, 2449222, 3179573, 2835532, 2841016, 2177421, 1680891, 1107957, 2534053, 2759234, 2177710, 1691537, 796181, 1579724, 2981909, 4023685, 2092354, 1536682, 2588985, 3223315]
16152C223315j081584j8879k71768Q27506R19641r67551p39246j89149k1755K80515
16142A961045J734358N3166l0344n63263o78147m89749o5563L21592J03182M14060
16132B760337k05019m70535K55986J09378l09446N34916j59964j67083N09517
16123B858087L5614j014684M526J345402l33881j129093m80184P70049J608552
16114C664388K03245p51973M02686Q86616j516216p22134J547883o42423j471505
16105A600567J185921M86800K1152Q4699n41555j187554R15722J528600r65993
16096C128359J85826q26652n68851K68489J156839q67243j311167Q85716O80053
16087B731369N34047J63405k35552m38995l6632k56294N79025k58674k01906K5908
$$ y = [3223315, 2141731, 2122852, 1851084, 2678590, 3598231, 2630680, 1891434, 1702285, 1680530, 1961045, 3695403, 3748569, 3718225, 3154962, 2476815, 1987066, 1921503, 2243095, 2346277, 2760337, 2555318, 2084783, 2340769, 2450147, 2140701, 2675617, 2515653, 2348570, 2858087, 2893701, 1879017, 1883543, 3228945, 2895064, 1765971, 1285787, 2055836, 3664388, 3867633, 3115660, 3518346, 4404962, 2888746, 2166612, 3714495, 3072072, 1600567, 2786488, 3273288, 3294440, 3379139, 2837584, 1650030, 2565752, 4094352, 3128359, 3314185, 2487533, 1918682, 2187171, 3344010, 2476767, 1165600, 2051316, 2731369, 3265416, 3428821, 3193269, 2754274, 2717642, 2461348, 3040373, 2781699, 2579793, 2605701]
16077B605701Q98025N14136q46910M00216p47040r30966R1055K074119J312034
16068E370370r64572j707847r58719J032874P18331l11430j615077P94668J333192
16059C691790j49048r55886Q54415K64478j647857M39514L07201R79952l09431
16050C475128q44640j367359R29371J509252m53330q32454p61203R42553M65587
16041C062905Q54742O3151m44728r60213N74253J171422j73971j727495k98822
16032B121244J452520o57077l08802n27358j31566J4294J007323O77363O82344
16023D330285N39345j253603j368195M52750j11419o93976O42141L28399o22456
16014B243271J018986N78336j785850j75982J055886j80514o52151R82359P68132
$$ y = [2605701, 3503726, 4017862, 3170952, 3571168, 2824128, 1893162, 1984217, 4058336, 5370370, 4405798, 2697951, 1739232, 2772106, 3490437, 3179007, 1563930, 2358598, 3691790, 3542742, 2586856, 3441271, 3705749, 2057892, 2497406, 2804607, 3784559, 3475128, 2630488, 1263129, 2192500, 3701752, 3248422, 2415968, 1654765, 2597318, 3062905, 3917647, 3980798, 3536070, 2575857, 3150110, 4321532, 4147561, 2420066, 2121244, 3573764, 2916687, 2607885, 2080527, 1948961, 1963255, 2970578, 3647941, 4330285, 4869630, 3616027, 2247832, 2700582, 2589163, 1895187, 2537328, 2865727, 2243271, 3262257, 3840593, 2054743, 1878761, 2934647, 2754133, 2101982, 3084341, 3852473]
16005C852473n80504p57556l22101J052670l5366r56784K5807J329909Q28432
15996D436980j100065j125284N8356J041812k01635o65718Q2048P23429l88121
15987B861802J49400k51709m15739K21877M11617q7329l31356K44673j269444
15978A533792K01430J186152n28675n67429J278735o7374j875445L08456J475637
15969B945279m61017m21559L41585O18853J496003j053601j526647L34592J357205
15960C630693k3035n86521k69357j066191n4927J559085J28278q98514j1008J578729
15950C987232n08869j979631J44509J132832P58414j342810k93353Q61742J5911
15941B775977r16716J6186L83298L67773P0456N26940j31661n44091k51272R2710
$$ y = [3852473, 3271969, 2514413, 2192312, 3244982, 3209616, 2252832, 2278639, 3608548, 4436980, 3336915, 2211631, 2269987, 3311799, 3110164, 2444446, 2526494, 3249923, 2861802, 3011202, 2759493, 2343754, 2565631, 2977248, 2889919, 2558563, 2803236, 1533792, 1735222, 2921374, 2392699, 1825270, 3104005, 3036631, 1161186, 1469642, 2945279, 2484262, 2062703, 2404288, 3023141, 4519144, 3465543, 1938896, 2273488, 3630693, 3607658, 3021137, 2751780, 1685589, 1630662, 3189747, 3318025, 2419511, 2408503, 3987232, 3478363, 1498732, 1643241, 2776073, 3534487, 2191677, 1898324, 2760066, 2775977, 1859261, 1875447, 2258745, 2626518, 2696974, 3223914, 3092253, 2548162, 2296890, 2389600]
15931B389600M91578l92794R0928J22259K67863L36345M09914l13795m38250m09672
15921B553976J42158L57226n1992p56471k45315J592417l66634r79756j23159
15912B122450K13179m15677J230962P78347m56710l37909n63888J34179M75317
15903C180250k83639q90386O12197R85664J12395j867773K39778M86942K49097
15894B824525J0793Q85274O20557j010068j00738M5091O51665M42775n87482k359872
15884A422520L36340J163806j50626l15990O93666Q40328j97705m36425j371036
15875A984878M82814O66275o36511j035476J654351R20450j689357m01316J176768
$$ y = [2389600, 2881178, 2488384, 2579312, 2701571, 2969434, 3305779, 3715693, 3401898, 2963648, 2553976, 2696134, 3053360, 3001368, 2244897, 1999582, 3591999, 3225365, 2245609, 2122450, 2335629, 1919952, 3150914, 3929261, 3472551, 3134642, 2570754, 2704933, 3180250, 2896611, 2006225, 2618422, 3604086, 3716481, 1848708, 2088486, 2575428, 2824525, 2835318, 3720592, 4341149, 3331081, 3230343, 3275434, 3927099, 4369874, 3782392, 1422520, 1758860, 2922666, 2772040, 2456050, 3149716, 3990044, 3792339, 3355914, 1984878, 2467692, 3133967, 2497456, 1461980, 3116331, 4036781, 2347424, 1946108, 3122876]
$$ [...]
##END NTUPLES=NMR SPECTRUM
##END=
