##TITLE=1H_DE-80H_X3
 200.13MHz, d2o
 8 sc
 
 19ns.26.2.2025
##JCAMPDX= 6.0         $$ Bruker NMR JCAMP-DX V2.0
##DATA TYPE= NMR SPECTRUM
##DATA CLASS= NTUPLES
##ORIGIN= UXNMR, Bruker Analytische Messtechnik GmbH
##OWNER= pz
$$ XWIN-NMR		Version 3.5
$$ Thu Apr  9 09:54:49 2026 Russian Standard Time (UT+4h)  Yarkov@DPX200
##.OBSERVE FREQUENCY= 200.1313
##.OBSERVE NUCLEUS= ^1H
##.ACQUISITION MODE= SIMULTANEOUS
##.ACQUISITION SCHEME= undefined
##.AVERAGES= 8
##.DIGITISER RES= 18
##SPECTROMETER/DATA SYSTEM= spect
##.PULSE SEQUENCE= zg30
##.SOLVENT NAME= CDCl3
##.SHIFT REFERENCE= (INTERNAL, CDCl3, 0, 15.402)
##AUDIT TRAIL= $$ (NUMBER, WHEN, WHO, WHERE, WHAT)
$$ ##TITLE= Audit trail, XWIN-NMR		Version 3.5
$$ ##JCAMPDX= 5.01
$$ ##ORIGIN= Bruker BioSpin GmbH
$$ ##OWNER= Yarkov
$$ C:/Bruker/XWIN-NMR/data/yarkov2/nmr/H-C/1/pdata/1/auditp.txt
$$ ##AUDIT TRAIL=  $$ (NUMBER, WHEN, WHO, WHERE, WHAT)
(   1,<2026-04-09 09:54:01.07 +0400>,<Yarkov>,<DPX200>,
      <created by zg, POWCHK disabled, PULCHK disabled
       configuration hash MD5:
       00 E9 B6 7A A2 85 ED C7 34 08 36 98 17 FE 4E 26
       data hash MD5: 16K
       A1 F5 16 E9 E6 BB E7 5D 69 78 7A C6 6B 63 54 97>)
(   2,<2026-04-09 09:54:07.62 +0400>,<Yarkov>,<DPX200>,
      <Start of raw data processing
       efp BC_mod = 2 LB = 0.25 FT_mod = 6 PKNL = 1 PHC0 = -5301.948 PHC1 = 6.821927 SI = 16K 
       data hash MD5: 16K
       FE A1 48 04 0C F8 44 E5 BC BE EC CC 0F FD 95 AC>)
(   3,<2026-04-09 09:54:13.01 +0400>,<Yarkov>,<DPX200>,
      <abs ABSG = 5 
       data hash MD5: 16K
       65 55 93 B2 32 9C B4 98 87 CC 36 67 1D ED CC 69>)
$$ ##END=
$$ 
$$ hash MD5
$$ 71 15 BA 65 0F 8E A6 C9 6C B9 45 D7 AE 89 90 1A
##$RELAX= 
##$RELAX= 
##$RELAX= 
##$RELAX= 
##$RELAX= 
##$RELAX= 
$$ Bruker specific parameters
$$ --------------------------
##$DU= <C:/Bruker/XWIN-NMR>
##$EXPNO= 1
##$NAME= <H-C>
##$PROCNO= 1
##$TYPE= <nmr>
##$USER= <yarkov2>
##$AMP= (0..31)
100 100 100 100 100 100 100 100 100 100 100 100 100 100 100 100 100 100 
100 100 100 100 100 100 100 100 100 100 100 100 100 100 
##$AQSEQ= 0
##$AQ_mod= 1
##$AUNM= <au_zg>
##$AUTOPOS= <>
##$BF1= 200.13
##$BF2= 200.13
##$BF3= 200.13
##$BF4= 200.13
##$BF5= 200.13
##$BF6= 200.13
##$BF7= 200.13
##$BF8= 200.13
##$BYTORDA= 1
##$CFDGTYP= 0
##$CFRGTYP= 5
##$CHEMSTR= <none>
##$CNST= (0..31)
1 1 145 1 1 1 1 1 1 1 1 1 1 1 1 1 1 1 1 1 1 1 1 1 1 1 1 1 1 1 1 1 
##$CPDPRG= <>
##$CPDPRG1= <>
##$CPDPRG2= <>
##$CPDPRG3= <>
##$CPDPRG4= <mlev>
##$CPDPRG5= <mlev>
##$CPDPRG6= <mlev>
##$CPDPRG7= <mlev>
##$CPDPRG8= <mlev>
##$CPDPRGB= <>
##$CPDPRGT= <>
##$D= (0..31)
0 0.7 0 0 0 0 0 0 0 0 0 0.03 0 0 0 0 0 0 0 0 0 0 0 0 0 0 0 0 0 0 0 0 
##$DATE= 1775714040
##$DBL= (0..7)
120 120 120 120 120 120 120 120 
##$DBP= (0..7)
150 150 150 150 150 150 150 150 
##$DBP07= 0
##$DBPNAM0= <>
##$DBPNAM1= <>
##$DBPNAM2= <>
##$DBPNAM3= <>
##$DBPNAM4= <>
##$DBPNAM5= <>
##$DBPNAM6= <>
##$DBPNAM7= <>
##$DBPOAL= (0..7)
0.5 0.5 0.5 0.5 0.5 0.5 0.5 0.5 
##$DBPOFFS= (0..7)
0 0 0 0 0 0 0 0 
##$DE= 6
$$ [...]
##$SUBNAM3= <"">
##$SUBNAM4= <"">
##$SUBNAM5= <"">
##$SUBNAM6= <"">
##$SUBNAM7= <"">
##$SUBNAM8= <"">
##$SUBNAM9= <"">
##$SW= 18.0517328524113
##$SWIBOX= (0..15)
0 0 2 0 0 0 0 0 0 0 0 0 0 0 0 0 
##$SW_h= 3612.71676300578
##$TD= 16384
##$TD0= 1
##$TE= 0
##$TE2= 300
##$TE3= 300
##$TEG= 300
##$TL= (0..7)
0 120 120 120 120 120 120 120 
##$TP= (0..7)
150 150 150 150 150 150 150 150 
##$TP07= 0
##$TPNAME0= <>
##$TPNAME1= <>
##$TPNAME2= <>
##$TPNAME3= <>
##$TPNAME4= <>
##$TPNAME5= <>
##$TPNAME6= <>
##$TPNAME7= <>
##$TPOAL= (0..7)
0.5 0.5 0.5 0.5 0.5 0.5 0.5 0.5 
##$TPOFFS= (0..7)
0 0 0 0 0 0 0 0 
##$TUNHIN= 0
##$TUNHOUT= 0
##$TUNXOUT= 0
##$USERA1= <user>
##$USERA2= <user>
##$USERA3= <user>
##$USERA4= <user>
##$USERA5= <user>
##$V9= 5
##$VALIST= <valist>
##$VCLIST= <CCCCCCCCCCCCCCC>
##$VD= 0
##$VDLIST= <DDDDDDDDDDDDDDD>
##$VPLIST= <PPPPPPPPPPPPPPP>
##$VTLIST= <TTTTTTTTTTTTTTT>
##$WBST= 1024
##$WBSW= 4
##$XGAIN= (0..3)
0 0 0 0 
##$XL= 0
##$YL= 0
##$YMAX_a= 692764
##$YMIN_a= -651086
##$ZGOPTNS= <>
##$ZL1= 120
##$ZL2= 120
##$ZL3= 120
##$ZL4= 120
##$ABSF1= 15.40203
##$ABSF2= -2.649817
##$ABSG= 5
##$ABSL= 3
##$ALPHA= 0
##$AQORDER= 0
##$ASSFAC= 0
##$ASSFACI= 0
##$ASSFACX= 0
##$ASSWID= 0
##$AUNMP= <proc_1d>
##$AZFE= 0.1
##$AZFW= 0.1
##$BCFW= 0
##$BC_mod= 2
##$BYTORDP= 0
##$COROFFS= 0
##$CY= -3
##$DATMOD= 1
##$DC= 0
##$DFILT= <>
##$DTYPP= 0
##$F1P= 0
##$F2P= 0
##$FCOR= 1
##$FTSIZE= 16384
##$FT_mod= 6
##$GAMMA= 0
##$GB= 0
##$INTBC= 1
##$INTSCL= 3.241238e-09
##$ISEN= 128
##$LB= 0.25
##$LEV0= 0
##$LPBIN= 0
##$MAXI= 10000
##$MC2= 0
##$MEAN= 0
##$ME_mod= 0
##$MI= 1.114404
##$NCOEF= 0
##$NC_proc= -5
##$NLEV= 6
##$NOISF1= 3.799351
##$NOISF2= 2.8
##$NSP= 0
##$NTH_PI= 0
##$NZP= 0
##$OFFSET= 15.40203
##$PC= 1
##$PHC0= -5301.948
##$PHC1= 6.821927
##$PH_mod= 1
##$PKNL= yes
##$PPARMOD= 0
##$PSCAL= 0
##$PSIGN= 0
##$REVERSE= no
##$SF= 200.13002395019
##$SI= 16384
##$SIGF1= 3
##$SIGF2= 2
##$SINO= 0.751879
##$SIOLD= 32768
##$SREGLST= <19F.Aceton>
##$SSB= 0
##$STSI= 16384
##$STSR= 0
##$SW_p= 3612.71676300578
##$SYMM= 0
##$S_DEV= 0
##$TDeff= 16384
##$TDoff= 0
##$TI= <>
##$TILT= no
##$TM1= 0
##$TM2= 0
##$TOPLEV= 0
##$USERP1= <user>
##$USERP2= <user>
##$USERP3= <user>
##$USERP4= <user>
##$USERP5= <user>
##$WDW= 1
##$XDIM= 16384
##$YMAX_p= 497530286
##$YMIN_p= -208857
$$ End of Bruker specific parameters
$$ ---------------------------------
##NTUPLES= NMR SPECTRUM
##VAR_NAME=  FREQUENCY,     SPECTRUM/REAL,   SPECTRUM/IMAG
##SYMBOL=    X,             R,               I
##VAR_TYPE=  INDEPENDENT,   DEPENDENT,       DEPENDENT
##VAR_FORM=  AFFN,          ASDF,            ASDF
##VAR_DIM=   16384,         16384,           16384
##UNITS=     HZ,            ARBITRARY UNITS, ARBITRARY UNITS
##FACTOR=    0.220516191357247, 1,           1
##FIRST=     3082.40863101037, 0,            0
##LAST=      -530.308131995405, 0,           0
##MIN=       -530.308131995405, -208857,     0
##MAX=       3082.40863101037, 497530286,    0
$$ Real data points
##PAGE= N=1
##DATA TABLE= (X++(R..R)), XYDATA
$$ [...]
7441A7402J2476n960k4996p379K283M015M073J1053m673j6006R774O717j2844
7428d065P651P366q836o037p114J4398P483j5183q159Q089m831j460n603J1908
7414d393l251n903R860p403R501q319p306J2705j0691k0535K136J4283m575O115
7400a7776o664m84J2491O205L005K774o227m276M296P109K589n482j0827N238
7386h029p023r001n48J1745k513m139K442k164k617J0014O956k404r048l022R755
7371i596r578p735J3056Q394o568k3896j1766J3500Q578K386K05R719k178k0817
7357c6296j2251j01J5998J5462p021p35k007o918J2908k870j5713J1576n881n249
7343c9098m491P442N5N949j1405q954j1386K0864J3103R399J438j0410m372k042
$$ plain form
7441 17402 29878 23918 -1078 -8457 -6174 -2159 1914 12967 8294 -7712 2062 8779 -4065
7428 -4065 3586 10952 2116 -3921 -11035 3363 10846 -4337 -12496 -4407 -9238 -10698 -16301 -4393
7414 -4393 -7644 -13547 -3687 -11090 -1589 -9908 -17214 -4509 -15200 -35735 -33599 -19316 -23891 -17776
7400 -17776 -24440 -24924 -12433 -6228 -3223 -449 -6676 -10952 -6656 453 3042 -2440 -13267 -8029
7386 -8029 -15052 -24053 -24601 -12856 -15369 -19508 -17066 -19230 -21847 -11833 -4877 -7281 -16329 -19351 -9596
7371 -9596 -19174 -26909 -13853 -5459 -12027 -35923 -47689 -34189 -25611 -23225 -23020 -13301 -15479 -36296
7357 -36296 -48547 -48648 -32650 -17188 -24209 -24944 -26951 -33869 -20961 -23831 -39544 -27968 -33849 -39098
7343 -39098 -43589 -36147 -36092 -30143 -41548 -50502 -61888 -41024 -27921 -18522 -17084 -27494 -31866 -33908
7329c3908n353j0589M484L092K0885J7440M677j4840m570K085m198L115l928N14
7315b1094r452J791J14J3677R141j931j76k4842J2827P481j3170M750m993J3254
7301a2623K818r18o287m606K82l935J0875K180J1479m707j2744o667J6234q074
7287a6693m179Q026M231j3020k321J2665J4236o921o889k241R063n679N363J3324
7273H965j4615M23j098r825J4735o009j4991J4564R437k4507O95K1484k032p45
7259c519r994O92n455r703M452J3953O851p59K101J629R249j0551J0860j0489
7245f83m694K1745Q470J5723k4745J3599K1593J0344J6662R127k9919j4030O063
7232D9255j2448j5791m955j3033q634J6754j907j2589r232l126l662M947J5887
$$ plain form
7329 -33908 -39261 -49850 -45366 -42274 -21389 -3949 728 -14112 -18682 -16597 -20795 -17680 -21608 -21094
7315 -21094 -30546 -28755 -28641 -14964 -5823 -7754 -7930 -32772 -19945 -12464 -25634 -20884 -25877 -12623
7301 -12623 -9805 -10723 -17010 -21616 -21334 -25269 -14394 -12214 -735 -5442 -18186 -24853 -8619 -16693
7287 -16693 -20872 -12846 -8615 -21635 -23956 -11291 2945 -3976 -10865 -13106 -4043 -9722 -4359 8965
7273 8965 -5650 -5227 -6325 -16150 -1415 -7424 -22415 -7851 1586 -22921 -22226 -742 -2774 -3519
7259 -3519 -13513 -12821 -18276 -27979 -23527 -9574 -2723 -3482 -1381 248 9497 -1054 9806 -683
7245 -683 -5377 16368 24838 40561 15816 29415 51008 61352 78014 87141 57222 43192 49255
7232 49255 36807 21016 16061 3028 -5606 11148 9241 -3348 -12580 -15706 -19368 -14421 1466
7219A466k567q923L18J1237J0640n309j1391p302L835n885J2445j4753J1638j1366
7205a5917J85J2556J0161L690k4509J5875p054j194K2271j0431K79m303j1914
7192a0305M331O649P245j1671Q699M185m501m330N358L392p995l122J0936k98
7178H573j292Q608J0432o319m775q561p669L541j1257J0239R052j1592n745L100
7164c665n731k423M741J7111J5j1181J0374K678O069n77q584j0794p503N785J5336
7149A1651q696k5420J3328J4166K801J0251j1709P523q57K370j858l874N473J9410
7135C4559k114l640K20N516J571J125k0168j9655J1925Q210J3309P164r798k4287
7121C937K11J2477j1129J512j934l880Q771J0568P725J972j6020J293R101o137
$$ plain form
7219 1466 -1101 -10024 -9706 1531 12171 6862 -4529 -11831 -7996 -13881 -1436 -16189 -4551 -15917
7205 -15917 -15732 -3176 6985 10675 -13834 2041 -5013 -6207 16064 5633 5912 1609 -10305
7192 -10305 -5974 675 7920 -3751 4948 9133 4632 302 5660 9052 1057 -2065 8871 8573
7178 8573 7281 15889 26321 20002 15227 6666 -1003 2538 -8719 1520 10572 -1020 -6765 -3665
7164 -3665 -9396 -11819 -7078 10033 10048 -1133 9241 11919 17988 17411 8827 -1967 -9470 -3685 11651
7149 11651 2955 -22465 -9137 5029 7830 18081 6372 13895 13038 15408 13550 9676 15149 34559
7135 34559 32445 28805 29025 34541 36112 37237 17069 -2586 9339 17549 30858 38022 28224 3937
7121 3937 4148 16625 5496 7008 5074 1194 9965 20533 28258 30230 14210 15503 24604 18467
7107A8467j2319K036J0378p892M160M687M217R22k879Q321R54m413J2087j1674
7093B7052j8249j2603P238N102J1481J573M609K711p410o016N915J3865M731q270
7079C1729N263o692O100J474j1185R475m306j3811N54l829Q298K408p841j5036
7065B601J4492J7871J0094l681j6397N405J6113m170k2543J0838P911J570p914
7052C2190O81Q047j5768p310Q231K646M419K897l924q472R385l944l934R292j868
7037C2568M078J328J0259R75N049M552j495O725m237j940j676m675j9O061J743
7022E9296j0744j4101J7377J0311j6832k2258K0379L431j0612N240l762r080M835
7009C3480j5456O967M251Q478J5950k862p46p622O406J1631j4988k0912Q984J0058
$$ plain form
7107 18467 6148 8184 18562 10670 14830 19517 23734 24656 21777 30098 31052 26639 38726 27052
7093 27052 8803 -3800 3438 8540 20021 21594 26203 28914 21504 15488 21403 35268 39999 31729
7079 31729 36992 30300 36400 37874 26689 36164 31858 18047 18601 14772 23070 25478 17637 2601
7065 2601 17093 34964 45058 41377 24980 30385 46498 42328 19785 30623 38534 40104 32190
7052 32190 32871 40918 25150 17840 26071 28717 33136 36033 32109 23637 33022 29078 25144 34436 32568
7037 32568 36646 37974 48233 49208 54257 58809 57314 64039 59802 57862 56186 51511 51492 57553 59296
7022 59296 48552 34451 51828 62139 45307 23049 43428 46859 36247 41487 37725 28645 33480
7009 33480 18024 24991 29242 37720 53670 50808 50062 42440 48846 60477 45489 24577 33561 43619
6995D3619o684j0392J7208J8902j1556j7082J0269R062M600j0303M302P339Q749
6982F8033m385J0869q491Q843J1493l625l453j9317P67P881M159K460n957l387
6968F5890J1206R113n738M284p828N736J402K244j493L945O83J1792j5222R74
6954H6988k959j0543O265J152J4120J1702M999j0667R544K951l457j5924R744
6941A03915m958J1392k4322j1304q613J3946J962J5612p008n021R37j625N045
6928H9958k3268J0253Q544K217j1644k16J7808R841M329j0796Q641M904N884K135
6914A18590O721l212Q272R10k791q502K172O301O238L949J472L0609J3548M259
6900A88536m405L530J8943K1627J1564K4538J3495M1097L3877K2078J8760M0434
$$ plain form
6995 43619 36935 26543 43751 62653 51097 34015 44284 53346 57946 47643 51945 59284 68033
6982 68033 63648 74517 66026 74869 86362 82737 79284 59967 60734 68615 72774 75234 69277 65890
6968 65890 77096 86209 80471 84755 76927 82663 84065 86309 84816 88761 89444 101236 86014 86988
6954 86988 84029 73486 79751 80903 95023 106725 111724 101057 110601 113552 110095 94171 103915
6941 103915 98957 110349 86027 74723 66110 80056 82018 97630 90622 85601 86538 84913 89958
6928 89958 66690 76943 85487 87704 76060 75844 93652 103493 107822 97026 105667 110571 116455 118590
6914 118590 125311 122099 130371 131281 128490 119988 122160 128461 134699 138648 140120 170729 184277 188536
6900 188536 184131 187661 206604 228231 239795 264333 277828 318925 352802 374880 393640 434074
6888D34074K6208K1220K4759L0502K3857J2351k2022k529j0808j918j1714k7929
6876D96051l4613j5721l8601l6682j2248j7271j3574j9011j2466l1791j4205j4269
6864B35599m538j6221m277j5401j6052j5258K2971j2781k0026Q503L95m035N571
6851A64450j0053P104N406K43J6194l263r678k521q100p609P25k931r657p575
6837A32735o522j1729M510J8678k482j7266j4533M335J2977M744r307M792j1263
6824A09669k5821M242J8415K2882M207j4506k081O261r39M487k2582P958q331
6811A03861j966J1045q811q866J6744r696j1429P437J7091K718r000q36q625k686
6797I6981N456M786j1058L403K0127q973m306K531m693j0908m550Q971R467L51
$$ plain form
6888 434074 460282 481502 506261 536763 560620 572971 550949 548420 537612 535694 523980 496051
6876 496051 461438 445717 407116 370434 358186 340915 327341 308330 295864 264073 249868 235599
6864 235599 231061 214840 210563 195162 179110 163852 186823 174042 154016 162519 162914 158879 164450
6851 164450 154397 161501 166907 167150 183344 180081 170403 167882 159782 152173 152898 149967 140310 132735
6837 132735 126213 114484 118994 137672 135190 117924 103391 107726 120703 125447 116140 120932 109669
6824 109669 83848 88090 106505 129387 133594 119088 117007 123268 122329 126816 104234 112192 103861
6811 103861 101895 112940 104129 95263 112007 102311 90882 98319 115410 118128 109128 108292 99667 96981
6797 96981 102437 107223 96165 99568 119695 110722 106416 108947 104254 93346 88796 97767 107234 107585
6783A07585o282L5N389m18l188M629Q203R796j3206m563J1416k3620O006R734
6769A11516O959m43J065j2130o579M64J172k195J2215P20k009Q381J245o075m95
6754A13811m935Q84L278p429O425l5p17o141L911L13O295K388R79n776R571L922
6738A26744M101n418n38k41j3562p560n218R170N090N866J4323k2550J5497R323
6724A35027j382k4162Q249q621K062J1197n974K367J3335m515J1806O656l967
6711A42078r512j1021j108J9479l681J388J6543K338k244j0550K345R97O497j7334
6697A36215j4672J719Q066K926J4765L843J6747j2999l3601K4576J9817L494k4518
6684A46378n56O716o203R979J4934J5379j0260j094m374r002j530n931R97J3038
$$ plain form
6783 107585 101303 101338 106727 106309 103121 107750 115953 125749 112543 107980 119396 95776 101782 111516
6769 111516 118475 118032 119097 106967 100388 100852 102024 99829 112044 112764 110755 119136 120381 114306 113811
6754 113811 108876 109760 113038 105609 112034 111999 111282 105141 109052 109365 115660 118048 119027 113251 122822 126744
6738 126744 130845 125427 124889 124648 111086 103526 98308 107478 112568 118434 132757 110207 125704 135027
6724 135027 133645 109483 117732 109111 111173 122370 116396 118763 132098 127583 139389 146045 142078
6711 142078 132566 121545 120437 139916 136235 137623 154166 156504 154260 143710 146055 147052 153549 136215
6697 136215 121543 123262 131328 134254 149019 152862 169609 156610 123009 147585 167402 170896 146378
6684 146378 145822 152538 146335 156314 171248 186627 176367 175273 170899 161897 160367 154436 155433 168471
6670A68471l664j540j3755J7135Q969J7837j8062j5405P190j9280L477l27l790
6657A47256R274j617K692Q547K3321O344k2174j0159n900J2330K5705j2140l017
6644A80462r715J7829j9434j236J7540m715Q150j2062m89K842J239J1976j0570
6631A81817r693J1415P61K346j933J285R544r882L47K0418r852j769J6636r225
6617B02215m259K3975L937J036n218j274r543L116m98N14M721O20j9970o767K8467
6602B21072m131l211O649P356j1366j4844J0562J2121P670l250R674O121k2344
6589B22079J0141J0075j0018o106K432p15q888L929L987J063j4654K0534J2866
6576B46725j2789j5054r113j583J7522j133k3687J0901J7191p35M58N321l961
$$ plain form
6670 168471 164807 163267 149512 166647 175616 193453 175391 159986 167176 147896 151373 151046 147256
6657 147256 156530 154913 157605 166152 189473 195817 173643 163484 157584 169914 195619 183479 180462
6644 180462 170747 188576 169142 167906 185446 180731 188881 176819 176330 179172 180411 192387 181817
6631 181817 172124 183539 184300 186646 184713 185998 195542 185660 186007 206425 196573 194804 211440 202215
6617 202215 197956 221931 225868 226904 221686 220412 210869 213985 213487 214001 218722 219342 199372 192605 221072
6602 221072 216941 213730 220379 227735 216369 201525 212087 224208 231878 228628 238302 244423 222079
6589 222079 232220 242295 232277 226171 228603 227888 219000 222929 226916 227979 213325 233859 246725
6576 246725 233936 218882 209769 208186 225708 224575 200888 211789 228980 228245 228703 234024 230063
6563B30063j1634Q325L2239p989p177P248J4093J2567j2678N33n468m094N474
6550B61502J0304L755J249L447r996R105M489p881p233J4756N244j9194o389J3201
6536B76359j8480k239J5136m319J188j1582N036J5761j664J564n249P320P623
6523B86454l293J9281n935R578m759n915J0237J5764J4865K8671J6768K9840L0335
6510D41891K1057J0781N372j6697m733l76j0096r641l1573L389J0234K4961J7528
6497D62097J8955J6150n12p001j1117j1079j5207j7163j260j9663j7352l964p080
6484C85804k497o7m31j0354n721J9966j2773M149J71J3398J322j8533N296L271
6470C83001J4022j1326p431K934j5952j4016L333q820K361L650k620M043n833
$$ plain form
6563 230063 218429 226754 258993 251004 243827 251075 265168 277735 265057 265590 260122 256028 261502
6550 261502 271806 275561 276810 280257 270261 279366 283855 275974 268741 283497 288741 269547 263158 276359
6536 276359 257879 255640 270776 266457 267645 256063 261099 276860 275196 276760 271511 278831 286454
6523 286454 283161 302442 296507 306085 301326 295411 305648 321412 336277 364948 381716 411556 441891
6510 441891 462948 473729 479101 462404 457671 457295 447199 437558 405985 409374 419608 444569 462097
6497 462097 481052 497202 496690 489689 478572 467493 452286 435123 433863 414200 396848 392884 385804
6484 385804 383307 383240 382809 372455 366734 386700 373927 378076 378247 391645 392967 374434 379730 383001
6470 383001 397023 385697 378266 381200 365248 351232 354565 345745 348106 351756 349136 353179 347346
6457C47346l998N161L1625k74j3272N368l804M370N534J5214J3187J8812K3906
6444D49175J3643o929J241M7443L5033L6501L0247K7415P282M528o597m1125p459
6431E90398j5634j0459j789K1645K7975K0334J2760J6946r857q675k7302m0234
6419E76108k8717k7744l6517k3812j5172J0289j3704o762J60R98O567o065O692
6406D42321O976M610n840q270j2460R528J896Q815m094m661j578Q444K294o076
6392D41905j2365K6020J4065M192P439j2159j0768J1567K0502N35K299Q651o370
6379D95513m162k180K2346K754j2224J5668J0432k902j2593J0197L842j0240J3581
6366E30032P428K374N720p938p86J7409m956M717J3398k911J5985N427n567J0258
$$ plain form
6457 347346 343348 348509 380134 379860 366588 371956 368152 372522 378056 393270 406457 425269 449175
6444 449175 462818 455889 457130 504573 539606 576107 606354 633769 641051 645579 638982 597857 590398
6431 590398 574764 564305 562516 584161 612136 632470 645230 662176 652319 643644 616342 576108
6419 576108 547391 519647 483130 459318 444146 454435 440731 433969 434129 435127 441694 435629 442321
6406 442321 449297 453907 448067 439797 427337 436865 438761 447576 443482 438821 437243 445687 447981 441905
6392 441905 429540 455560 469625 473817 481256 469097 458329 469896 490398 490933 493232 501883 495513
6379 495513 491351 489171 511517 514271 502047 517715 528147 525245 512652 522849 526691 516451 530032
6366 530032 537460 539834 545554 537616 536830 554239 549283 554000 567398 564487 580472 585899 580332 590590
6352E90590K2635j5078K445R28L416M214M27J430Q64J0636Q535m576j681K2543
6338F47328J6808o258o78K324J209K6088J1247J7342L183K757n78K2498R237L415
6324G55922J6864R539J0476p251J9183J9579K0174P576J8050J0251K7572J8433
6312I26368Q659K1588J8269N22J3268K9763K945K5164L1863R296J8415K0201J3458
6299A139779J2926j2456J5609J771P293J4893J3985K2636J9093J1807N485J0878
6287A263699J9758J7936K6603J6612M704L6077K0329K4981K9032N2522L5349L2076
6275A579678L0330K2358K9610L4878L1879K8058M8384N6415L8990O4684J13662
6264B078926J06377J29846J56199J59149J62976J96883K32465K92929L42963M71287
$$ plain form
6352 590590 613225 598147 600592 601520 604936 609150 609577 611007 611871 622507 631042 626466 624785 647328
6338 647328 664136 657878 657200 659524 660733 686821 698068 715410 718593 721350 720772 743270 752507 755922
6324 755922 772786 782325 792801 785550 804733 824312 844486 852062 870112 880363 907935 926368
6312 926368 935027 956615 974884 975406 988674 1018437 1021382 1046546 1078409 1087705 1106120 1126321 1139779
6299 1139779 1152705 1140249 1155858 1157629 1164922 1179815 1193800 1216436 1235529 1247336 1252821 1263699
6287 1263699 1283457 1301393 1327996 1344608 1349312 1385389 1405718 1430699 1459731 1512253 1547602 1579678
6275 1579678 1610008 1632366 1661976 1696854 1728733 1756791 1805175 1861590 1900580 1965264 2078926
6264 2078926 2185303 2315149 2471348 2630497 2793473 2990356 3222821 3515750 3858713 4330000
6254D330000O54833Q59406J043328J088332R09872M99877O167l90410o52090o95689
6244G653626n85437l89608j60972P6886L70971O39907Q27102Q36050N70303J08926
6234I947754m24766q50262j016450j047253r07748p32767n91955m57276l56077
6225C563200k57881j88781j47766j12107o2756n379m544j6975K222j5591k6451
6214B727191m4348l8310j5127l8020n4131j9574j8583j4159K2554J048m099K7518
6202B531960L7103K3202O7827M2594O3251J11208Q3789R4831J42374J53622J78294
6191C530055K02013K34513K72270L10210L97568M60409N97430P82552J029596
6182G816616J375583J673373J800495J612300J048305K41812n36807j077733j261438
$$ plain form
6254 4330000 4984833 5844239 6887567 7975899 8885771 9385648 9391815 9001405 8349315 7653626
6244 7653626 7068189 6678581 6517609 6594495 6965466 7605373 8432475 9268525 9838828 9947754
6234 9947754 9522988 8672726 7656276 6609023 5701275 4968508 4376553 3919277 3563200
6225 3563200 3305319 3116538 2968772 2856665 2793909 2788530 2783986 2767011 2769233 2753642 2727191
6214 2727191 2682843 2644533 2629406 2591386 2537255 2517681 2499098 2484939 2507493 2508541 2504442 2531960
6202 2531960 2569063 2592265 2660092 2702686 2765937 2877145 2960934 3055765 3198139 3351761 3530055
6191 3530055 3732068 3966581 4238851 4549061 4946629 5407038 6004468 6787020 7816616
6182 7816616 9192199 10865572 12666067 14278367 15326672 15568484 15031677 13953944 12692506
6173A2692506j157812q72854n20665j17484L60257P94840J166865J284812J035404
6164A4665869M30645l45858j039324j469248j593165j494986j272032j068988
6156F812913q65330p14976n91970m88157m04626k91711k39944j64790j33898j09216
6146B808295n5860q4563o6995m0928n1218o8064o1990m0364m8052m8888k7058
6135B214315l0781p272j5915j0099n773J313O49o188J175O475M246R17J3367K1414
6121B187843K9869O075N337O719M925J9055K6029K3526K6225J9891K8975K1133
6109B405602P090r049j1390j8798j1443R192j7736n817R285J6683K6285Q00L5414
6096B436118N0766M5838N2832O3347N3525N4156O0595Q9582P0754O9791N7478
$$ plain form
6173 12692506 11534694 10661840 10141175 10023691 10383948 11178788 12345653 13630465 14665869
6164 14665869 15096514 14750656 13711332 12242084 10648919 9153933 7881901 6812913
6156 6812913 5947583 5232607 4640637 4152480 3747854 3456143 3216199 3051409 2917511 2808295
6146 2808295 2752435 2667872 2600877 2559949 2508731 2440667 2378677 2338313 2290261 2241373 2214315
6135 2214315 2183534 2176262 2160347 2150248 2144475 2145788 2146437 2140249 2141424 2147899 2152145 2153062 2166429 2187843
6121 2187843 2217712 2223787 2229124 2235843 2240768 2259823 2285852 2309378 2335603 2355494 2384469 2405602
6109 2405602 2412692 2403643 2392253 2373455 2362012 2371204 2353468 2347651 2356936 2373619 2399904 2400704 2436118
6096 2436118 2486884 2532722 2585554 2648901 2702426 2756582 2817177 2906759 2977513 3047304 3104782
6085C104782L6683N7329L3273L0791O7467N8006N6805Q6625J26430J23396J11193
6074C892780Q1304K9948J6601Q759O161l043O740J1486K8308K7106M2147O9758
6062D218055P3325Q5189R7356J07559J26180J45108J44915J79505J94001J81503
6052E552696J54356J08110L0867m1175o3748n7621o6252p168R648J0980N5945
6041E686638Q5658J11443J31653J79876J73631J64147J61620J54384J26408J01970
6031G077428J02110R9499J15568J25197J09156J35373J38285J57073J89767K49120
6021H498576L07781L36678L91546M53702N37671O06329P11078Q51161J000376
6012A3694898J139074J286719J368487J335697J232849J011238P85944O53594
$$ plain form
6085 3104782 3141465 3198794 3232067 3262858 3330325 3388331 3445136 3531761 3658191 3781587 3892780
6074 3892780 3974084 4004032 4020633 4029392 4035553 4032510 4039250 4050736 4079044 4106150 4148297 4218055
6062 4218055 4291380 4376569 4473925 4581484 4707664 4852772 4997687 5177192 5371193 5552696
6052 5552696 5707052 5815162 5846029 5804854 5741106 5683485 5617233 5610065 5619713 5630693 5686638
6041 5686638 5772296 5883739 6015392 6195268 6368899 6533046 6694666 6849050 6975458 7077428
6031 7077428 7179538 7279037 7394605 7519802 7628958 7764331 7902616 8059689 8249456 8498576
6021 8498576 8806357 9143035 9534581 9988283 10525954 11132283 11843361 12694522 13694898
6012 13694898 14833972 16120691 17489178 18824875 20057724 21068962 21854906 22508500
6004B2508500O52563P56028R88036J307553J678837K003112K328291K605216K809015
5995C7637151K928538K894978K594446J978096J104322J49533o30330j102750
5987D7553984j278691j269021j227796j222834j237287j241201j116125p93107
5979C8167922l71766J23863O57919J219391J801073K419245L031012L471491L529807
5970E4049957L007902J772010J26734j615730l048024l926939m327566m294981
5962D1743363m035793l677168l270647k869369k476963k079944j686374j314052
5954B0333053r57907o56784m16968k37062j70073k41777l94174n82126p39367
5945A5936815q49908q62700q13202p69106o66223n92072m96781m15084l47007
$$ plain form
6004 22508500 23161063 23917091 24905127 26212680 27891517 29894629 32222920 34828136 37637151
5995 37637151 40565689 43460667 46055113 48033209 49137531 49287064 48656734 47553984
5987 47553984 46275293 45006272 43778476 42555642 41318355 40077154 38961029 38167922
5979 38167922 37796156 37920019 38577938 39797329 41598402 44017647 47048659 50520150 54049957
5970 54049957 57057859 58829869 58956603 57340873 54292849 50365910 46038344 41743363
5962 41743363 37707570 34030402 30759755 27890386 25413423 23333479 21647105 20333053
5954 20333053 19375146 18718362 18301394 18064332 17894259 17652482 17258308 16676182 15936815
5945 15936815 15086907 14224207 13411005 12641899 11975676 11383604 10886823 10471739 10124732
5936A0124732l12851k46660j93536j32311j04499m4116Q86N3797R8658J76281
5926I420381L15146M84050O96896Q73407R43849P74461M29581m6914n09841p88124
5916A2592892q70317p72268o07458m41567k79464j47561l8351R0886K01452L30487
5906A0058731M43067N52319O42027P45533Q68041J005839J071370R76538O72303
5897A7035768J69944l72528q43837j089422j061641q96073p06612m78622k91423
5888A1465554r5580J3775J39705K38297K70251K80092K31056J47385O2865O028
5878A2759428l9867n0152m2805j6410m363o983Q075N9059J24529J56033K09455
5867A3155999L06151K89624K67107K55889K27199J72107J61729J76429J67844
$$ plain form
5936 10124732 9811881 9565221 9371685 9239374 9134875 9090759 9091645 9145442 9244100 9420381
5926 9420381 9735527 10219577 10916473 11789880 12733729 13508190 13937771 13890857 13381016 12592892
5916 12592892 11722575 10950307 10342849 9901282 9621818 9474257 9435906 9526792 9728244 10058731
5906 10058731 10501798 11054117 11696144 12441677 13309718 14315557 15386927 16363465 17035768
5897 17035768 17205712 16833184 15989347 14899925 13838284 12942211 12235599 11756977 11465554
5888 11465554 11369974 11383749 11523454 11761751 12032002 12312094 12543150 12690535 12753400 12759428
5878 12759428 12719561 12669409 12626604 12610194 12605831 12598848 12606923 12665982 12790511 12946544 13155999
5867 13155999 13462150 13751774 14018881 14274770 14501969 14674076 14835805 15012234 15180078
5858A5180078J62276J53061R2284N7774k681j5271k3524j1972K8684M6616P0683
5847A5738008O0622P8001J44260J73348J56938J38177R5028J261j24755j66595
5837A6294293k09918k03324k04704k04022j69769j22092j03551q7138p1342n7526
5827A4860907l6963k9501p455m2384r0868j57024k68797l33777l52675l80225
5817A3161238l71005l41490l34391k98975k64451k59390k06701j56624j57357
5808A0770854j35817j17450j49559j41716j49237j82552k16428k61371k79576
5799I137148l13328l19985l49242l37764l45097l12439l06957k64646k17883j92150
5789F177657j44492j24770j09669r9979q6458p9898o7930p1501j12464j21211
$$ plain form
5858 15180078 15342354 15495415 15587699 15645473 15642792 15627521 15603997 15592025 15620709 15667325 15738008
5847 15738008 15798630 15876631 16020891 16194239 16351177 16489354 16584382 16585643 16460888 16294293
5837 16294293 16084375 15881051 15676347 15472325 15302556 15180464 15076913 14989775 14918433 14860907
5827 14860907 14823944 14794443 14786988 14744604 14653736 14496712 14227915 13894138 13541463 13161238
5817 13161238 12790233 12448743 12114352 11815377 11550926 11291536 11084835 10928211 10770854
5808 10770854 10635037 10517587 10368028 10226312 10077075 9894523 9678095 9416724 9137148
5799 9137148 8823820 8503835 8154593 7816829 7471732 7159293 6852336 6587690 6369807 6177657
5789 6177657 6033165 5908395 5798726 5698747 5612289 5532391 5464461 5392960 5280496 5159285
5779E159285j48333j68441j94378k01349j96113j72969j54192j54057j25113j08153
5769C536187r5687o8384p9353p1736n3212k9025k4064m7103o0321m9322l1967
5758B926013m6535p1690n1450l2111l5897m3703o7108m1701l5473l6129k5716
5747B438500l4714j8380j1755k3396k1101m3940j8099k5262j4111j9825k6839
5736B181078k5610M589j5411j8382l467j7131k4246j8346M117j6960p15j4402
5724B035114l3074O301j1616R821m569k9289K53k2930r824j1838m89k6413k8113
5711A873334j0191o446j3649j1691m844r525K837j8945K1923J0819j4550j2220
5699A806852m49J8712K580p257q746L344J2191k1544M68o046J3581N972j9274
$$ plain form
5779 5159285 5010952 4842511 4648133 4446784 4250671 4077702 3923510 3769453 3644340 3536187
5769 3536187 3440500 3372116 3292763 3221027 3167815 3138790 3114726 3067623 3007302 2957980 2926013
5758 2926013 2879478 2807788 2756338 2724227 2688330 2644627 2577519 2535818 2500345 2464216 2438500
5747 2438500 2403786 2385406 2373651 2350255 2329154 2285214 2267115 2241853 2227742 2207917 2181078
5736 2181078 2155468 2160057 2144646 2126264 2122797 2105666 2081420 2063074 2067191 2050231 2049516 2035114
5724 2035114 2002040 2008341 1996725 2006546 2001977 1972688 1972941 1950011 1940187 1928349 1927860 1901447 1873334
5711 1873334 1863143 1856697 1843048 1831357 1826513 1816988 1819825 1800880 1822803 1833622 1819072 1806852
5699 1806852 1806403 1825115 1827695 1820438 1811692 1815036 1827227 1805683 1806151 1800105 1813686 1819658 1800384
5686A800384J1329Q831R947J2353o234J6313r785j0655K1168Q127o2j9931l5526
5673A806259m906j6066m6855l0748M485k9153j4780M516j4648K472N838j6284
5661A650130L022O357p116J5237n692L471j0847l5958k3540p705j2437k2707j7545
5648A534670j7022k0066j1051k0600j2981k0258j3322j0288k7412k1544j436j6006
5636A342684q519j2999j1157J947j708k0215K364r022o568q062l741j1654n80
5623A252770j0998J0745J0759j0623L353J5619Q761j7970q470m958J6624J8082
5611A283694J4660m570j5554Q997M535o797j4252j1795m052o051o830r930l815
5598A228240j987o978m732m747o393N585J3115R702K573R417L979J6531n550m447
$$ plain form
5686 1800384 1811713 1820544 1830491 1842844 1836610 1852923 1843138 1832483 1853651 1861778 1861716 1841785 1806259
5673 1806259 1801353 1785287 1738432 1707684 1712169 1683016 1668236 1672752 1658104 1660576 1666414 1650130
5661 1650130 1653152 1659509 1652393 1667630 1661938 1665409 1654562 1618604 1595064 1587359 1574922 1552215 1534670
5648 1534670 1517648 1497582 1486531 1465931 1452950 1432692 1419370 1409082 1381670 1360126 1358690 1342684
5636 1342684 1334165 1321166 1310009 1311956 1310248 1290033 1292397 1283375 1276807 1268745 1265004 1253350 1252770
5623 1252770 1241772 1252517 1263276 1252653 1256006 1271625 1280386 1262416 1253946 1248988 1265612 1283694
5611 1283694 1298354 1293784 1278230 1287227 1291762 1284965 1270713 1258918 1254866 1248815 1241985 1232055 1228240
5598 1228240 1226253 1219275 1214543 1209796 1203403 1208988 1222103 1231805 1234378 1243795 1247774 1264305 1258755 1254308
5584A254308m286J379j8855p633r624j1099k0487l008R603j9951Q171k6533j7310
5571A134675j0672p136k84j5151j0641j0156O021M688J1154K336j7503j674j131
5558A084526N209L018j701r025q481j10J7000k653k531K3209K265J5946N662L187
5544A135521j6247J703J523m525p825Q734L23r720k4711J0373K501j5447K2162
5531A104365j0562R315J1487K7006K437l070r240j178M606M335m664m493j4423
5518A115921K125o864Q917J0009P867Q819K010P02M965l710k0356p201j4662j2128
5504A096414P485R114j2479j1123lj3172q215J0351j9021q461j964o821Q936j7059
5490A033982q867l077k2471k3416k1987k4326k2423M8n477q707o976J015R898
$$ plain form
5584 1254308 1250022 1251401 1232546 1224913 1215289 1204190 1183703 1180695 1190298 1170347 1178518 1151985 1134675
5571 1134675 1124003 1116867 1116583 1101432 1090791 1080635 1086656 1091344 1102498 1104834 1087331 1085657 1084526
5558 1084526 1089735 1092753 1091052 1082027 1073546 1073436 1090436 1087783 1085252 1108461 1110726 1126672 1132334 1135521
5544 1135521 1119274 1120977 1122500 1117975 1110150 1118884 1119207 1109487 1084776 1095149 1097650 1082203 1104365
5531 1104365 1093803 1103118 1114605 1141611 1144048 1140978 1131738 1130560 1135166 1139501 1134837 1130344 1115921
5518 1115921 1118046 1111182 1120099 1130108 1137975 1146794 1148804 1149506 1154471 1150761 1130405 1123204 1108542 1096414
5504 1096414 1103899 1113013 1100534 1089411 1089408 1076236 1068021 1078372 1059351 1050890 1048926 1042105 1051041 1033982
5490 1033982 1025115 1022038 999567 976151 954164 929838 907415 907463 901986 893279 886303 887318 897216
5477H97216o223L880J575n28Q99j3452j1710O130m469l1334R173L974j338l055
5463H50738k503k0759j3967J3126J1829M084K58J0897j067P89J151j3373j1656
5450H29547r202J0826k361M187K462M452j471J5885N309Q426J6027K4996M217
5437I13300J879J4532j034J835k628n497P969k361j6994j6972p108M210j0121
5424H81010m509n90r681k407J2166J195L386j77J8216J1654j3741J7421Q48j938
5410I12853j3736K851n505k4076m410j5860o837n375O67k0286j7862n831R052
5397H05645q191M158j607P036P609j9179j20J5125J291Q382m437p232J5573K0168
5383H44221Q714m17K361K7825K0057K7003K7268m44J5626O420j3837m9R350p864
$$ plain form
5477 897216 890993 894873 896448 895920 896819 883367 871657 877787 873318 841984 851157 855131 853793 850738
5463 850738 848235 827476 813509 826635 838464 842548 842806 853703 852636 853425 854576 841203 829547
5450 829547 820345 831171 828810 832997 835459 839911 838440 854325 859634 868060 884087 909083 913300
5437 913300 915179 929711 928677 930512 927884 922387 930356 927995 911001 894029 886921 891131 881010
5424 881010 876501 875911 866230 863823 875989 877184 880570 880393 898609 910263 896522 913943 914791 912853
5410 912853 899117 901968 896463 872387 867977 852117 845280 839905 840572 820286 802424 796593 805645
5397 805645 797454 801612 800005 807041 814650 795471 795351 810476 811767 820149 815712 808480 824053 844221
5383 844221 852935 852518 854879 882704 902761 929764 957032 956588 972214 978634 964797 964748 974098 966234
5369I66234r803k6647q620j075j8025R158o352O020M899P539J0482Q051m011J9095
5355I56945J5828K5123Q381J9857n229o213K58l8748j3001k83p721k7113k0092
5342I07992L114Q696n115l749K712j3253O798R985j4586j370J2686K5464L551
5329I42925k923k6919K0763J1435J7743K1035j0957j8133O100L968K2843K6693
5317A014573k929K8172L3478M1331K8407K6139K40M494J7246Q536J1341q314p033
5304A195681p167j243J2991J0385P440O293o790q96J5206M4554M432O50K5153
5291A306689R419J2221M247j766J3862n895j896q025J819M752q868p379p683N194
5277A316691N412L775k4589J2493J9550K137Q013j034j2103k780k5568k2304J6268
$$ plain form
5369 966234 956431 929784 921164 920089 902064 911222 904870 910890 915789 923328 933810 941861 937850 956945
5355 956945 972773 997896 1006277 1026134 1020905 1014692 1014950 976202 963201 962918 955197 928084 907992
5342 907992 911106 919802 914687 910938 913650 900397 907195 917180 902594 901224 913910 939374 942925
5329 942925 940002 913083 933846 945281 963024 984059 973102 954969 961069 965037 987880 1014573
5317 1014573 1011644 1039816 1073294 1114625 1143032 1169171 1169411 1173905 1191151 1199687 1211028 1202714 1195681
5304 1195681 1188514 1187271 1200262 1210647 1218087 1224380 1217590 1216694 1231900 1276454 1280886 1281536 1306689
5291 1306689 1316108 1328329 1332576 1330810 1344672 1338777 1336881 1328856 1330675 1335427 1326559 1319180 1311497 1316691
5277 1316691 1322103 1325878 1301289 1313782 1333332 1335469 1343482 1342448 1330345 1327565 1301997 1279693 1295961
5264A295961J4949K0416J8018Q042K148J9033j0913k3067j9473j1073N694O846
5252A326581J5377J4874J458J3085P890m841R112J8758J2369J3381K7329K7576
5240A482949K6228L8175L9870K1570j493K5906M7360M9473N2082O3127N3936O9458
5228A968641Q6293Q3907Q8535Q6206J26125J18687J76082K28054L06014L93177
5218C661721M52072M37498L37031J59222o651o4144n1731k4841R3107K15458L78550
5207E587292N55805P28291P98106P43125N84615L46867J46188O8342P4808O5145
5197I698584L4907R0608J89668K83386L17592K78424K04636J14306R9594J73628
5187A1485333L03388L49860L48550K23732J02368n9561j91946l63310l96961l04564
$$ plain form
5264 1295961 1310910 1331326 1349344 1357386 1359534 1378567 1367654 1344587 1325114 1314041 1319735 1326581
5252 1326581 1341958 1356832 1358290 1371375 1379265 1374424 1383536 1402294 1414663 1428044 1455373 1482949
5240 1482949 1509177 1547352 1587222 1608792 1607299 1633205 1680565 1730038 1782120 1845247 1899183 1968641
5228 1968641 2054934 2138841 2227376 2313582 2439707 2558394 2734476 2962530 3268544 3661721
5218 3661721 4113793 4551291 4888322 5047544 5040893 4976749 4925018 4900177 4993284 5208742 5587292
5207 5587292 6143097 6871388 7669494 8412619 8997234 9344101 9490289 9558631 9633439 9698584
5197 9698584 9733491 9824099 10013767 10297153 10614745 10893169 11097805 11212111 11311705 11485333
5187 11485333 11788721 12138581 12487131 12710863 12813231 12753670 12561724 12198414 11801453 11496889
5177A1496889j81905n1634l7907j39665k93182m21839m31559l67244k64865j35879
5167I171210p1282K1472P9720L7882q3459l20320o01852p87331q21623p34615
5157E889802o00299m44169k77837r0487J1571R2928J08081K2373j39769k96004
5147D276190l93256m04255l36218l01945k42364j96378j64302j34987j03587q3514
5137A915384q0556m7817k6543m0257j2327l2665k9603k0005k2119j4039k1227
5126A568226j4905l470R06o780k1510q181o280j9573j3617q226j8415m507J5277
5113A458945q012q435m436J507m797m144p886N997Q172l6k6746J5361J7148j2943
5099A429695P218R711j782J3310K0242R058R884J9401p615Q425J2545M539J0349
$$ plain form
5177 11496889 11314984 11263350 11225443 11085778 10792596 10370757 9939198 9571954 9307089 9171210
5167 9171210 9099928 9121400 9201120 9239002 9155543 8835223 8233371 7446040 6624417 5889802
5157 5889802 5289503 4845334 4567497 4477010 4488581 4581509 4689590 4711963 4572194 4276190
5147 4276190 3882934 3478679 3142461 2840516 2598152 2401774 2237472 2102485 1998898 1915384
5137 1915384 1834828 1787011 1760468 1720211 1707884 1675219 1645616 1625611 1603492 1589453 1568226
5126 1568226 1553321 1549851 1550757 1543977 1522467 1514286 1508006 1488433 1474816 1466590 1448175 1443668 1458945
5113 1458945 1450933 1442498 1438062 1439569 1434772 1430628 1422742 1428739 1436911 1436875 1410129 1425490 1442638 1429695
5099 1429695 1436913 1446624 1444842 1458152 1478394 1487452 1497336 1516737 1509122 1517547 1530092 1534631 1544980
5086A544980q680K9765K8955J4996O692O072J4174J4562l486J8028J8285O951
5074A691294N397M83J2014K7531J4596K2863L5606K1528Q413m284J9235l147K4001
5061A875530M4199J5284K1246J4536J2316q15P077K0691J0824M296J4822P976
5049B047982J951K9214J6027R471L673J3587P928K0237J6867j0911J7438K6699
5037B200163J986J7092O260K7831J6316K6881J4588j125N6Q343K2785K3096K3028
5024B387300L3816K8675Q593L3507O654j3037K636K8835K6796L4272J2629L7859
5012B628535K5568Q641J9777K2705J7290K2168L3113M0621J9305M3098O2415N2008
5000B995244N9945O3284P7490Q6596R8822R6806J03872J29369J40107J55527J70223
$$ plain form
5086 1544980 1536300 1566065 1595020 1610016 1616708 1622780 1636954 1651516 1648030 1666058 1684343 1691294
5074 1691294 1696691 1697174 1709188 1736719 1751315 1774178 1809784 1831312 1839725 1835441 1854676 1851529 1875530
5061 1875530 1919729 1935013 1956259 1970795 1983111 1982296 1989373 2010064 2020888 2025184 2040006 2047982
5049 2047982 2049933 2079147 2095174 2104645 2108318 2121905 2129833 2150070 2166937 2156026 2173464 2200163
5037 2200163 2202149 2219241 2225501 2253332 2269648 2296529 2311117 2309992 2310048 2318391 2341176 2364272 2387300
5024 2387300 2421116 2449791 2458384 2491891 2498545 2485508 2488144 2516979 2543775 2578047 2590676 2628535
5012 2628535 2654103 2662744 2682521 2705226 2722516 2744684 2777797 2818418 2837723 2880821 2943236 2995244
5000 2995244 3055189 3118473 3195963 3282559 3381381 3478187 3582059 3711428 3851535 4007062 4177285
4989D177285J72829J80229K29229K77598L26193L75045M19788M57980M29572L51207
4979G396955K52427Q9082p0266j80628k26791k47750k18664j73027j13580n5772
4969F451986q488P5279J43402K21371K93463L53979L93803L61774K91436J48623
4959H726628m7249j61732k74366l19134l14487k84246k62668j76638j55192j22838
4949F608078q4547m3932j0459L0998P1459Q9088J33595J62196K00008K42367K64888
4938G663739K55557K79190K86659K79745K58849K94169L13438L69998M37524N12987
4928A0951855N71128N86616N93329N08613L52843J85641k8020j86340k81042l49770
4918A2904853l47705l12227k80728k31645j46910o1657M6005J58982K83165L71497
$$ plain form
4989 4177285 4350114 4530343 4759572 5037170 5363363 5738408 6158196 6616176 7045748 7396955
4979 7396955 7649382 7738464 7668198 7487570 7260779 7013029 6794365 6621338 6507758 6451986
4969 6451986 6443498 6518777 6662179 6883550 7177013 7530992 7924795 8286569 8578005 8726628
4959 8726628 8679379 8517647 8243281 7924147 7609660 7325414 7062746 6886108 6730916 6608078
4949 6608078 6523531 6479599 6469140 6500138 6571597 6660685 6794280 6956476 7156484 7398851 7663739
4938 7663739 7919296 8198486 8485145 8764890 9023739 9317908 9631346 10001344 10438868 10951855
4928 10951855 11522983 12109599 12702928 13211541 13564384 13750025 13722005 13535665 13254623 12904853
4918 12904853 12557148 12244921 11964193 11732548 11585638 11523981 11569986 11728968 12012133 12383630
4908A2383630L98863M02114K91425J45889M270j53293k68958l26427l03239k51840
4898A2322434k13140j30901k1428N1895J27774K13999K92692L58851M44642N18884
4888A3965702N69778O41348P08756P59856P68945P65605P27019O65510N87820
4879B0160339N05051M18752L47633L38706L54322L78164M38594N14760O37699
4870B4094020P19998Q03644Q74239R71103J001490J009226J039173J005800R54373
4861C2473066R25852Q69708Q44566Q08246P39137P00508O08393M99352L68366
4852C8837194K43609J37147J2279r7399j68778k20375k41682k35972j55230j21641
4842C7989152l8733J2122O2597J12251J21762J32952Q8203N6610J9911n2345m4133
$$ plain form
4908 12383630 12782493 13184607 13476032 13621921 13626191 13472898 13203940 12877513 12574274 12322434
4898 12322434 12109294 11978393 11956965 12008860 12136634 12350633 12643325 13002176 13446818 13965702
4888 13965702 14535480 15176828 15885584 16645440 17414385 18179990 18907009 19572519 20160339
4879 20160339 20665390 21084142 21431775 21770481 22124803 22502967 22941561 23456321 24094020
4870 24094020 24814018 25617662 26491901 27463004 28464494 29473720 30512893 31518693 32473066
4861 32473066 33398918 34268626 35113192 35921438 36660575 37361083 37969476 38468828 38837194
4852 38837194 39080803 39217950 39230229 39132830 38964052 38743677 38501995 38266023 38110793 37989152
4842 37989152 37950419 37962541 38025138 38137389 38259151 38392103 38480306 38536916 38556827 38504482 38460349
4831C8460349m3442o858O1108K09111M21450P41422J211234J695818J942656J670040
4821D6362888P93231l45055j191410j452125j246335p84077k97769J29896N00343
4812D2469587Q06857J098770J386432J696970K056180K543145L023483L291871
4804E8373295L221448K722383K078174J390105O51696l02538j308734j968971
4796F4856858k043917j715574j249955p99643l98721o136L82036Q13618J367822
4787F1206388K012563K753884L562898M210019M358172L739778K404692Q49522
4779H5097916k62737p51407p06866m97409k11059Q1586L26432N11944O23396O54008
4769H4865804N42432L32298M0869l10606o07134q22282r09503q76996p27579n49758
$$ plain form
4831 38460349 38416907 38410049 38471157 38680268 39101718 39843140 41054374 42750192 44692848 46362888
4821 46362888 47156119 46811064 45619654 44167529 42921194 42137117 41839348 41969244 42469587
4812 42469587 43276444 44375214 45761646 47458616 49514796 52057941 55081424 58373295
4804 58373295 61594743 64317126 66395300 67785405 68437101 68134563 66825829 64856858
4796 64856858 62812941 61097367 59847412 59047769 58649048 58642912 59024948 59838566 61206388
4787 61206388 63218951 65972835 69535733 73745752 78103924 81843702 84248394 85097916
4779 85097916 84835179 84083772 83376906 82879497 82668438 82750024 83076456 83588400 84211796 84865804
4769 84865804 85408236 85740534 85781403 85470797 84863663 84041381 83131878 82254882 81527303 80977545
4759H0977545k71008n6950O5046M9507j34331m79721q80453j312721j679318j974073
4749G4303523k178853k318680k408563k434673k369723k252635k109130j970362
4741E6260904j825046j745854j699088j659144j686497j709844j685274j611544
4733D2638613j535581j470568j404176j390627j376042j335633j298477j231462
4725C1596047j163411j141707j210984j299213j371196j429629j454665j415047
4717B1110195j327404j176321j058605r14983p85340o77368o17485n26271m46635
4708A3579783l93286l14768k55782k02214j27146l4329M014L3625P9023Q4819
4698A2453739M4025K1974M5535R1455J27332J74761J91261J94021J23224l3932
$$ plain form
4759 80977545 80706537 80649587 80714633 80764140 80629809 80150088 79269635 77956914 76277596 74303523
4749 74303523 72124670 69805990 67397427 64962754 62593031 60340396 58231266 56260904
4741 56260904 54435858 52690004 50990916 49331772 47645275 45935431 44250157 42638613
4733 42638613 41103032 39632464 38228288 36837661 35461619 34125986 32827509 31596047
4725 31596047 30432636 29290929 28079945 26780732 25409536 23979907 22525242 21110195
4717 21110195 19782791 18606470 17547865 16632882 15847542 15170174 14552689 14026418 13579783
4708 13579783 13186497 12871729 12615947 12413733 12286587 12252258 12256272 12289897 12368920 12453739
4698 12453739 12497764 12519738 12565273 12656728 12784060 12958821 13150082 13344103 13467327 13433395
4688A3433395k10051l74460m77513n39062n87267n48870m99662m21084l35242
4679I440184k54117j87751j14533j9634O4033J57025K24604L47641M35472N43306
4669A0636230O15769N93461N47967M50278L19359K15541J13085K7723j05642k19648
4659A3194123l59113m87818n92892o61646o61021o29204n50629m87030m00386
4650H364384l35562k46278j38418q3836l1151M9351R4497J00024J40351J45980
4640H059342J62592J77812K03393K46666L10594L33111L45182L02806K44217J97727
4630A0583442J49868R3556N1064n351j00647k21971l57237m79732m90135m60417
4620H762440m23041l71752k97561k25297j40358m7848L6183J06631J75464K26208
$$ plain form
4688 13433395 13223344 12848884 12371371 11832309 11245042 10696172 10196510 9775426 9440184
4679 9440184 9186067 8998316 8883783 8864149 8928182 9085207 9309811 9657452 10092924 10636230
4669 10636230 11251999 11845460 12393427 12843705 13163064 13378605 13491690 13519413 13413771 13194123
4659 13194123 12835010 12347192 11754300 11092654 10431633 9802429 9251800 8764770 8364384
4650 8364384 8028822 7782544 7644126 7560290 7529139 7578490 7672987 7773011 7913362 8059342
4640 8059342 8221934 8399746 8603139 8849805 9160399 9493510 9838692 10141498 10385715 10583442
4630 10583442 10733310 10826866 10877930 10872579 10771932 10549961 10192724 9712992 9222857 8762440
4620 8762440 8339399 7967647 7670086 7444789 7304431 7256583 7292766 7399397 7574861 7801069
4610G801069K47991K66176K58243K24644J21370J3045j40242k84906m22919m81537
4600G602934m91611m63347m46223l87379l39821k68105k19938k01043j83355j43139
4590D458973r6254n1466j9693K6507N3879N7500R1863R0388J16924J68512J82869
4579E080002K12742K72084L12704L45610L94333M02994M14823M06686K99094J57709
4569H298781r41j68201l28867m41908n51856n77718n65823n40831m65367l68326
4559D288943k88183k26729j72508j26680j09403q3724n2755n370l159j8255J733
4548C203910K976Q486M7636K2710M8871O6050P4247P8744J15158J27853J44207
4537C940848J69746K15601K39502L04231M34845O02468P93426J107337J515828
$$ plain form
4610 7801069 8049060 8315236 8573479 8798123 8919493 8932538 8792296 8507390 8084471 7602934
4600 7602934 7111323 6647976 6201753 5814374 5474553 5206448 4986510 4785467 4602112 4458973
4590 4458973 4362719 4311253 4291560 4318067 4371946 4429446 4521309 4611697 4728621 4897133 5080002
4579 5080002 5292744 5564828 5877532 6223142 6617475 7020469 7435292 7841978 8141072 8298781
4569 8298781 8297840 8129639 7800772 7358864 6807008 6229290 5663467 5122636 4657269 4288943
4559 4288943 4000760 3774031 3601523 3474843 3365440 3281716 3228961 3223591 3220432 3202177 3203910
4548 3203910 3206886 3215372 3263008 3285718 3334589 3400639 3474886 3553630 3668788 3796641 3940848
4537 3940848 4110594 4326195 4565697 4869928 5304773 5907241 6700667 7808004 9323832
4528I323832J906511K137711J915906J152924R084r44125j403147j318081r48921
4519A1831694m55836R3503P41926J356521J659203J401360O32775m32463j236232
4510A5592451j441232j151471n93477J07732P63751J161339J050195M60153n08125
4501A5441316j275071j504529j334474r48518m65341N6750O32185J097064J262300
4492A2961682R59134J90741p89798j484325j716274j585894j298069j028136p67418
4483E441643n81822m45403l53246k82887k08788j62515j22895j24066r7149k6142
4473C036730P290M8568L0177q746n9105r2276j20892j33478j21690q5432m2368
4462B458778K1220K5275J2193O076j4246j6123j5294m4469k1248m627J3961J1861
$$ plain form
4528 9323832 11230343 13368054 15283960 16436884 16445968 15501843 14098696 12780615 11831694
4519 11831694 11375858 11469361 12211287 13567808 15227011 16628371 17261146 16828683 15592451
4510 15592451 14151219 12999748 12406271 12514003 13277754 14439093 15489288 15949441 15441316
4501 15441316 14166245 12661716 11327242 10378724 9913383 9970133 10602318 11699382 12961682
4492 12961682 13920816 14111557 13321759 11837434 10121160 8535266 7237197 6209061 5441643
4483 5441643 4859821 4414418 4061172 3778285 3569497 3406982 3284087 3160021 3062872 3036730
4473 3036730 3044020 3092588 3122765 3114019 3054914 2962638 2841746 2708268 2586578 2501146 2458778
4462 2458778 2479998 2505273 2517466 2523542 2509296 2493173 2477879 2433410 2412162 2407535 2421496 2433357
4450B433357k6707o5661n7515n1068j6781j235r087J3990q806K85J916l834P064
4437B215918M1134K2190L4461O7521O3294K5340o401r716o614K0217J6980k692
4425B481632P833K32K7824m122K5648M4912J5460N3795N1197M9380M5366N4766
4413B853923P852J7919N3398J01757J73596K52805L45580L73088L24094J96327
4403D700339m3667k13932k70742k41525j81379j00221l2149J773J7381K7580J5071
4392C678529j0097p9347q7050q2060l8966p727N8809J08369J16664J36694J39780
4381C933598J31086J02390K4689J6713j2635N307K8326K6354j0954o2054m3435
4370D139385J0832O3011J07526J37705K15668K20516K15239J25607Q8342M0831
$$ plain form
4450 2433357 2406650 2340989 2283474 2232406 2215625 2214390 2205303 2219293 2210487 2210772 2212688 2208854 2215918
4437 2215918 2257052 2279242 2313703 2381224 2444518 2469858 2463457 2453741 2447127 2467344 2484324 2481632
4425 2481632 2489465 2489697 2517521 2513399 2539047 2583959 2599419 2653214 2704411 2753791 2799157 2853923
4413 2853923 2861775 2879694 2933092 3034849 3208445 3461250 3806830 4179918 4504012 4700339
4403 4700339 4656672 4442740 4171998 3930473 3749094 3648873 3616724 3618497 3635878 3663458 3678529
4392 3678529 3668432 3589085 3502035 3419975 3381009 3373282 3432091 3540460 3657124 3793818 3933598
4381 3933598 4064684 4167074 4191763 4208476 4195841 4201148 4229474 4255828 4244874 4182820 4139385
4370 4139385 4150217 4213228 4320754 4458459 4674127 4894643 5109882 5235489 5323831 5364662
4360E364662l66r337O3771R4577N3293L3126J8654L0423K7331N6837J12390J42228
4348E987589J52070J30575R2156M7908Q931k0483M3783J55381K07113K00581J80934
4337G186538J31597J20084J37552J80675K35383K88854L13129K32141K00967J97826
4327I224746K09337K48032K74737K16777J98142K47623L52762L70725L33403K22279
4317A1898563J37998O5338N3426R1785K01638L80807O75908R66346J140239J128944
4307A6740992J065336J033253J153996J327530J522798J664696J839963J895792
4299B8244356K169586K555605L081853L646024M296667M689206M868943M513992
4291E8066232M574060N446653P301294J0107640J4779774K1857368L6624959O5242211
$$ plain form
4360 5364662 5364296 5354959 5418730 5513307 5566600 5599726 5618380 5648803 5676134 5732971 5845361 5987589
4348 5987589 6139659 6270234 6362390 6410298 6419229 6398746 6442529 6597910 6805023 7005604 7186538
4337 7186538 7318135 7438219 7575771 7756446 7991829 8280683 8593812 8825953 9026920 9224746
4327 9224746 9434083 9682115 9956852 10173629 10371771 10619394 10972156 11342881 11676284 11898563
4317 11898563 12036561 12101899 12155325 12247110 12448748 12829555 13505463 14471809 15612048 16740992
4307 16740992 17806328 18839581 19993577 21321107 22843905 24508601 26348564 28244356
4299 28244356 30413942 32969547 36051400 39697424 43994091 48683297 53552240 58066232
4291 58066232 62640292 68086945 75388239 85495879 100275653 122133021 158757980 224000191
4283B24000191R4615073R8337721P0787247R790054n9243217q9047586q1899246
4276B67340237o3232931m7015539l4649649k5354528j9206270j5333224j2135313
4269E0412783q274990n025480l439882k468150k129771j562825r50512m99784
4261B6061389j76937J81088N15956Q20861J028018J263887J442992J729314K020001
4252C4886569K168433K030121J655598J030124L76025j47896m96067q08147j106752
4243C9588008j479780j878889k245465k541581k739394k793560k689304k439667
4235B0780368k143379j834566j539997j318964j119982q95516p05365n64144m98828
4226A0159627m59912m19756l74173l24355k59310k11142j91704k23175k63601
$$ plain form
4283 224000191 318615264 416952985 487740232 497530286 438287069 349239483 267340237
4276 267340237 204107306 157091767 122442118 97087590 77881320 62548096 50412783
4269 50412783 42137793 37112313 33672431 31204281 29074510 27511685 26561173 26061389
4261 26061389 25884452 26065540 26581496 27402357 28430375 29694262 31137254 32866568 34886569
4252 34886569 37055002 39085123 40740721 41770845 42146870 41998974 41502907 40694760 39588008
4243 39588008 38108228 36229339 33983874 31442293 28702899 25909339 23220035 20780368
4235 20780368 18636989 16802423 15262426 13943462 12823480 11927964 11222599 10658455 10159627
4226 10159627 9699715 9279959 8905786 8581431 8322121 8110979 7919275 7696100 7432499
4217G432499k89833k59962k04620j10398p9363o4791l4859n8256j32708j73572
4207F024137j71929j64747j05286p6871m1464l6850m6252p0709l8348J6233Q0481
4196E368395J09560J38559J32761J10016M1377N1574n51k2911m1047l5042r585
4185E843106K3607J0879Q083J8544M3702J00266J53292J85503K29175K31356K35444
4174G082957K29796J94456J50464J34577J52303K14731K50719L24304L76404M29087
4164I539798M17961M19797L57524L62200L52515L87565M00276L90400L86965M00022
4154A3415023M04696M34973M52390M75531M72157M67357M94071N48377N80651
4145A7745226O28363O71732O39165O14828N76402N25215M91910N02024M82302
$$ plain form
4217 7432499 7142666 6882704 6678084 6567686 6488323 6423532 6388673 6330417 6197709 6024137
4207 6024137 5852208 5687461 5582175 5505304 5463840 5426990 5380738 5310029 5271681 5287914 5368395
4196 5368395 5477955 5616514 5749275 5859291 5900668 5952242 5951691 5928780 5887733 5852691 5843106
4185 5843106 5866713 5877592 5885675 5904219 5947921 6048187 6201479 6386982 6616157 6847513 7082957
4174 7082957 7312753 7507209 7657673 7792250 7944553 8159284 8410003 8734307 9110711 9539798
4164 9539798 9957759 10377556 10735080 11097280 11449795 11837360 12237636 12628036 13015001 13415023
4154 13415023 13819719 14254692 14707082 15182613 15654770 16122127 16616198 17164575 17745226
4145 17745226 18373589 19045321 19684486 20299314 20875716 21400931 21892841 22394865 22877167
4136B2877167N05896M94499N12861N41157N64627N68704N63960O14622O40726
4127B7884219O90397O99611P17408P23265P40443Q20439R12712J013757J081343
4118C5283594J148330J160601J067481Q77434O44229L86545J99108J11734J24014
4109D1003070K00226K95751L48399L72939L98818M18381M47231M07128L87012
4100D4278955M23149M13075M28200M59869M97372O21308Q33429J071214J329188
4091E0355759J603154J850749J988080K036668J908141J675541J450021J262179
4083F4130292J159654J090198R93134R01906P14453N17331L31106J75222J2008
4074G0025304j52019k59363l24040l56483l02061k32541j39331o1106K301p585
$$ plain form
4136 22877167 23383063 23877562 24390423 24931580 25496207 26064911 26628871 27243493 27884219
4127 27884219 28574616 29274227 29991635 30714900 31455343 32275782 33188494 34202251 35283594
4118 35283594 36431924 37592525 38660006 39537440 40181669 40568214 40767322 40879056 41003070
4109 41003070 41203296 41499047 41847446 42220385 42619203 43037584 43484815 43891943 44278955
4100 44278955 44702104 45115179 45543379 46003248 46500620 47121928 47955357 49026571 50355759
4091 50355759 51958913 53809662 55797742 57834410 59742551 61418092 62868113 64130292
4083 64130292 65289946 66380144 67373278 68275184 68989637 69506968 69838074 70013296 70025304
4074 70025304 69873285 69613922 69289882 68933399 68631338 68398797 68259466 68198360 68200661 68193076
4064F8193076j1371N634k053N0141J14329J95903L09516L70637M20979M43806
4054G0090597L54108K27745J4927k33380m86438o72544p68988q59902j003796
4045F6662329j226890j469681j647061j715229j663875j546554j474462j470155
4037E4448422j437512j328991j196276r87823p27286m65839k24420o3937N0732
4028D8067070P4205K205j05297k23533k80521l01758l45233l97394m65427n64720
4018D5459597p00695q43538r76543j040301j032306r77919r11485q71665q69667
4009C7235478q78714r20364r19638q97742q17232p74432p56818p09358o72381
4000B9888799o32961o36856n82242n60034n59754n17930n43951n76474o16222
$$ plain form
4064 68193076 68181705 68187339 68185286 68235427 68349756 68545659 68855175 69225812 69646791 70090597
4054 70090597 70444705 70672450 70687377 70453997 69967559 69295015 68526027 67666125 66662329
4045 66662329 65435439 63965758 62318697 60603468 58939593 57393039 55918577 54448422
4037 54448422 53010910 51681919 50485643 49497820 48770534 48304695 48080275 48016338 48067070
4028 48067070 48141275 48143480 48038183 47814650 47534129 47232371 46887138 46489744 46024317 45459597
4018 45459597 44758902 43915364 42938821 41898520 40866214 39888295 38976810 38105145 37235478
4009 37235478 36356764 35436400 34516762 33619020 32801788 32027356 31270538 30561180 29888799
4000 29888799 29255838 28618982 28036740 27476706 26916952 26399022 25855071 25278597 24662375
3991B4662375p25183p88585q67484r50483r64803r32959q99608q57847q29220
3982A6846203q08228p44518o88848o39812n62751n12841m27889l94314l48886
3973A1718116l38630l28379l25463l10158l16610l06895l09738k89686k56262
3964H936295k75171k57998k75560k58283k56355k10373j56463j38417j03990q7450
3954F916235q9618j30808j47056j18961q7947m0109q47L4900K1810n5638j29636
3943F172325j73425j80437j39984j30796j11987q7596n7554n7247n0308j2458
3933E170533m7802l6421l1855m3657k8214n3978m3797m0166o0291m9607k131J1826
3921D744440k4328m9959n0163o0584o9165m8606m1132l9654N8k120J8423M7969
$$ plain form
3991 24662375 23937192 23148607 22281123 21330640 20365837 19432878 18533270 17675423 16846203
3982 16846203 16037975 15293457 14604609 13964797 13402046 12889205 12461316 12067002 11718116
3973 11718116 11379486 11051107 10725644 10415486 10098876 9791981 9482243 9192557 8936295
3964 8936295 8661124 8403126 8127566 7869283 7612928 7402555 7246092 7107675 7003685 6916235
3954 6916235 6826617 6695809 6548753 6429792 6341845 6301736 6300889 6335789 6357599 6301961 6172325
3943 6172325 5998900 5818463 5678479 5547683 5435696 5348100 5290546 5233299 5182991 5170533
3933 5170533 5122731 5086310 5054455 5010798 4982584 4928606 4884809 4844643 4784352 4734745 4732614 4744440
3921 4744440 4720112 4670153 4619990 4559406 4490241 4441635 4400503 4360849 4360907 4358787 4377210 4425179
3909D425179O1527N2390P5201N4138O7681N4130J1352J8850K6508K3007M4105
3898D914068M4635M8181m867k4543m0667l0967l7537j5168M427n677J447K7005
3886D880337P3821P2973R8808J22932J33508J43108J42336J04390P1401O0745
3876E904359P7760Q3487R1036J20309J57255J41023J42264J41418J51879J33768
3866G144558J05163O5554N3212P1744Q3217Q6054J08581J37525J69583J99308
3856H224499K14695K59417K98170L40391L88811M24436M63128N08769N56516O16518
3846A2295350P29129P98608Q54387R29174R88798J004643R91399R91125R46798
3837B0529411R10218Q41962P76184P25934O94576O99381P26769P43433P47787
$$ plain form
3909 4425179 4486706 4539096 4614297 4668435 4736116 4790246 4801598 4820448 4846956 4869963 4914068
3898 4914068 4958703 5006884 5002017 4977474 4936807 4905840 4868303 4853135 4857562 4851885 4853332 4880337
3886 4880337 4954158 5027131 5125939 5248871 5382379 5525487 5667823 5772213 5843614 5904359
3876 5904359 5982119 6065606 6156642 6276951 6434206 6575229 6717493 6858911 7010790 7144558
3866 7144558 7249721 7315275 7368487 7440231 7523448 7609502 7718083 7855608 8025191 8224499
3856 8224499 8439194 8698611 8996781 9337172 9725983 10150419 10613547 11122316 11678832 12295350
3846 12295350 13024479 13823087 14677474 15606648 16595446 17600089 18591488 19582613 20529411
3837 20529411 21439629 22281591 23057775 23783709 24478285 25177666 25904435 26647868 27395655
3828B7395655P51973P50406P60842P26866O47635M86274K68310K0114k02930l64635
3818C1240510m72896n56039o42979p05662p36726p48488o99416o39411n78882
3809B5460011n17712m66200m78450m90032n09181m73478m43323m25879m01519
3800B1254237l84192l74641l76055l97484m03029m01706l89796l64071l15803
3791A7847460k14915j76120r5980N815Q0371J39051J63468J65008J28327P5586
3781A8118071K3211l363k4392k6016n630O1379J47482K01677K68843L01788L18949
3770A9381999L14013K90402K45431J74985J08838N3375J5615j0760l321j9743
3760B0550834j5148k6557n2839q4554r0981j09593j45699j59751k24568k78414
$$ plain form
3828 27395655 28147628 28898034 29658876 30385742 31033377 31519651 31787961 31808075 31605145 31240510
3818 31240510 30767614 30211575 29568596 28862934 28126208 27377720 26678304 26038893 25460011
3809 25460011 24942299 24476099 23997649 23507617 22998436 22524958 22081635 21655756 21254237
3800 21254237 20870045 20495404 20119349 19721865 19318836 18917130 18527334 18163263 17847460
3791 17847460 17632545 17456425 17360445 17366260 17446631 17585682 17749150 17914158 18042485 18118071
3781 18118071 18141282 18137919 18113527 18087511 18081881 18143260 18290742 18492419 18761262 19063050 19381999
3770 19381999 19696012 19986414 20231845 20406830 20515668 20569043 20584658 20573898 20570577 20550834
3760 20550834 20535686 20509129 20456290 20371736 20280755 20171162 20025463 19865712 19641144 19362730
3750A9362730l23640l61770l50603k85157k69134k51397k70986k97627l13746
3741A6638670k99508k39430j66435o4533K8865J44730K16163K60918K88754K97892
3731A7106086K68099K13210J61989R4817M7817J1835j8786n9750n8546p5959n4029
3720A7636783l9888j9858R620k8712n3928j11753j84776k25354k52653k45467
3710A6484014k38254k13751k01945k25885k22823k53489k95913l11899l20084
3701A4199971l00549k83011k76200k55894j96163j68735j25150o9508l4600K3528
3691A2513689Q0267J35038J41206J79725K02366K79027L39948L67327M33806M85189
3681A5157588M83296M60393M38162M06016M11847M07108M35874M71119M46646
$$ plain form
3750 19362730 19039090 18677320 18326717 18041560 17772426 17521029 17250043 16952416 16638670
3741 16638670 16339162 16099732 15933297 15868764 15897629 16042359 16258522 16519440 16808194 17106086
3731 17106086 17374185 17587395 17749384 17844201 17892018 17903853 17885067 17825317 17766771 17690812 17636783
3720 17636783 17596895 17577037 17586657 17557945 17504017 17392264 17207488 16982134 16729481 16484014
3710 16484014 16245760 16032009 15830064 15604179 15381356 15127867 14831954 14520055 14199971
3701 14199971 13899422 13616411 13340211 13084317 12888154 12719419 12594269 12524761 12490161 12513689
3691 12513689 12593956 12728994 12870200 13049925 13252291 13531318 13871266 14238593 14672399 15157588
3681 15157588 15640884 16101277 16539439 16945455 17357302 17764410 18200284 18671403 19118049
3672A9118049M15693L75187K87246K00604J59447J66722J12953Q3278N6573K1351
3662B0997103o2398j48211j90675k10041j97679j81819j88488j86780k01531k62390
3652A9167091l03832k96606k78500k73765k24906j96117k11073k42652l01299
3643A6838341l05233l29185l29828l05332k80144k72436k40855j85143j24125
3634A4466060j5464J02058J91732K76963L51689L99587M28810M46971M31608M27637
3624A7507651M13883M20471M07029M04749M40948M85117M92267M08996K66353
3615B1247464Q4995q5440k00072k35668k30845k16987k36816k04375j95504k17457
3605A9509295k43847k21306k45967k30771j64704p6664K042P0361J49592J86456
$$ plain form
3672 19118049 19533742 19908929 20196175 20396779 20556226 20722948 20835901 20919179 20975752 20997103
3662 20997103 20934705 20786494 20595819 20385778 20188099 20006280 19817792 19631012 19429481 19167091
3652 19167091 18863259 18566653 18288153 18014388 17789482 17593365 17382292 17139640 16838341
3643 16838341 16533108 16203923 15874095 15568763 15288619 15016183 14775328 14590185 14466060
3634 14466060 14450596 14552654 14744386 15021349 15373038 15772625 16201435 16648406 17080014 17507651
3624 17507651 17921534 18342005 18749034 19153783 19594731 20079848 20572115 20981111 21247464
3615 21247464 21332459 21247019 21046947 20811279 20580434 20363447 20126631 19922256 19726752 19509295
3605 19509295 19265448 19044142 18798175 18567404 18402700 18326036 18328078 18398439 18548031 18734487
3595A8734487K43640K94637L03614K81004K01172J03831J8437l1583l3679m2353
3585B0073207q9087j72778k85424l74402m54560m40385l91790l29804k28051j18704
3575A7188222k1995O2428N6510L3848m6407j48355k44153l77513m84400n65815
3565A5452370o45301p04182o72609o25395n59243m60536l57126k70047k33874
3556A0924057j57044j36228q6117m3156l3989m808P893M1762P3730J15696J87545
3545A0889341K90313L95832M56441N53738O30066O90667P18363P62781P32603
3536A6120145O32384N75181M78394L74470J99607J0838j51387k72554l47568l86655
3526A7232855l73342l47006l55990l64514l89968m12855m02933l66187k94991
$$ plain form
3595 18734487 18978127 19272764 19576378 19857382 20058554 20162385 20180822 20149239 20115560 20073207
3585 20073207 19984120 19811342 19525918 19151516 18696956 18256571 17864781 17534977 17306926 17188222
3575 17188222 17166227 17228655 17285165 17319013 17272606 17124251 16880098 16502585 16018185 15452370
3565 15452370 14807069 14102887 13430278 12804883 12245640 11785104 11427978 11157931 10924057
3556 10924057 10767013 10630785 10544668 10501512 10467523 10462715 10470608 10512370 10586100 10701796 10889341
3545 10889341 11179654 11575486 12031927 12585665 13215731 13906398 14624761 15387542 16120145
3536 16120145 16752529 17327710 17806104 18180574 18380181 18391019 18239632 17967078 17619510 17232855
3526 17232855 16859513 16512507 16156517 15792003 15402035 14989180 14586247 14220060 13925069
3517A3925069k23617j71839j67358k29143l10825l98340m34117m68520m32237
3508A1089073l82891l17817k53062k03567j88969j60529j30637o1183k9507k832
3498I358079K9572Q5490R1958Q3626J02613J26111J47213J58118J84632J91751
3488A0559163K25586J95579J44718J20499P0519M8744M5892N7864J01216J48993
3478A1718773J47058J29022J20873J25145J25798J49277J17698Q6629M2284p313
3468A2755244l7506j4512J854M3847J06444J51164J71815J89730J50146J23906
3458A3642132R5597M0870N5141P0122J42594K35109K65109K23584J09068n8200
3448A4821126j56052k35237k41437j88751j33764r8058p0012n5234k7459J5171
$$ plain form
3517 13925069 13701452 13529613 13362255 13133112 12822287 12423947 11989830 11521310 11089073
3508 11089073 10706182 10388365 10135303 9931736 9742767 9582238 9451601 9390418 9360911 9358079
3498 9358079 9387651 9473141 9565099 9648725 9751338 9877449 10024662 10182780 10367412 10559163
3488 10559163 10784749 10980328 11125046 11245545 11316064 11364808 11410700 11468564 11569780 11718773
3478 11718773 11865831 11994853 12115726 12240871 12366669 12515946 12633644 12720273 12762557 12755244
3468 12755244 12717738 12703226 12705080 12748927 12855371 13006535 13178350 13368080 13518226 13642132
3458 13642132 13737729 13778599 13833740 13903862 14046456 14281565 14546674 14770258 14879326 14821126
3448 14821126 14665074 14429837 14188400 13999649 13865885 13767827 13697815 13642581 13615122 13630293
3438A3630293P4536J36637K31506K77791K94336K25673P7512j15098k25451k93132
3428A4314603k88532k46573j95870j27304p7497k6905K5418P2926J01251O1840
3418A3613357L2886O707j0173k277K3705M8161M6773J02378J31540J27836J78907
3407A4299800K18749L38601N86202R35126J404754J818116J972657J618215O99507
3398B3891727m73120j386390j726565j553872j211207q64996o24082m66759l27397
3389A5257339k77816j91897r7010P750O0599J16447K01534K55149K96528L20423
3379A5949046L59487L43248L69178L88223M45349N30660O24616P37465Q69117
3370B0616389R84806J080088J124240J187543J221819J173898J011742Q11827
$$ plain form
3438 13630293 13704829 13841466 14072972 14350763 14645099 14870772 14948284 14833186 14607735 14314603
3428 14314603 14026071 13779498 13583628 13456324 13378827 13351922 13377340 13450266 13551517 13613357
3418 13613357 13646243 13652950 13642777 13640500 13664205 13712366 13759139 13861517 13993057 14120893 14299800
3407 14299800 14518549 14857150 15443352 16378478 17783232 19601348 21574005 23192220 23891727
3398 23891727 23418607 22032217 20305652 18751780 17540573 16675577 16051495 15584736 15257339
3389 15257339 14979523 14787626 14690616 14698366 14758965 14875412 15076946 15332095 15628623 15949046
3379 15949046 16308533 16651781 17020959 17409182 17854531 18385191 19009807 19747272 20616389
3370 20616389 21601195 22681283 23805523 24993066 26214885 27388783 28400525 29212352
3362B9212352O66236O70342Q00440J005177J155720J167656J084392R20010P09127
3353C7391452N26132L84936L15661M13218O41829R65513J239467J411434J481414
3344D4771056J582777J933253K816624M285217O305772Q456142R954810R650841
3336H9756492O914934K051957l495543p759272r639600r491011q254640o707801
3328E3375516n248708m036462l036127k184681j418139p51442j66636K63637N06817
3319C7303775O76646O99016Q55356J173533J505967J918884K232131K410268K494402
3310E1269978K572430K756709L208621M102889N503600P503036R689400J1184026
3302I7790689J0922279Q286392L604197j292371m455581n270662m768562m395530
$$ plain form
3362 29212352 29878588 30548930 31349370 32354547 33510267 34677923 35762315 36682325 37391452
3353 37391452 37917584 38302520 38618181 39031399 39673228 40638741 41878208 43289642 44771056
3344 44771056 46353833 48287086 51103710 55388927 61694699 70150841 80105651 89756492
3336 89756492 96671426 98723383 95227840 87468568 77828968 68337957 60083317 53375516
3328 53375516 48126808 44090346 41054219 38869538 37451399 36699957 36533321 36796958 37303775
3319 37303775 37980421 38679437 39534793 40708326 42214293 44133177 46365308 48775576 51269978
3310 51269978 53842408 56599117 59807738 63910627 69414227 76917263 86606663 97790689
3302 97790689 108712968 116999360 120603557 119311186 114855605 109584943 104816381 100420851
3294A00420851m680222m969472m593742l927175l402155l141891k863613k362375
3286G0480206j668711q95269l42395j52211l95794r44915j489060j723866j591734
3277F1276251j070783k33318Q18036J854530K678986L011216K674203J768593
3269G2777714O02325l06317n95627k44698O38564J872994L440658N287241P386469
3260I0859323R683850J1960580J3730849J4371361J3300152J0116694N106319
3253A69129128q55683o617431j1195799j3881940j4505184j3587745j1923082
3246I6562264j0057230q382978o973699n814120m940295m224356l677379l228579
3238D9263628k850614k606462k405118k248939k102418j981609j834074j696364
$$ plain form
3294 100420851 95740629 90771157 86177415 82250240 78848085 75706194 72842581 70480206
3286 70480206 68811495 67916226 67573831 67421620 67025826 66080911 64591851 62867985 61276251
3277 61276251 60205468 59972150 60790186 62644716 65323702 68334918 71009121 72777714
3269 72777714 73380039 73073722 72478095 72233397 72871961 74744955 78185613 83472854 90859323
3260 90859323 100543173 112503753 126234602 140605963 153906115 164022809 169129128
3253 169129128 168273445 161656014 150460215 136578275 122073091 108485346 96562264
3246 96562264 86505034 78122056 71148357 65334237 60393942 56169586 52492207 49263628
3238 49263628 46413014 43806552 41401434 39152495 37050077 35068468 33234394 31538030
3230C1538030j570837j422410j321451j234318j137340j039707r31916q56491
3222B2023560p97797p62866p77791p59772p55218p29758o81912o12953n36571
3213A5608922m67973l87269l09714k16317j60493q4930l6625J8997P9546J13865
3203A4158009J33912J55840J87830K35442K72006K74824K76581K89079K52208
3194A6235731K22353J87647Q4058j1692j11702j88689k21003k49911k80698l18638
3184A5347456l59913l56765m01685m15856l97173l98129l48599k94330k52709
3175A2122297k06866j37518o8186l7879k122M2421M6721R1688Q7231J02900J53270
3164A2193957J42653J62646J96570K40970K89515L02165L59558M55214N63677
$$ plain form
3230 31538030 29967193 28544783 27223332 25989014 24851674 23811967 22880051 22023560
3222 22023560 21225763 20462897 19685106 18925334 18170116 17440358 16758446 16145493 15608922
3213 15608922 15140949 14753680 14443966 14227649 14067156 13982226 13945601 13964598 14044144 14158009
3203 14158009 14291921 14447761 14635591 14871033 15143039 15417863 15694444 15983523 16235731
3194 16235731 16458084 16645731 16729789 16718097 16606395 16417706 16196703 15946792 15666094 15347456
3184 15347456 14987543 14630778 14229093 13813237 13416064 13017935 12669336 12375006 12122297
3175 12122297 11915431 11777913 11709727 11671848 11669726 11712147 11758868 11850556 11937787 12040687 12193957
3164 12193957 12336610 12499256 12695826 12936796 13226311 13528476 13888034 14343248 14906925
3155A4906925P07504R37269J191691J554584J992860K495848L039146L411366
3147C0237193L457580K954629J932939O49384m41779j014277r49182n77969k02343
3138C6046175j49995n56344j301168k154950k769920k971611k813778k462720
3130B0865689k049064j627186j292479j033400q11603o45121m96191l86292k95278
3121A2229075k35837j70280j33523j21740p6495l6886O311M3611R1506J41473
3111A1737215J81400K66997L04259L88119M66384N69879O62275P97003R28791
3102A6302322J106011J298909J465887J700596J965255K320583K811966L449016
3094C2420545M276602N313131O398258P320794P658934P054585N302306K597212
$$ plain form
3155 14906925 15614429 16551698 17743389 19297973 21290833 23786681 26825827 30237193
3147 30237193 33694773 36649402 38582341 39231725 38789946 37775669 36826487 36248518 36046175
3138 36046175 35896180 35339836 34038668 31883718 29113798 26142187 23328409 20865689
3130 20865689 18816625 17189439 15896960 14863560 14051957 13406836 12910645 12524353 12229075
3121 12229075 11993238 11822958 11689435 11567695 11491200 11454314 11460625 11504236 11595742 11737215
3111 11737215 11918615 12185612 12489871 12877990 13344374 13914253 14576528 15373531 16302322
3102 16302322 17408333 18707242 20173129 21873725 23838980 26159563 28971529 32420545
3094 32420545 36697147 42010278 48408536 55729330 63388264 70442849 75745155 78342367
3086G8342367l86671k924300m479689m891204m447077l433328k089515n67242
3078E5123341J035237K648864M031878M770890M552824L097361O49647k195351
3070G3714691m752415o449641p120884o971198o344153n510144m684715l940345
3062B7941196l253333k685842k208466j807007j503543j264142j101053r79521
3054A3138289q87312p96602p24995o70062o16906n49225n08584m48879m19109
3045G516615l59940l14899k67640k67980k42509k31530k44310k43292k22737k38305
3035D883473k40976k10706j84364j62026j64905j56471j29631j21609j22214r9848
3025C290723r9085r0374n6086m8501m4690k331k0177k3334m8503q4950j04275
$$ plain form
3086 78342367 77955696 75031396 70551707 65660503 61213426 57780098 55690583 55123341
3078 55123341 56158578 58807442 62839320 67610210 72163034 75260395 75910042 73714691
3070 73714691 68962276 62512635 55391751 48420553 42076400 36566256 31881541 27941196
3062 27941196 24687863 22002021 19793555 17986548 16483005 15218863 14117810 13138289
3054 13138289 12250977 11454375 10729380 10059318 9442412 8893187 8384603 7935724 7516615
3045 7516615 7156675 6841776 6574136 6306156 6063647 5832117 5587807 5344515 5121778 4883473
3035 4883473 4642497 4431791 4247427 4085401 3920496 3764025 3634394 3512785 3390571 3290723
3025 3290723 3191638 3101264 3045178 2996677 2951987 2949656 2929479 2906145 2857642 2772692 2668417
3014B668417p4692p9232p7873o6710o2100m4412m8120k4297q241j7004m4982l9230
3002B081524l9845n4724m8938m9205n2927l5000k3006o2965o8484l1646n1333
2991A563451k9538M96l640M496M936J1455J7570Q119J8072J0698l2227k6765l3923
2978A513200j6145l5896j2878L4994L5479L3115M0765K0103N43k5575l3212n9086
2966A495407p5936q1424p2936o5893n0679n4092l5366l7530k9807j4277p777j3236
2954I56454k0478r223k7871k2392k0078l7814l5953j7816k4404l3007l5194j3801
2942F58423k1945j9273j9705n92n774m0497j5501j3867k1517j0568p836n225k3572
2929D52551k4404j2357P645q834j9271k7990P663j3450k1292J850j2671j1828
$$ plain form
3014 2668417 2593725 2514493 2436620 2369910 2307810 2263398 2215278 2190981 2182740 2165736 2120754 2081524
3002 2081524 2041679 1986955 1938017 1888812 1835885 1800885 1777879 1714914 1646430 1614784 1563451
2991 1563451 1533913 1534409 1530769 1535265 1540201 1551656 1569226 1577345 1595417 1606115 1573888 1547123 1513200
2978 1513200 1497055 1461159 1448281 1483275 1518754 1551869 1592634 1612737 1613280 1587705 1554493 1495407
2966 1495407 1419471 1338047 1265111 1199218 1148539 1094447 1059081 1021551 991744 977467 969690 956454
2954 956454 935976 926753 898882 876490 856412 818598 782645 764829 740425 707418 672224 658423
2942 658423 636478 617205 597500 596908 591134 550637 535136 521269 499752 489184 481348 476123 452551
2929 452551 428147 415790 423435 414601 395330 367340 375003 361553 340261 342111 329440 317612
2917C17612n361j7689M753R016o04J378r72O653j4273j4594K192m301k8424K95
2903B55681P335k0790k3690r894O682j7416l8346k491P796o171m13J5153l346
2890A70090j6836m070o503O643k4336k7771J1020r691J0122J6947k0014Q4j0259
2877I5426O324m948k47j600j4186J1580J40K9168N113j984k2767j4478K8505J4673
2863A30719j0824N105J2854J358p104j2567j4583P142k195r982q795l638l596
2850H3894N663j8760j4574j5282k9454k4755q913J5510j3043j2165O797r030j4320
2837d8432P512K0151J7263L961L934j1990k058M589k715J2733L060l400J4340
2824A8948j0480j4122j6377K9836q34m413L555J0266L374l713O484J4534K5204
$$ plain form
2917 317612 312251 294562 299315 308331 307727 309105 308133 314786 300513 285919 288111 283810 255386 255681
2903 255681 263016 242226 218536 208642 215324 197908 159562 157071 164867 158696 158283 173436 170090
2890 170090 153254 149184 142681 149324 124988 97217 108237 98546 108668 125615 105601 105685 95426
2877 95426 101750 96802 96555 94955 80769 92349 92489 121657 126770 124786 102019 87541 116046 130719
2863 130719 119895 125000 137854 139212 132108 119541 104958 112100 109905 99923 91128 87490 83894
2850 83894 89557 70797 56223 40941 11487 -13268 -22181 -6671 -19714 -31879 -25082 -34112 -48432
2837 -48432 -40920 -20769 -3506 455 4389 -7601 -9659 -5070 -7785 4948 8008 4608 18948
2824 18948 8468 -5654 -22031 7805 6971 2558 6113 16379 19753 16040 22524 37058 62262
2811F2262Q142J103L9579J8182K2981N0839L2613K6452P948R082k2120k7992j8319
2798B10752o334k6005k3756J2451m121j907J5216J8003K0510O899K6311m493j8846
2785B24680k9188n5655j9874j7878j9550m2502k0304j0033n533j2932k086k9836
2773d0691J87N179k5985R696R64j7502o713J2821j0545m209q433j882r680R718
2759h7075o171j0598j8594L427j9996J4938J0145k8153j4903J0256o275R066J8951
2746a24982j0825o292j4739J0593o953n984J1527r640N776m23J1816J0729j1002
2733a40399r409j429r594m076J0050L921N805j903r195P930J1999j191P24j362
2719a38129j896Po833j539j1352j1621P729r112J5619L490J1586r721j3339J3724
$$ plain form
2811 62262 70404 71507 111086 129268 152249 203088 235701 262153 270101 279183 257063 229071 210752
2798 210752 204418 178413 154657 167108 162987 161080 176296 194299 214809 221708 248019 243526 224680
2785 224680 195492 139837 119963 102085 82535 40033 19729 9696 4163 -8769 -10855 -40691
2773 -40691 -40504 -35325 -61310 -51614 -50650 -68152 -74865 -62044 -72589 -76798 -85231 -87113 -96793 -87075
2759 -87075 -93246 -103844 -122438 -119011 -139007 -124069 -113924 -142077 -156980 -146724 -152999 -143933 -124982
2746 -124982 -135807 -142099 -156838 -146245 -153198 -159182 -147655 -157295 -151519 -151942 -140126 -129397 -140399
2733 -140399 -149808 -151237 -160831 -164907 -154857 -150936 -145131 -147034 -156229 -148299 -136300 -137491 -136767 -138129
2719 -138129 -140025 -140018 -146851 -148390 -159742 -171363 -163634 -172746 -157127 -153637 -142051 -151772 -165111 -151387
2705a51387j008M28l170k1570K151R736l36m26n561L467j207m36J685M191p480
2690a70923q15j6353J3146J2581l269j9057J3421K8507l250j555p936O226j384
2677a50661P153r456J3739J7335l2651j5403K1219j3270J7722K7377J6731N206
2665i4959K481J4031N102o018q430j1447l49j5913L003j6011n605Q611j0224N072
2651a30656L191p72j3455j415P216J3381p955J4079R510J3184K0088K1420J090
2638e1094j0492j5502k2938k5292k535R216j2394j9461j7551l965j4025j1656
2626a97689M346O348j0945k126l093q97J0652J0737l806k2384K214J3200J0903
2613a82540m783L846r30p907K485m04L966m479m000Q678J0426J471r23K375Q756
$$ plain form
2705 -151387 -152395 -151967 -155137 -176707 -174556 -164820 -165156 -165582 -171143 -167676 -168883 -169319 -167634 -163443 -170923
2690 -170923 -171738 -188091 -174945 -162364 -165633 -184690 -171269 -142762 -146012 -147567 -155503 -149277 -150661
2677 -150661 -143508 -152964 -139225 -121890 -154541 -169944 -148725 -161995 -144273 -116896 -100165 -94959
2665 -94959 -92478 -78447 -73345 -79363 -87793 -99240 -99589 -115502 -112499 -128510 -134115 -125504 -135728 -130656
2651 -130656 -127465 -128237 -141692 -143107 -135891 -122510 -130465 -116386 -106876 -93692 -73604 -52184 -51094
2638 -51094 -61586 -77088 -100026 -125318 -127853 -118637 -131031 -150492 -168043 -172008 -186033 -197689
2626 -197689 -193343 -186995 -197940 -200066 -203159 -204056 -193404 -182667 -186473 -208857 -206643 -193443 -182540
2613 -182540 -187323 -183477 -184407 -192314 -189829 -190233 -186267 -190746 -194746 -186068 -175642 -174171 -175094 -172719 -163963
2598a63963q37J5427K165O788j1599k677M116k1830L271l553k0478N410j879j445
2584a91084m967O42l406k67N603p156J5426k209j1451o657J824K919n494R709
2570a96568K265N14q300k781J8437J480n390N843m001J731Q153j9753p685J1397
2556a94658O275j4478j702J2689L253J1557j4902j101J6379N189o761j5775Q708
2543a85327L498l982O631k247M377J2687j3275n064j642J1387J546J6089L362
2530a51960p325j7239j221N335R211R36N745J491o854L495J349m933J3919j278
2516a49329N906J729q446j0801K093M209j3141J6407l051k706J2440n307n332
2503a55329j2262O091p72J0589P831M757K2216j2952R332J306j35J3778N306O117
$$ plain form
2598 -163963 -164800 -149373 -147208 -140420 -152019 -154696 -150580 -172410 -169139 -172692 -193170 -187760 -189639 -191084
2584 -191084 -196051 -195409 -198815 -199082 -193479 -200635 -185209 -187418 -198869 -205526 -203702 -200783 -206277 -196568
2570 -196568 -194303 -193789 -202089 -204870 -186433 -184953 -190343 -184500 -188501 -186770 -178617 -198370 -206055 -194658
2556 -194658 -188383 -202861 -204563 -191874 -188621 -177064 -191966 -193067 -176688 -171499 -178260 -194035 -185327
2543 -185327 -181829 -185811 -179180 -181427 -177050 -164363 -177638 -182702 -184344 -172957 -171411 -155322 -151960
2530 -151960 -159285 -176524 -177745 -172410 -163199 -162263 -156518 -155027 -161881 -158386 -157037 -161970 -148051 -149329
2516 -149329 -143423 -141694 -150140 -160941 -158848 -154639 -167780 -151373 -154424 -157130 -144690 -149997 -155329
2503 -155329 -167591 -161500 -162272 -151683 -143852 -139095 -116879 -129831 -120499 -119193 -119328 -105550 -100244 -94127
2489i4127j1867j3528j262j3339j2651O663K5767M914J1601q173j3450P255J911
2476a10286m100M40J1238M58r926j7J463K102J3195J3941J8250L018r674L700
2462f6198j165J0188k368o77O644Q593N186J2939j840j0453P081P715l232o709
2448c4296K1467J7198p205N071J6566J585Q696O262J0729p702r38K5461J3274
2435G6168Q291j6673o423J7731Q787j6561J4030K2031J9747K9730L4840J8664
2423B10362J9197L4108N0718P1107N4043M8947O0353Q7635J38995J56320J83678
2412A115463J54264J00355M6490Q2876J07974J30041J52816K42624L94787N60003
2402C087693Q68058J577132K732954L731436L506105J998375j389443l802644
$$ plain form
2489 -94127 -105994 -119522 -120784 -134123 -146774 -140111 -114344 -109430 -97829 -106002 -119452 -112197 -110286
2476 -110286 -114386 -113946 -102708 -102250 -112176 -112193 -110730 -108628 -95433 -81492 -63242 -60224 -69898 -66198
2462 -66198 -67363 -57175 -59543 -60220 -53576 -44983 -39797 -26858 -28698 -39151 -32070 -24355 -27587 -34296
2448 -34296 -12829 4369 -2836 2235 18801 20386 29082 35344 46073 38371 37433 62894 76168
2435 76168 84459 67786 61363 79094 87881 71320 85350 107381 127128 156858 191698 210362
2423 210362 229559 263667 314385 385492 439535 488482 548835 636470 775465 931785 1115463
2412 1115463 1269727 1370082 1416572 1499448 1607422 1737463 1890279 2132903 2527690 3087693
2402 3087693 3955751 5532883 8265837 11997273 15503378 17501753 16112310 12309666
2394A2309666l222260k274160j628384j210694q57148o70729n09598m52897l19097
2385A164699j42507o3003r667j3373p6001j20145j26242q7080n4523n1623l2749
2374C87786l5366n2254l9579l1021j4573k5463j1397j0461J3313j0944l860l6576
2362A29605l8769j7759k4610j1781l707n353r592k1749p199j4729k4487j1599
2350f1729k611q910j2605J12K251k033j1713P282p368o010j0709J0988J0180J3827
2336g9048j5211j3527n290n251l762q96j8308J2217N354j1580M602l799M772n583
2322a35310k3505P744P156Q330K716k3057p573o994O585M422J0658K757N231L776
2308a37064J1221j2318J4641o611j2219J1933j3326j0881j0540K463j6314l580
$$ plain form
2394 12309666 9087406 6813246 5184862 3974168 3117020 2446291 1936693 1483796 1164699
2385 1164699 1022192 959189 949522 936149 860148 740003 613761 526681 472158 420535 387786
2374 387786 352420 300166 260587 229566 214993 189530 178133 167672 180985 170041 166181 129605
2362 129605 90836 73077 48467 36686 32979 27626 18034 -3715 -10914 -25643 -50130 -61729
2350 -61729 -64340 -73250 -85855 -85743 -83492 -85525 -97238 -89956 -97324 -103334 -114043 -103055 -92875 -79048
2336 -79048 -94259 -107786 -113076 -118327 -122089 -122985 -141293 -129076 -123722 -135302 -130700 -134499 -129727 -135310
2322 -135310 -158815 -151071 -143915 -135585 -132869 -155926 -163499 -170493 -163908 -159486 -148828 -146071 -140840 -137064
2308 -137064 -125843 -138161 -123520 -130131 -142350 -130417 -143743 -154624 -165164 -162701 -179015 -182595
2296a82595N426o939J3194J9314m183N622j9187J1202r161O238O056j2374j1224
2283a78611j0875R196Q408M213q458q590O686j729J1071J1470j4833k938n433
2270a80423N312L368J0487m379k5519J6320k200l037l314m19J8343n230r682n623
2256a85996J2607J7833n907L500J006k7421r522J150M995R880J8008r55n540j5796
2242a82158K073J9796j5747k536M512o772j0756q686N881K2686J441j0433r073
2229a89772k389R669j75p653m234J3800Q249J6239j9878O889J3423n163o756j121
2215a68872P672l671R37n378j2056l471J7344p49k3614q960O958Q664L711q646
2201a90131R500r392L463R031N127N255P813n340J0606N751j0066n541j9263j2298
$$ plain form
2296 -182595 -177169 -184108 -170914 -151600 -155783 -150161 -169348 -158146 -167307 -161069 -155013 -167387 -178611
2283 -178611 -189486 -180290 -171882 -167669 -176127 -184717 -178031 -179760 -168689 -157219 -172052 -174990 -180423
2270 -180423 -175111 -171743 -161256 -165635 -191154 -174834 -177034 -180071 -183385 -183804 -165461 -170691 -180373 -185996
2256 -185996 -173389 -155556 -161463 -157963 -156957 -184378 -193900 -192750 -187755 -177875 -159867 -160822 -166362 -182158
2242 -182158 -180085 -160289 -176036 -178572 -174060 -180832 -191588 -200274 -194393 -171707 -170266 -180699 -189772
2229 -189772 -192161 -182492 -182667 -190320 -194554 -180754 -172505 -156266 -176144 -169255 -155832 -160995 -167751 -168872
2215 -168872 -161200 -164871 -163934 -169312 -181368 -184839 -167495 -168244 -191858 -200818 -193860 -185196 -181485 -190131
2201 -190131 -180631 -190023 -186560 -177529 -172402 -167147 -159334 -164674 -154068 -148317 -158383 -163924 -183187 -195485
2187a95485m872K4429k432q69L991p806J776k309n501J0594J9656j1570j1095
2174a81493N593N00l959o557o226N04J2627O591j3322q436J4393l212K421m064
2160a84640l575o631O490K1265j4218Q538P876M190r244o080K3114r405j5455
2147a77775n255L355l546J6440j814R471P331l784o461K652R132K783o048m329
2133a57848L467J5644R543P456k110P041R799o682l00p32j04j8833j3737j8018
2119a65414N588j5216J6886J3926j046K845j2320j2353J0837j0651k733J5135
2107a54516j1085j7892K7446r787k64J3696L41r771l107O154r418o48J4265p415
2093a62001j2080j740P812J1184j2156Q216N196J4481l322j7937q128J1812k0208
$$ plain form
2187 -195485 -200357 -175928 -178360 -179229 -175238 -183044 -181268 -183577 -189078 -178484 -158828 -170398 -181493
2174 -181493 -175900 -175400 -179359 -185916 -192142 -191638 -179011 -172420 -185742 -194178 -179785 -182997 -180576 -184640
2160 -184640 -188215 -194846 -188356 -167091 -181309 -172771 -164895 -160705 -169949 -176029 -152915 -162320 -177775
2147 -177775 -183030 -179675 -183221 -166781 -168595 -159124 -151793 -155577 -162038 -159386 -150254 -147471 -153519 -157848
2133 -157848 -154381 -138737 -129194 -121738 -123848 -116807 -107008 -113690 -113990 -114722 -114826 -133659 -147396 -165414
2119 -165414 -159826 -175042 -158156 -144230 -145276 -142431 -154751 -167104 -156267 -166918 -169651 -154516
2107 -154516 -165601 -183493 -156047 -165834 -166098 -152402 -152061 -161832 -164939 -158785 -168203 -168851 -154586 -162001
2093 -162001 -174081 -175821 -168009 -156825 -168981 -160765 -155569 -141088 -144410 -162347 -170475 -158663 -178871
2080a78871M459K016k157k01J3535M741j5029P929N443m478j266M685N456o183
2066a59921N022L129P00J8423m388j4669k881k224L48K080j7460J3052O042k731
2052a55478J3675J054L191k3994M61J0330K3016J0846k0946j8831J9143M854J63
2039a32516M389J136p434j3028L353R16j994j7557Q063l71L481R99n676O051n984
2024a56172L954J2415j9304m503P170L868J104j5261J712J8041N555j0513k0718
2011a72652J5016L734j0367M17J2289J9828p296m894j010j4020J169j310Q764
1998a50332K043K1892j77j1788r637j5498J1585O549J2459n379r054K259n145
1985a50223J7493j0417j1755p397J5186K7009l247R919j5871l41o506k863N127
$$ plain form
2080 -178871 -174412 -172396 -174553 -174754 -161219 -156478 -171507 -163578 -158135 -162613 -163879 -159194 -153738 -159921
2066 -159921 -154899 -151770 -151070 -132647 -137035 -151704 -154585 -156809 -156461 -154381 -171841 -158789 -152747 -155478
2052 -155478 -141803 -140749 -137558 -161552 -161091 -150761 -127745 -116899 -137845 -156676 -137533 -132679 -132516
2039 -132516 -128127 -126991 -134425 -147453 -144100 -143184 -145178 -162735 -154672 -155043 -151562 -150563 -156239 -150188 -156172
2024 -156172 -152218 -139803 -159107 -163610 -156440 -152572 -151468 -166729 -165017 -146976 -141421 -151934 -172652
2011 -172652 -157636 -153902 -164269 -163852 -151563 -131735 -139031 -143925 -144935 -158955 -157786 -159096 -150332
1998 -150332 -148289 -126397 -126574 -138362 -147999 -163497 -151912 -145363 -132904 -138283 -147337 -145078 -150223
1985 -150223 -132730 -143147 -154902 -162299 -147113 -120104 -123351 -113432 -129303 -129644 -136150 -139013 -133886
1972a33886j8469J812Q846P825j037m665N020l747M581Q105P334m912L980j3369
1958a32582m263R486n505L725K368r766k0l645J089M97O386K627N188L638r78
1943a21755m768q228N109n407l383P680j441r811m217J137l19J3912j1969J021
1929a42439O090J141R470j3631O503j1399q081K9481J462j4024k724p739J6629
1916a29261L59J6222m567k811r00M773k727j503k117p809J5330l297j347k980
1902a22635n971J3664J5080L484j4073o016j4396j0644m867M358P244J0779n261
1889a29254j604L090j327M363n233l599n176M205M153N419j377k364Q80k469M576
1874a25717J981j8651J6438o863J1128R000k672o665r84l780J0659P311j0268
$$ plain form
1972 -133886 -152355 -150543 -141697 -133872 -134909 -139574 -134554 -138301 -133720 -125615 -118281 -123193 -119213 -132582
1958 -132582 -136845 -127359 -132864 -129139 -126771 -136537 -136557 -140202 -139113 -138616 -132230 -129603 -124415 -120777 -121755
1943 -121755 -126523 -134751 -129642 -135049 -138432 -130752 -132193 -142004 -146221 -145084 -145403 -131491 -143460 -142439
1929 -142439 -136349 -135208 -125738 -139369 -132866 -144265 -152346 -122865 -121403 -135427 -138151 -145890 -129261
1916 -129261 -128902 -112680 -117247 -120058 -120958 -116185 -118912 -120415 -122532 -130341 -115011 -118308 -119655 -122635
1902 -122635 -128606 -114942 -99862 -96378 -110451 -116467 -130863 -141507 -146374 -142016 -134772 -123993 -129254
1889 -129254 -130858 -127768 -129095 -124732 -129965 -133564 -138740 -134535 -130382 -124963 -126340 -128704 -127824 -130293 -125717
1874 -125717 -123736 -142387 -125949 -132812 -121684 -112684 -115356 -122021 -123005 -126785 -116126 -108815 -119083
1861a19083q975k332n56L679O998k545j247O156o513R453K22r40J1706r991m267
1846a18235N339n275J1215O202j2014p319p533L543J0672J6897j6880n416J0492
1833a08312M031L702j604J617j9130j8557J8439M661n447k285J1337R031j1300
1820a13817k559j2271Q234O37j895J5130r170L656R272J629k657n141J1334Q253
1806h9365j1747m957j6172n402J1872R249O304K709n523k502k3941K4365R10J3720
1792i0480n888j5555m158l379N13J2807K0556k8146j4657K5716J5748L955J27
1779h2841p871k524p190L125L842N219r190N049R42o770J090l112m159K044N471
1764i6875O072k810n36n05J365j4777j511j7033M89M390J8672J3129L670j9321
$$ plain form
1861 -119083 -128058 -130390 -130946 -127267 -120269 -122814 -124061 -117905 -124418 -114965 -114743 -115683 -103977 -113968 -118235
1846 -118235 -112896 -118171 -106956 -100754 -112768 -120087 -127620 -124077 -113405 -96508 -113388 -118804 -108312
1833 -108312 -104281 -100579 -102183 -100566 -119696 -138253 -119814 -115153 -120600 -122885 -111548 -102517 -113817
1820 -113817 -116376 -128647 -120413 -119776 -121671 -106541 -115711 -112055 -102783 -101154 -103811 -108952 -97618 -89365
1806 -89365 -101112 -106069 -122241 -127643 -115771 -106522 -100218 -97509 -103032 -105534 -129475 -105110 -104200 -90480
1792 -90480 -96368 -111923 -116081 -119460 -118947 -106140 -85584 -113730 -128387 -102671 -86923 -82968 -82841
1779 -82841 -90712 -93236 -100426 -97301 -93459 -88240 -97430 -92381 -91439 -98209 -97119 -100231 -104390 -102346 -96875
1764 -96875 -90803 -93613 -94149 -94654 -93289 -108066 -109577 -126610 -126121 -121731 -103059 -89930 -86260 -105581
1750a05581q464J510R247J2970J0658o59k1448K330j0895J163J3505P792p043
1737i4915q628j180o967l312Q643J0007o758j1881N40J3617J1316j2210P284J4658
1723g9786j4767J1610j456p360R841r01Q324q35k7202r241K2600J426P16N567
1709h1464j727j443r19j9407p572j2897K2198l976J485J5453n327l962J5071q975
1695i3462M948N456p406L812Q740L49l917P926J966J925M888j7350j3102M734
1681i0493m40p015m87J133J128j122o798J2300j095k4160l571J8252J1954J0914
1667g9500k749K342J837M568q308R13k0127p435l085K6515J438r031j7671J8762
1653i1531Q456j6052K376j1165J1470R984p939j7437j2155K3279M120K02q717
$$ plain form
1750 -105581 -114045 -112535 -103288 -90318 -79660 -80319 -101767 -99437 -110332 -109169 -95664 -87872 -94915
1737 -94915 -103543 -104723 -111690 -115002 -106359 -96352 -103110 -114991 -114451 -100834 -89518 -101728 -94444 -79786
1723 -79786 -94553 -82943 -84399 -91759 -81918 -82819 -74495 -75330 -102532 -111773 -89173 -87747 -87031 -81464
1709 -81464 -83191 -84634 -85553 -104960 -112532 -125429 -103231 -107207 -105722 -90269 -95596 -99558 -84487 -93462
1695 -93462 -88514 -83058 -90464 -86652 -77912 -77563 -81480 -73554 -71588 -69663 -64775 -82125 -95227 -90493
1681 -90493 -90933 -97948 -98435 -97302 -96174 -97296 -104094 -91794 -92889 -117049 -120620 -102368 -90414 -79500
1667 -79500 -82249 -79907 -78070 -73502 -81810 -80897 -101024 -108459 -111544 -85029 -83591 -92622 -110293 -91531
1653 -91531 -83075 -99127 -96751 -107916 -96446 -86462 -94401 -111838 -123993 -100714 -96594 -96392 -105109
1640a05109q266K3524O046J2432O291j2525k4256R728J1436j204L009j0416R191
1627h0119m805P772K083j6071K761l704q648J3775R013J618O540j3141r439m179
1613i6544J1088J0457Q820n916m349k375n22L554o780Q545q866j4289P730o130
1599i5577M369J2134P406P28P94k035j2128l2653K5175J5082J353J6699k187l0069
1585i0909O102K7707q270r835j4567J4701M124p73p654n269q625k63N210K2355
1571f5966O22p354Q190j8705j885N182K3319j2602j649m350j8305Q201J6570n007
1557g3739P432J788p514N631J900k196o865J674J5435K402r475j931N872p664
1543f7250r31j88P847K844m962P691j1307K506j0588M759k312j766J0557J9972
$$ plain form
1640 -105109 -113375 -89851 -83805 -71373 -65082 -77607 -101863 -92135 -80699 -81903 -78894 -89310 -80119
1627 -80119 -84924 -77152 -75069 -91140 -88379 -92083 -100731 -86956 -77943 -76325 -69785 -82926 -92365 -96544
1613 -96544 -85456 -74999 -66179 -72095 -76444 -78819 -79341 -75787 -82567 -74022 -82888 -97177 -89447 -95577
1599 -95577 -91208 -79074 -71668 -70940 -70146 -72181 -84309 -116962 -91787 -76705 -75352 -58653 -60840 -90909
1585 -90909 -84807 -57100 -65370 -75205 -89772 -75071 -70947 -71720 -79374 -84643 -93268 -93531 -88321 -65966
1571 -65966 -65344 -72698 -64508 -83213 -85098 -79916 -56597 -69199 -70848 -75198 -93503 -85302 -68732 -73739
1557 -73739 -66307 -64519 -72033 -66402 -64502 -66698 -73563 -71889 -56454 -54052 -63527 -65458 -59586 -67250
1543 -67250 -68181 -68369 -60522 -57678 -62640 -54949 -66256 -63750 -74338 -69579 -71891 -73657 -63100 -43128
1529d3128l681j7550q22R511L450m704M555K21p358L862j6629m178J7766p593
1515f6278k788R311P998j0500j1459k213n905N106K0650N290J592N323j5813j0071
1501f9757J0422q698L805L452J0244O544q374r222n340K4854k2878j7482P734
1488g4696J0019P200K008k0302K231K5034j7922k891l358N695Q639o269J0244
1475e4368J190M746k769J47P51j1385J0219Q417J1908j3615j0964n850L105M317
1461e4151K018J4905j2289j853O818L116j8156J3523k185k2245K272K7144k0925
1448f2008q478J9906M169o953j9018J4191p017K1507j56n354o721J1043k769p963
1434e5621L169o583k418j819j2638N066P684J0306R281j0711n924m42M694k757
$$ plain form
1529 -43128 -46809 -64359 -65181 -55670 -52220 -56924 -52369 -52148 -59506 -55644 -72273 -76451 -58685 -66278
1515 -66278 -69066 -59755 -51757 -62257 -73716 -75929 -81834 -76728 -56078 -50788 -49196 -43873 -59686 -69757
1501 -69757 -59335 -68033 -64228 -60776 -50532 -43988 -52362 -61584 -66924 -42070 -64948 -82430 -74696
1488 -74696 -64677 -57477 -55469 -75771 -73540 -48506 -66428 -69319 -72677 -66982 -58343 -64612 -54368
1475 -54368 -53178 -48432 -51201 -51054 -50303 -61688 -51469 -43052 -31144 -44759 -55723 -61573 -58468 -54151
1461 -54151 -52133 -37228 -49517 -51370 -44552 -41436 -59592 -46069 -48254 -70499 -68227 -41083 -62008
1448 -62008 -70486 -50580 -46411 -53364 -72382 -58191 -65208 -43701 -43857 -49211 -55932 -44889 -47658 -55621
1434 -55621 -52452 -59035 -61453 -63272 -75910 -70844 -63160 -52854 -43573 -54284 -60208 -60650 -55956 -58713
1420e8713J5828K2599j3546j8313Q693r726n834l155k581R565J4390M827l64j6468
1406e2798J470P895n908R053n320Q749M749j3253K193j2258J0388O739j5091K7070
1392b6322r395j1218J3506j5747J1580L285j0002M969J798n00l040k1637J0650
1379e2073O84k252m887J3889Q941r010M724J1415k0010o455J0239l474J958J6488
1365b9823J1339j1901j7173j3127N466K1704K929j8351M601K399l056q289O762
1352d6520J5657L392j4245O47J35j3187M460N322k112n859l988J2246R603m865
1338c9314j0581K0774O093q750k889J38J236n619r567K283ql20P992m618L471
1323c9679P095j9766r642K078R945P174K5749K939J0324j635k8163j599J6859
$$ plain form
1420 -58713 -42885 -20286 -33832 -52145 -43452 -53178 -59012 -62167 -64748 -55183 -40793 -35966 -36330 -52798
1406 -52798 -51328 -43433 -49341 -40288 -45608 -36859 -32110 -45363 -43170 -55428 -45040 -38301 -53392 -26322
1392 -26322 -35717 -46935 -33429 -49176 -37596 -34311 -44313 -39344 -37546 -38046 -41086 -62723 -52073
1379 -52073 -51389 -53641 -58528 -44639 -35698 -44708 -39984 -28569 -48579 -55034 -44795 -48269 -46311 -29823
1365 -29823 -18484 -30385 -47558 -60685 -55219 -33515 -30586 -48937 -44336 -41937 -44993 -53282 -46520
1352 -46520 -30863 -27471 -41716 -41069 -40934 -54121 -49661 -44339 -46451 -52310 -56298 -44052 -34449 -39314
1338 -39314 -49895 -29121 -23028 -31778 -34667 -34529 -33293 -38912 -48479 -46196 -46204 -46524 -38532 -43150 -39679
1323 -39679 -32584 -52350 -61992 -59914 -49969 -42795 -17046 -14107 -3783 -5418 -33581 -35180 -18321
1310a8321L425k1842q656K0753k576n350k091J4800M664k4854M72M388N092l482
1296c3578j1862P376l296N717Q997j3348o408m605p36J5892K7823k8458j5013
1283e1499J5516m042M48J3688N004k309P561j2572l726j074k135k092L701k71
1269c3802m679L47l111j723O002K808q384J5343j5412J844O392k974J197L669
1255c2483K173N807J6295j8166j4543R740P48j094j0280O135J5020l084j8267
1242d1999J0113l692L576j7271J6405N248q464r227J9507k958R329o508l7588
1229f3529J7297J3686J9139nN876j9628j1505Q452j0230J34J6121p17m989J892
1215b8006J6153j5451k744k510r612n990Q909o230J4692O553l641l500k446J6792
$$ plain form
1310 -18321 -14896 -36738 -45394 -24641 -27217 -32567 -34658 -19858 -15194 -40048 -39576 -35188 -30096 -33578
1296 -33578 -45440 -38064 -41360 -35643 -26646 -39994 -46402 -51007 -51743 -35851 -8028 -36486 -51499
1283 -51499 -35983 -40025 -39577 -25889 -20885 -23194 -15633 -28205 -31931 -33005 -35140 -37232 -33531 -33802
1269 -33802 -38481 -38134 -41245 -42968 -36966 -34158 -42542 -27199 -42611 -40767 -34375 -37349 -36152 -32483
1255 -32483 -30310 -24503 -8208 -26374 -40917 -31177 -30429 -31523 -41803 -35668 -20648 -23732 -41999
1242 -41999 -31886 -35578 -32002 -49273 -32868 -27620 -36084 -45311 -25804 -28762 -19433 -25941 -63529
1229 -63529 -46232 -32546 -13407 -13412 -7536 -27164 -38669 -30217 -40447 -40313 -24192 -24909 -29898 -28006
1215 -28006 -11853 -27304 -30048 -32558 -42170 -48160 -39251 -45481 -30789 -24236 -27877 -31377 -33823 -17031
1201a7031k440n020R481k3022L513M892j1324j4170M033J3125J2785J8058j7660
1188b4780j953J536j0106o741K585j348q281R473J973M895K2973j2372q700j372
1174c2218N285M457P592n540m364M10J886j2783n870K1434m229j8437J276l999
$$ plain form
1201 -17031 -19471 -24491 -15010 -38032 -34519 -29627 -40951 -55121 -51088 -37963 -25178 -7120 -24780
1188 -24780 -26733 -25197 -35303 -42044 -39459 -40807 -49088 -39615 -37642 -32747 -9774 -22146 -30846 -32218
1174 -32218 -26933 -22476 -14884 -20424 -24788 -24378 -22492 -35275 -41145 -19711 -23940 -42377 -41101 -45100
$$ [...]
##END NTUPLES=NMR SPECTRUM
##END=
