##TITLE=1H_DE-80H_X3
 200.13MHz, d2o
 8 sc
 
 19ns.26.2.2025
##JCAMPDX= 6.0         $$ Bruker NMR JCAMP-DX V2.0
##DATA TYPE= NMR SPECTRUM
##DATA CLASS= NTUPLES
##ORIGIN= UXNMR, Bruker Analytische Messtechnik GmbH
##OWNER= pz
$$ XWIN-NMR		Version 3.5
$$ Thu Apr  9 09:45:53 2026 Russian Standard Time (UT+4h)  Yarkov@DPX200
##.OBSERVE FREQUENCY= 200.1313
##.OBSERVE NUCLEUS= ^1H
##.ACQUISITION MODE= SIMULTANEOUS
##.ACQUISITION SCHEME= undefined
##.AVERAGES= 8
##.DIGITISER RES= 18
##SPECTROMETER/DATA SYSTEM= spect
##.PULSE SEQUENCE= zg30
##.SOLVENT NAME= CDCl3
##.SHIFT REFERENCE= (INTERNAL, CDCl3, 0, 15.402)
##AUDIT TRAIL= $$ (NUMBER, WHEN, WHO, WHERE, WHAT)
$$ ##TITLE= Audit trail, XWIN-NMR		Version 3.5
$$ ##JCAMPDX= 5.01
$$ ##ORIGIN= Bruker BioSpin GmbH
$$ ##OWNER= Yarkov
$$ C:/Bruker/XWIN-NMR/data/yarkov2/nmr/H-C/1/pdata/1/auditp.txt
$$ ##AUDIT TRAIL=  $$ (NUMBER, WHEN, WHO, WHERE, WHAT)
(   1,<2026-04-09 09:44:51.10 +0400>,<Yarkov>,<DPX200>,
      <created by zg, POWCHK disabled, PULCHK disabled
       configuration hash MD5:
       00 E9 B6 7A A2 85 ED C7 34 08 36 98 17 FE 4E 26
       data hash MD5: 16K
       93 D8 A3 EF AA DA A8 1B 7A F3 05 64 76 C3 9A 72>)
(   2,<2026-04-09 09:45:03.01 +0400>,<Yarkov>,<DPX200>,
      <Start of raw data processing
       efp BC_mod = 2 LB = 0.25 FT_mod = 6 PKNL = 1 PHC0 = -5301.948 PHC1 = 6.821927 SI = 16K 
       data hash MD5: 16K
       C0 E0 22 2D 35 77 EC 51 DC 8B F5 C0 27 E8 29 F4>)
$$ ##END=
$$ 
$$ hash MD5
$$ 10 CC 43 14 A5 FF 20 AE 7D C7 6B 67 03 42 BC 73
##$RELAX= 
##$RELAX= 
##$RELAX= 
##$RELAX= 
##$RELAX= 
##$RELAX= 
$$ Bruker specific parameters
$$ --------------------------
##$DU= <C:/Bruker/XWIN-NMR>
##$EXPNO= 1
##$NAME= <H-C>
##$PROCNO= 1
##$TYPE= <nmr>
##$USER= <yarkov2>
##$AMP= (0..31)
100 100 100 100 100 100 100 100 100 100 100 100 100 100 100 100 100 100 
100 100 100 100 100 100 100 100 100 100 100 100 100 100 
##$AQSEQ= 0
##$AQ_mod= 1
##$AUNM= <au_zg>
##$AUTOPOS= <>
##$BF1= 200.13
##$BF2= 200.13
##$BF3= 200.13
##$BF4= 200.13
##$BF5= 200.13
##$BF6= 200.13
##$BF7= 200.13
##$BF8= 200.13
##$BYTORDA= 1
##$CFDGTYP= 0
##$CFRGTYP= 5
##$CHEMSTR= <none>
##$CNST= (0..31)
1 1 145 1 1 1 1 1 1 1 1 1 1 1 1 1 1 1 1 1 1 1 1 1 1 1 1 1 1 1 1 1 
##$CPDPRG= <>
##$CPDPRG1= <>
##$CPDPRG2= <>
##$CPDPRG3= <>
##$CPDPRG4= <mlev>
##$CPDPRG5= <mlev>
##$CPDPRG6= <mlev>
##$CPDPRG7= <mlev>
##$CPDPRG8= <mlev>
##$CPDPRGB= <>
##$CPDPRGT= <>
##$D= (0..31)
0 0.7 0 0 0 0 0 0 0 0 0 0.03 0 0 0 0 0 0 0 0 0 0 0 0 0 0 0 0 0 0 0 0 
##$DATE= 1775713490
##$DBL= (0..7)
120 120 120 120 120 120 120 120 
##$DBP= (0..7)
150 150 150 150 150 150 150 150 
##$DBP07= 0
##$DBPNAM0= <>
##$DBPNAM1= <>
##$DBPNAM2= <>
##$DBPNAM3= <>
##$DBPNAM4= <>
##$DBPNAM5= <>
##$DBPNAM6= <>
##$DBPNAM7= <>
##$DBPOAL= (0..7)
0.5 0.5 0.5 0.5 0.5 0.5 0.5 0.5 
##$DBPOFFS= (0..7)
0 0 0 0 0 0 0 0 
##$DE= 6
##$DECBNUC= <off>
##$DECIM= 32
##$DECNUC= <off>
##$DECSTAT= 4
##$DIGMOD= 1
##$DIGTYP= 9
##$DL= (0..7)
0 120 120 120 120 120 120 120 
##$DP= (0..7)
$$ [...]
##$SUBNAM2= <"">
##$SUBNAM3= <"">
##$SUBNAM4= <"">
##$SUBNAM5= <"">
##$SUBNAM6= <"">
##$SUBNAM7= <"">
##$SUBNAM8= <"">
##$SUBNAM9= <"">
##$SW= 18.0517328524113
##$SWIBOX= (0..15)
0 0 2 0 0 0 0 0 0 0 0 0 0 0 0 0 
##$SW_h= 3612.71676300578
##$TD= 16384
##$TD0= 1
##$TE= 0
##$TE2= 300
##$TE3= 300
##$TEG= 300
##$TL= (0..7)
0 120 120 120 120 120 120 120 
##$TP= (0..7)
150 150 150 150 150 150 150 150 
##$TP07= 0
##$TPNAME0= <>
##$TPNAME1= <>
##$TPNAME2= <>
##$TPNAME3= <>
##$TPNAME4= <>
##$TPNAME5= <>
##$TPNAME6= <>
##$TPNAME7= <>
##$TPOAL= (0..7)
0.5 0.5 0.5 0.5 0.5 0.5 0.5 0.5 
##$TPOFFS= (0..7)
0 0 0 0 0 0 0 0 
##$TUNHIN= 0
##$TUNHOUT= 0
##$TUNXOUT= 0
##$USERA1= <user>
##$USERA2= <user>
##$USERA3= <user>
##$USERA4= <user>
##$USERA5= <user>
##$V9= 5
##$VALIST= <valist>
##$VCLIST= <CCCCCCCCCCCCCCC>
##$VD= 0
##$VDLIST= <DDDDDDDDDDDDDDD>
##$VPLIST= <PPPPPPPPPPPPPPP>
##$VTLIST= <TTTTTTTTTTTTTTT>
##$WBST= 1024
##$WBSW= 4
##$XGAIN= (0..3)
0 0 0 0 
##$XL= 0
##$YL= 0
##$YMAX_a= 481332
##$YMIN_a= -393375
##$ZGOPTNS= <>
##$ZL1= 120
##$ZL2= 120
##$ZL3= 120
##$ZL4= 120
##$ABSF1= 0
##$ABSF2= 0
##$ABSG= 0
##$ABSL= 0
##$ALPHA= 0
##$AQORDER= 0
##$ASSFAC= 0
##$ASSFACI= 0
##$ASSFACX= 0
##$ASSWID= 0
##$AUNMP= <proc_1d>
##$AZFE= 0.1
##$AZFW= 0.1
##$BCFW= 0
##$BC_mod= 2
##$BYTORDP= 0
##$COROFFS= 0
##$CY= -3
##$DATMOD= 1
##$DC= 0
##$DFILT= <>
##$DTYPP= 0
##$F1P= 0
##$F2P= 0
##$FCOR= 1
##$FTSIZE= 16384
##$FT_mod= 6
##$GAMMA= 0
##$GB= 0
##$INTBC= 1
##$INTSCL= 3.241238e-09
##$ISEN= 128
##$LB= 0.25
##$LEV0= 0
##$LPBIN= 0
##$MAXI= 10000
##$MC2= 0
##$MEAN= 0
##$ME_mod= 0
##$MI= 1.114404
##$NCOEF= 0
##$NC_proc= -6
##$NLEV= 6
##$NOISF1= 3.799351
##$NOISF2= 2.8
##$NSP= 0
##$NTH_PI= 0
##$NZP= 0
##$OFFSET= 15.40203
##$PC= 1
##$PHC0= -5301.948
##$PHC1= 6.821927
##$PH_mod= 1
##$PKNL= yes
##$PPARMOD= 0
##$PSCAL= 0
##$PSIGN= 0
##$REVERSE= no
##$SF= 200.130023950128
##$SI= 16384
##$SIGF1= 3
##$SIGF2= 2
##$SINO= 0.751879
##$SIOLD= 32768
##$SREGLST= <19F.Aceton>
##$SSB= 0
##$STSI= 16384
##$STSR= 0
##$SW_p= 3612.71676300578
##$SYMM= 0
##$S_DEV= 0
##$TDeff= 16384
##$TDoff= 0
##$TI= <>
##$TILT= no
##$TM1= 0
##$TM2= 0
##$TOPLEV= 0
##$USERP1= <user>
##$USERP2= <user>
##$USERP3= <user>
##$USERP4= <user>
##$USERP5= <user>
##$WDW= 1
##$XDIM= 16384
##$YMAX_p= 323341350
##$YMIN_p= -1074428
$$ End of Bruker specific parameters
$$ ---------------------------------
##NTUPLES= NMR SPECTRUM
##VAR_NAME=  FREQUENCY,     SPECTRUM/REAL,   SPECTRUM/IMAG
##SYMBOL=    X,             R,               I
##VAR_TYPE=  INDEPENDENT,   DEPENDENT,       DEPENDENT
##VAR_FORM=  AFFN,          ASDF,            ASDF
##VAR_DIM=   16384,         16384,           16384
##UNITS=     HZ,            ARBITRARY UNITS, ARBITRARY UNITS
##FACTOR=    0.220516191357247, 1,           1
##FIRST=     3082.40863100942, 0,            0
##LAST=      -530.308131996361, 0,           0
##MIN=       -530.308131996361, -1074428,    0
##MAX=       3082.40863100942, 323341350,    0
$$ Real data points
##PAGE= N=1
##DATA TABLE= (X++(R..R)), XYDATA
$$ [...]
9914 253823 265254 198986 196098 289020 263189 227053 233800 239052 165844 140646 234246 186510
9902 186510 207092 253889 278731 261482 253404 253541 298002 269535 289469 332279 289383 241183
9890 241183 260293 242805 240104 245842 230824 223571 192145 272429 244460 257163 245634 182826
9878 182826 189485 239904 274354 239405 191993 198166 170311 173426 245138 280553 194268 172195
9866 172195 223775 263363 254325 266496 207035 247621 304150 225623 244117 243514 260850 240665
9854 240665 251089 306137 303598 193106 184481 216292 201651 193709 210201 237055 223450 206411
9842 206411 203300 224373 173703 170858 198776 228457 205037 219279 163688 177768 239979 281714
9830 281714 215231 213894 165618 167846 238025 271132 267330 196638 243743 245122 204499 231080
9818 231080 194480 161930 250266 275010 195488 189767 210101 247016 266699 249424 261030 288087
9806 288087 331835 371518 300819 276080 249902 247345 203818 177817 236817 256836 277329 242054
9794 242054 249089 283646 283743 192598 192938 262838 253244 224433 250242 274970 219898 210557 237480
9781 237480 232064 233653 256099 299198 296988 238925 280101 294717 290136 342088 311196 281013
9769 281013 254261 274769 312277 307824 263917 288614 211640 245737 247689 233891 241461 263329
9757 263329 292918 285386 268248 320539 225253 227016 261287 250809 306014 262947 237085 288820
9745 288820 339103 331357 325942 286825 287388 288826 289139 244441 296559 356190 375442 377440 368783
9732 368783 324156 247700 284022 339021 344380 386883 386509 336831 339791 374346 373621 373593 401966
9719 401966 337970 319408 305548 333223 307889 196418 302944 394465 370201 305508 374065
9708 374065 397482 351608 330047 310755 333796 337714 321434 314244 339318 358921 369905 347892
9696 347892 304589 341012 362893 333932 363294 371739 416787 398035 383243 456064 442080 454385
9684 454385 437792 455833 513559 528746 544168 553420 627380 685531 807694 829141 847374 973700
9672 973700 1041810 1071280 1086025 1077935 993219 974813 950838 771753 699206 622386 538498 542191
9660 542191 570226 519590 503005 503506 434667 478102 517973 479977 422925 456290 498119 500350
9648 500350 550659 583405 601651 610250 641101 651770 778678 858036 964392 1039040 1093392
9637 1093392 1165578 1125328 1199825 1270672 1184474 1040179 978673 920395 832008 706342 640249
9626 640249 597044 508414 451373 494474 517874 497920 471244 420611 428481 395583 469790 454573
9614 454573 408730 457447 473369 419512 435134 509547 466343 465540 403248 455217 457431 455869
9602 455869 425607 420684 427271 472959 450280 441939 427761 462153 427616 477262 440686 448999
9590 448999 455604 455841 437586 435308 489306 502557 404296 371358 443731 452556 467450 496049 481774
9577 481774 465411 442268 453107 404527 379784 358842 410095 422766 508833 556567 548086 478874
9565 478874 420671 508428 470137 524210 507384 555029 468749 510449 549952 488922 442102 481523
9553 481523 534044 529787 533819 551043 538773 578320 490223 461620 501343 510316 485298 456336
9541 456336 463357 531112 446154 483650 475923 503914 492918 503071 549618 551112 569161 615750
9529 615750 654232 585913 544937 550514 565079 614513 537585 519791 518584 498292 577578 549637
9517 549637 533444 515623 580519 528276 569497 595329 562175 586551 583209 596031 528775 620815
9505 620815 654545 642354 601825 619004 617607 629140 616754 621247 708266 722722 651566 620596
9493 620596 674723 679606 644675 652464 642440 637154 602741 659531 731664 748362 727277 736879
9481 736879 707954 798941 845846 823994 784614 756046 810963 700261 689485 720470 819196
9470 819196 747928 717189 687732 695984 646429 699452 714011 751622 805416 801730 763451 744998
9458 744998 779318 773517 807514 770445 794900 875363 773069 754638 819734 798204 793113 888895
9446 888895 916701 940433 872348 874701 836557 868475 884091 863889 968740 989474 964648 1022952
9434 1022952 964872 986992 959044 985420 1025702 1071663 1070339 1114944 1189513 1157069 1155693 1197800
9422 1197800 1275580 1283384 1316812 1294872 1326197 1369479 1472379 1635626 1736045 1752119 1785624
9411 1785624 1817647 1808321 1779971 1747974 1607369 1719122 1790359 1875569 1982716 2049273 2097018
9400 2097018 2194024 2257205 2303687 2228169 2135779 2030967 1921360 1924303 1893079 1857480 1864113
9389 1864113 1900846 1950257 2046003 2070661 2076835 2135885 2245745 2295906 2326427 2310346 2318784 2435280
9377 2435280 2529326 2650375 2771682 2969744 3119277 3148648 3143141 3197537 3194085 3143357 3173168
9366 3173168 3242055 3320893 3406949 3532506 3672399 3843145 3872132 3952952 4078967 4075209 4140987
9355 4140987 4153750 4171097 4345520 4511929 4613872 4773094 4904604 5041778 5141447 5254841
9345 5254841 5447639 5530627 5689705 5874416 6018254 6126869 6243611 6391504 6456519 6534059
9335 6534059 6678602 6718207 6726914 6740402 6742529 6767972 6734456 6711042 6668179 6625490 6589367 6512117
9323 6512117 6386611 6173819 5977388 5854524 5712429 5631255 5521606 5362829 5178454 4969919
9313 4969919 4850887 4719276 4596700 4441640 4259765 4179127 3985638 3877778 3795396 3709514
9303 3709514 3587222 3468990 3386473 3257780 3216256 3140630 3026820 3007019 2900594 2833423
9293 2833423 2798493 2718930 2680016 2650336 2671455 2618242 2606784 2572509 2617103 2700697 2664839
9282 2664839 2544876 2448001 2319972 2214243 2188016 2150314 2085745 2033029 2009224 1938057 1876046
9271 1876046 1881697 1925606 1959438 2005187 2096730 2111386 2175313 2100338 2068626 2030805 1964817 1856641
9259 1856641 1709568 1730884 1714135 1716917 1671042 1570581 1595820 1548741 1574878 1629634 1635886
9248 1635886 1605512 1642273 1758255 1837005 1940095 1947879 1888714 1837451 1717589 1650185 1592779
9237 1592779 1577318 1578499 1531478 1553368 1565483 1561883 1536015 1601294 1598685 1694876 1780980 1842694
9225 1842694 2012946 2040559 1978042 2014447 2082799 2146325 2190448 2186894 2125905 2009179 1913576
9214 1913576 1854608 1858115 1819297 1817981 1833795 1932969 1915844 1927142 1893975 1823190 1804603 1643154
9202 1643154 1607645 1556014 1506361 1537625 1599306 1553054 1546011 1506804 1489204 1593992 1674664
9191 1674664 1640814 1682424 1769305 1857383 1895289 1982337 1935502 1958259 2028651 2030695 2083415 2147768
9179 2147768 2138982 2230391 2290963 2299670 2358127 2343543 2273442 2142676 2023340 1942550 1885653
9168 1885653 1834021 1883747 1895470 1853516 1847608 1912147 1902881 1884038 1843126 1757954 1699991 1725849
9156 1725849 1684723 1710956 1745455 1801304 1934577 2027500 2082922 2137713 2196243 2189944 2189645 2213070
9144 2213070 2229948 2272882 2230889 2101287 2021895 1992967 1965363 2068107 2123452 2192131 2244066
9133 2244066 2339381 2415648 2482039 2499122 2505926 2620094 2646248 2553840 2508648 2448283 2257602
9122 2257602 2078747 1981015 1888359 1904763 1847442 1804503 1762117 1748619 1861168 1801572 1755613
9111 1755613 1780253 1816187 1843158 1866088 1765422 1787969 1844163 1833926 1783079 1767783 1822075
9100 1822075 1894094 1938379 1928911 1932406 1980072 2068547 2095387 2081602 2008932 2032430 2101926 2023810
9088 2023810 2048009 2112562 2232315 2253529 2263372 2274203 2218723 2271610 2220651 2108528 2091337
9077 2091337 2085036 2098845 2087973 2062180 2048279 2080036 2082343 2138898 2182818 2240632 2345926 2413399
9065 2413399 2432386 2438908 2490841 2435302 2456435 2486944 2530874 2484759 2328892 2280911 2234901
9054 2234901 2262374 2333753 2413112 2402603 2371078 2472053 2626960 2729856 2883363 3038101
9044 3038101 3210549 3264215 3248446 3261438 3224819 3227601 3173177 3103037 2986386 2982069 2972115 2935470
9032 2935470 2927990 2987718 3111067 3188463 3278977 3366380 3428788 3467538 3553013 3590138 3560833
9021 3560833 3552433 3486562 3398061 3318703 3341896 3281108 3305447 3367191 3270126 3381190 3460424
9010 3460424 3442405 3529955 3605281 3677544 3721178 3817749 3901592 3953119 4013884 4101443 4237225
8999 4237225 4323998 4317581 4453729 4437707 4378851 4459289 4510725 4593560 4715984 4936652 5152240
8988 5152240 5231079 5284818 5353359 5389529 5488175 5465011 5446311 5484070 5503694 5566936 5624013
8977 5624013 5719553 5718862 5737837 5743629 5794788 5861361 5917122 5974339 6148470 6283973 6392082
8966 6392082 6506374 6689571 6931793 7185035 7471738 7776607 8108423 8398476 8736238 8974881
8956 8974881 9208727 9456248 9693711 10065493 10480080 10851954 11132637 11499848 11924116 12385991
8946 12385991 12810605 13275111 13612795 14072462 14720155 15357605 16115203 16964933 17830478
8937 17830478 18853695 20070955 21520183 23350103 25525933 28204193 31635849 36806487
8929 36806487 45667282 61442736 84209775 110196707 132276013 142570095 135364782
8922 135364782 118792755 100612324 82614904 67347500 55467800 46903913 40773918
8915 40773918 36585942 33915178 32609130 32434783 33485541 35958499 40780199 48766306
8907 48766306 59943161 72820508 84651171 91573918 91527399 85314308 74846722 63197360
8899 63197360 53417215 46027127 40738591 37029486 34640378 33443249 33399886 34193615 36024093
8890 36024093 39243684 44757904 53889993 67091471 83538039 100408712 113115348 117544746
8882 117544746 113256961 101683457 86177887 71841516 60648829 52630033 47080182
8875 47080182 43584782 41674336 41227391 42034796 44309109 48402434 55559758 66748549
8867 66748549 81972364 99418346 115575244 125818153 127365501 121745855 112231841 103970958
8859 103970958 101097817 104028300 110108324 115269050 115698615 110299865 100366500 88531890
8851 88531890 78361390 72096250 70902068 75227126 84436375 96286297 107118355 112532225
8843 112532225 110072203 101125361 88163762 74595742 63438523 55629982 51041407 48610238
8835 48610238 47286112 45878282 43509663 40222364 36837017 34046255 32225732 31414958
8827 31414958 31501894 32233545 33260274 34350258 35366615 36200676 37077989 38127936 39830246
8818 39830246 43329105 49695087 59777317 73277533 88029829 100539391 107050498 105861334
8810 105861334 98243934 87007166 75951536 68024425 64791671 66961566 74303367 85446463
8802 85446463 97255724 105356937 106491100 100629380 90141827 78053916 67399929 59276201
8794 59276201 52922045 47405754 42399938 37707225 33513154 29720607 26483555 23813354
8786 23813354 21697446 20278619 19534310 19421384 19768842 20384787 21017372 21678503 22485539
8777 22485539 23406516 24244674 24377431 23494633 21393825 18825353 16287300 14023173 12125763
8768 12125763 10699755 9627155 8798873 8143834 7573382 7139270 6882403 6552905 6293522
8759 6293522 6054194 5918607 5809626 5667254 5480946 5345022 5351198 5260564 5107322 4955543
8749 4955543 4958454 4877575 4772979 4695864 4581665 4501372 4397103 4307999 4258579 4248564 4234035
8738 4234035 4207917 4110088 4128109 4120032 4090424 4115373 4144417 4234497 4266287 4253012 4205155 4246636
8726 4246636 4269150 4198243 4138665 4142785 4084948 3986506 3960208 3953605 4046068 4153748 4078297 4113283
8714 4113283 4214680 4222863 4288764 4334499 4358890 4455287 4466024 4519641 4626823 4658794 4690615
8703 4690615 4764816 4699565 4672387 4771070 4919559 5054613 5188197 5322729 5608400 5763748
8693 5763748 5974221 6191775 6466123 6604320 6760203 6962971 7151746 7397688 7772296 8143282
8683 8143282 8647890 9127413 9631657 10290633 11090094 12067850 13270534 14485115 15840007
8674 15840007 17674017 20366055 24628242 31333223 40381989 50633462 59281008 63507057
8666 63507057 61636431 55046301 47251150 40656790 36385855 34629093 35679207 39778637
8658 39778637 46295921 53170933 57754050 57729108 52562162 44668126 36867498 30510051
8650 30510051 25911653 22573640 20229445 18536537 17374408 16592674 16105917 15849988 15932866
8641 15932866 16260512 16884195 17786020 18934648 20342141 21913320 23708761 25968185 28973684
8632 28973684 33633278 40686699 50729288 63495258 77549812 90064312 98070091 99641788
8624 99641788 94906173 85510547 74856589 66512412 62416348 63256328 68756124 77493318
8616 77493318 86930714 93541758 94594810 89616327 79673357 67103178 54771120 44656197
8608 44656197 37297612 32213225 28855302 26551788 24706643 22881171 20814421 18842106
8600 18842106 17344460 16264251 15670939 15301576 15297542 15656105 16044243 16550033 17366595
8591 17366595 18734888 21039279 24927731 30847041 38336055 45494066 50200787 50664537
8583 50664537 46837184 41061568 35734572 32087568 30544963 31262079 34571270 40044886
8575 40044886 46306722 51332579 52779406 49731010 43152979 35576299 29067396 24209112
8567 24209112 20914897 19020190 18031096 17466689 16889760 16026491 14707143 13027125 11310153
8558 11310153 9907600 8871120 8055185 7420006 6833717 6334972 5809350 5340226 4890631
8549 4890631 4581408 4357337 4152164 4006515 3871550 3789049 3805037 3806456 3824538 3899988 4049597
8538 4049597 4201757 4508294 5037596 5735499 6367573 6827864 6913221 6579611 5857833 5117180
8528 5117180 4564976 4163657 3979864 4163801 4604946 5161217 5524389 5498746 5116848 4456852
8518 4456852 3705941 3070616 2693193 2376157 2147177 1972650 1771705 1542774 1465336 1385217
8508 1385217 1217603 1093433 1007764 968567 973910 954185 833927 816981 780264 746624 713121
8497 713121 737346 863914 1016089 1000116 981200 966737 974730 951596 973373 940898 879560
8486 879560 844655 716511 673459 581033 565940 526098 548977 647550 690793 630044 571493
8475 571493 499103 533801 490161 393342 328613 298644 322874 248682 224286 169452 186827 266031
8463 266031 199946 160113 114261 123115 149889 143962 160203 109853 108522 155131 215305 219044
8451 219044 252071 322799 468109 587792 674882 722892 698739 633718 475732 400921 285121
8440 285121 220758 157884 170501 235852 259328 247142 264969 270342 212179 220673 148095 84023
8428 84023 12987 -28547 -89356 -84907 -88823 -104360 -147752 -164987 -179983 -192583 -210957 -194431
8416 -194431 -146725 -192656 -210353 -174227 -185689 -187838 -149845 -147409 -198304 -149899 -143123 -200139
8404 -200139 -121875 -167110 -152548 -117441 -129344 -265550 -358616 -271300 -198206 -234235 -201226
8393 -201226 -206306 -217333 -238907 -204489 -177554 -189012 -248582 -171775 -156325 -217095 -249536 -269592
8381 -269592 -306307 -285004 -267826 -246319 -190336 -172117 -223959 -246410 -265651 -308966 -385530 -423448
8369 -423448 -371202 -291581 -285729 -249017 -291759 -265502 -222022 -322066 -303961 -339024 -339088 -294135
8357 -294135 -215282 -253173 -263687 -309150 -275548 -318658 -313707 -304324 -343380 -346962 -352042 -318984
8345 -318984 -271470 -275436 -308254 -351150 -298771 -313285 -288405 -296067 -305908 -306425 -308809 -265986 -289772
8332 -289772 -318721 -301688 -315864 -291160 -346450 -306092 -314116 -318423 -274997 -255545 -225280 -243130
8320 -243130 -218011 -213609 -288890 -306335 -318909 -359809 -236315 -256514 -290205 -284216 -220750 -230548
8308 -230548 -215958 -204730 -210369 -139503 -157774 -206028 -168739 -75271 -66977 -33908 -8307 -57133
8296 -57133 -92831 -138851 -120351 -132296 -108418 -110566 -89720 2392 10204 6204 -22660 -60535
8284 -60535 -66037 -136674 -127684 -103337 -142234 -151350 -149751 -180373 -209848 -227746 -163573 -137979 -65905
8271 -65905 -41920 -94337 -114133 -119790 -142164 -133787 -84772 -64013 -31815 35051 30257 119677
8259 119677 241251 251790 284767 286644 215607 136224 173527 219608 209997 158121 182819 251959
8247 251959 239678 250772 231932 203706 112146 67537 62581 -55087 -122902 -145775 -109282 -130871
8235 -130871 -195151 -226582 -199332 -162567 -133143 -169257 -107743 -156057 -149542 -140981 -172762 -161134
8223 -161134 -118166 -189427 -131038 -142098 -99124 -16561 63576 49241 -29374 -53727 -101584 -75392
8211 -75392 -40324 7969 -72736 -62996 -92191 -45080 -32313 7561 27714 -66367 -67055 -106025
8199 -106025 -170964 -199927 -178133 -152742 -221174 -260914 -153474 504089 308207 -44993 17125
8188 17125 -24270 -112535 -149644 -166430 -214682 -219708 -213205 -171632 -237204 -212569 -190242 -169462
8176 -169462 -134215 -122869 -118938 -84433 -83859 -121824 -104513 -61992 -73713 -107126 -142776 -90691
8164 -90691 -84518 -140873 -166470 -166660 -194047 -151535 -170398 -120774 -156563 -144966 -123533 -138883
8152 -138883 -228962 -212711 -151113 -207644 -227029 -166606 -146080 -183074 -209729 -217162 -175808 -175489
8140 -175489 -187319 -146231 -167784 -185626 -202816 -152214 -112398 -162585 -190947 -223183 -221953 -264154
8128 -264154 -190741 -207001 -263125 -164913 -131537 -96407 -129478 -151243 -152401 -234499 -179729 -269483
8116 -269483 -253983 -155963 -203358 -184725 -137890 -182643 -219805 -211742 -148554 -105311 -155539 -129535
8104 -129535 -157796 -150144 -188193 -146848 -195465 -189562 -150819 -242562 -220281 -209301 -170469 -166116
8092 -166116 -172201 -143512 -162183 -193039 -191820 -128869 -105925 -183307 -146095 -130402 -139759 -165782
8080 -165782 -106055 -131142 -141931 -184088 -169909 -177403 -226432 -153519 -146956 -207429 -188676 -218196
8068 -218196 -227444 -188769 -141833 -160527 -208227 -183745 -220002 -189032 -182377 -183291 -197817 -211519
8056 -211519 -228922 -252353 -191636 -185728 -217971 -198308 -128558 -176408 -263450 -224982 -179350 -182771
8044 -182771 -190702 -95218 -131236 -170233 -107378 -77477 -90925 -112328 -122149 -140560 -233819 -201067
8032 -201067 -209784 -234166 -230238 -224922 -222446 -203613 -144623 -165856 -135035 -132250 -166631 -89433 -67610
8019 -67610 -71395 -73077 -126134 -104727 -107171 -81520 -100042 -102227 -104365 -127217 -145121 -158690 -171925
8006 -171925 -116832 -93491 -133077 -137037 -169413 -204256 -136115 -134230 -124692 -136147 -176233 -149715
7994 -149715 -135631 -152596 -123963 -95335 -90958 -128240 -215037 -194979 -210259 -182736 -195500 -152038
7982 -152038 -110702 -187346 -171235 -209886 -124681 -72372 -64452 -114845 -162127 -160778 -195774 -142950
7970 -142950 -159275 -96439 -146833 -140765 -163452 -222607 -211637 -216300 -154510 -108705 -212771 -140991
7958 -140991 -14304 -30834 -68464 -82431 -118358 -117110 -121219 -93630 -115900 -113695 -134251 -121875
7946 -121875 -147098 -150765 -109553 -121445 -122310 -122783 -74813 -100788 -127853 -114685 -75684 -70306 -57906
7933 -57906 -15838 -1127 -64472 -130352 -72735 -74317 -112773 -86874 -101289 -92414 -119353 -61789
7921 -61789 -87598 -88491 -139948 -70895 -10104 -58008 -36478 -50008 -102274 -144146 -115511 -69345
7909 -69345 13451 -1419 -4333 -26596 -35968 -59397 -109798 -91286 -63479 -95640 -158744 -164074
7897 -164074 -147153 -95467 -152522 -124065 -39543 -133733 -122146 -48883 -62537 -102669 -180202 -113487
7885 -113487 -146883 -175334 -110361 -34909 -41810 -2331 -96672 -108424 -81230 -50421 -33901 -64818
7873 -64818 -73675 -3119 9936 -74907 -14871 8595 -1719 30047 23594 -26289 -56874 6945
7861 6945 82752 -28102 -107990 -173152 -144551 -83026 -61507 -108865 -73803 -115141 -116368 -20921
7849 -20921 23996 36972 3443 -24325 -8657 -17197 -41493 -27663 -22983 -25341 -22797 -33067 -122255
7836 -122255 -96850 -57897 -60074 -36620 -102527 -100879 25753 20217 -45342 -66742 -115909 -140846
7824 -140846 -68021 19548 -2344 7231 -46307 -32777 -46886 -50063 -87879 -67481 -120739 -115418
7812 -115418 -74601 -56824 30295 -6798 -56024 -23224 -35973 -8329 -30377 -55547 -47371 -79500
7800 -79500 -28791 -39635 -29369 29064 1338 -99362 -135361 -79284 -82120 -110287 -99822 -88975
7788 -88975 -8523 -40275 -59228 -70037 -34241 -98550 -74646 -47443 -54950 -48491 -75026 -64290
7776 -64290 -72018 -50207 -89273 -90907 -42369 -46102 -9399 -96295 -107403 -69547 -175991 -169949
7764 -169949 -160890 -83788 -12576 -89279 -87148 -41618 -35692 -35518 -36758 -50156 -63925 -82354 -106926
7751 -106926 -102507 -44764 -31971 -49920 -45042 -93003 -80844 -51676 -86699 -52359 -13413 12032
7739 12032 12136 -80614 -81751 -15057 13010 28932 27036 -7945 -38019 8969 -16206 6901 35413
7726 35413 -16293 -1882 6667 14577 -23077 -59699 -149151 -65418 -25701 -41497 -13154 3614
7714 3614 -51360 -77428 -81944 -76523 -21411 6035 5756 20996 -17286 -31512 1814 -7812 57298
7701 57298 86708 62462 32269 28810 45434 58205 32172 6933 36318 21717 16224 3164
7689 3164 -10034 -21917 -52408 -57266 12936 7905 6711 -234 -24339 -25008 -41269 -11408 -69513
7676 -69513 -8079 -53670 -37027 -92882 -36706 82163 19438 -68266 19588 -26687 -41537 16120
7664 16120 19800 6477 -58636 -54827 17887 98074 29378 -48306 -3873 69016 7808 90738
7652 90738 62504 -17237 -38638 21212 6480 -53529 -15455 -37604 -47908 22568 -538 -27458
7640 -27458 -7022 -29948 -102856 -78506 -29462 -36961 -20903 -3795 21239 28199 48734 58834
7628 58834 -84909 -93256 2641 18552 -44218 -6021 38850 53611 -2619 -11940 69123 23347
7616 23347 52968 110835 173584 63287 35400 14296 -3775 -49801 -10801 -10611 -16618 78486
7604 78486 48215 78231 118648 20240 5298 -2871 39084 101217 133566 84747 51225 12744
7592 12744 56208 74564 47725 81098 108594 51017 47165 110069 78776 9578 16773 36964
7580 36964 911 41617 36370 -8095 -36827 41620 56747 40870 56722 15571 4020 61096
7568 61096 1166 82645 42654 14806 10299 -27657 26623 32778 -23515 28923 45877 45889 58767
7555 58767 5968 -59188 -6499 4027 33759 56990 30253 -2040 54845 75404 20421 65397
7543 65397 81511 29568 51555 89564 41998 80374 44682 49758 47387 20710 -59762 30503
7531 30503 48887 20554 80937 9289 -40565 25683 45147 86883 85599 87774 77461 33391
7519 33391 -40958 -8638 101819 80147 33488 37425 73008 82130 113871 64184 71382 73142
7507 73142 77235 72060 74285 42243 17674 43734 45620 71322 104953 103233 117880 100610 6279
7494 6279 -32717 23891 10474 60191 135039 137970 111595 103512 74578 65270 72894 48592 76446
7481 76446 99778 143561 179288 159615 133885 108255 118989 108227 49510 89528 128910 107106
7469 107106 121011 119852 119187 147974 157759 114989 131895 158532 170926 135483 69776 104876
7457 104876 47393 32014 50994 74052 153107 125491 76058 115337 149064 159700 60828 31774
7445 31774 21227 52149 105924 76638 101878 114644 141126 195467 119672 128867 161415 166248
7433 166248 209914 142906 114243 120750 116501 68237 87441 108543 46091 124721 193372 204700
7421 204700 197905 202648 190739 187545 147510 104062 102136 94531 140650 161400 151086 135957 98924
7408 98924 94208 70833 79480 81812 98222 135018 112973 179577 199658 215366 192006 132984
7396 132984 130344 109416 56417 7321 35726 69744 102332 156754 111225 71890 38743 -1695
7384 -1695 62056 127041 144905 103614 116451 149301 150397 139940 136627 139212 139375 145438 224980
7371 224980 188011 197727 203720 153304 79215 90420 121749 182420 278119 236876 187715 152750
7359 152750 122641 70235 19417 61562 77997 151653 191113 215733 204725 151469 178873 139508
7347 139508 162038 161330 185413 147190 176682 187273 210935 223758 189225 217366 191901 133604
7335 133604 157159 169028 201548 178678 198403 222463 178683 190287 185563 139675 173412 116447
7323 116447 150343 198159 157012 137668 115220 124803 169310 206767 275564 236681 196254 255059
7311 255059 222097 185237 244504 260819 205381 178885 234985 229964 277064 302339 306185 320640
7299 320640 320909 279628 205811 199906 200227 280060 315470 252299 185296 243886 267921 284043 253980
7286 253980 199223 202859 162531 180983 208986 232342 249782 257489 199009 152295 116707 101062
7274 101062 195206 306871 302868 241062 144493 171446 154142 165502 164701 161880 168816 130895
7262 130895 81534 135249 223022 185754 181836 99982 122120 160345 207861 177231 239544 243421
7250 243421 215700 199366 205067 201815 252984 288369 292470 234474 190164 117757 144285 176244
7238 176244 151940 232462 263552 212931 251856 222777 166195 162148 234801 302398 332007 316211
7226 316211 289697 245259 158709 127930 163299 240053 260283 289569 247707 219311 268906 242473
7214 242473 261180 196646 287902 272799 213557 226448 244434 215128 193442 271907 274806 240608
7202 240608 260055 317603 267094 206360 232252 289460 244033 195960 216657 317347 275319
7191 275319 179080 150197 280507 225680 258628 264658 299252 319809 330937 378531 308232 306282
7179 306282 298427 301160 289893 337348 344367 289730 310022 370613 345218 320614 345389 346014 241195
7166 241195 270582 281387 295755 396768 385752 363391 332292 320258 265895 335896 319654
7155 319654 218084 228316 224052 249945 329613 282629 257793 281403 237214 194498 263719 293603
7143 293603 304442 246608 276659 310250 278464 246473 266806 299633 264808 291598 256232 265974
7131 265974 233653 150975 197671 280632 290639 219015 194836 185181 228205 218244 246226 264070
7119 264070 174796 159803 163314 191670 211923 236305 246358 154300 170152 190200 155376 233029
7107 233029 252242 215185 259020 238436 281811 274409 238409 281951 220741 197116 224842 281440
7095 281440 246705 315044 212347 181511 223393 229486 257472 283988 281588 225473 228151 214353
7083 214353 250987 255771 275905 228068 224049 276148 298076 285648 297627 305901 366416 361142
7071 361142 370649 347675 255602 259701 264041 318247 319842 295551 274447 256240 286991 269435
7059 269435 233127 293361 319035 327194 312403 254676 226301 250878 260289 339698 344654 352018
7047 352018 373504 271572 254564 312667 252682 227836 236391 236046 302969 288756 262397 264245
7035 264245 240205 288173 316595 331215 349139 316183 300242 235536 166677 182833 264472 319387
7023 319387 277355 332294 367815 295878 245449 214660 282357 332505 327164 286414 253054 318650
7011 318650 318160 312769 287997 259265 313754 353612 333876 314306 286037 235129 313019 271261
6999 271261 273124 324783 307245 332133 285007 365414 357500 386232 439375 386058 308078 306736
6987 306736 294615 267409 290202 285035 314252 360002 332706 298006 305366 392243 354958 359086
6975 359086 361026 340579 315293 259393 345323 373478 432606 388674 313449 303855 255386 358115
6963 358115 375773 310907 396354 433458 335414 297758 366715 349539 282938 315482 286660 340091
6951 340091 376874 333618 316645 275322 310973 358848 386930 390949 449026 417494 382093 369425
6939 369425 361230 379950 335545 314077 333267 260642 294226 324781 367083 401212 410144 392785
6927 392785 353122 350817 397769 421723 400094 370637 360112 303847 308468 305864 300657 296308 310867
6914 310867 281855 403519 368421 370590 334767 366376 395191 458877 453728 375692 385576 379191
6902 379191 360593 364524 373988 339206 343711 302900 353991 328987 327657 355159 387318 416111
6890 416111 387514 377894 400891 442336 397872 366791 421501 436873 470213 435397 360080 334924
6878 334924 376312 394643 413724 451310 433011 407757 396250 392298 353155 395890 457375 418625
6866 418625 407382 410898 420251 400919 386085 352828 394550 407928 399565 401338 461870 370533
6854 370533 302575 375819 410155 394795 416672 371029 424135 433433 414698 419378 414598 375532
6842 375532 412774 412747 431476 390554 423126 392206 364013 321528 387170 441370 430214 475832
6830 475832 435078 456155 483270 468468 486842 448431 420178 459212 482265 441891 402199 465141
6818 465141 478068 486574 432508 462628 491939 456938 486997 503056 506576 431761 428464 450695
6806 450695 490683 497511 456259 460063 438940 470448 506569 517944 458755 445947 455120 469094
6794 469094 404434 326691 361671 446941 442207 457570 469343 462392 494619 547671 591024 545597
6782 545597 492377 498039 525885 461077 448092 506845 435683 425432 411223 422793 426129 463434
6770 463434 443610 474133 505964 520128 497121 493901 519407 504357 488634 497546 450913 445775
6758 445775 436447 489647 446095 431619 471645 468413 499950 527149 521024 538215 497209 475838
6746 475838 467719 516889 510726 490403 483222 441928 483723 467061 503141 460792 474349 540130
6734 540130 537587 498445 439783 476653 547102 556317 546255 497342 481854 449518 409651 503483
6722 503483 548318 525629 484904 522804 480036 506210 541087 536078 611311 545891 589677 610420
6710 610420 656501 648028 653841 650624 617854 565315 564116 613620 634310 610664 644080 594001
6698 594001 584343 605501 599519 581759 570795 566595 540052 575483 594350 625801 640277 713126
6686 713126 697147 678996 670834 596230 571196 520942 581421 607566 627696 638266 566783 580827
6674 580827 606821 629494 681934 626218 631892 611438 695978 730525 678727 669077 652359 634492
6662 634492 648278 692314 628322 663277 692875 718394 714789 710083 742173 717205 681230 711160
6650 711160 638532 600916 613398 695266 743824 721798 691354 707861 682009 641892 686506 715982
6638 715982 716747 760151 768253 784593 742346 799187 795939 786463 765682 755386 891694 917402
6626 917402 918449 941910 989779 979796 891061 931812 960018 894844 897954 878807 918328 906653
6614 906653 921273 925611 991384 1012075 1012588 1077637 1096888 1058648 1093625 974877 889125 904405
6602 904405 932441 880177 856580 851352 832098 826778 865427 802231 842532 883904 944345 985766
6590 985766 1048982 1107556 1121466 1260014 1260418 1244859 1234972 1301670 1266482 1202304 1145892 1151050
6578 1151050 1024752 1045353 1068896 1078894 1167963 1223059 1230939 1224582 1239531 1267537 1209192 1141861
6566 1141861 1070941 978031 979498 1022679 1063038 1044013 1107170 1093311 1111738 1195654 1220706 1295268
6554 1295268 1394901 1390709 1454944 1456428 1376736 1331137 1311223 1283751 1173492 1125683 1175778 1228622
6542 1228622 1286394 1438992 1454334 1429582 1462463 1425825 1360156 1283936 1269304 1178536 1105950
6531 1105950 1105258 1058904 1070515 1058419 1124615 1116451 1183682 1215091 1192505 1191187 1236600 1285531
6519 1285531 1279387 1269488 1267447 1382991 1567659 1637782 1664712 1652458 1595000 1543779 1488747 1373554
6507 1373554 1318138 1318541 1353179 1376298 1421194 1603436 1691910 1690905 1731764 1700013 1628197 1543989
6495 1543989 1431622 1357374 1297622 1285614 1215633 1235496 1218023 1183623 1122202 1153466 1148548
6484 1148548 1140484 1196240 1211121 1170001 1220462 1222988 1165795 1268959 1315345 1290908 1302549 1272194
6472 1272194 1200215 1214543 1241458 1209697 1186319 1226742 1227980 1307396 1314564 1337948 1408994 1360864
6460 1360864 1255268 1288410 1374152 1419986 1432330 1406958 1442834 1430875 1411218 1396273 1401425
6449 1401425 1429997 1394116 1441259 1482369 1497318 1570112 1529077 1573417 1579973 1598330 1579486 1574208
6437 1574208 1565539 1554773 1565725 1581471 1623895 1642883 1644842 1612488 1627981 1730882 1760808 1761067
6425 1761067 1764394 1741123 1772926 1763686 1787774 1822070 1854116 1875211 1878498 1819250 1795866 1833910
6413 1833910 1886244 1899962 1892858 1903701 1840410 1877969 1943546 1955249 2010588 2015272 2059935 2120158
6401 2120158 2132612 2190191 2236653 2241144 2217577 2244303 2274433 2378588 2460216 2491394 2589697
6390 2589697 2707605 2747415 2823140 2939502 3087808 3067122 3012711 2961740 2884778 2934501 2924502
6379 2924502 2930636 2934679 2950267 2977575 3067755 3152611 3139912 3112109 3168208 3251988 3341377 3503606
6367 3503606 3610051 3670932 3826802 3940286 4015750 4023173 4017365 3999021 3928161 3902846 3915473
6356 3915473 3919903 4012458 4112968 4189990 4254126 4364997 4402600 4548879 4638333 4770837 4928515
6345 4928515 5076149 5164067 5296371 5624328 5828706 6004839 6230377 6497709 6785473 7071067
6335 7071067 7413081 7693524 8101156 8552049 9072876 9721983 10356009 11286955 12313335
6326 12313335 13461435 14848736 16445091 18237081 20594147 24047480 29071350 36324534
6318 36324534 45633263 55706047 64087474 68093151 66866569 61057595 53355413 45976434
6310 45976434 40215045 36378957 34319157 34068656 36233182 41168202 48735731 57709459
6302 57709459 65534842 69514543 67894618 61231968 51797228 42281903 34359323 28258856
6294 28258856 23618371 20122223 17383719 15177870 13524031 12213102 11156101 10514615
6286 10514615 10021124 9683343 9530362 9443496 9404342 9405637 9264425 9286557 9243359 9139015
6276 9139015 9084405 9154293 9256716 9415494 9653289 9861250 10109422 10468022 10804706 11135520
6266 11135520 11519323 11985492 12449678 12989738 13628281 14417730 15374929 16416333 17629721
6257 17629721 19035009 20660783 22479830 24632695 27200612 30193068 33981691 39308400
6249 39308400 47382136 59232106 75010234 92951725 109217053 119268333 119972157 112042342
6241 112042342 99029284 85308916 73771934 65529339 60652503 58969070 61112411 67828855
6233 67828855 79141456 93637924 107650591 116499682 116701594 107946046 93109988 76600377
6225 76600377 61723150 49634730 40309973 33227863 27600682 23158836 19641855 16830848
6217 16830848 14697861 13140178 11890487 10906862 10159320 9488614 8963889 8528074 8210547
6208 8210547 7873566 7463101 7214534 6911603 6654992 6434181 6230208 6116340 5985340 5852953
6198 5852953 5607258 5435328 5287823 5114298 5039259 5014794 4874006 4733085 4691125 4668585
6188 4668585 4646358 4651294 4675340 4585434 4450412 4414765 4250569 4146225 4061583 3904657 3854753
6177 3854753 3854944 3800430 3727251 3661055 3583849 3591654 3550328 3519078 3483459 3441893 3433788 3415988
6165 3415988 3377073 3281186 3320824 3298683 3299468 3260370 3283634 3292737 3290420 3234609 3271392 3349088
6153 3349088 3385629 3379530 3295990 3296177 3336224 3379241 3347669 3344380 3293668 3356342 3346277 3455050
6141 3455050 3475594 3499448 3582717 3602451 3691219 3745666 3739037 3803891 3771108 3894110 4038384
6130 4038384 4110433 4180094 4254634 4319311 4328147 4406719 4402326 4407647 4409486 4427925 4531255 4614192
6118 4614192 4733464 4838434 4948294 5079734 5259992 5353638 5508003 5655024 5757818 6024887
6108 6024887 6235940 6435411 6707177 7015440 7335020 7650550 8050135 8331245 8655521 9091327
6098 9091327 9540794 10016166 10538682 11148454 11807828 12616714 13505319 14502918 15661691
6089 15661691 17106229 18855471 20982752 23482858 26390352 30006375 34904403 42000409
6081 42000409 52601864 67273507 84748968 101380241 112445847 113987944 105903043
6074 105903043 91715636 76286330 62889620 52443971 44718791 39162917 35253408
6067 35253408 32692116 31150463 30639111 31043485 32209407 34419072 37861774 43339186
6059 43339186 52265586 65571515 82724217 100664607 114182140 118536032 112274954 98014244
6051 98014244 80892207 65055889 52343507 42628398 35290524 29619114 25169675 21542071
6043 21542071 18626331 16363661 14577465 13274182 12392901 11669125 11058890 10579585 10206736
6034 10206736 9980289 9741278 9584588 9539293 9503668 9466308 9530688 9636028 9820505 10057378
6024 10057378 10366547 10716670 11111250 11499053 11863591 12171076 12674383 13244318 14078311
6015 14078311 15086376 16248395 17873687 19931221 23026008 27908803 35254503 44906375
6007 44906375 55060891 62979329 65940628 62931251 55390323 46329688 38227992 31843637
5999 31843637 27087476 23638761 21140793 19468592 18380698 17894149 17843139 18278612 19190804
5990 19190804 20700126 23259252 27428657 34072452 43349158 53942073 63119243 67688246
5982 67688246 65956555 58808084 48984159 39351697 31454347 25248207 20586248 17047330
5974 17047330 14215682 11983083 10241330 8843343 7816395 6997144 6374987 5852816 5427956
5965 5427956 5164141 4887793 4655273 4392177 4142600 3917972 3754954 3630245 3474565 3347847
5955 3347847 3253272 3214103 3144814 3111619 3032204 3009257 3003406 2884736 2822447 2738560 2750209
5944 2750209 2714092 2593300 2609264 2546450 2446053 2423020 2423657 2409638 2464806 2553018 2576389
5933 2576389 2630144 2628449 2583294 2521224 2462797 2364305 2282785 2208384 2167915 2165102 2171404 2100788
5921 2100788 2013734 2096497 2067805 2052332 2064938 1890914 1802866 1727193 1699222 1654094 1519342
5910 1519342 1470105 1462128 1363039 1333077 1318171 1238958 1216326 1221800 1223553 1191822 1126380 1152405
5898 1152405 1135678 1107070 987546 987866 996001 1081078 1047532 1043525 1040233 994761 999781 967076
5886 967076 950765 909480 975539 890271 888229 983907 961815 965754 1018074 1053439 1021056 951995
5874 951995 877032 924375 890991 902029 848102 877893 821105 803684 829091 788085 861144 840667
5862 840667 865661 803451 737314 716890 704318 659713 562534 557675 593339 587240 648978 600548
5850 600548 585578 609020 639711 702508 725064 718084 698273 631243 535836 490276 581972 630353
5838 630353 630454 606855 631291 595679 534016 562298 545729 530698 535610 521370 536970 568571
5826 568571 557873 590698 609600 596927 571099 528508 523475 566937 590265 567684 530139 476544
5814 476544 525359 563735 550634 533030 548113 504420 459769 497137 547454 523118 493083 514565
5802 514565 555570 563781 581961 541825 564652 577397 586089 572592 580497 596011 625120 585462
5790 585462 539396 639800 659705 564847 596593 624124 581189 596514 567699 565500 726751
5779 726751 771641 762545 702084 706154 747607 771873 815583 784392 807081 822634 936058 1007549
5767 1007549 1043328 1068484 1130617 1181951 1112026 1073856 1058281 988751 962972 932165 954452
5756 954452 948365 962223 1006800 1008803 937550 911161 917504 922601 905720 972438 1015034 1101015
5744 1101015 1211752 1246386 1255562 1261353 1153428 1125009 1067349 977745 910951 859860 874348
5733 874348 892784 927985 857857 824908 773456 808531 810828 818223 788793 827087 852068 849453
5721 849453 808169 726797 724044 721668 701329 744360 765942 811576 816708 778629 824153 809477
5709 809477 802654 752632 791726 765059 795205 831000 836376 848722 907503 895292 888151 915108
5697 915108 925624 934624 962975 1073752 1093806 1092321 1114247 1076918 1009088 1045487 1032608 1039928
5685 1039928 1106668 997560 921858 936031 949096 898182 922176 945806 989795 993549 1010544
5674 1010544 1105005 1183334 1302909 1386750 1367760 1392625 1302942 1293473 1260853 1212113 1186419
5663 1186419 1153474 1168104 1123960 1163622 1177834 1250807 1209702 1264291 1260438 1237007 1163094 1182260
5651 1182260 1262538 1241613 1232548 1206973 1167517 1195336 1175982 1133016 1153362 1173372 1178661 1164761
5639 1164761 1146805 1141156 1147868 1139812 1151245 1136853 1126731 1073155 1029389 1097316 1075966 1038401
5627 1038401 1012657 978324 926008 957004 957412 896018 906743 973100 1014266 1038656 1034820 983044
5615 983044 977127 983521 967830 915933 865864 884123 853821 818889 892333 903395 890436 905858
5603 905858 945764 919899 887045 913502 918157 963748 955548 940089 905974 964518 959032 896781
5591 896781 909050 995356 970658 871670 949536 957173 883347 819819 827027 914809 893566 901698
5579 901698 920460 949438 943669 966989 977455 974933 1068188 1027612 1005122 1030925 1009470 948225
5567 948225 989212 1093704 1103952 1088332 1107990 1056927 1119816 1177649 1110058 997900 971649
5556 971649 1022296 1087554 1088980 1062440 1040595 1095903 1075939 1068645 1148273 1155788 1154353 1174429
5544 1174429 1157483 1164292 1122686 1104869 1027608 1082683 1097363 1092589 1070990 1123892 1128011 1115245
5532 1115245 1180117 1242823 1216404 1132130 1130651 1109019 1097802 1140150 1112710 1119731 1144471 1120201
5520 1120201 1146683 1179169 1122260 1109628 1184914 1176607 1255518 1221968 1210167 1117132 1128636 1208377
5508 1208377 1255266 1241895 1231775 1247168 1308253 1323498 1317776 1259139 1222829 1267162 1245586 1234951
5496 1234951 1189578 1180806 1217389 1182286 1269624 1256490 1310874 1323683 1262903 1274885 1272722 1308321
5484 1308321 1219606 1242333 1267005 1332726 1379463 1334064 1350367 1389282 1438523 1397092 1412324
5473 1412324 1403630 1320264 1343234 1341939 1342488 1395386 1461955 1389193 1425634 1447410 1456590 1527993
5461 1527993 1473390 1392777 1333328 1455579 1542425 1522879 1448561 1461501 1471800 1480342 1514425
5450 1514425 1536411 1597772 1620399 1605156 1586389 1566275 1580771 1584561 1652211 1575198 1554371 1567390
5438 1567390 1604407 1679711 1678753 1646825 1721949 1783385 1763362 1786121 1780149 1740060 1762322 1768093
5426 1768093 1755983 1786070 1741767 1808146 1854602 1871929 1856579 1857306 1898396 1983836 1990321 2040095
5414 2040095 2042649 2041789 2044977 2017041 1991862 2028951 2069435 2102353 2143295 2125333 2125187 2240069
5402 2240069 2282003 2334206 2324367 2335544 2352930 2357455 2333621 2331084 2422408 2461138 2494336 2507699
5390 2507699 2574472 2500590 2606132 2642893 2664779 2719660 2699715 2676622 2744539 2828572 2775186
5379 2775186 2849059 2931706 2985699 2910875 2854874 2873344 2991652 3135018 3156303 3191394 3213578
5368 3213578 3184168 3191202 3220501 3226441 3254483 3307119 3402154 3375307 3376293 3463896 3471179 3487946
5356 3487946 3439806 3316664 3325501 3407616 3457941 3465220 3553848 3658410 3662321 3679210 3708294 3747486
5344 3747486 3648981 3711357 3772455 3778743 3737657 3794589 3851949 4015280 4125791 4130651 4198543
5333 4198543 4210549 4239711 4216941 4206946 4280278 4325446 4418174 4535901 4589299 4694647 4777078
5322 4777078 4861732 4945399 5061244 5124174 5288932 5369392 5419798 5556604 5726867 5840858
5312 5840858 5968363 6172954 6400640 6614679 6812030 6973296 7145496 7340889 7616656 7906676
5302 7906676 8268713 8633713 8947034 9348084 9841411 10409063 10927993 11632418 12511208 13424682
5292 13424682 14670115 16381603 18892125 22359255 26577981 30730710 33735317 34714267
5284 34714267 33541654 31535649 29901042 29179173 29382155 30653056 33375979 37937751
5276 37937751 44253332 51488316 58445871 63509383 66423538 67867967 68404528 68542329
5268 68542329 68524196 68053073 67582581 67871903 69166543 70896513 72130588 73241016 74881000
5259 74881000 76727596 78473295 81104270 84862743 88818347 91851407 93229927 92566137
5251 92566137 89903709 85821470 81821091 78909763 77137469 76142311 75119172 73248754
5243 73248754 70889479 68860106 66654420 64341124 62802424 62532712 62991279 63623998 64462065
5234 64462065 65208871 64588794 61241865 55528217 48451246 41156630 34973977 30252112
5226 30252112 26967135 25075454 24491837 25398552 27528363 29833607 31195746 30526132 27620747
5217 27620747 23509791 19669834 16633296 14330508 12380766 10817927 9666914 8821205
5209 8821205 8145074 7618625 7151351 6776718 6496423 6213668 6007281 5875403 5730460 5528253
5199 5528253 5391334 5205361 5138832 4996056 4871307 4780209 4669360 4537668 4410325 4309417
5189 4309417 4264508 4150743 4069651 4047301 4025840 3936675 3890892 3884799 3841522 3745044 3663088
5178 3663088 3714356 3605132 3580695 3552648 3458982 3498621 3435925 3311968 3236647 3275517 3239467
5167 3239467 3155622 3160474 3154093 3137540 3166433 3113359 3085517 3098853 3105776 3002628 3004804 2962522
5155 2962522 2939029 2888515 2950231 3017558 2973671 2999612 2951852 2974037 2985555 3025153 3069448
5144 3069448 3077942 3116173 3172847 3154261 3179175 3183463 3188408 3221072 3321172 3311840 3290017 3296701
5132 3296701 3292844 3393368 3398673 3411079 3412984 3472324 3471789 3434144 3409218 3392011 3497181 3556493
5120 3556493 3629441 3670405 3660783 3712065 3808255 3941891 3998218 4052513 4160477 4153489 4159384 4192185
5108 4192185 4145580 4166660 4155676 4074412 4113880 4008611 3963648 3870736 3849623 3789618 3710110
5097 3710110 3712007 3757647 3759912 3784863 3810672 3824656 3894634 3876050 3938839 3984788 4058784 4208954
5085 4208954 4303166 4311125 4367692 4463928 4552687 4632496 4685050 4832916 4871012 4933831 4876533
5074 4876533 4756199 4716358 4600570 4544184 4435661 4391001 4423909 4378102 4316718 4283632 4311563
5063 4311563 4362068 4386113 4430790 4470249 4382652 4300476 4311977 4323590 4326974 4351258 4444596 4419098
5051 4419098 4382682 4383315 4362076 4408476 4442276 4403367 4343258 4332519 4358825 4360794 4346278 4360839
5039 4360839 4387539 4352473 4349633 4290215 4327052 4374285 4386032 4370461 4388500 4415238 4411457 4410382
5027 4410382 4501443 4533378 4565408 4572404 4620799 4701330 4688556 4734513 4765950 4753332 4794820 4964509
5015 4964509 5007290 5021963 5069326 5087028 5118576 5194065 5248415 5267560 5268262 5315396 5313158 5317902
5003 5317902 5362816 5363448 5384797 5535218 5575239 5491464 5526390 5621416 5789704 5836771 6007833
4992 6007833 6071111 6084589 6210539 6307775 6400633 6461907 6575144 6732459 6917790 7029613
4982 7029613 7121400 7223323 7268936 7248769 7312871 7380188 7416042 7455809 7570068 7635738 7779520
4971 7779520 8011464 8146894 8296217 8469695 8555531 8657243 8834187 8997984 9062596 9121097
4961 9121097 9169989 9099318 9012512 8961058 8950722 9011704 9037555 9164433 9284962 9499096 9691308
4950 9691308 9916423 10081066 10266467 10403821 10491668 10642051 10727025 10813708 10897668 11077852
4940 11077852 11294848 11581829 11757115 11840339 11975902 12205596 12278325 12423361 12543954 12683891
4930 12683891 12895051 13034898 13276920 13486086 13802780 14121772 14382029 14740111 15083487
4921 15083487 15510512 15916228 16352172 16811121 17275581 17627615 17934932 18330809 18802054
4912 18802054 19227609 19731786 20290699 20821602 21375087 21997136 22617563 23341602 24175643
4903 24175643 25179213 26265916 27449983 28703536 30079652 31653669 33406254 35456203
4895 35456203 37816351 40666196 44268032 49517138 57938843 70996711 88329492 106691698
4887 106691698 120579726 124818094 117572827 103460685 89399833 78586485 71065469
4880 71065469 66198264 63480863 62498252 63063402 65014128 68676669 74846760 84790558
4872 84790558 99626713 119304621 141549093 163236501 181133664 193439140 200272839
4865 200272839 201137373 193123144 176104902 156074586 138978755 127042347 119896356 116762697
4857 116762697 117330004 120867021 126431274 133459642 141475932 150881845 163021248 179188373
4849 179188373 198183329 215571950 225407482 223103632 209065331 190172498 172732345
4842 172732345 158849070 148266462 140656058 135799529 133483274 133616277 135836894 140319907
4834 140319907 146589171 154165874 163094897 173378537 185380575 199402585 215680153
4827 215680153 233624705 252088965 269131344 282997600 292639872 297855365 298818192 295887366
4819 295887366 289104311 278792726 265422226 249750828 233236384 217570288 204302557
4812 204302557 194283797 187656138 184121592 182859154 182966350 183965543 185549079 187706148
4804 187706148 190855395 195678106 202985595 213481858 227303762 244124139 262686891
4797 262686891 281244384 297748222 310687221 319209322 323341350 323303012 319230680 310866063
4789 310866063 298070764 281366165 262494466 243535466 226170820 211213906 198595688
4782 198595688 188025695 179062765 171468911 164982365 159390655 154708348 150844518 147963210
4774 147963210 146294244 145829156 146200262 146998348 147813226 148372555 148677167 149003531 149201578
4765 149201578 148864939 147179863 143396528 137024805 128608448 119127732 109746020 101022296
4757 101022296 93276610 86452019 80243650 74497291 69189716 64115330 59251192 54703626
4749 54703626 50389292 46389594 42723677 39343580 36251618 33391028 30737541 28501643
4741 28501643 26517743 24863792 23378416 22158887 21051182 20132979 19317453 18505294 17851153
4732 17851153 17220671 16604329 16042450 15556722 15127779 14693693 14349850 14024334 13722702
4723 13722702 13432683 13217529 12921029 12617327 12321255 11989740 11685307 11350462 11038694
4714 11038694 10788320 10465952 10174474 9891904 9635996 9359851 9105390 8858342 8621855
4705 8621855 8421691 8231905 8073295 7923404 7714778 7510781 7384304 7251995 7137868 7004978
4695 7004978 6909371 6826525 6626268 6431024 6280697 6135096 5999113 5930530 5844786 5674746
4685 5674746 5551667 5421540 5279222 5173148 5139297 5073064 4940978 4900775 4819403 4704269
4675 4704269 4682508 4656144 4715628 4842733 4958359 4987183 4990914 5038688 4970738 4848720 4730766
4664 4730766 4622924 4534938 4569443 4652275 4762805 4800940 4804086 4803150 4768997 4728232 4548293
4653 4548293 4426209 4331360 4427137 4503107 4507763 4499877 4510461 4426055 4349562 4237588 4202365
4642 4202365 4247250 4265243 4398817 4569048 4648384 4689604 4817442 4916014 4928254 4906167 4936876
4631 4936876 4930262 5014693 5062399 5029485 5169878 5368879 5505337 5603787 5712024 5824077 6018619
4620 6018619 6286962 6547577 6678778 6884269 7056963 7241994 7483238 7780361 8203553 8513036
4610 8513036 8841148 9171871 9546613 10041362 10643544 11249416 11927198 12692195 13592008 14622143
4600 14622143 15668120 16892169 18298855 19867652 21808283 24129714 26945132 30506578
4592 30506578 35530021 43224678 55096917 71645415 90929061 108168864 117650977 116175689
4584 116175689 105436288 91288524 78821161 70569733 66917950 68228435 75476950 88283800
4576 88283800 103962529 117334422 122950951 118195720 105594609 91450591 81015519
4569 81015519 76623722 79143588 87900236 99840908 109782189 112653321 106089575 92910116
4561 92910116 78776397 67493318 60054572 56731007 58010253 64531250 75358301 87373151
4553 87373151 95916208 96483481 87891695 73440648 58548673 46223808 36832587 29706815
4545 29706815 24282080 20187569 17076920 14763137 13008281 11686864 10679072 9892346
4537 9892346 9386247 8950716 8567436 8247758 7928768 7643750 7434458 7202436 6908483 6597275
4527 6597275 6360618 6189034 5987763 5779797 5570918 5411244 5294690 5163006 5012264 4817666
4517 4817666 4641458 4559130 4365778 4213866 4192187 4151749 4107549 4081328 4129270 4136360 4054906
4506 4054906 4081311 4095730 3980242 3900253 3885265 3841127 3824950 3749777 3712308 3677400 3534306
4495 3534306 3463518 3418117 3338563 3269313 3152276 3110419 3105156 3064339 3048035 3088727 3132573
4484 3132573 3166632 3173245 3079537 2944966 2863624 2764771 2677484 2648689 2688690 2692545 2595185 2586078
4472 2586078 2559951 2491575 2505031 2598730 2685641 2799997 2813988 2777768 2781854 2719578 2573653
4461 2573653 2481901 2386242 2341360 2249136 2113604 2118058 2094647 2021583 1990907 1977191 2005145
4450 2005145 2130543 2197776 2278371 2386909 2520659 2591827 2607839 2528806 2546273 2680205 3011824
4439 3011824 3552267 4030885 4544366 4740681 4381847 3719518 3152026 2721560 2466764 2252979
4429 2252979 2169365 2046983 1946442 1853069 1863817 1934261 1932989 1979286 1995156 1969434 1926897
4418 1926897 1851541 1826096 1827024 1801917 1737095 1698986 1644211 1623085 1652232 1633080 1603897 1645094
4406 1645094 1760387 1704009 1717580 1796044 1829530 1842501 1848311 1873398 1922609 2030189 2004825
4395 2004825 1990436 2011092 2047112 2000190 1913105 1912977 1873295 1892264 1946295 1871673 1922891 1853986
4383 1853986 1836790 1834064 1810390 1883782 1910195 1940571 1866277 1968033 2023013 2086687 2099749
4372 2099749 2122907 2128185 2147332 2159163 2239130 2272771 2218485 2175392 2172842 2195556 2137259 2204070
4360 2204070 2321956 2315540 2421478 2472936 2486146 2492398 2426624 2460062 2518826 2529403 2580427
4349 2580427 2656566 2767191 2864162 2965187 2969372 2980561 3107194 3242203 3272029 3378264 3408230
4338 3408230 3453087 3422057 3459622 3566074 3693239 3817585 4015075 4194916 4378620 4593682
4328 4593682 4698932 4811168 4945312 5035099 5156675 5259328 5266333 5324008 5366272 5418606 5458968
4317 5458968 5514116 5492102 5483883 5379818 5265790 5229497 5183263 5125823 5115291 5128695 5090887
4306 5090887 5051458 5040062 4913618 4849407 4705496 4630385 4419010 4392233 4339931 4245357 4193028
4295 4193028 4157815 4141703 4141368 4179347 4084188 4113498 4117152 4101769 4106212 4158541 4224327 4279171
4283 4279171 4377656 4439040 4486984 4504133 4481369 4517925 4604922 4644411 4749763 4824456 4887351
4272 4887351 4846813 4830352 4812239 4834743 4825059 4789638 4826368 4916367 4941777 4882393 4964781 4916703
4260 4916703 4951926 4982094 5025250 5057355 5102558 5220405 5283201 5315265 5330255 5470640 5553520
4249 5553520 5642358 5784604 5903129 6056465 6113231 6189785 6187872 6239917 6367660 6404049 6465003
4238 6465003 6549038 6664889 6743376 6861648 6928993 6973560 7146729 7274712 7358177 7481365
4228 7481365 7596754 7803572 7989428 8098627 8208951 8361760 8522457 8772574 8870549 9087633
4218 9087633 9370839 9418638 9595793 9908782 10155202 10337553 10579537 10908008 11279817 11595619
4208 11595619 11969963 12311424 12734682 13152789 13617878 14234225 14921938 15617095 16334730
4199 16334730 17165005 18273565 19427735 20708938 22181150 23811049 25448184 27134248
4191 27134248 28634637 29956675 31126684 32046803 32838903 33344290 33743818 34039077 34141049
4182 34141049 34389487 34901883 35788547 37175161 39079281 41669532 44716330 47801332 50593935
4173 50593935 52795935 54439679 55725699 56874126 57974772 59174888 60274459 61366837
4165 61366837 62374587 63192384 63954362 64842647 66035252 67594881 69506415 71422068 73090087
4156 73090087 74101925 74732980 75159030 75955831 77652386 80776599 85571813 91780985 98130300
4147 98130300 103462698 106703987 107569974 107076192 106376696 106246457 106986252 108272370 109606731
4138 109606731 110861503 111802952 112458765 112967692 113472706 113908943 114221630 114035185 113354237
4129 113354237 112094074 110578620 109170288 108396837 108649544 110376008 113866431 119189595
4121 119189595 126053948 133532737 140566175 146247986 150525407 154004941 157730751 162101471
4113 162101471 166705897 170855814 173920232 176099277 177921381 179464303 180402308 180130014
4105 180130014 178583392 176214704 173719389 171723674 170505765 170333051 171542088 173969929
4097 173969929 177197746 180599963 183684651 186115070 187503235 187846067 187263345 186220370
4089 186220370 185312900 184724528 184659513 185099946 186102987 187751749 189910783 191936485 193341622
4080 193341622 193708922 193186019 192257566 191666222 191404984 190890496 189691623 187193382 183973245
4071 183973245 181147998 179073187 176951272 173354348 167165939 158594551 149076367 140257168
4063 140257168 133257284 128527650 126097301 125355373 125568270 125807615 125625330 125108584 124565096
4054 124565096 124091562 123709622 123192654 122314747 120913221 118846128 116206139 113077157 109893841
4045 109893841 107324145 105933508 105750633 106526572 107467691 107323900 104930519 100280001 94108785
4036 94108785 87712970 82132217 77809315 74767407 72687120 71346105 70166561 68633581
4028 68633581 66770688 64449799 62067908 59839210 57915299 56364513 55112253 53990676
4020 53990676 53003474 52142996 51380071 50601250 49895878 49208447 48208045 46697592 44680711
4011 44680711 42197474 39386113 36649120 34154120 32152867 30602676 29424892 28563606
4003 28563606 27870085 27220861 26541432 25811981 25076706 24478466 23981608 23435333 22700368
3994 22700368 21787202 20674762 19486464 18351261 17254137 16290225 15398801 14481756 13645501
3985 13645501 12967814 12315908 11715845 11214646 10866654 10586117 10350073 10084690 9825998
3976 9825998 9532673 9074461 8604305 8213200 7888055 7529600 7333450 7111635 6939521 6746284
3966 6746284 6640599 6653207 6520771 6424827 6250101 6062472 5801725 5630132 5455482 5394746
3956 5394746 5296869 5262105 5261678 5185650 5077335 4831446 4589157 4396413 4266176 4149106 3990841
3945 3990841 3887880 3792796 3724913 3733715 3714680 3697810 3679468 3727307 3810605 3812429 3802688 3728264
3933 3728264 3615581 3586638 3571546 3587639 3665537 3720358 3719617 3646571 3564394 3404496 3231163
3922 3231163 3156425 3099638 2985207 2917354 2983850 3041238 3102123 3193129 3240903 3268078 3405845
3911 3405845 3536466 3585060 3520172 3394852 3248875 3174084 3105834 3063701 3078605 3121126 3204229
3900 3204229 3246529 3261695 3245676 3265314 3203740 3190250 3188739 3123081 3122554 3170500 3252360 3281011
3888 3281011 3283488 3272082 3287232 3298465 3363339 3504691 3525074 3573912 3656719 3616446 3634188
3877 3634188 3670680 3663808 3726673 3804712 3825207 3787244 3770071 3762262 3797980 3855114 3870201 3883906
3865 3883906 3927224 4040071 4144715 4261869 4349475 4449747 4564150 4636837 4643959 4680832 4626186
3854 4626186 4597990 4561633 4519426 4395800 4255468 4114963 3966483 3912358 3821968 3723295 3584530
3843 3584530 3510130 3413454 3468007 3566653 3625667 3611877 3592296 3593123 3587447 3544376 3512990 3481371
3831 3481371 3364400 3283316 3106669 2964125 2891810 2851626 2756269 2763450 2752097 2675635 2628550
3820 2628550 2511649 2473603 2472907 2434337 2415571 2427139 2437907 2418866 2452297 2536660 2556924 2554252
3808 2554252 2542371 2560593 2587013 2745837 2918090 3071776 3334342 3562775 3710794 3786456
3798 3786456 3899332 4003113 4148426 4282509 4460188 4707364 4894252 4987478 4982611 4998626
3788 4998626 4895461 4695723 4714890 4676574 4660517 4761008 4799435 4677216 4421959 4178569
3778 4178569 3940986 3624155 3260387 2896160 2709397 2574184 2441872 2333818 2264178 2262647
3768 2262647 2153805 2115686 2155603 2167528 2264184 2291440 2221329 2281409 2409839 2535555 2639610
3757 2639610 2785361 2811919 2878036 2950666 3004383 2992859 3044885 3186327 3296486 3306365 3273139
3746 3273139 3279540 3496411 3504276 3482347 3419745 3353319 3429136 3459392 3502921 3556069 3595727 3604655
3734 3604655 3563254 3473743 3317404 3091220 2935306 2787771 2637460 2499264 2378766 2213358
3724 2213358 2064339 1916318 1795534 1719986 1749486 1689454 1609929 1591420 1548582 1522329 1546811
3713 1546811 1521512 1504115 1444712 1419997 1426913 1393650 1393742 1331807 1407601 1501510 1568719 1568745 1589292
3700 1589292 1684597 1701632 1737663 1845223 1995205 2114039 2215508 2313647 2389689 2362865 2343412
3689 2343412 2293036 2305664 2370705 2409668 2410073 2340875 2367793 2467631 2531333 2506807 2503417 2575715
3677 2575715 2558361 2537626 2501497 2486189 2541165 2576993 2619742 2653293 2664046 2590558 2538940
3666 2538940 2507200 2563895 2572952 2651768 2666929 2725273 2681949 2510774 2494225 2416772 2335751
3655 2335751 2274267 2217651 2250264 2292016 2220513 2309378 2473796 2606065 2628267 2690836 2818665
3644 2818665 2933419 3010751 3067192 3022881 2902835 2808104 2745811 2606729 2548286 2558574 2598859
3633 2598859 2599774 2603426 2658909 2669194 2762464 2884368 2947058 3005320 3131178 3154892 3063378 3028822
3621 3028822 2995237 2971273 2902220 2806618 2802037 2853331 2888009 2940538 2922048 2869052 2875492 2878764
3609 2878764 2955750 3055131 3110616 3131009 3196598 3173989 3184110 3357994 3411560 3429843 3390884
3598 3390884 3380373 3463342 3602870 3713651 3823037 3898727 3979046 4130293 4252368 4320481
3588 4320481 4424050 4490870 4548263 4597714 4585433 4582354 4555417 4589594 4649468 4739722 4893221
3577 4893221 5116724 5378812 5545690 5715981 5773195 5911407 6159626 6301543 6675008 7231211
3567 7231211 7794265 8279536 8737283 9000725 9056339 8938141 8725078 8526577 8426722 8504204
3557 8504204 8625841 8795118 9030760 9379828 9734365 10121466 10591045 11083522 11581972 12070725
3547 12070725 12605185 13053071 13473463 13839419 14145826 14139877 13888861 13315107 12495707 11515177
3537 11515177 10519439 9692423 8904190 8210706 7688520 7221157 6757610 6423401 6116142
3528 6116142 5808568 5586468 5302424 5104232 4918848 4738919 4560633 4508583 4343704 4204183
3518 4204183 4080715 3925601 3771234 3623664 3559334 3454940 3374954 3228467 3124897 3099900
3508 3099900 3058642 2944550 2920280 2948430 2887395 2861197 2913986 2871436 2889740 2908462 2795784
3497 2795784 2749103 2685660 2634521 2619724 2550912 2552469 2521514 2512332 2523402 2545567 2542673 2533514
3485 2533514 2576135 2635068 2581525 2535432 2563244 2595345 2580474 2559191 2561913 2483119 2482188 2491172
3473 2491172 2505819 2502023 2533716 2630017 2709492 2732113 2768015 2834101 2861828 2951676 3058750
3462 3058750 3202652 3254458 3385713 3475167 3550470 3667250 3726781 3823045 3973405 4214261
3452 4214261 4433359 4528567 4628154 4608919 4649811 4619850 4618932 4714493 4733154 4837738 5069067
3441 5069067 5309630 5555813 5884237 6202076 6569269 7139877 8104818 9660451 12143354
3432 12143354 15591451 19234518 22115304 23309064 22269146 19483494 16030371 12889493
3424 12889493 10484757 8716210 7422505 6451907 5785066 5274531 4820860 4525202 4218166
3415 4218166 4022968 3969847 3960374 4006397 3964364 3985847 3934774 3769901 3553494 3448681 3426734
3404 3426734 3282761 3144256 3027374 2922079 2938207 2913710 2922628 2881171 2889847 2933821 2911935
3393 2911935 2853310 2817991 2858517 2905651 2906531 2997047 3119849 3164691 3261035 3387125 3569865
3382 3569865 3689454 3824017 3960183 4047130 4115593 4183074 4246754 4296981 4253018 4161246 4091286
3371 4091286 4158620 4276243 4453908 4521447 4584856 4600845 4631958 4629222 4562550 4524640 4525286 4454967
3359 4454967 4480975 4450794 4419805 4412783 4439790 4510460 4493339 4511304 4659828 4844272 5030213
3348 5030213 5292955 5603844 5873516 6062648 6222427 6298490 6474470 6674271 6975659 7459292
3338 7459292 7984023 8753220 9665671 10523816 11579231 13024732 15482039 20074315 27034615
3329 27034615 35671712 43627299 48002387 46686861 40307965 32524896 25783860 20756625
3321 20756625 17174906 14797153 13221476 11985514 10844993 9757276 8632020 7700760
3313 7700760 6941495 6320310 5894326 5571896 5216042 4959952 4807967 4647532 4523966 4380986
3303 4380986 4266962 4186255 4015943 3857487 3820233 3708420 3622553 3473427 3387316 3366682
3293 3366682 3425969 3415990 3315151 3171478 3125172 3072991 3036713 3027768 3036126 3128896 3299522
3282 3299522 3486613 3778146 4177712 4558768 5040534 5429252 5576504 5563144 5350016 5085889
3272 5085889 4835877 4561001 4330824 4262059 4173755 4041642 4000450 3945030 3903933 3917748 4026844
3261 4026844 4004433 3960004 3833205 3712132 3444296 3204268 2990808 2846860 2757405 2681035
3251 2681035 2669058 2613821 2576518 2594929 2644132 2690493 2734767 2721107 2720169 2834947 2935224
3240 2935224 2996210 3127422 3261020 3358099 3531746 3657942 3774660 3855406 3889580 3877602
3230 3877602 3820290 3797857 3785856 3768105 3826650 3873172 3891222 3924417 3992603 4062750 4161348
3219 4161348 4296395 4307846 4357304 4413502 4454063 4522608 4605834 4694371 4865045 5098062 5453588
3208 5453588 5792001 6202498 6731032 7230984 7623945 7655622 7426708 7102702 6645709 6241866
3198 6241866 5854423 5559546 5280016 5081103 4940729 4898501 4848123 4824805 4777772 4732170
3188 4732170 4698235 4633894 4641960 4563971 4514292 4551415 4697448 4755545 4917336 5167303 5376911
3177 5376911 5576280 5764113 5666769 5551693 5241220 4893849 4644183 4305750 3990951 3728443
3167 3728443 3534049 3271532 3086992 3022453 2964352 2924589 2829034 2774589 2785342 2699915 2624049
3156 2624049 2614511 2609033 2511232 2494934 2491047 2463661 2373944 2311087 2237588 2205788 2145045 2160189
3144 2160189 2199939 2298635 2359916 2462281 2492591 2364143 2287313 2186497 2052244 1941400
3134 1941400 1855771 1863964 1825408 1767033 1820598 1867211 1831973 1705965 1628678 1618382 1610052 1640797
3122 1640797 1691641 1700014 1714437 1793603 1907735 1993510 2105424 2192086 2243008 2295841 2287153
3111 2287153 2262690 2204601 2027749 2051031 1977792 1964817 2002634 1972831 2013604 2060983 2048115
3100 2048115 2035918 2062612 2136417 2289521 2496812 2714702 2949529 3228723 3419474 3363527
3090 3363527 3147746 2815889 2430224 2057906 1707011 1456674 1189143 861269 665121 545914
3080 545914 397610 347236 321191 196752 147463 74877 21491 -30144 -4646 -75113 -142426
3069 -142426 -135800 -97992 -84369 -167271 -228347 -261489 -255464 -288128 -285056 -371835 -370895 -394669 -324960
3056 -324960 -349844 -414337 -455410 -425601 -455511 -448175 -463219 -518732 -435115 -414694 -439802 -476943
3044 -476943 -509581 -531642 -515680 -479460 -412925 -389451 -370964 -393228 -445403 -523913 -519218 -542199
3032 -542199 -584282 -569837 -631495 -648511 -706785 -723566 -685116 -694324 -694357 -721788 -769591 -760523 -688339
3019 -688339 -670290 -781619 -797339 -701690 -747266 -779130 -718035 -770854 -815232 -781927 -768712
3008 -768712 -766770 -772955 -840821 -842303 -832748 -783112 -799377 -806280 -779045 -746385 -782878 -852254 -790943
2995 -790943 -841933 -859686 -820767 -827144 -835333 -824416 -854980 -850041 -905687 -929492 -934550 -920557
2983 -920557 -847176 -822404 -789833 -858843 -870071 -849978 -826613 -826548 -844494 -876135 -868788 -870408 -850405
2970 -850405 -841587 -858375 -883935 -867585 -856248 -880601 -797229 -836324 -884333 -918547 -901683 -903056
2958 -903056 -847836 -921109 -885010 -844327 -870951 -779474 -781153 -910419 -950395 -919015 -941585 -939421
2946 -939421 -946769 -941843 -976816 -997858 -935771 -892858 -918638 -945381 -979179 -1032994 -950836 -856723
2934 -856723 -870478 -839746 -853034 -935861 -930921 -927827 -921608 -982492 -956826 -902847 -957824 -919881
2922 -919881 -886229 -845393 -832252 -831452 -895943 -880228 -939033 -940365 -949890 -962718 -983070 -986177 -930758
2909 -930758 -931594 -945273 -971926 -993779 -1036224 -967807 -936060 -961236 -1015129 -1022315 -968963 -898794
2897 -898794 -924175 -929763 -918329 -959072 -1010124 -998786 -955668 -910183 -956663 -976880 -980216 -877055
2885 -877055 -913146 -984751 -952965 -935440 -936796 -944821 -1000359 -943549 -919566 -942736 -920939 -969240
2873 -969240 -917096 -892869 -877662 -969242 -1014964 -992933 -1013164 -962861 -985162 -968504 -933098 -948355
2861 -948355 -950535 -886101 -907541 -972655 -910459 -899833 -910306 -945284 -952986 -913727 -982401 -1018763
2849 -1018763 -992352 -997204 -1027368 -1014537 -985920 -1031703 -992481 -958445 -927949 -1074428 -1073718 -1031113
2837 -1031113 -1004471 -967734 -971712 -930550 -878196 -904113 -940165 -948381 -962548 -981129 -949196 -917765
2825 -917765 -921921 -916242 -930156 -942161 -905975 -918827 -920334 -940911 -951920 -1003151 -986452 -923876
2813 -923876 -913911 -927038 -917023 -901130 -878982 -928387 -925349 -983961 -956970 -889131 -908764 -926731
2801 -926731 -949245 -915590 -919380 -920258 -909048 -929015 -937275 -1013210 -1053862 -970491 -927421 -966311
2789 -966311 -991974 -971968 -951463 -889590 -923237 -961236 -933428 -907734 -889383 -889141 -943438 -986028
2777 -986028 -976282 -920382 -921291 -925941 -929167 -924250 -913598 -869402 -874147 -932803 -961173 -935275 -931687
2764 -931687 -924332 -892990 -922885 -912248 -942856 -965112 -957500 -941115 -919155 -935507 -968892 -995635
2752 -995635 -991019 -987056 -1010817 -945882 -927815 -948295 -980127 -943328 -971326 -985810 -939542 -964131
2740 -964131 -929254 -963283 -920603 -919347 -864574 -889670 -877418 -849772 -811361 -881512 -940875 -973484
2728 -973484 -977930 -1001340 -982098 -975358 -976301 -1026355 -996191 -986079 -982703 -940113 -927397 -987405 -923532
2715 -923532 -863180 -855635 -879185 -889981 -857627 -853018 -869891 -869765 -914794 -871958 -821506 -819363 -765412
2702 -765412 -834003 -827740 -900963 -908200 -885389 -872442 -895866 -821313 -808819 -843298 -864526 -865891
2690 -865891 -783281 -821827 -741096 -750208 -738768 -796105 -792794 -771226 -882552 -842626 -850418 -785169
2678 -785169 -783742 -674869 -640687 -594597 -516716 -416848 -401045 -473018 -494611 -560786 -648044 -704333
2666 -704333 -608957 -676637 -805227 -824869 -793614 -828612 -839862 -772594 -778381 -763919 -816158 -793018
2654 -793018 -833818 -860770 -831299 -863730 -823921 -839502 -813941 -840949 -878589 -874573 -881238 -836309
2642 -836309 -795824 -822959 -815404 -803909 -815700 -838227 -803819 -799316 -760224 -723138 -741478 -777546
2630 -777546 -790949 -737555 -716720 -714075 -765712 -730120 -714946 -780397 -858928 -792151 -764923 -796430
2618 -796430 -772733 -702204 -719400 -725094 -757365 -731431 -787728 -802251 -803460 -832919 -815076 -786852
2606 -786852 -814104 -804483 -756856 -739350 -781348 -775913 -744872 -745257 -783355 -702241 -649861 -703944
2594 -703944 -713909 -722529 -725185 -735208 -736118 -730462 -721949 -787152 -754478 -682942 -713213 -763271 -796223
2581 -796223 -753503 -732704 -695846 -682558 -733141 -686697 -645107 -703516 -670307 -679758 -704197 -672034
2569 -672034 -668273 -684765 -696225 -649314 -675627 -687830 -663481 -641205 -611170 -595716 -563700 -597635
2557 -597635 -590407 -650377 -616476 -571220 -543572 -527023 -538223 -560554 -638935 -593631 -555115 -645878
2545 -645878 -646497 -555862 -584591 -640087 -635769 -619157 -648125 -633651 -573123 -577270 -629814 -644522
2533 -644522 -616601 -590339 -576157 -532479 -540105 -540261 -563083 -562818 -541475 -521514 -579475 -594566 -646486
2520 -646486 -565325 -560665 -619072 -569494 -526521 -499411 -493823 -486782 -428875 -511674 -458155 -453853
2508 -453853 -403576 -440500 -491172 -479410 -410225 -386892 -361159 -358350 -424000 -376459 -350983 -392132
2496 -392132 -304634 -370863 -353446 -342319 -390457 -306949 -294681 -319893 -286184 -295433 -273143 -303613
2484 -303613 -323556 -291299 -193933 -109344 -39268 -148968 -156191 -129729 -91083 -109644 -164140 -155413
2472 -155413 -166560 -111845 -112274 -90921 -31044 -39600 -30285 18158 -47153 34811 47374 47706 156577
2459 156577 208713 233007 250385 296868 280486 333449 391093 356942 447345 481250 493698 525260
2447 525260 608986 647589 650017 709124 840174 890908 937149 989325 1039259 1096481 1214656
2436 1214656 1290422 1426459 1643104 1865815 2012995 2237877 2506824 2711958 2889099 3095379
2426 3095379 3428905 3829623 4290985 5032984 5884409 6671762 7269567 7533580 7656360 8048021
2416 8048021 8670850 9699374 11028388 12722012 14844132 17991977 23500934 34577006
2408 34577006 51642506 70981006 85959101 90069702 77162149 57292094 41833759
2401 41833759 30954955 23400974 17522114 13261645 10081967 7872387 6151811 5212577
2393 5212577 4839981 4683125 4614224 4365380 3789156 3105573 2535811 2091166 1691841 1456821
2383 1456821 1213741 1087304 926112 803114 657849 631390 584687 638739 548223 426440
2373 426440 372894 367806 283050 277575 297069 244851 123179 173280 132679 122737 94002 37163
2361 37163 -26894 -47022 -57178 -123022 -146657 -109329 -134574 -172299 -189388 -235046 -179175 -257500
2349 -257500 -290844 -234161 -250760 -249659 -257018 -283435 -400262 -491247 -481049 -510695 -521419 -515497
2337 -515497 -624110 -618041 -597381 -539400 -561553 -573234 -658210 -669791 -691650 -717319 -700201 -661923
2325 -661923 -662698 -650956 -637205 -714049 -687549 -668522 -654567 -569199 -542034 -588009 -571895 -628558
2313 -628558 -644833 -679726 -675898 -606722 -671372 -664277 -648263 -745655 -772768 -734172 -727979 -718289
2301 -718289 -715421 -737182 -760318 -791953 -761205 -787569 -786058 -794728 -775982 -766560 -713825 -784418
2289 -784418 -757569 -785144 -783789 -708531 -752792 -809447 -837347 -762046 -855206 -895689 -978221 -898755
2277 -898755 -885866 -873726 -864150 -845131 -798290 -835346 -863470 -881247 -847100 -819848 -862720 -941643
2265 -941643 -921720 -853052 -778916 -830543 -860873 -842689 -860952 -897395 -933060 -1011126 -964205 -898087
2253 -898087 -875824 -892829 -892774 -776170 -768698 -784193 -772525 -790840 -857902 -899433 -898911 -892631 -887529
2240 -887529 -889270 -973121 -982800 -943270 -901485 -886482 -895291 -860809 -809200 -759073 -750238 -836203
2228 -836203 -858701 -827302 -819251 -786031 -809403 -781260 -780152 -810235 -878688 -888405 -869220 -916496
2216 -916496 -941829 -902223 -865927 -867664 -849160 -808477 -877456 -849808 -869572 -817995 -839864 -860674
2204 -860674 -892824 -868389 -814027 -833604 -879571 -903784 -819582 -799547 -819049 -841867 -867348 -891533
2192 -891533 -955132 -877598 -819525 -844234 -923113 -875353 -893080 -878928 -859388 -893052 -926084 -830560
2180 -830560 -815761 -864051 -881773 -844831 -863394 -804897 -773012 -811035 -832765 -801000 -776228 -796323
2168 -796323 -826636 -934776 -863870 -837965 -843417 -907877 -815908 -748853 -832935 -788633 -769856 -812586
2156 -812586 -800376 -813392 -877146 -876660 -797364 -748897 -782338 -822448 -852527 -859351 -767211 -719789
2144 -719789 -754764 -793517 -737141 -630883 -659207 -635131 -487457 -359273 -354266 -486109 -475705
2133 -475705 -598955 -655583 -672584 -712392 -772260 -838087 -809658 -766101 -735551 -747012 -789537
2122 -789537 -895609 -871508 -807234 -827563 -883215 -835226 -824192 -885185 -852688 -854842 -853297 -836802
2110 -836802 -811536 -835447 -841779 -829609 -822771 -842786 -814748 -784946 -738061 -773004 -784259 -880237
2098 -880237 -897027 -865971 -802810 -807239 -841171 -836949 -820170 -834561 -849158 -918216 -922340 -909122
2086 -909122 -900855 -869353 -881899 -911227 -900270 -894472 -821296 -850282 -856826 -849108 -794155 -815616
2074 -815616 -870830 -813585 -786775 -781607 -783794 -762248 -758540 -759118 -795577 -810179 -820995 -767087 -745920
2061 -745920 -785676 -821670 -803396 -812967 -830646 -804380 -850506 -805216 -727381 -724767 -808045 -812567
2049 -812567 -765998 -801358 -857190 -855210 -885253 -830829 -845267 -882298 -842390 -881220 -831300 -767625
2037 -767625 -789686 -791825 -762017 -727218 -784996 -858608 -788956 -808072 -785651 -773074 -852081 -875637
2025 -875637 -827514 -837853 -849055 -841480 -819710 -802444 -728639 -795267 -758571 -775888 -736299 -774757
2013 -774757 -782113 -796602 -809439 -800964 -812838 -768476 -816863 -858003 -820394 -830394 -840328 -819724
2001 -819724 -808127 -893811 -921173 -872434 -774708 -750223 -733494 -792614 -726962 -724516 -745618 -772211
1989 -772211 -746013 -795865 -794693 -737439 -727043 -754499 -789309 -722732 -790906 -793626 -802763 -791866
1977 -791866 -792908 -852755 -797811 -795068 -787782 -796907 -813330 -724558 -790622 -833947 -765427 -794806
1965 -794806 -821812 -777963 -746812 -799584 -813995 -810568 -815376 -836413 -855734 -839555 -823221 -788147
1953 -788147 -781707 -743650 -713453 -669883 -672855 -745397 -772736 -753349 -782274 -808726 -770795 -801553
1941 -801553 -824411 -760888 -777624 -746075 -748510 -749671 -852129 -887246 -844534 -779464 -792346 -825766
1929 -825766 -823644 -785142 -783208 -803699 -873438 -811436 -719754 -705511 -814856 -822407 -771420 -696176
1917 -696176 -677604 -694913 -783853 -799663 -771283 -793263 -762324 -766910 -772255 -804942 -782583 -752539
1905 -752539 -750446 -753418 -767379 -743328 -823676 -827481 -755336 -790779 -750789 -734588 -757366 -832283
1893 -832283 -833104 -808527 -775844 -783027 -764017 -677323 -758889 -794480 -732201 -729872 -750019 -714382
1881 -714382 -725017 -721683 -690266 -725652 -794415 -771944 -773001 -803811 -736652 -752775 -737965 -774848
1869 -774848 -818473 -823961 -821382 -836153 -786974 -753066 -799365 -817323 -796727 -736191 -716624 -768212
1857 -768212 -818080 -826588 -803601 -761485 -751474 -749578 -772434 -817313 -842454 -798065 -740025 -710365
1845 -710365 -722321 -733516 -757842 -742119 -742394 -762583 -746829 -698319 -680548 -718989 -727682 -772520
1833 -772520 -724209 -721385 -722145 -729077 -718522 -708897 -722608 -760526 -779568 -643361 -659159 -676757
1821 -676757 -706729 -709670 -760124 -733141 -754282 -727368 -706806 -708811 -707515 -698672 -649655 -677424
1809 -677424 -731295 -741343 -674295 -702066 -760897 -775696 -727495 -719960 -702173 -715632 -690788 -666467
1797 -666467 -737262 -751975 -720303 -767158 -767379 -721150 -693866 -715463 -756666 -834813 -773460 -702075
1785 -702075 -736195 -748717 -752238 -869074 -859714 -820440 -847329 -893967 -776435 -749358 -803189 -775579
1773 -775579 -786957 -767392 -751577 -743211 -717776 -707254 -733379 -738914 -735003 -782918 -729479 -733973
1761 -733973 -784805 -756988 -759757 -837790 -826576 -788559 -745545 -745794 -789032 -731504 -733835 -734547 -847731
1748 -847731 -830920 -819589 -816418 -734352 -792579 -735535 -733944 -669511 -714426 -723390 -654474 -736884
1736 -736884 -754045 -796274 -807939 -827542 -760256 -666623 -691283 -765169 -813968 -773217 -717464 -712659
1724 -712659 -744688 -739507 -766721 -784378 -781928 -798450 -790265 -779452 -800180 -717765 -683979 -716876
1712 -716876 -738239 -798621 -802410 -727138 -724566 -687883 -714523 -691475 -671670 -716572 -759532 -746152
1700 -746152 -729622 -777172 -780790 -722142 -703620 -750908 -728129 -755040 -698893 -728737 -707802 -765085
1688 -765085 -746898 -746916 -703216 -701339 -673639 -640569 -728425 -724436 -714780 -703018 -664075 -662556 -683713
1675 -683713 -721038 -736645 -697777 -683599 -708409 -665754 -670519 -709471 -717359 -708201 -714415 -729476
1663 -729476 -810423 -746527 -749846 -767207 -703410 -662942 -720251 -717655 -696048 -736818 -714660 -699495
1651 -699495 -659496 -614907 -673207 -744984 -757049 -733342 -674277 -701462 -650840 -688700 -677686 -738740
1639 -738740 -722329 -683872 -707245 -705085 -785429 -752762 -715857 -725811 -708860 -674228 -730763 -771599
1627 -771599 -800411 -789694 -762942 -721863 -676689 -709610 -790204 -710837 -712694 -733722 -722459 -736152
1615 -736152 -717613 -726585 -726888 -728943 -712166 -705155 -671250 -648813 -656045 -699609 -695230 -730245 -728009
1602 -728009 -688868 -724117 -729447 -768552 -777620 -703236 -703705 -703370 -698694 -680495 -681791 -734145 -728381
1589 -728381 -737579 -673805 -734783 -768475 -716231 -674648 -640117 -665564 -684180 -772536 -728112 -739897
1577 -739897 -720632 -712050 -741150 -711857 -719822 -787528 -717863 -720864 -784857 -773292 -738276 -705134
1565 -705134 -769715 -727829 -683662 -729735 -704850 -675850 -709867 -752506 -723483 -768449 -688574 -650754
1553 -650754 -622098 -604754 -613158 -684578 -675371 -680731 -688068 -705247 -727513 -690736 -728360 -724697 -750129
1540 -750129 -757997 -811041 -790772 -767122 -788809 -800313 -783653 -739780 -693396 -690148 -786352 -771126
1528 -771126 -772691 -789885 -720770 -664124 -741764 -762572 -722117 -706776 -708474 -662758 -717922 -664842
1516 -664842 -661043 -728737 -760744 -687769 -695323 -722618 -668682 -687082 -683222 -621977 -614637 -647679
1504 -647679 -687982 -717269 -672429 -640590 -661868 -710481 -672503 -762994 -737562 -687147 -588086 -656804
1492 -656804 -641938 -634067 -612259 -622007 -648877 -661055 -715404 -776642 -794766 -753962 -694793 -712904
1480 -712904 -681278 -693634 -746340 -742862 -743040 -772204 -685704 -673726 -678192 -682771 -706572 -729021 -731555
1467 -731555 -702055 -769830 -701678 -666913 -711160 -678201 -667807 -638244 -628151 -657693 -649613 -666573
1455 -666573 -667763 -662985 -677402 -688893 -747919 -754207 -716197 -694312 -646694 -659849 -646513 -615254
1443 -615254 -741029 -717899 -695194 -674990 -676688 -743354 -694628 -689264 -665641 -666745 -656062 -712342
1431 -712342 -590619 -607817 -693533 -675934 -703288 -713933 -748631 -763759 -757215 -760586 -683114 -676035
1419 -676035 -713516 -693576 -765753 -740966 -672187 -702676 -670291 -712389 -765247 -757340 -754005 -719692
1407 -719692 -722398 -715431 -696707 -689592 -691082 -678402 -637872 -684639 -786321 -742339 -719858 -730892
1395 -730892 -743557 -736417 -738799 -674279 -694266 -633370 -602394 -657712 -647745 -671247 -702904 -720889
1383 -720889 -709568 -708811 -647322 -666939 -719407 -740330 -753705 -752813 -715228 -700317 -682457 -671340
1371 -671340 -642035 -608386 -663784 -693004 -649706 -614925 -625680 -704546 -661897 -630787 -570989 -631200
1359 -631200 -645914 -618604 -635453 -747958 -704840 -572658 -605390 -649260 -691069 -720222 -745720
1348 -745720 -667399 -599184 -670218 -684240 -658793 -652440 -675082 -713711 -703688 -655573 -650631 -668929
1336 -668929 -630313 -659680 -669803 -648773 -644476 -639523 -688829 -771180 -745979 -648454 -691022 -741023
1324 -741023 -724956 -664225 -684325 -748828 -680488 -611255 -647666 -714188 -733992 -719002 -670783 -738995
1312 -738995 -740390 -708357 -646156 -631540 -632510 -650059 -706538 -693346 -674921 -636903 -608207 -642360
1300 -642360 -652918 -620263 -647917 -668307 -656332 -699325 -702040 -739706 -748607 -690701 -734331 -745012
1288 -745012 -706912 -675191 -709389 -703833 -708716 -732312 -741524 -708101 -690956 -710997 -613665 -586262
1276 -586262 -659097 -648613 -663762 -629002 -659140 -691530 -679034 -692390 -655046 -703409 -679979 -718616
1264 -718616 -739225 -701172 -671856 -633177 -631827 -646481 -633822 -646091 -644795 -667841 -665634 -767876
1252 -767876 -721734 -713912 -654202 -616743 -580285 -539080 -643644 -675088 -656791 -668581 -615415 -607260
1240 -607260 -647639 -643402 -634929 -647348 -656196 -600376 -630515 -647878 -661887 -657997 -729744 -748802
1228 -748802 -714507 -724799 -739724 -666961 -691080 -612525 -559747 -586762 -628555 -575010 -551216 -627795
1216 -627795 -614342 -558699 -597770 -594646 -618536 -661674 -675484 -674477 -571897 -601481 -627341 -636169
1204 -636169 -657681 -640272 -588421 -615734 -636536 -632501 -621491 -642285 -635179 -654043 -697691 -723289
1192 -723289 -696466 -700014 -692634 -652520 -663548 -633334 -603969 -680482 -695063 -712663 -740939 -662546
1180 -662546 -656272 -612746 -653015 -660857 -665183 -642397 -604757 -613421 -616724 -584482 -632448 -605401 -585530
1167 -585530 -572393 -556139 -610277 -602813 -605878 -652121 -761088 -774671 -699787 -662351 -738145 -690105
1155 -690105 -610639 -619649 -589163 -638227 -637253 -705609 -650843 -636386 -659353 -626888 -612779 -621347
1143 -621347 -669236 -695314 -676925 -690921 -727766 -700211 -708055 -687973 -655528 -661341 -625790 -614221
1131 -614221 -671863 -704518 -742111 -675357 -624775 -581708 -586768 -616871 -666003 -612296 -608801 -632972
1119 -632972 -659839 -660150 -641932 -580249 -600161 -595045 -632997 -623769 -545031 -572632 -655474 -728006
1107 -728006 -657616 -651404 -686154 -656215 -606969 -586798 -652049 -620680 -567846 -619820 -674405 -625334
1095 -625334 -634595 -671247 -636534 -626175 -562505 -574151 -711975 -720335 -674188 -661554 -725369 -716318
1083 -716318 -622522 -648015 -657218 -601059 -583960 -619734 -649082 -601278 -637615 -645214 -563045 -597572
1071 -597572 -613024 -680129 -634271 -602567 -633664 -661429 -629925 -647260 -622555 -648289 -664251 -614322
1059 -614322 -638029 -634067 -616073 -645106 -661688 -643209 -568878 -606185 -641647 -620875 -594966 -596061
1047 -596061 -600847 -572836 -591004 -563502 -595971 -631647 -646575 -659489 -598976 -581315 -573566 -635701
1035 -635701 -679993 -653540 -658568 -607039 -539536 -603675 -641620 -712433 -697298 -658095 -651552 -576243
1023 -576243 -586561 -630028 -653720 -669689 -610744 -661934 -632370 -625176 -730180 -710446 -690709 -709791
1011 -709791 -684574 -625790 -666799 -629804 -572586 -568199 -607242 -631519 -683900 -699994 -636187 -654042
999 -654042 -716607 -662992 -609769 -626108 -588930 -601789 -666986 -653621 -611053 -593486 -629741 -620156
987 -620156 -629125 -635066 -659265 -659258 -706663 -713078 -753623 -714612 -706634 -691938 -634774 -629529 -677795 -633377
973 -633377 -598603 -631849 -654479 -654534 -706464 -691803 -657048 -693857 -665036 -686586 -672342 -690486
961 -690486 -700634 -693119 -656465 -643130 -626215 -658674 -663848 -630561 -605071 -605088 -647221 -661558 -712279
948 -712279 -608264 -634673 -658882 -675575 -698061 -653463 -630778 -629532 -583513 -607790 -619856 -593639
936 -593639 -537028 -499439 -563317 -621651 -656449 -690050 -652862 -571669 -595721 -625305 -691171 -624736
924 -624736 -573386 -652237 -670864 -583673 -617236 -625928 -641346 -542258 -614717 -650732 -616022 -577354
912 -577354 -602948 -600298 -594068 -596727 -598944 -602059 -651011 -658975 -615465 -642084 -614394 -626529 -741109
899 -741109 -691866 -609749 -591688 -578223 -582402 -613668 -646307 -632321 -639818 -544808 -516825 -531955
887 -531955 -607599 -653826 -648058 -637529 -633842 -695206 -679642 -624298 -539074 -516630 -508527 -600197
875 -600197 -630063 -563347 -614334 -550321 -550469 -554294 -626380 -541844 -522403 -639471 -647032 -616746
863 -616746 -575263 -630129 -602259 -658267 -654939 -683536 -687453 -686488 -681324 -693322 -699095 -638374 -659790
850 -659790 -657669 -624444 -587008 -619128 -586549 -611284 -566513 -580706 -565640 -615970 -567021 -566946 -560494
837 -560494 -529091 -546532 -600211 -630693 -599805 -639052 -632130 -630697 -680152 -658814 -612428 -637990
825 -637990 -622691 -605048 -644171 -698976 -648157 -614011 -616590 -653326 -629317 -551653 -535520 -606728
813 -606728 -677967 -697212 -645841 -575239 -646880 -677607 -641411 -586745 -567916 -587771 -689885 -696167
801 -696167 -643612 -617500 -635611 -625259 -618542 -620308 -642248 -618214 -629297 -606322 -528548 -581261
789 -581261 -571814 -552981 -539620 -551640 -599263 -596388 -603205 -662200 -650584 -634918 -617584 -590791
777 -590791 -551184 -550450 -515618 -577933 -617320 -634618 -565010 -520053 -577775 -585004 -534849 -585325
765 -585325 -606394 -622091 -569292 -533674 -580388 -575486 -603915 -642551 -672361 -691680 -639119 -641039
753 -641039 -618047 -639166 -621422 -596203 -613196 -626223 -594884 -579916 -600505 -598107 -530919 -509462
741 -509462 -604135 -574564 -631416 -630794 -575132 -588110 -557471 -573973 -612160 -568106 -632078 -679624
729 -679624 -625394 -635598 -604608 -595533 -612061 -588535 -547495 -558695 -628327 -595747 -616549 -611646
717 -611646 -601501 -512831 -560818 -569695 -554531 -566936 -609097 -658042 -618750 -558782 -574857 -537641
705 -537641 -557854 -635749 -546646 -533022 -540752 -540222 -566868 -688872 -688136 -583178 -556862 -587619
693 -587619 -585731 -626488 -605615 -628062 -664013 -634092 -598973 -592982 -655923 -635241 -523469 -576600
681 -576600 -654696 -619768 -588714 -598850 -596634 -630516 -719999 -648395 -598123 -617786 -577205 -602873
669 -602873 -609208 -636308 -575060 -579673 -638676 -613681 -601678 -559753 -569788 -627933 -613631 -594241
657 -594241 -639369 -566831 -564643 -611991 -620731 -599259 -597285 -571081 -596276 -625620 -580823 -544576
645 -544576 -553957 -580884 -589678 -559842 -592114 -606964 -568069 -571681 -564416 -529114 -473326 -507887 -535243
632 -535243 -523824 -554292 -609547 -599548 -614350 -647255 -689163 -631459 -613135 -623024 -616910 -628988
620 -628988 -610853 -568035 -616330 -596140 -525810 -557545 -594503 -548990 -504373 -555080 -516996 -638363
608 -638363 -552149 -528721 -460133 -470506 -553985 -524183 -523954 -518113 -481259 -555820 -603982 -590082
596 -590082 -585990 -563753 -581677 -615640 -619951 -547652 -623485 -706726 -656866 -610429 -667718 -605029
584 -605029 -588749 -569526 -466273 -485319 -537373 -565994 -553337 -588724 -645304 -590436 -546988 -544722
572 -544722 -604798 -620137 -557447 -482101 -502489 -536074 -558685 -581929 -532834 -553669 -590449 -611717
560 -611717 -613867 -534087 -610216 -610373 -550421 -612708 -588717 -569099 -567986 -568804 -615270 -618619 -663972
547 -663972 -680049 -674913 -658851 -642864 -716311 -739062 -702614 -623964 -565530 -558372 -583402 -617936
535 -617936 -557049 -523469 -548895 -607797 -573592 -538646 -625852 -597375 -494118 -575102 -636432 -605742
523 -605742 -601675 -581645 -601916 -553878 -530225 -572705 -553422 -559455 -537672 -553083 -556099 -517036
511 -517036 -598541 -645615 -668469 -659567 -621504 -618081 -547973 -582689 -608032 -611067 -635243 -624720
499 -624720 -587116 -573969 -570457 -636181 -576986 -563099 -568328 -570332 -575080 -560072 -599670 -582428 -646175
486 -646175 -620628 -606292 -674983 -645638 -575174 -542712 -494617 -487488 -525853 -518125 -565744 -582038
474 -582038 -564853 -509023 -554688 -584290 -551385 -564878 -590819 -556139 -537017 -552625 -557526 -563532
462 -563532 -497471 -565884 -612688 -648647 -614645 -666480 -671021 -641921 -646621 -614954 -669796 -672988
450 -672988 -603182 -545241 -535356 -527630 -521126 -645220 -638280 -671285 -700640 -598959 -585943 -601415
438 -601415 -589517 -591535 -626430 -597323 -560381 -604197 -560833 -529409 -597173 -592040 -523114 -508023
426 -508023 -535662 -556475 -544718 -571711 -640759 -660544 -618635 -608341 -608238 -611102 -644254 -592220
414 -592220 -633776 -646931 -600972 -613358 -597602 -683206 -668537 -601745 -520265 -576325 -539304 -520118
402 -520118 -551309 -558516 -575389 -597087 -575866 -559022 -552015 -467636 -528530 -560672 -578100 -545654
390 -545654 -507147 -527191 -572602 -573316 -593677 -610810 -631863 -607104 -637877 -587788 -543252 -585005
378 -585005 -523795 -513364 -470798 -549709 -500998 -481113 -487313 -557077 -607807 -611466 -638380 -588104
366 -588104 -549473 -510822 -588195 -620270 -543062 -553987 -566013 -565435 -627799 -543352 -544253 -545152 -543816
353 -543816 -512858 -461673 -508582 -586355 -584260 -567375 -633489 -590739 -568075 -613416 -618133 -583288
341 -583288 -566284 -549200 -527950 -609232 -594945 -558426 -514551 -580279 -590389 -612833 -638381 -627092
329 -627092 -655345 -647781 -629642 -591791 -513166 -481204 -489357 -498845 -511336 -503444 -486507 -536503 -508763
316 -508763 -586459 -593899 -573564 -629582 -654759 -598959 -552354 -602315 -551619 -501497 -460161 -494368
304 -494368 -568249 -633633 -652672 -684394 -631687 -560360 -567728 -520487 -531890 -553074 -506320 -485202
292 -485202 -565167 -581804 -590603 -590475 -576562 -555178 -515660 -540230 -533609 -519319 -555688 -624988 -647514
279 -647514 -583918 -521252 -518267 -576733 -645528 -638850 -624554 -593534 -566274 -602793 -553617 -580783
267 -580783 -538072 -548895 -528129 -547535 -580525 -621825 -600102 -566592 -634028 -722520 -726476 -659855
255 -659855 -602958 -534210 -535291 -520432 -550187 -535916 -507693 -442891 -495138 -544498 -624313 -558454
243 -558454 -498611 -538334 -501294 -497841 -546796 -549026 -589888 -538015 -598670 -651790 -639930 -621566
231 -621566 -572800 -519439 -545785 -578907 -582621 -579396 -548390 -559668 -540986 -513511 -595688 -638136
219 -638136 -609351 -602189 -597502 -538165 -543286 -549243 -570580 -532047 -469099 -568996 -601570 -649699 -704129
206 -704129 -619280 -625197 -527135 -569648 -651361 -620696 -559646 -564675 -559380 -577740 -630356 -631450 -623904
193 -623904 -598953 -555223 -589315 -589039 -562191 -566217 -573625 -552442 -527886 -545583 -571719 -518879 -498367
180 -498367 -524959 -557675 -640896 -583757 -596562 -595797 -608370 -587265 -555629 -604419 -686422 -671278
168 -671278 -708562 -658409 -613216 -608534 -596891 -653065 -561299 -537066 -584392 -597523 -556980 -545794
156 -545794 -554830 -573714 -623352 -639120 -518468 -524887 -528834 -507523 -583935 -607477 -614370 -578360
144 -578360 -582884 -566545 -589421 -621005 -659705 -578905 -519920 -504551 -541017 -503412 -576666 -587236
132 -587236 -550669 -522693 -607358 -592005 -550571 -542420 -535740 -574798 -635839 -583315 -579588 -606089
120 -606089 -609375 -566004 -591667 -641796 -662645 -597742 -574653 -556378 -578550 -603568 -555366 -609058
108 -609058 -550435 -538021 -562404 -557771 -609470 -615216 -544234 -561475 -608958 -566720 -582607 -619476
96 -619476 -651215 -635483 -596640 -615078 -619084 -602759 -524264 -507319 -550632 -578643 -580469 -600359
84 -600359 -646147 -641957 -663565 -640257 -595136 -596657 -572502 -653549 -585615 -600941 -607993 -578361 -571796
71 -571796 -549569 -564626 -601890 -568751 -586869 -577790 -621409 -606433 -586478 -590092 -545394 -554332 -582987
58 -582987 -603388 -593530 -570796 -627547 -630856 -635310 -640053 -648590 -664808 -617728 -544054 -546888 -554570
45 -554570 -569585 -607811 -615539 -631828 -609595 -619605 -632039 -643384 -634710 -627702 -634799 -589627 -615412
32 -615412 -626504 -659102 -688953 -650563 -629536 -638316 -627633 -578748 -626233 -660242 -660964 -598883 -582539
19 -582539 -628661 -651449 -660965 -631983 -642793 -656159 -594164 -614197 -641560 -684643 -647474 -645133
7 -645133 -676991 -632611 -628086 -634335 -607849 -639457 -598905
0 -598905
$$ Imaginary data points
##PAGE= N=2
##DATA TABLE= (X++(I..I)), XYDATA
16383 -1470718 -1419655 -1369402 -1333823 -1374747 -1405295 -1341264 -1277775 -1214953 -1215967 -1199284 -1167643
16372 -1167643 -1103736 -1067690 -1093920 -1084077 -1026997 -979383 -965875 -926163 -874902 -861364 -848540
16361 -848540 -802436 -776802 -801665 -740154 -667127 -668505 -645565 -613078 -606028 -609144 -558095 -511633
16349 -511633 -497587 -465342 -420079 -455071 -433343 -374438 -391717 -332463 -271612 -251218 -209761
16338 -209761 -171854 -130698 -87125 -56398 -21526 -67047 -46028 -11474 7256 30849 43395
16327 43395 103820 132695 153588 181962 187701 222330 234438 287850 314386 335930 343846 381667
16315 381667 383680 396273 400613 430299 451628 447945 538472 570670 556942 564927 636599 608508
16303 608508 596550 633144 698211 703707 705849 714439 748413 703539 748288 848319 854046 897431
16291 897431 944348 936405 926626 929064 982532 1060515 1029999 1046196 1059693 1122842 1144970 1175075
16279 1175075 1196364 1217262 1168325 1228419 1275468 1318766 1302896 1337678 1312546 1263431 1327463
16268 1327463 1401663 1417546 1408965 1452644 1454682 1514804 1513808 1525035 1481461 1515703 1514717 1490952
16256 1490952 1562532 1607148 1628145 1645586 1627977 1657555 1657427 1688065 1716539 1740802 1801585 1839039
16244 1839039 1865656 1880084 1877603 1857419 1876079 1892969 1943621 1901387 1926101 1953596 1941126
16233 1941126 1927245 1901172 2030963 1979317 1905385 1965236 2008442 1991723 2053474 2128193 2127204
16222 2127204 2104751 2005816 2046015 2078442 2115545 2133125 2163929 2237983 2287430 2252200 2222862
16211 2222862 2230135 2201602 2242777 2326969 2354405 2299584 2266561 2286513 2375620 2405994 2381586
16200 2381586 2364871 2351122 2392254 2366650 2369316 2408113 2430091 2475110 2456937 2393111 2383904 2403012
16188 2403012 2397973 2447389 2461267 2527281 2480439 2541217 2494309 2540807 2541976 2563158 2580862 2534843
16176 2534843 2519450 2565455 2541318 2547815 2562686 2567326 2525850 2582674 2606803 2577738 2560399 2560500
16164 2560500 2561439 2568676 2619296 2579323 2625130 2598967 2629925 2697499 2777570 2784806 2773557 2720654
16152 2720654 2790234 2823610 2773828 2806465 2802752 2755462 2721371 2711199 2756945 2784605 2731217
16141 2731217 2692064 2661299 2658421 2694491 2658672 2743992 2757802 2773711 2770944 2759569 2762583 2776741
16129 2776741 2774439 2772029 2739856 2684416 2670247 2775589 2815854 2841924 2858878 2894337 2909400
16118 2909400 2848754 2848780 2815230 2799650 2817786 2844908 2848892 2862848 2888796 2921549 2928867 2958089
16106 2958089 2936404 2922166 2849075 2863485 2875595 2868906 2875794 2846560 2810493 2865163 2928766 2893266
16094 2893266 2895815 2924164 2947216 2878585 2940143 2895552 2885462 2894761 2876015 2782886 2804013 2895409
16082 2895409 2947063 2944999 2946667 2954289 2973245 2999748 2975715 2900192 2888526 2913516 2943129 2966017
16070 2966017 2910303 2860680 2860357 2906483 2927481 2959203 2969880 2954770 2945272 2997913 3017117 2950778
16058 2950778 2888313 2981112 2914378 2865441 2962561 2945647 2902937 2923251 2933877 2950308 2966280
16047 2966280 2999669 2975428 2883904 2938850 2901890 2880833 2906910 2987025 3019957 3003253 3011350
16036 3011350 3009875 3039818 2954154 2952177 3022755 3006064 2978513 2915112 2989641 3091825 3038467
16025 3038467 3037241 3047677 2966981 2922004 2940544 2913628 2921387 3031967 2978165 2941448 2927223
16014 2927223 2932988 3029578 2980201 2970953 2988644 2992388 3053512 3024323 2977381 3024951 2989332 3000210
16002 3000210 2984037 2971936 2990999 2944960 3020696 3046502 3024993 3087169 3053907 3055116 3061322 3094177
15990 3094177 3081839 3037593 3007390 2996745 2960293 2994485 2982484 3044838 3063182 3004162 3007786
15979 3007786 3019896 2954494 3005066 2954802 2957101 2958038 3011926 3041743 3014703 3002475 2938991 2988640
15967 2988640 3054346 3004345 3022385 3015502 2940498 2936340 2931170 2943668 2935773 2921651 2956218 3001656
15955 3001656 2909763 2951207 2979203 3021438 3090696 2999184 2958367 2950281 2978911 3054175 3039311
15944 3039311 2977647 3006403 2957567 2947877 2967900 2945360 2918673 2922280 2930905 2975211 3005585 2929765
15932 2929765 2948828 2967305 2938559 2963677 2962397 2981017 3010602 3018986 3024424 3007078 2995081 3003200
$$ [...]
##END NTUPLES=NMR SPECTRUM
##END=
