##TITLE=1H_DE-80H_X3
 200.13MHz, d2o
 8 sc
 
 19ns.26.2.2025
##JCAMPDX= 6.0         $$ Bruker NMR JCAMP-DX V2.0
##DATA TYPE= NMR SPECTRUM
##DATA CLASS= NTUPLES
##ORIGIN= UXNMR, Bruker Analytische Messtechnik GmbH
##OWNER= pz
$$ XWIN-NMR		Version 3.5
$$ Wed Mar 11 10:31:27 2026 Russian Standard Time (UT+4h)  Yarkov@DPX200
##.OBSERVE FREQUENCY= 200.1313
##.OBSERVE NUCLEUS= ^1H
##.ACQUISITION MODE= SIMULTANEOUS
##.ACQUISITION SCHEME= undefined
##.AVERAGES= 8
##.DIGITISER RES= 18
##SPECTROMETER/DATA SYSTEM= spect
##.PULSE SEQUENCE= zg30
##.SOLVENT NAME= CDCl3
##.SHIFT REFERENCE= (INTERNAL, CDCl3, 0, 15.4593)
##AUDIT TRAIL= $$ (NUMBER, WHEN, WHO, WHERE, WHAT)
$$ ##TITLE= Audit trail, XWIN-NMR		Version 3.5
$$ ##JCAMPDX= 5.01
$$ ##ORIGIN= Bruker BioSpin GmbH
$$ ##OWNER= Yarkov
$$ C:/Bruker/XWIN-NMR/data/yarkov2/nmr/H-C/1/pdata/1/auditp.txt
$$ ##AUDIT TRAIL=  $$ (NUMBER, WHEN, WHO, WHERE, WHAT)
(   1,<2026-03-11 10:28:56.73 +0400>,<Yarkov>,<DPX200>,
      <created by zg, POWCHK disabled, PULCHK disabled
       configuration hash MD5:
       00 E9 B6 7A A2 85 ED C7 34 08 36 98 17 FE 4E 26
       data hash MD5: 16K
       DE 25 76 F1 A6 35 D5 5C A8 81 14 FB 92 D3 8E C4>)
(   2,<2026-03-11 10:30:02.59 +0400>,<Yarkov>,<DPX200>,
      <Start of raw data processing
       efp BC_mod = 2 LB = 0.25 FT_mod = 6 PKNL = 1 PHC0 = -5299.148 PHC1 = 6.821927 SI = 16K 
       data hash MD5: 16K
       D4 02 D0 17 AF 74 08 99 C9 8B D5 ED D2 FA 22 65>)
(   3,<2026-03-11 10:30:11.14 +0400>,<Yarkov>,<DPX200>,
      <abs ABSG = 5 
       data hash MD5: 16K
       D1 FC 82 A3 10 A0 7A 82 43 69 B6 67 CB 87 3F 14>)
$$ ##END=
$$ 
$$ hash MD5
$$ D3 EE EF 70 B0 22 87 60 7B 1F 28 27 DF A0 39 34
##$RELAX= 
##$RELAX= 
##$RELAX= 
##$RELAX= 
##$RELAX= 
##$RELAX= 
$$ Bruker specific parameters
$$ --------------------------
##$DU= <C:/Bruker/XWIN-NMR>
##$EXPNO= 1
##$NAME= <H-C>
##$PROCNO= 1
##$TYPE= <nmr>
##$USER= <yarkov2>
##$AMP= (0..31)
100 100 100 100 100 100 100 100 100 100 100 100 100 100 100 100 100 100 
100 100 100 100 100 100 100 100 100 100 100 100 100 100 
##$AQSEQ= 0
##$AQ_mod= 1
##$AUNM= <au_zg>
##$AUTOPOS= <>
##$BF1= 200.13
##$BF2= 200.13
##$BF3= 200.13
##$BF4= 200.13
##$BF5= 200.13
##$BF6= 200.13
##$BF7= 200.13
##$BF8= 200.13
##$BYTORDA= 1
##$CFDGTYP= 0
##$CFRGTYP= 5
##$CHEMSTR= <none>
##$CNST= (0..31)
1 1 145 1 1 1 1 1 1 1 1 1 1 1 1 1 1 1 1 1 1 1 1 1 1 1 1 1 1 1 1 1 
##$CPDPRG= <>
##$CPDPRG1= <>
##$CPDPRG2= <>
##$CPDPRG3= <>
##$CPDPRG4= <mlev>
##$CPDPRG5= <mlev>
##$CPDPRG6= <mlev>
##$CPDPRG7= <mlev>
##$CPDPRG8= <mlev>
##$CPDPRGB= <>
##$CPDPRGT= <>
##$D= (0..31)
0 0.7 0 0 0 0 0 0 0 0 0 0.03 0 0 0 0 0 0 0 0 0 0 0 0 0 0 0 0 0 0 0 0 
##$DATE= 1773210536
##$DBL= (0..7)
120 120 120 120 120 120 120 120 
##$DBP= (0..7)
150 150 150 150 150 150 150 150 
##$DBP07= 0
##$DBPNAM0= <>
##$DBPNAM1= <>
##$DBPNAM2= <>
##$DBPNAM3= <>
##$DBPNAM4= <>
##$DBPNAM5= <>
##$DBPNAM6= <>
##$DBPNAM7= <>
##$DBPOAL= (0..7)
0.5 0.5 0.5 0.5 0.5 0.5 0.5 0.5 
##$DBPOFFS= (0..7)
0 0 0 0 0 0 0 0 
##$DE= 6
$$ [...]
##$SUBNAM3= <"">
##$SUBNAM4= <"">
##$SUBNAM5= <"">
##$SUBNAM6= <"">
##$SUBNAM7= <"">
##$SUBNAM8= <"">
##$SUBNAM9= <"">
##$SW= 18.0517328524113
##$SWIBOX= (0..15)
0 0 2 0 0 0 0 0 0 0 0 0 0 0 0 0 
##$SW_h= 3612.71676300578
##$TD= 16384
##$TD0= 1
##$TE= 0
##$TE2= 300
##$TE3= 300
##$TEG= 300
##$TL= (0..7)
0 120 120 120 120 120 120 120 
##$TP= (0..7)
150 150 150 150 150 150 150 150 
##$TP07= 0
##$TPNAME0= <>
##$TPNAME1= <>
##$TPNAME2= <>
##$TPNAME3= <>
##$TPNAME4= <>
##$TPNAME5= <>
##$TPNAME6= <>
##$TPNAME7= <>
##$TPOAL= (0..7)
0.5 0.5 0.5 0.5 0.5 0.5 0.5 0.5 
##$TPOFFS= (0..7)
0 0 0 0 0 0 0 0 
##$TUNHIN= 0
##$TUNHOUT= 0
##$TUNXOUT= 0
##$USERA1= <user>
##$USERA2= <user>
##$USERA3= <user>
##$USERA4= <user>
##$USERA5= <user>
##$V9= 5
##$VALIST= <valist>
##$VCLIST= <CCCCCCCCCCCCCCC>
##$VD= 0
##$VDLIST= <DDDDDDDDDDDDDDD>
##$VPLIST= <PPPPPPPPPPPPPPP>
##$VTLIST= <TTTTTTTTTTTTTTT>
##$WBST= 1024
##$WBSW= 4
##$XGAIN= (0..3)
0 0 0 0 
##$XL= 0
##$YL= 0
##$YMAX_a= 467031
##$YMIN_a= -449011
##$ZGOPTNS= <>
##$ZL1= 120
##$ZL2= 120
##$ZL3= 120
##$ZL4= 120
##$ABSF1= 15.44169
##$ABSF2= -2.610159
##$ABSG= 5
##$ABSL= 3
##$ALPHA= 0
##$AQORDER= 0
##$ASSFAC= 0
##$ASSFACI= 0
##$ASSFACX= 0
##$ASSWID= 0
##$AUNMP= <proc_1d>
##$AZFE= 0.1
##$AZFW= 0.1
##$BCFW= 0
##$BC_mod= 2
##$BYTORDP= 0
##$COROFFS= 0
##$CY= -3
##$DATMOD= 1
##$DC= 0
##$DFILT= <>
##$DTYPP= 0
##$F1P= 0
##$F2P= 0
##$FCOR= 1
##$FTSIZE= 16384
##$FT_mod= 6
##$GAMMA= 0
##$GB= 0
##$INTBC= 1
##$INTSCL= 3.241238e-09
##$ISEN= 128
##$LB= 0.25
##$LEV0= 0
##$LPBIN= 0
##$MAXI= 10000
##$MC2= 0
##$MEAN= 0
##$ME_mod= 0
##$MI= 1.114404
##$NCOEF= 0
##$NC_proc= -6
##$NLEV= 6
##$NOISF1= 3.799351
##$NOISF2= 2.8
##$NSP= 0
##$NTH_PI= 0
##$NZP= 0
##$OFFSET= 15.45932
##$PC= 1
##$PHC0= -5299.148
##$PHC1= 6.821927
##$PH_mod= 1
##$PKNL= yes
##$PPARMOD= 0
##$PSCAL= 0
##$PSIGN= 0
##$REVERSE= no
##$SF= 200.130012484377
##$SI= 16384
##$SIGF1= 3
##$SIGF2= 2
##$SINO= 0.751879
##$SIOLD= 32768
##$SREGLST= <19F.Aceton>
##$SSB= 0
##$STSI= 16384
##$STSR= 0
##$SW_p= 3612.71676300578
##$SYMM= 0
##$S_DEV= 0
##$TDeff= 16384
##$TDoff= 0
##$TI= <>
##$TILT= no
##$TM1= 0
##$TM2= 0
##$TOPLEV= 0
##$USERP1= <user>
##$USERP2= <user>
##$USERP3= <user>
##$USERP4= <user>
##$USERP5= <user>
##$WDW= 1
##$XDIM= 16384
##$YMAX_p= 344840614
##$YMIN_p= -766860
$$ End of Bruker specific parameters
$$ ---------------------------------
##NTUPLES= NMR SPECTRUM
##VAR_NAME=  FREQUENCY,     SPECTRUM/REAL,   SPECTRUM/IMAG
##SYMBOL=    X,             R,               I
##VAR_TYPE=  INDEPENDENT,   DEPENDENT,       DEPENDENT
##VAR_FORM=  AFFN,          ASDF,            ASDF
##VAR_DIM=   16384,         16384,           16384
##UNITS=     HZ,            ARBITRARY UNITS, ARBITRARY UNITS
##FACTOR=    0.220516191357247, 1,           1
##FIRST=     3093.87391828074, 0,            0
##LAST=      -518.842844725039, 0,           0
##MIN=       -518.842844725039, -766860,     0
##MAX=       3093.87391828074, 344840614,    0
$$ Real data points
##PAGE= N=1
##DATA TABLE= (X++(R..R)), XYDATA
$$ [...]
5933A0001913O054L4130R8785J41546J63168K48674K57058K24537J46849Q1602
5923A1404316J8586O2317r3306k36406k23339k63134k64388p0170j2256N8658
5913A0380878J30684K66646L97355L52774J97512K34245K00940P9758j66509l39128
5903A1735155l68673l35429l18846k88238j56506j2839R8343K01572P3808L9031
5893A0667378m7284o0753j49279j55023n4491p4586p3150j94869k73696k25579
5883I358668j70799p5460P2574L6767j0920k8016j60385k86224m04926l31692
5873G999587j17889l4197P0765j410j02205j14743k34225k75218k54255l19858
5863F616352j91944j71077j00142j25861j53703q7333j48790j81467j59753o5319
$$ y = [10001913, 10007967, 10042097, 10140882, 10282428, 10445596, 10694270, 10951328, 11175865, 11322714, 11404316, 11422902, 11485219, 11391913, 11155507, 10932168, 10669034, 10404646, 10334476, 10322220, 10380878, 10511562, 10778208, 11175563, 11528337, 11725849, 11960094, 12161034, 12240792, 12074283, 11735155, 11366482, 11031053, 10712207, 10423969, 10267463, 10254624, 10352967, 10554539, 10628347, 10667378, 10620094, 10559341, 10410062, 10255039, 10200548, 10125962, 10052812, 9857943, 9584247, 9358668, 9187869, 9112409, 9184983, 9221750, 9210830, 9182814, 9022429, 8736205, 8331279, 7999587, 7881698, 7847501, 7918266, 7916856, 7814651, 7699908, 7465683, 7190465, 6936210, 6616352, 6424408, 6253331, 6153189, 6027328, 5873625, 5786292, 5637502, 5456035, 5296282, 5230963]
5853E230963j79231j19554j80557k05520j96364j88712j61992j15358j1258q5534
5843C786883J6763n9169j29164m5687j01697j95009j28991j54632r9358q1459
5833B808480j26131o2946l9044q9051j58604q6319r2535j44190j5803n3261n4171
5822A886425m0260m5762q9603J1773m2105o4655l3220o0393p4066l0386r561J27827
5810A536014o7315j08987J6624m1137L6731J698o9801k3900k5782j48022j7185
5799A088938l0024j294J5940K5167L6455j10169M4065J4588m1432p4033N5851
5788A024052k9524J2182K6073k6418M6434L9052J8450N3076L6081m4556M2501
5777A197403p0569j5921n9585n475m2145L849l62p3060k4549N944j6119l2937
$$ y = [5230963, 5051732, 4932178, 4751621, 4546101, 4349737, 4161025, 3999033, 3883675, 3872417, 3786883, 3803646, 3744477, 3615313, 3569626, 3467929, 3272920, 3143929, 2989297, 2889939, 2808480, 2682349, 2619403, 2580359, 2491308, 2332704, 2246385, 2153850, 2009660, 1993857, 1940596, 1886425, 1846165, 1800403, 1710800, 1722573, 1680468, 1615813, 1582593, 1522200, 1448134, 1417748, 1408187, 1536014, 1468699, 1359712, 1376336, 1335199, 1371930, 1373628, 1303827, 1279927, 1254145, 1106123, 1088938, 1058914, 1057620, 1073560, 1098727, 1135182, 1025013, 1069078, 1083666, 1042234, 968201, 1024052, 994528, 1006710, 1032783, 1006365, 1052799, 1091851, 1110301, 1163377, 1199458, 1154902, 1197403, 1126834, 1110913, 1051328, 1045853, 1003708, 1007557, 1007195, 934135, 909586, 915530, 899411, 866474]
5765H66474Q3290L1352n1610K5949K9183J01606O5593J13006Q6583R439q1556
5754A279309r9326l2473k8309j780p6151o4160m6553k0378p899L406J5046j7929
5742I02803K1507K678o1723J4767k8600N4155J34198r17J0268L0667l6400p7554
5730I65849j5996j3017n1340p261J8545n8538l0143k2080n4841M0367O1893L214
5718H36652j6487J6874P5991l2733n941m8720N926N2621N7311M966o056K867k739
5705I40532L3368k7130O535n1473P45k7850J12344j6188j6334l8218m9121P8756
5693I45966Q371l0414o6398J4535N6117M9867p3770Q3730O1523J7366o397o4822
5681I95674O5327J67l593K0663L417R863k8716J1815k6659Q853r2m2481N1198
$$ y = [866474, 949764, 981116, 929506, 955455, 984638, 1086244, 1151837, 1264843, 1351426, 1360865, 1279309, 1179983, 1147510, 1119201, 1117421, 1041270, 977110, 930557, 910179, 902280, 905686, 920732, 902803, 924310, 926988, 865265, 880032, 851432, 905587, 1039785, 1038868, 1049136, 1079803, 1043403, 965849, 949853, 936836, 885496, 878235, 896780, 838242, 808099, 786019, 731178, 771545, 833438, 836652, 820165, 837039, 913030, 880297, 874356, 825636, 831562, 884183, 941494, 946460, 940404, 943271, 940532, 973900, 946770, 953305, 901832, 902577, 874727, 987071, 970883, 954549, 916331, 867210, 945966, 954337, 923923, 857525, 872060, 928177, 978044, 904274, 988004, 1049527, 1066893, 1060496, 995674, 1061001, 1061168, 1057575, 1078238, 1081655, 1091518, 1062802, 1074617, 1047958, 1056811, 1056719, 1014238, 1065436]
5668A065436l871m0974n5510R7082m306o0048n0122k4538k739l2372R1023N452
5656I84513o0446J0252K892m818K3358m9682l449Q2503J9073L3564o3115o378
5644I68267J3825k897M8748r316l7462k496n0017J7300L3130n9304J3197j9201
5632I13774j02748l9070R0946J5477L5490L7183K5879r152o0398j5154k3296N6251
5620I25182k6477L1748M9101j30096O4434p2129q01J7038k5563r273P1268K7519
5608I21951m2454J1788m4395N054L6966m4625P0220J8777l6735l7992o573L0073
5596H82055j6234N3379L5282n711n1740K2519m0765o872N0042p561J0307K1515
5584I46216K7132J8858n3901N1731n848q6658j0350j6015L2988k9127k6647M7037
$$ y = [1065436, 1061565, 1020591, 965081, 1062163, 1057857, 997809, 947687, 923149, 920410, 888038, 979061, 984513, 924067, 934319, 937211, 932393, 955751, 906069, 902620, 985123, 1004196, 1037760, 974645, 968267, 982092, 979195, 1027943, 1018627, 981165, 978669, 928652, 945952, 979082, 919778, 932975, 913774, 811026, 771956, 862902, 878379, 913869, 951052, 976931, 967779, 907381, 892227, 868931, 925182, 898705, 930453, 979554, 849458, 913892, 841763, 840962, 858000, 832437, 823164, 894432, 921951, 879497, 891285, 846890, 851944, 888910, 844285, 914505, 933282, 896547, 858555, 851982, 882055, 865821, 919200, 954482, 948771, 897031, 919550, 878785, 871913, 921955, 914394, 924701, 946216, 973348, 992206, 938305, 990036, 984188, 897530, 887180, 871165, 904153, 875026, 848379, 895416]
5572H95416O595k2726O0055j5724j11151l434j1873R0882K4780k9483M5279n352
5560I23264J9522N8645K6462k9776k4609N959P720J8496q7315n3423P988M1799
5548I14732j5013l7311J4912m0363O4485M1146L290k8741k703N4388p9281k3032
5536H66509j6808J9480K5532j988K4082k8728J6906j2941n110p372n0124L1519
5524H60957l6532K6265k6034M882n5805k8466L4279Q6637j3175K977k6932k5892
5512H03161R1875L6181p0600k5954O3715n3087M5111k7021P58q342o6231O8597
5500H58163J5620n1915m3138K8001j077K3544M5677m4068o4484K1978O0674j2423
5488H36552N0998J3957j3911l1240J2706p7689k1074M6489J8151J531l4511J4093
$$ y = [895416, 902011, 879285, 939340, 923616, 812465, 809031, 797158, 888040, 912820, 883337, 928616, 923264, 942786, 1001431, 1027893, 998117, 973508, 979467, 987187, 1005683, 918368, 864945, 872933, 914732, 899719, 862408, 877320, 836957, 901442, 942588, 945878, 917137, 914434, 968822, 889541, 866509, 849701, 869181, 894713, 892725, 916807, 888079, 904985, 892044, 886934, 879562, 829438, 860957, 824425, 850690, 824656, 829538, 773733, 745267, 779546, 866183, 853008, 855985, 829053, 803161, 895036, 931217, 860617, 834663, 898378, 845291, 890402, 863381, 864139, 855797, 789566, 858163, 873783, 821868, 778730, 806731, 805654, 829198, 874875, 830807, 766323, 788301, 848975, 836552, 887550, 901507, 887596, 856356, 869062, 791373, 770299, 816788, 834939, 836470, 801959, 816052]
5476H16052p587j5433Q3705N1921q315M8652m4589k2820o084O3372K0335m1312
5464I37897L0747K1374R730R0250N6391j36264l1983O6458P7466p8578l2392k154
5452A008942L1682j5170O643o2109J0333P8178j3391k9579Q463K045N081m1788
5440I89330o1275J886k1310J1689j734k644M2731K384K5735L815k9930J9817P318
5427I87812O7066K9321q251j2776L3055J6754J6276j6517K693J5617P162L0841
5415A169053L4154m1353k6124j1649n9012j8251k0905O9784P8318J2029R102q7586
5403A107560m0494J04908J5334o714n3303l8396k5139Q1197N7102J6729M3275
5392A262059J1879j8598j2138j0360P789L7565P1873r986l3427n9339l9424j9188
$$ y = [816052, 808465, 793032, 876737, 928658, 920343, 968995, 924406, 901586, 895502, 958874, 979209, 937897, 968644, 990018, 999748, 1089998, 1146389, 1010125, 978142, 1044600, 1122066, 1043488, 1011096, 1008942, 1040624, 1025454, 1032097, 969988, 980321, 1058499, 1045108, 1015529, 1023992, 1026037, 1031118, 989330, 928055, 929941, 908631, 920320, 918586, 915942, 958673, 961057, 986792, 990607, 960677, 980494, 987812, 1054878, 1084199, 1075948, 1063172, 1096227, 1112981, 1129257, 1112740, 1115433, 1131050, 1138212, 1169053, 1203207, 1161854, 1135730, 1124081, 1065069, 1046818, 1025913, 1095697, 1174015, 1186044, 1195146, 1107560, 1067066, 1171974, 1187308, 1180594, 1127291, 1088895, 1063756, 1144953, 1202055, 1218784, 1262059, 1273938, 1255340, 1243202, 1232842, 1240631, 1278196, 1350069, 1340083, 1306656, 1247317, 1207893, 1188705]
5380A188705P0261N4455J8566K7145p2291p369P8582Q8569K7452J3461o013J1469
5368A492992j0298R424k116J2330m3139L5388L5081M1992M7373m2716l8541j1012
5356A526758M9424J18301O7727M7723k5362n1284J038N6843l8985K6697r851K7316
5344A796345m8970L1453j6926k402J2369M8519L0314q5537J4915L2446M5806k1326
5332A837006K1885R6631J6066m0723p4321l1413N2951N9131p4314l8398P7343
5321A901844l2596K1843M7269N3328K9579N852p679j5331K8689j3182o2766K2076
5309A978926J8034M2520N1401K7901K9246j5331k7782M8517N9261l41j6721j211
5297B194420K6441P303J11102Q7891l2870N2140O6082n4007k9460M2265j6126
$$ y = [1188705, 1258966, 1313421, 1331987, 1359132, 1286841, 1279472, 1358054, 1446623, 1474075, 1487536, 1481523, 1492992, 1482694, 1492118, 1490002, 1502332, 1459193, 1494581, 1529662, 1571654, 1619027, 1576311, 1537770, 1526758, 1576182, 1694483, 1762210, 1809933, 1784571, 1733287, 1734325, 1791168, 1752183, 1778880, 1769029, 1796345, 1747375, 1778828, 1761902, 1759500, 1771869, 1820388, 1850702, 1765165, 1780080, 1812526, 1858332, 1837006, 1858891, 1955522, 1971588, 1930865, 1856544, 1825131, 1878082, 1937213, 1862899, 1824501, 1901844, 1869248, 1891091, 1938360, 1991688, 2021267, 2027119, 2019440, 2004109, 2032798, 2019616, 1956850, 1978926, 1996960, 2039480, 2090881, 2118782, 2148028, 2132697, 2104915, 2153432, 2212693, 2212352, 2195631, 2194420, 2220861, 2228164, 2339266, 2427157, 2394287, 2446427, 2512509, 2458502, 2429042, 2471307, 2455181]
5286B455181M2057R6673O7318O6989M3726J21114R9990P6456O6420P4033O5424
5275C275381J41913J01167J00698J20093J63931J83094K14280L42873L33706N32206
5265E509342P80572J124077J363348J240348N58588j06501m90709n10167m30851
5256I038047j40309R4997L91933Q87584J449981J967608K114221J778969J389849
5247A8972880Q26739M76489L41912J75290j32726k61414r0998J39033N1911j7623
5237B0481493K86317O28136O93765O21227O88220R39864J169002J298542J000109
5228B7806675K70505n27758j100525j255955j035796n08044m41286p31588q54783
5219B1621445n32340l29521m30864o04285l52409J712K1249J83834L05523K14534
$$ y = [2455181, 2497238, 2593911, 2661229, 2728218, 2771944, 2893058, 2993048, 3069504, 3135924, 3209957, 3275381, 3417294, 3518461, 3619159, 3739252, 3903183, 4086277, 4300557, 4643430, 4977136, 5509342, 6289914, 7413991, 8777339, 10017687, 10576275, 10469774, 9979065, 9468898, 9038047, 8897738, 8992735, 9384668, 10272252, 11722233, 13689841, 15804062, 17583031, 18972880, 19799619, 20276108, 20618020, 20793310, 20660584, 20399170, 20308172, 20447205, 20499116, 20481493, 20767810, 21395946, 22089711, 22710938, 23399158, 24339022, 25508024, 26806566, 27806675, 28077180, 27549422, 26448897, 25192942, 24157146, 23649102, 23207816, 22476228, 21621445, 21089105, 20759584, 20328720, 19724435, 19372026, 19373738, 19394987, 19578821, 19884344, 20098878]
5209B0098878j03752o99628j278264j934543k164037j984127j519577j082990
5201I331960p52605m86384l82N04034P50819P46753J69936n84922j053925j142841
5191G482443r94817q11982o21326n59379l44478k57603j85265j77501k69722p9673
5181C180697j37405p162n1422q9335n3606j14209k7656o3971J7354J3924n2649
5170B614560j3262n8065j4971J9024q0737n5053j3500J0099j2103k8432M4464
5159B412024Q0739M0065r0326P249k4790k7506p320K449k1469J876j0349N209
5147B367851m4771J3587J4268N126k7788k1876K8739m0060M7208j3991M7196Q560
5135B384049j3512n2469J7970K851L7485L9081l7611o71j9626j3416K2296k9168
$$ y = [20098878, 19995126, 19295498, 18017234, 16082691, 13918654, 11934527, 10414950, 9331960, 8579355, 8092971, 8092589, 8596623, 9347442, 10094195, 10264131, 9679209, 8625284, 7482443, 6487626, 5675644, 5054318, 4494939, 4150461, 3892858, 3707593, 3530092, 3260370, 3180697, 3043292, 3036130, 2984708, 2895373, 2841767, 2727558, 2699902, 2635931, 2653285, 2667209, 2614560, 2601298, 2543233, 2528262, 2547286, 2466549, 2411496, 2397996, 2408095, 2395992, 2367560, 2412024, 2492763, 2532828, 2442502, 2449751, 2424961, 2397455, 2390135, 2392584, 2371115, 2372991, 2362642, 2367851, 2323080, 2336667, 2350935, 2356061, 2328273, 2306397, 2335136, 2295076, 2342284, 2328293, 2375489, 2384049, 2370537, 2318068, 2336038, 2338889, 2376374, 2415455, 2377844, 2377173, 2357547, 2344131, 2366427, 2337259]
5123B337259j1206Q7272M1575p09j4039n7218M8765P913j0477p681l9664J4172
5111B395962J50685m7035l4137L7340L0494K8107L5979o88k4438l664j4596o4409
5099B489600K8771N042o512M8954O012M1768J4152M8727O6741L5250l660M7562
5087B822407K7020j1430J1762L9007K0380l8742N3347K5009K1032R212k052O3535
5075C040487P1238j729j3616k3509k8754J2265K3058Q9155N0729O297M3469O8205
5063C337295J8827O9383L2063R779J03349J48193Q0117Q4031K4113N0134O472
5052C963756L2319J5933M2485n5758J727n894L728K6499N8842J8433J6245L5924
5040D154239K3747P5833J83841Q0761K6286J31712J7187K8268J13810J39046J56708
$$ y = [2337259, 2326053, 2413325, 2454900, 2454191, 2440152, 2382934, 2431699, 2439612, 2429135, 2421454, 2381790, 2395962, 2546647, 2499612, 2465475, 2502815, 2533309, 2561416, 2597395, 2596707, 2572269, 2568605, 2554009, 2489600, 2518371, 2523413, 2516901, 2565855, 2571867, 2613635, 2627787, 2676514, 2743255, 2778505, 2774845, 2822407, 2849427, 2837997, 2849759, 2888766, 2909146, 2870404, 2923751, 2948760, 2969792, 2979004, 2976952, 3040487, 3111725, 3109996, 3096380, 3072871, 3044117, 3056382, 3079440, 3168595, 3219324, 3225621, 3269090, 3337295, 3356122, 3425505, 3457568, 3467347, 3570696, 3718889, 3799006, 3883037, 3907150, 3957284, 3963756, 3996075, 4012008, 4054493, 3998735, 4000462, 3994568, 3998296, 4024795, 4083637, 4102070, 4118315, 4154239, 4177986, 4253819, 4437660, 4518421, 4544707, 4676419, 4693606, 4721874, 4835684, 4974730, 5131438]
5029E131438J20905J28942J92757K35699L06027L98015M59275O05684R07518J224055
5019I710315J363136J207301O76843J57848l07774m65583l14381Q1455N03591
5010A2612751P60637P03688Q0570m38321q74585r53133r02456n24112j74477P8466
5000A0369028N56745J018604J201331J015864L78533k53781m58098n79605l51141
4991A2897480J72503N59672O90695M33755k32822q32711j087346j093891r78028
4982A0529307q21298n85700k83567k28911p8382P2821J56992K68618M59139P20287
4972A0209306J157286J604080J725626J321954M59552k68663n56660n27545k42303
4963A4882633L75076R52598J061630O89997n3752p66445j164947j118038q20916
$$ y = [5131438, 5252343, 5381285, 5574042, 5809741, 6115768, 6513783, 6973058, 7578742, 8486260, 9710315, 11073451, 12280752, 12957595, 13115443, 12807669, 12342086, 12027705, 12109160, 12612751, 13373388, 14077076, 14157646, 13719325, 12844740, 11891607, 10989151, 10465039, 10290562, 10369028, 10925773, 11944377, 13145708, 14161572, 14540105, 14286324, 13828226, 13248621, 12897480, 13069983, 13629655, 14320350, 14754105, 14521283, 13688572, 12601226, 11507335, 10529307, 9708009, 9122309, 8838742, 8609831, 8531449, 8604270, 8761262, 9029880, 9489019, 10209306, 11366592, 12970672, 14696298, 16018252, 16477804, 16209141, 15652481, 15124936, 14882633, 15257709, 16210307, 17271937, 17961934, 17908182, 17141737, 15976790, 14858752, 14037836]
4954A4037836n18543k4715M27324Q78570J323848J366312Q50996J18337n34375
4945A7925590p79607o80766j70876L94369P86663Q61742K93803n58397j260601
4936A6811920j471566j400957j220314r07050o74002m89248l72093j77664r4283
4927A0004743p366K3610J49764J76565J44177J96250K39670K09828K90904K64238
4917A1692383L80153N04154N86114N31681L95472J86857j50192l20705m20607
4908A3385310l60734l11179k90934q7335j4316M3664J59856L59725N21269N79460
4898A3984786P25050O96585N16977J92651r7145k73061k36235k39957k16796Q5171
4888A5138026J26286J27101K14809L81503M40596N41503N50206O60622Q23672
$$ y = [14037836, 13519293, 13494578, 13921902, 14800472, 16124320, 17490632, 18341628, 18459965, 17925590, 17145983, 16465217, 16294341, 16688710, 17475373, 18337115, 18630918, 18072521, 16811920, 15340354, 13939397, 12719083, 11812033, 11138031, 10648783, 10276690, 10099026, 10004743, 9997377, 10020987, 10170751, 10347316, 10491493, 10687743, 10927413, 11137241, 11428145, 11692383, 12072536, 12576690, 13162804, 13694485, 14089957, 14276814, 14126622, 13805917, 13385310, 13024576, 12713397, 12422463, 12335128, 12320812, 12364476, 12524332, 12884057, 13405326, 13984786, 14709836, 15406421, 15923398, 16116049, 16018904, 15745843, 15509608, 15269651, 15052855, 15138026, 15264312, 15391413, 15606222, 15987725, 16428321, 16969824, 17520030, 18180652, 19004324]
4879A9004324Q80623R05402R27459J090287J108410J027359J090556J112243J059003
4870B8205666J063045J032692J036075J273837J580497K098653L075207M649149
4862D4014821O470940P198105N595357K065219j198215l072053l214928k556156
4854E5303090j551252p49801L9019N76326R65513J260913J625402K168784L206371
4845F2844365M720931O456069P097078O096597M301027L097809J670231q77982
4837I5406125m084638o281654o670558n526869l956936k505108j345654n97230
4829F4437478L3286O91704J490436K358449L272835M250038N662925O646948N953008
4820I4797107K785185r64920l576934m445417m116068l474135k931920k635292
$$ y = [19004324, 19884947, 20790349, 21717808, 22808095, 23916505, 24943864, 26034420, 27146663, 28205666, 29268711, 30301403, 31337478, 32611315, 34191812, 36290465, 39365672, 44014821, 50485761, 57683866, 63279223, 65344442, 64146227, 61074174, 57859246, 55303090, 53751838, 53002037, 53041056, 53617382, 54582895, 55843808, 57469210, 59637994, 62844365, 67565296, 74021365, 81118443, 87215040, 91516067, 94613876, 96284107, 95406125, 91321487, 85039833, 78369275, 72842406, 68885470, 66380362, 65034708, 64437478, 64470764, 65162468, 66652904, 69011353, 72284188, 76534226, 82197151, 88844099, 94797107, 97582292, 96617372, 93040438, 88595021, 84478953, 81004818, 78072898, 75437606]
4812G5437606k423305k128354j763013j287686o41102o2265N03848J124563J599073
4803G0359365J915989K145847K461490K852810L455145L841869L972495L690281
4795I4695291K883722J959496J137823N92879K98663M5260l09224q46647j491562
4786I8965701k071363k388266k419107j991020j412684p14852j60710O9230M46515
4777H8323444O90856P32933O13927K31203n7420k98169j31313Q4652M13852P82107
4767I1386072R89229J523851K256462L128455L821828M120860L811314K859625
4759A13897696J526917J61579o57258j155417j385279j765713k493888l444411
4751A04684226m568602n216196n321554n081882m528769m054582l535644l078105
$$ y = [75437606, 73014301, 70885947, 69122934, 67835248, 67194146, 67131881, 67635729, 68760292, 70359365, 72275354, 74421201, 76882691, 79735501, 83190646, 87032515, 91005010, 94695291, 97579013, 99538509, 100676332, 101269211, 101567874, 101613134, 101303910, 100457263, 98965701, 96894338, 94506072, 92086965, 90095945, 88683261, 87968409, 87807699, 87876929, 88323444, 89014300, 89747233, 90361160, 90592363, 90534943, 90236774, 90105461, 90190113, 90603965, 91386072, 92375301, 93899152, 96155614, 99284069, 103105897, 107226757, 111038071, 113897696, 115424613, 115586192, 114928934, 113773517, 112388238, 110622525, 108128637, 104684226, 100115624, 94899428, 89577874, 84495992, 79967223, 75912641, 72376997, 69298892]
4743F9298892k637155k302095j850302j452793j051895n63570j29038J39315L57534
4734E9808893M33254J23470l21439o06033p81025q82658r71794j260496j823212
4725E3718960k451418k965215l279269l131204k968555k669263k516555k427102
4717C1310379k276746k191947k059126j878116j497906j273736j066636p85932
4709A8280234m51647l29693k46682L0052J17524L82073O03687P39836P43762O51658
4699B0520804K63172j44468m90001p17855q24097q54943r08394r09703q98836
4690A5035679q01611p95990o58190m58840l12371l77087k43513j13435j20626
4681A1154016p583j214R5842J55142L22230M29033O24833O65383O85083P42674
$$ y = [69298892, 66661737, 64359642, 62509340, 61056547, 60004652, 59441082, 59312044, 59451359, 59808893, 60242147, 60365617, 60044178, 59438145, 58657120, 57774462, 56802668, 55542172, 53718960, 51267542, 48302327, 45023058, 41891854, 38923299, 36254036, 33737481, 31310379, 29033633, 26841686, 24782560, 22904444, 21406538, 20132802, 19066166, 18280234, 17828587, 17498894, 17252212, 17282264, 17399788, 17781861, 18385548, 19125384, 19869146, 20520804, 20783976, 20639508, 20149507, 19431652, 18607555, 17752612, 16844218, 15934515, 15035679, 14234068, 13438078, 12779888, 12321048, 12008677, 11631590, 11388077, 11274642, 11154016, 11146433, 11145219, 11241061, 11396203, 11718433, 12147466, 12772299, 13437682, 14122765, 14865439]
4671A4865439O78051O17944M57690M30796N68629Q44553J089608J004843M95719
4662B1053272K0997m54599q01553r63285q01004o41058m81281k98828l26201k79704
4652A6026756k84082m67243n33324m57287m12865k97494j81953j88476k54874
4643A2949158m02521m22047k95473j82438K0942J15903K00976M44641N89982Q19143
4633A3838266R45027R50644R73148O44010L35868j61919m55206o39551p41790
4624A5688497p05431o76455o35365n27953m51185j89368o2222R5969J80008J53981
4614A2870476J92086K11709L28964M11525M78617J50546k92892n68089p93690
4605A2989252p65926p06265n00330k46598j14528L724M7628J76253Q4576m1044
$$ y = [14865439, 15543490, 16161434, 16619124, 17049920, 17618549, 18463102, 19552710, 20557553, 21053272, 21074269, 20619670, 19818117, 18854832, 18053828, 17412770, 16931489, 16632661, 16306460, 16026756, 15742674, 15275431, 14742107, 14284820, 13871955, 13574461, 13392508, 13204032, 12949158, 12546637, 12124590, 11829117, 11646679, 11667621, 11783524, 11984500, 12429141, 13019123, 13838266, 14783293, 15733937, 16707085, 17351095, 17686963, 17525044, 17069838, 16430287, 15688497, 14983066, 14306611, 13671246, 13143293, 12692108, 12502740, 12440518, 12536487, 12716495, 12870476, 13062562, 13274271, 13603235, 14014760, 14493377, 14643923, 14351031, 13782942, 12989252, 12223326, 11517061, 11016731, 10770133, 10655605, 10659329, 10706957, 10883210, 10967786, 10926742]
4595A0926742N8642M8595P5217O3398O1759N6385m0640j94273l25764l18560l23846
4584A0087655k20892j40825p2330L5947J68651K99627M27282M99864N92232N87712
4574A2264923M27458L52788L40435L08364L89549M67776M69972O24570O67224
4565A6313059R02835J238558J789140K839950M439163N638553N260438K797962
4557D1219658p26077l384493m349767l879816k786782j565603p6732J666733L502583
4548B9619704M853354M399512J766643j392624l425861m059863l256897j686827
4540B6817141L77256K482759L973469L470950J029733j711016l589591m169275
4532B8681426l554714k614860j456150j71564J312140L043090L880983K775323
$$ y = [10926742, 10985384, 11033979, 11109196, 11172594, 11234353, 11290738, 11250098, 11055825, 10730061, 10411501, 10087655, 9866763, 9725938, 9653608, 9689555, 9858206, 10157833, 10585115, 11084979, 11677211, 12264923, 12692381, 13045169, 13385604, 13693968, 14083517, 14551293, 15021265, 15645835, 16313059, 17215894, 18454452, 20243592, 23083542, 27522705, 33161258, 38421696, 41219658, 40493581, 37109088, 32759321, 28879505, 26092723, 24527120, 24450388, 26117121, 29619704, 34473058, 38872570, 40639213, 39246589, 35820728, 31760865, 28503968, 26817141, 27194397, 29677156, 33650625, 37121575, 38151308, 36440292, 32850701, 28681426, 25126712, 22511852, 21055702, 20884138, 22196278, 25239368, 29120351, 31895674]
4524C1895674K08770k393123m068044m394141l717054k845894k233806j703168
4516A0749214j240111r36388p51914n84791m20235l27853j91279k09724k55967
4507E830952j59026r5480q6505j26952j31417l3456o7309j23481p3817n7823o6625
4496D809061p6669r2023o8282l7427j14779n0976r885l1591q311N4600l3958r2554
4484D247206p5474R49o6274o0679P722K7349Q2357K6024P3159p1642n7726M2223
4472D175194m5345l2994l6304J8838R3261n998j8293m3454K3191O39r6087k6553
4460D006095L8307Q2259K8182L9756L8511o0549o4211n1464k9265L9074j3091
4449D053604m469q0289O660L8421L3478Q6559J7075l856N5716L5718n4500j8983
$$ y = [31895674, 32104444, 29711321, 25643277, 21249136, 17532082, 14686188, 12452382, 10749214, 9509103, 8572715, 7820801, 7236010, 6815775, 6487922, 6296643, 6086919, 5830952, 5671926, 5576446, 5489941, 5362989, 5231572, 5198116, 5130807, 5007326, 4933509, 4875686, 4809061, 4732392, 4640369, 4572087, 4534660, 4419881, 4368905, 4359020, 4327429, 4319118, 4373718, 4339760, 4247206, 4171732, 4172681, 4106407, 4045728, 4053450, 4080799, 4163156, 4189180, 4262339, 4190697, 4132971, 4175194, 4129849, 4096855, 4060551, 4079389, 4172650, 4166652, 4148359, 4104905, 4128096, 4128735, 4032648, 4006095, 4044402, 4126661, 4154843, 4194599, 4233110, 4172561, 4108350, 4056886, 4027621, 4066695, 4053604, 4049135, 3968846, 3975506, 4013927, 4047405, 4133964, 4151039, 4147183, 4202899, 4238617, 4184117, 4165134]
4437D165134P4014Q5083o4103J4266l562m7711l5798L7345k34l1517J2618Q1701
4425D287236j9529Q349N9955J1063K6927J26423J07837K8607K9010J862J3921
4414D681661L1545J39440k4910L3785R3128Q4513Q0217J39343J78756J66244K31516
4403E835238L36347M69383N32864O26118P96281N94816L24993j12001m35010n51908
4393H417121l81947k74748k21977J4804J01267K50182M63984N85202O46548O35684
4383A0236120L48220l5367p3247m8307M4344K11042K83144J71958o5445m06107
4373A0666355m34630l53635l76890k71270k09098j46380K8945J17461K09665M61357
4363I691880O13104O12674L61252K3480k23294m43603m40239j89773j92367Q8280
$$ y = [4165134, 4239148, 4324231, 4260128, 4274394, 4270832, 4223121, 4187323, 4224668, 4224434, 4192917, 4205535, 4287236, 4267707, 4276056, 4336011, 4347074, 4374001, 4500424, 4608261, 4636868, 4665878, 4667740, 4681661, 4713206, 4852646, 4827736, 4861521, 4954649, 5039162, 5119379, 5258722, 5437478, 5603722, 5835238, 6171585, 6640968, 7173832, 7799950, 8596231, 9191047, 9516040, 9404039, 8969029, 8417121, 8035174, 7760426, 7538449, 7553253, 7654520, 7904702, 8368686, 8953888, 9600436, 10236120, 10584340, 10548973, 10475726, 10427419, 10471763, 10682805, 10965949, 11137907, 11072462, 10666355, 10231725, 9878090, 9501200, 9229930, 9020832, 8874452, 8903397, 9020858, 9230523, 9691880, 10304984, 10917658, 11278910, 11302390, 11079096, 10635493, 10195254, 10005481, 9813114, 9901394]
4353I901394L09339L73900M05805L69358K50658J50820m2490q1849K6591J29068
4343A1792594K51949N19917P99147J079722J067821Q65042N56937K10865P5789
4334A7219783j98011l05580k47120q2329J71979L88407N13475N13472M41938L02341
4324A8718355R8276j40606k65140j46412R8850K48835M47287L04338J91940N5962
4314A9611685r2480k35284m99039q17227r30379q63961o03601l78014o6116K02826
4304A5328410L58541M78029K48470P573l16655n03719m95159n06383l20501r0245
4294A4188361K1126K71788L01789L59069J67992k8846k43137l47168l60237k89170
4284A4041567j19617n3584J57206L24727M79704O99345Q35024Q71731N94136L32002
$$ y = [9901394, 10210733, 10584633, 10990438, 11359796, 11610454, 11761274, 11718784, 11636935, 11663526, 11792594, 12044543, 12564460, 13363607, 14443329, 15511150, 16376192, 16933129, 17143994, 17219783, 17021772, 16716192, 16469072, 16386743, 16558722, 16947129, 17460604, 17974076, 18416014, 18718355, 18816631, 18676025, 18410885, 18264473, 18363323, 18612158, 19059445, 19363783, 19555723, 19611685, 19519205, 19283921, 18784882, 17967655, 17037276, 16173315, 15569714, 15191700, 15125584, 15328410, 15686951, 16164980, 16413450, 16421023, 16104368, 15600649, 15105490, 14599107, 14278606, 14188361, 14209487, 14481275, 14783064, 15142133, 15310125, 15281279, 15038142, 14690974, 14330737, 14041567, 13921950, 13868366, 14025572, 14350299, 14830003, 15529348, 16364372, 17236103, 17830239, 18162241]
4274A8162241Q4096p9152m7378k4204J38013J97619p116l01288l46050m36917
4264A7339864l93956k25925k32641k11576j71680j4345O4603J96660M34536M85134
4254A7270674K63403o4042m66123q27350r88348q22900p77752o63211m63270l61774
4244A2099307j72473n2548j30278n7363j01909k04420j61178j38052j38088j20090
4234A0822908p9112n8145o5124m4190p0752j27940j09768j37546q4721j65932
4224I879678j13282N052N9534R8095K06911J92458K03441J37921K13930K03219
4214A1086957J53790K1803k217n3466j58394K911j26725j32449o3686r6091r2640
4203A0539793n1479o2121N114R4949P0106J27021M9080l1319L7280j936j6859
$$ y = [18162241, 18246337, 18167185, 18119807, 18095603, 18233616, 18431235, 18424119, 18122831, 17776781, 17339864, 16945908, 16719983, 16487342, 16275766, 16104086, 16089741, 16154344, 16351004, 16785540, 17270674, 17534077, 17470035, 17003912, 16176562, 15188214, 14365314, 13587562, 12924351, 12461081, 12099307, 11926834, 11874286, 11744008, 11686645, 11584736, 11380316, 11219138, 11081086, 10942998, 10822908, 10743796, 10685651, 10620527, 10576337, 10505585, 10377645, 10267877, 10130331, 10045610, 9879678, 9766396, 9771448, 9830982, 9929077, 10135988, 10328446, 10531887, 10669808, 10883738, 11086957, 11240747, 11262550, 11260333, 11206867, 11048473, 11051384, 10924659, 10792210, 10728524, 10632433, 10539793, 10488314, 10426193, 10431307, 10526256, 10596362, 10723383, 10772463, 10741144, 10778424, 10776488, 10759629]
4192A0759629o4041j49799j62628j25685j29186j32088k1224m7098q9521l4283
4182I804076l8197q4457l5448O164K9256L2856M0452J50364J13877J56100R5180
4171A0270223J55512K07565K10444K41791J99042J47037J96020J80632J93051
4162A2001317L75947M62656M55341N30244O46088P14251O98511N04960N54056
4153A6943371M99072M55653L59319K44282K85416K37966K00222K59514L51595
4144A9836410N52027P35710Q42450J112329J302651J336348J378868J541632J542315
4135C0180740J128682M99105J49003k9009J13989L56920M74212M21363M95296
4126C3790301M64303M06850N84683O95845O52147M72597J86775J7609J11913L50398
$$ y = [10759629, 10695588, 10545789, 10383161, 10257476, 10128290, 9996202, 9974978, 9927880, 9838359, 9804076, 9765879, 9681422, 9645974, 9652138, 9681394, 9714250, 9754702, 9905066, 10018943, 10175043, 10270223, 10425735, 10633300, 10843744, 11085535, 11284577, 11431614, 11627634, 11808266, 12001317, 12377264, 12839920, 13295261, 13825505, 14471593, 15185844, 15884355, 16389315, 16943371, 17442443, 17898096, 18257415, 18501697, 18787113, 19025079, 19225301, 19484815, 19836410, 20388437, 21124147, 21966597, 23078926, 24381577, 25717925, 27096793, 28638425, 30180740, 31309422, 31808527, 31957530, 31928521, 32042510, 32399430, 32873642, 33295005, 33790301, 34254604, 34661454, 35246137, 35941982, 36594129, 37066726, 37253501, 37271110, 37383023, 37733421]
4116C7733421P42395J214399J890467K325684K554103K192940J355439O39236
4108E0648084K11398k0085L01127O61737Q73724Q92587P89978N69951L45278L92479
4098E5666258L30325K32065J46441N7065k07716m22212m30344m32441k59484J73101
4088E4853058N95716J151517J817506K234928K436249K296436J897835J475036
4080F8758281J361726J481181J797074K099421K016952J755998J484234J313832
4072H2068699J299383J266254P26748K65364k16702m48609m68069l73120q3199
4063H4036749K10999N97249R79434J231629J579416J688624J348474P70919p4025
4054I2369468r52594j380619j389902j225608q76188n55537J7469L39309O57734
$$ y = [37733421, 38475816, 39690215, 41580682, 43906366, 46460469, 48653409, 50008848, 50648084, 50859482, 50839397, 51140524, 51802261, 52675985, 53568572, 54358550, 54928501, 55273779, 55666258, 55996583, 56228648, 56375089, 56432154, 56224438, 55802226, 55371882, 54939441, 54679957, 54853058, 55448774, 56600291, 58417797, 60652725, 63088974, 65385410, 67283245, 68758281, 70120007, 71601188, 73398262, 75497683, 77514635, 79270633, 80754867, 82068699, 83368082, 84634336, 85361084, 85626448, 85409746, 84961137, 84493068, 84119948, 84036749, 84247748, 84844997, 85824431, 87056060, 88635476, 90324100, 91672574, 92443493, 92369468, 91416874, 90036255, 88646353, 87420745, 86544557, 85989020, 86006489, 86345798, 87003532]
4045H7003532Q62277R11442N89469J22919k63817l90020l48837k07185k85548
4036H7994232n98706j134463j405431j169393q77262p32091j303470k275730l293122
4027G5204564l831524l898047l536139k871475k076099j134641m57456Q1548M44967
4018E7925698L50098K13918J19212Q76j74917k67704n89619p46794j003940j162697
4008E4664131j087235p90260m03376P4497M96130N96152J30148q75464j783322
3999E1021401k469825k595086k448915j997837j463572r87583o61077m46063m53129
3990C7498314o26627p71291q96340q56749p59646o35243o31002n82519n21527
3981C1217370m72858m56780l37028k92048k22557l04098n59885q21237r56462
$$ y = [87003532, 87865809, 88777251, 89366720, 89489639, 89225822, 88835802, 88486965, 88279780, 87994232, 87395526, 86261063, 84855632, 83686239, 82808977, 82076886, 80773416, 78497686, 75204564, 71373040, 67474993, 63938854, 61067379, 58991280, 57856639, 57399183, 57480731, 57925698, 58275796, 58489714, 58608926, 58609802, 58434885, 58167181, 57577562, 56830768, 55826828, 54664131, 53576896, 52786636, 52383260, 52457757, 52953887, 53550039, 53680187, 52804723, 51021401, 48551576, 45956490, 43507575, 41509738, 40046166, 39058583, 38397506, 37951443, 37498314, 36871687, 36100396, 35204056, 34347307, 33587661, 32952418, 32321416, 31738897, 31217370, 30744512, 30287732, 29950704, 29658656, 29436099, 29132001, 28572116, 27750879, 26794417]
3972B6794417j104880j156005j071674q77163p25347m62634k59865k21651k22373
3963B0692825k25379k60982j17973K0707k6056r5981j58073j86932l74331m40061
3953A8827764m83478n20752n04284m19196l11842l00406k60661j62094J6535N6095
3943A5937681R1013K79663L96898N03645N17871L78053K74265J75628q7656o1804
3933A8405257j22695j89993k40235k16639r5307J21694L97537O12342P74908R14486
3923B0361355R00903Q01193O03988L78876K7949j83152l78619n20362p11434p92951
3913B0487746o32187m13439k83336l0285J62981L39367N94913Q29026R04492Q15756
3903B2775034P03976L16397L2082k58935l42257k74211j59519o2081O4121K30887
$$ y = [26794417, 25689537, 24533532, 23461858, 22584695, 21859348, 21396714, 21136849, 20915198, 20692825, 20467446, 20206464, 20088491, 20109198, 20083142, 19987161, 19829088, 19642156, 19267825, 18827764, 18344286, 17823534, 17319250, 16900054, 16588212, 16287806, 16027145, 15865051, 15881586, 15937681, 16028694, 16308357, 16705255, 17208900, 17726771, 18104824, 18379089, 18554717, 18467061, 18405257, 18282562, 18092569, 17852334, 17635695, 17540388, 17662082, 18059619, 18671961, 19446869, 20361355, 21262258, 22063451, 22667439, 23046315, 23074264, 22891112, 22512493, 21992131, 21280697, 20487746, 19855559, 19442120, 19158784, 19128499, 19291480, 19630847, 20225760, 21054786, 21959278, 22775034, 23479010, 23795407, 23827489, 23568554, 23226297, 22952086, 22792567, 22730486, 22794607, 23025494]
3893B3025494L76666N88407Q25911J068567J216340J382693J474087J702645J514263
3884C3175073J204854P46226J60509m15539p57854q08744q13509n34101k14061
3875C1742854K01542M46259Q43066J275975J699946J984214K000093J816905J671922
3866D3682776J300220R39825M68155k37432q14617j207500j359978j038484o71170
3857D1061795l21647J33316K95408L60689L18732L18136L47135J84077l490l80461
3847D2313690q05821j049136r52824p12728n12482l13391j48554m7931N2335K12392
3837C8035550K48430J88797k5612j74706m74307n96120n12061m12091k37034M0798
3827C6081644M13276P60645J040945J282228J505850J496795J410830J185482
$$ y = [23025494, 23402160, 23990567, 24816478, 25885045, 27101385, 28484078, 29958165, 31660810, 33175073, 34379927, 35126153, 35286662, 34871123, 34113269, 33304525, 32491016, 31956915, 31742854, 31944396, 32390655, 33233721, 34509696, 36209642, 38193856, 40193949, 42010854, 43682776, 44982996, 45922821, 46390976, 46153544, 45338927, 44131427, 42771449, 41732965, 41061795, 40740148, 40873464, 41168872, 41529561, 41848293, 42166429, 42513564, 42697641, 42694151, 42313690, 41507869, 40458733, 39505909, 38793181, 38280699, 37967308, 37818754, 37770823, 37823158, 38035550, 38283980, 38472777, 38447165, 38272459, 37798152, 37202032, 36689971, 36277880, 36040846, 36081644, 36494920, 37255565, 38296510, 39578738, 41084588, 42581383, 43992213, 45177695]
3819D5177695J028196R15270Q49463Q19481Q08847O23965L12167j20976n02717
3810D9911391j053625j372279j573917j897958k034189j906875j488195q75713
3802C7708640l32485J92631O59232Q51984R26702R97323J020663Q68920P46326
3793D3639936O18208L84098p0154m36561q24462j043737j167405j109944p57728
3784C9232251l22676O7897K26415O4151j66984l96581l14973N9516M54549R61126
3774C9864691J574890J923021J810124J467213Q49157J52365m09657o16556n69398
3765D6045850l33385j98003m06938q46662j232438j493796j518452j062582n78338
3756C8375256M4327P93548J440264J853180J863302J732925J308498P20487N6303
$$ y = [45177695, 46205891, 47121161, 47970624, 48790105, 49598952, 50222917, 50535084, 50414108, 49911391, 48857766, 47485487, 45911570, 44013612, 41979423, 40072548, 38584353, 37708640, 37376155, 37568786, 38228018, 39080002, 40006704, 41004027, 42024690, 42893610, 43639936, 44258144, 44642242, 44572088, 44135527, 43311065, 42267328, 41099923, 39989979, 39232251, 38909575, 38977472, 39203887, 39268038, 39101054, 38704473, 38389500, 38449016, 38903565, 39864691, 41439581, 43362602, 45172726, 46639939, 47489096, 47641461, 47231804, 46615248, 46045850, 45712465, 45514462, 45107524, 44260862, 43028424, 41534628, 40016176, 38953594, 38375256, 38419583, 39213131, 40653395, 42506575, 44369877, 46102802, 47411300, 48131787, 48188090]
3747D8188090o12747r50873j328811j534975j663418j898895j873827j689934
3739C6634610j564510j324584j190046r91140o72225l26883j34928p868L20648
3730C0743074K93037J29171j75702m24029m22083k95346m9585J98647J50649k39481
3720B9908352o60398j163280j491541j628932j582074j347984j014700p48454
3712B0270989m62439j95212L9369L16869O31335Q44680J126210J090613O25408
3703B4287822K34515k54345p83870r15656r64494r42385p59491q41661q38139
3694A8222296p37467o46288o13267m32094l13198j96154j05266n0062M0501l4980
3684A5134021J8323j5772L7943J2390K3379k29878m56829n91992o17992n18582
$$ y = [48188090, 47575343, 46624470, 45295659, 43760684, 42097266, 40198371, 38324544, 36634610, 35070100, 33745516, 32555470, 31564330, 30892105, 30565222, 30430294, 30422426, 30743074, 31036111, 31165282, 30989580, 30565551, 30143468, 29848122, 29798537, 29997184, 30147833, 29908352, 29247954, 28084674, 26593133, 24964201, 23382127, 22034143, 21019443, 20270989, 19808550, 19613338, 19652707, 19969576, 20600911, 21445591, 22571801, 23662414, 24287822, 24522337, 24267992, 23484122, 22568466, 21603972, 20661587, 19902096, 19060435, 18222296, 17484829, 16838541, 16225274, 15793180, 15479982, 15283828, 15178562, 15128500, 15169001, 15134021, 15152344, 15136572, 15174515, 15186905, 15210284, 14980406, 14523577, 13931585, 13313593, 12795011]
3674A2795011m89870m32499m41928k85476k11566k29110j32506j02208J9975J63269
3664A0653092J72933K71974K03681J83443p9351k00123l64563l42895k09234k31917
3654A0057040j98019p0443j27287K0367Q2619J27540K51735L03715K78966J92146
3644A0918379O5578j52390j71276k14171k11836p9265j6525K3530M8077k6698
3634A0183403j88633k11701k46207j30040K301m3980J6021p134J2210j36856k00586
3623I048798l8010J9275L7501l7406j74776j16041j27316k16407k52476k35728
3613G907414j59158j64113r5778n8627r8388l9706k6679O7484R8442R4680J8991
3602G544562o4829p1569o9937j25012j11060j22532p385o1889k6865n6264K968
$$ y = [12795011, 12305141, 11872642, 11430714, 11145238, 10933672, 10704562, 10572056, 10469848, 10489823, 10653092, 10826025, 11097999, 11301680, 11485123, 11405772, 11205649, 10841086, 10498191, 10288957, 10057040, 9859021, 9788578, 9661291, 9681658, 9764277, 9891817, 10143552, 10447267, 10726233, 10918379, 10983957, 10831567, 10660291, 10446120, 10234284, 10155019, 10138494, 10162024, 10210101, 10183403, 9994770, 9783069, 9536862, 9406822, 9409123, 9365143, 9381164, 9374030, 9386240, 9249384, 9048798, 9010788, 9030063, 9067564, 9030158, 8855382, 8739341, 8612025, 8395618, 8143142, 7907414, 7748256, 7584143, 7488365, 7429738, 7331350, 7291644, 7264965, 7332449, 7430891, 7525571, 7544562, 7479733, 7408164, 7338227, 7213215, 7102155, 6979623, 6972238, 6910349, 6883484, 6827220, 6830188]
3591F830188K3928j1375J8381q05L0057N4572Q178O2170K2088l8451P9375K1157
3579G099463M3123J1948J9374P3794l4976P7803J18260L5500L1239N0899L1195
3568G557622N8475R3687K2778J2876R0683Q9650N1967J14183J47750K59430J68549
3557H667650K39384J18321J44921K59010J70192J30018J79873K54337J57209K29646
3547A0550561K25473J34398K17879J89546K08571J22282J52079J41252J60564
3538A2102605R6722J70217J98582K33312L07160K90225L78842M47714N19714L89353
3528A5134446L67072M21552M30389N44823M93460M33918M31710L37701K98738
3519A8893809J98958R0905o0355r5933j06200Q1128J77002J90890R9845J62528
$$ y = [6830188, 6854116, 6842741, 6861122, 6860317, 6890374, 6944946, 6953124, 7015294, 7037382, 6998931, 7078306, 7099463, 7142586, 7154534, 7173908, 7247702, 7212726, 7290529, 7408789, 7444289, 7475528, 7526427, 7557622, 7616097, 7709784, 7732562, 7745438, 7836121, 7925771, 7977738, 8091921, 8239671, 8499101, 8667650, 8907034, 9025355, 9170276, 9429286, 9599478, 9729496, 9909369, 10163706, 10320915, 10550561, 10776034, 10910432, 11128311, 11317857, 11526428, 11648710, 11800789, 11942041, 12102605, 12199327, 12369544, 12568126, 12801438, 13108598, 13398823, 13777665, 14225379, 14745093, 15134446, 15501518, 15923070, 16353459, 16898282, 17391742, 17825660, 18257370, 18595071, 18893809, 19092767, 19183672, 19123317, 19027384, 18921184, 19002312, 19179314, 19370204, 19470049, 19632577]
3509A9632577J71654K94375O17283R04492R29277O84422M92584J44399l2657Q3623
3499B3922029M07363Q42440J228393J516026J386817J032753O03119K55793q1103
3490C1113630k96579n87178r68867j189025j326824j240589j126832q42986o05976
3481B2928774m39615m09036k35776k28801k35181p4942J87411L43671M53454N07686
3471B2797645M50005L07841J93930J95587K74169M24770M04504M67395K71635
3462B5787481l5794m48096o35977p07778o25798l89119k65325j58739o20N0486
3452B2570721R864j27965l81938n61719p09125m54464n3212K47739M27095L49576
3442B1316572O089n06367p77625q80069r19407o04294l71512k09991l26075o25378
$$ y = [19632577, 19804231, 20098606, 20715889, 21620381, 22549658, 23234080, 23726664, 23871063, 23838406, 23922029, 24329392, 25171832, 26400225, 27916251, 29303068, 30335821, 30938940, 31194733, 31113630, 30817051, 30229873, 29261006, 28071981, 26745157, 25504568, 24377736, 23534750, 22928774, 22489159, 22080123, 21844347, 21615546, 21380365, 21305423, 21492834, 21836505, 22289959, 22797645, 23247650, 23555491, 23749421, 23945008, 24219177, 24643947, 25048451, 25515846, 25787481, 25751687, 25303591, 24667614, 23959836, 23334038, 22944919, 22679594, 22520855, 22520235, 22570721, 22580585, 22452620, 22070682, 21508963, 20799838, 20345374, 20292162, 20539901, 20966996, 21316572, 21322661, 20816294, 20038669, 19158600, 18239193, 17634899, 17263387, 17053396, 16727321, 16101943]
3432A6101943p33433q43120p56616o22178l49043k45026j59235l9744R4156K94472
3422A2742176K53799L69342L71220L15352L14728J79525J50758J77432K22015
3413A5096347J68248J88958J95418J93578K85873K58642K35881J97127J69538
3404A6989610Q5922J16844Q4233M6144L0600j32904K3821R9045K83578O29944
3394A8256837O77915O54928L83828J43405l8952l4129Q2196L77091O60504Q23848
3384B1987471Q11824O52348M75708K98935L74432M62729O33203N57297J88083
3375B6442030k73881r56435j336421j486768j402911j168198r09965o83886n35811
3366A7687754l63352l65915k81161k7094L7173J59750K22857L36800L16012K64081
$$ y = [16101943, 15368510, 14525390, 13768774, 13146596, 12797553, 12552527, 12393292, 12353548, 12447704, 12742176, 12995975, 13365317, 13736537, 14051889, 14366617, 14546142, 14696900, 14874332, 15096347, 15264595, 15453553, 15648971, 15842549, 16128422, 16387064, 16622945, 16820072, 16989610, 17075532, 17192376, 17276609, 17322753, 17353353, 17220449, 17244270, 17343315, 17626893, 18256837, 18934752, 19589680, 19973508, 20116913, 20077961, 20043832, 20126028, 20503119, 21163623, 21987471, 22799295, 23451643, 23927351, 24226286, 24600718, 25063447, 25696650, 26253947, 26442030, 26168149, 25211714, 23875293, 22388525, 20985614, 19817416, 18907451, 18223565, 17687754, 17324402, 16958487, 16677326, 16650232, 16687405, 16847155, 17070012, 17406812, 17722824, 17986905]
3356A7986905J61680l3585j5029q5904r070o9278M9402J91515K94875L48813L90938
3345A9211262L60463L66218M69592O45296Q37822J035143J026176R36677O61651
3336B5550300J62871m18005o57677q26108p46784l93863j51384L23699N14548
3327B3357597M45589J78154k3678l05633n79703n40562l30375k0258L50417N47807
3317B3079355M78275K51772j10338l83141m31894l60282k21662K39138P27691
3308B3268914R83184J130176R13911N60141M433n14258q31048j100438j096832
3299B3318183j078140j020239q21906p30109n78788l88893k86834j05224J41064
3290A8449114L23945N21817N31494O16358N09393M48434K72432j17375n13576
$$ y = [17986905, 18148585, 18115000, 18099971, 18014067, 18004997, 17935719, 17985121, 18176636, 18471511, 18820324, 19211262, 19571725, 19937943, 20407535, 21052831, 21890653, 22925796, 23951972, 24888649, 25550300, 25713171, 25295166, 24637489, 23811381, 23064597, 22670734, 22519350, 22843049, 23357597, 23803186, 23981340, 23957662, 23652029, 23072326, 22531764, 22201389, 22181131, 22531548, 23079355, 23557630, 23809402, 23699064, 23315923, 22884029, 22523747, 22302085, 22541223, 23268914, 24252098, 25382274, 26296185, 26856326, 26860759, 26346501, 25515453, 24415015, 23318183, 22240043, 21219804, 20397898, 19667789, 19089001, 18700108, 18413274, 18308050, 18449114, 18773059, 19294876, 19826370, 20442728, 20952121, 21400555, 21672987, 21555612, 21042036]
3281B1042036q11940r98232j159022j023217q05571n03749l48479L7898K49081
3272A5678805M33615O56244Q04004Q96391P39344N49046J63262j01752l58504
3263A9460455n00138m47211m10370m22547k10743m6415L7646J35732q9542m9499
3253A7457368j79195k73513j92525n2198m9952k6047P2538K4173J86840K30826
3243A7198315K40840L26124K45062K9339j55651k35891k35519k24902k78709l80014
3233A6528994m32099n03040m47894l78798k13665p3220N698O3983J33465K70624
3223A4954048K75616M42625N50853O71181P89567J037552J422035J784822K465514
3214B4393813L177148L903951M135358L738504K992309J664003J99890j302174
$$ y = [21042036, 20230096, 19231864, 18072842, 17049625, 16244054, 15740305, 15391826, 15429724, 15678805, 16112420, 16768664, 17572668, 18469059, 19208403, 19757449, 19920711, 19818959, 19460455, 18960317, 18513106, 18102736, 17680189, 17469446, 17423031, 17460677, 17596409, 17506867, 17457368, 17278173, 17004660, 16812135, 16759937, 16709985, 16683938, 16756476, 16780649, 16967489, 17198315, 17439155, 17765279, 18010341, 18039680, 17884029, 17648138, 17412619, 17187717, 16909008, 16528994, 16096895, 15593855, 15145961, 14767163, 14553498, 14480278, 14485976, 14549959, 14683424, 14954048, 15229664, 15672289, 16223142, 16894323, 17683890, 18721442, 20143477, 21928299, 24393813, 27570961, 31474912, 35610270, 39348774, 42341083, 44005086, 44204976, 42902802]
3206D2902802k527572l238389l453343l147695k585797j963699j496606q85693
3198B3604008n93520m00200l70616k32383j11792j32545r7660p9930P9655N8177
3188B1723194j7256J0010L0653P1639J67531L06097M71682O18585P76890R37874
3178B5096899J166557J425626J892301K485518L321142M471253N810662P203593
3170E2873551Q321860Q125846O543448L594507k21766l813901o444595p507419
3162F1471531p364301o305445m930567l456057k399303j570254r15411n48770
3154C3981423k16603l0228J19424K50531L21693L98897N63749P15968Q49280R67844
3144C7921978J032238J018774R77788Q79367Q91649J073399J210090J467179J815246
$$ y = [42902802, 40375230, 37136841, 33683498, 30535803, 27950006, 25986307, 24489701, 23604008, 23010488, 22610288, 22239672, 22007289, 21895497, 21762952, 21665292, 21585362, 21665017, 21723194, 21705938, 21715948, 21746601, 21818240, 21985771, 22291868, 22763550, 23382135, 24159025, 25096899, 26263456, 27689082, 29581383, 32066901, 35388043, 39859296, 45669958, 52873551, 61195411, 69321257, 75864705, 79459212, 79237446, 75423545, 68978950, 61471531, 54107230, 47801785, 42871218, 39415161, 37015858, 35445604, 34530193, 33981423, 33764820, 33734592, 33854016, 34104547, 34426240, 34825137, 35388886, 36104854, 36954134, 37921978, 38954216, 39972990, 40950778, 41830145, 42721794, 43795193, 45005283, 46472462, 48287708]
3135D8287708K139106K613365L156290L624991M095308M738121N427040O496323
3127H0578252Q026996J0650075J4508784J9931128K6028091L0542913L1186555
3120B21452794K6439448J6855687M559829n829915j0203817p262515J805626J0899908
3112B58717045J2870550O160679k830805o843559k985517O594154J6521521K2324219
3104C10528287K0855113J2626811Q30403j0375982j7864320k0804806k0259022
3097B75536484j8167794j5978617j3792868j1525272r183458p954308r262503
3090A89671664j2670518j6091781j7434447j6325813j3382126r695420n547209
3083I8524350r31344M126159Q252307R236453O073395J46972n228884p765513
$$ y = [48287708, 50426814, 53040179, 56196469, 59821460, 63916768, 68654889, 74081929, 80578252, 88605248, 99255323, 113764107, 133695235, 159723326, 190266239, 221452794, 247892242, 264747929, 269307758, 263477843, 253274026, 246011511, 247817137, 258717045, 271587595, 277748274, 274917469, 268073910, 265088393, 271682547, 288204068, 310528287, 331383400, 344010211, 344840614, 334464632, 316600312, 295795506, 275536484, 257368690, 241390073, 227597205, 216071933, 206888475, 198934167, 189671664, 177001146, 160909365, 143474918, 127149105, 113766979, 104071559, 98524350, 97593006, 101719165, 109971472, 119207925, 125281320, 125428292, 120199408, 112433895]
3075A12433895p190041m686669j613969J359910M281381P412095J1213867J5335621
3067A38546090J7465570J5171613P413969l599330j3481118j9517321k1040505
3060A20958968j9361365j6085298j2563397r601910p261430n575203m479952l703390
3052D2327023l220297k898687k606133k305851k045051j777149j507532j257183
3044B4709140r89947q04417o80698n50526m56416k99014k18308j50797j93756
3035B0365261n8474N2834Q2268J91016J66861K06275K00628J96864L38091M81174
3025B2222798P39552Q88716J097456J088320J194806J167132R86042J066327J195166
3016C1646315J485412J814100K150843K396371K660602K781003L135207L741927
$$ y = [112433895, 105243854, 100557185, 98943216, 100303126, 104584507, 111996602, 123210469, 138546090, 156011660, 171183273, 178597242, 174997912, 161516794, 141999473, 120958968, 101597603, 85512305, 72948908, 63346998, 56085568, 50510365, 46030413, 42327023, 39106726, 36208039, 33601906, 31296055, 29251004, 27473855, 25966323, 24709140, 23719193, 22914776, 22234078, 21683552, 21227136, 20928122, 20709814, 20559017, 20365261, 20306787, 20359621, 20441889, 20632905, 20799766, 21006041, 21206669, 21403533, 21741624, 22222798, 22962350, 23851066, 24948522, 26036842, 27231648, 28398780, 29384822, 30451149, 31646315, 33131727, 34945827, 37096670, 39493041, 42153643, 44934646, 48069853, 51811780]
3008E1811780N255629Q286463J4151519K4134245L5976059M2123227L4113476
3001B15852398J2676667j1859370k8974181l4729490l2043511k5622086j9053984
2994G6246443j3801928j0182845p909912o468356n356633m308441l491651k714885
2986B2011792k062811j639459j346042j154806r63884q45477o87544n58057n26041
2977A2227671n04285l91752l80863l65109k62957j98802r9149r3297J9455K97858
2967A0248770M15431M65941M60051L38556J27497J0627k57238m44067l62827k51615
2957A0751126j07485o6006j58807k24904k56272l39977j27877P243K49720L24320
2947A0051081M13721M51217K83983K94672O5283j60138k07428j6112J99221O86535
$$ y = [51811780, 57067409, 65353872, 79505391, 103639636, 139615695, 181738922, 215852398, 228529065, 216669695, 187695514, 152966024, 120922513, 95300427, 76246443, 62444515, 52261670, 44351758, 37883402, 32526769, 28218328, 24726677, 22011792, 19948981, 18309522, 16963480, 15808674, 14844790, 13999313, 13311769, 12753712, 12227671, 11723386, 11331634, 10950771, 10585662, 10322705, 10123903, 10024754, 9931457, 9950912, 10248770, 10664201, 11130142, 11590193, 11928749, 12056246, 12066873, 11809635, 11365568, 11002741, 10751126, 10643641, 10577635, 10418828, 10193924, 9937652, 9597675, 9469798, 9477041, 9726761, 10051081, 10464802, 10916019, 11200002, 11494674, 11559957, 11399819, 11192391, 11176279, 11375500, 12062035]
2937A2062035J253695J764441J949639J754518J272525L54739o69189j387955
2929A8354448j955823k021721j819199j509568j149712q50437n83283m09677j46334
2920G908694N5051M62461P37159J126803J505785J953800J944200J614511Q78329
2911A8186793n7881j005081j737011k137492k091833j817225j458005j135256
2903F747009q64894o46562n34834l31795k56399k00157j54971q7251n1457o7044
2893C551645m3678l501N5722J31240P7726N0176J10705J79508J23874J39054K59955
2882D632426K76018M66337P79005R87657J430323J765303J935466J889252J408148
2873A5569935O00354k83980j130092j650216j839073j695254j421982j067925
$$ y = [12062035, 13315730, 15080171, 17029810, 18784328, 20056853, 20411592, 19742403, 18354448, 16398625, 14376904, 12557705, 11048137, 9898425, 9047988, 8464705, 8055028, 7908694, 7963745, 8426206, 9163365, 10290168, 11795953, 13749753, 15693953, 17308464, 18186793, 18128912, 17123831, 15386820, 13249328, 11157495, 9340270, 7882265, 6747009, 5882115, 5235553, 4700719, 4368924, 4112525, 3912368, 3757397, 3670146, 3618689, 3551645, 3507967, 3504466, 3560188, 3691428, 3769154, 3819330, 3930035, 4109543, 4233417, 4372471, 4632426, 4908444, 5374781, 6153786, 7141443, 8571766, 10337069, 12272535, 14161787, 15569935, 16170289, 15886309, 14756217, 13106001, 11266928, 9571674, 8149692, 7081767]
2865G081767o63118n08240l30650r7294N2321L38829O50797J030504J424693J709840
2855A0689449J784525J531093J012566J65663p44593j510950j896023j928076
2847I103654j697518j330913j104981q43569n32251l60924k36729j37329j6974
2838B842466J3205J4246J4694n2782p2117k08548j32458l6343n2108j08433m550
2827B217272J3990l6667o4068k2188P3280P9901j4884J9558P260n9884r1542k01866
2815A920162j11633j08619j29720j39000l4150l0013j34375q4463j15333j24090
2805I08766p6540j13370j25745n1456n523j4171N5879N7036K1588o3740J2619
2794F05343K8242q6894m3711K332L4275m1667m825J36329K0714Q5929J00035K471
$$ y = [7081767, 6418649, 5910409, 5579759, 5482465, 5534786, 5873615, 6524412, 7554916, 8979609, 10689449, 12473974, 14005067, 15017633, 15183296, 14438703, 12927753, 11031730, 9103654, 7406136, 6075223, 4970242, 4126673, 3594422, 3233498, 2996769, 2859440, 2842466, 2855671, 2869917, 2884611, 2831829, 2759712, 2551164, 2418706, 2382363, 2330255, 2221822, 2217272, 2231262, 2194595, 2130527, 2108339, 2181619, 2261520, 2246636, 2266194, 2273454, 2213570, 2122028, 1920162, 1808529, 1699910, 1570190, 1431190, 1397040, 1367027, 1232652, 1148189, 1032856, 908766, 832226, 718856, 593111, 541655, 536132, 521961, 577840, 634876, 656464, 592724, 605343, 633585, 546691, 502980, 505312, 539587, 497920, 493095, 629424, 650138, 736067, 836102, 838573]
2782H38573P7322j3592p2100j14248j04155p8632p3135j11571o5639j8632m0817
2771B23374k7690k9915J3463n5118n0332o209m512n5383m3365J4356k7177j4953
2759f3461l1733N7338K3343m9722J0529k8831P3559k8125m0718j7455p271k6950
2747a29497O1215N9729k9283l7108N4578j6837n926o427l4340Q482k8117P5344
2735b8187k8326K5989J3590J375m2641l7103M4504O2645L3793l2821J9046O4827
2723I6691J27016J89132K13513J83687R7387J7677j07745k18912j45327j17283
2713C35836j70176j04307n9425k9117p8119j8814r622n1046N952R414k1066k1610
2701b12100K4794J2735J1770m1279J6625m8562n232l0079k0913P7548r6714p163
$$ y = [838573, 915895, 902303, 830203, 715955, 611800, 533168, 460033, 348462, 282823, 264191, 223374, 195684, 165769, 179232, 124114, 73782, 67573, 63061, 7678, -35687, -21331, -48508, -63461, -95194, -37856, -14513, -64235, -53706, -82537, -8978, -37103, -77821, -95276, -102547, -129497, -68282, -8553, -37836, -74944, -20366, -37203, -43129, -49556, -83896, -75414, -103531, -28187, -56513, -30524, -16934, -15559, -58200, -95303, -50799, 11846, 45639, 12818, 31864, 96691, 223707, 412839, 626352, 810039, 907426, 925103, 817358, 598446, 453119, 335836, 165660, 61353, 1928, -27189, -105308, -124122, -133744, -184790, -178838, -169424, -190490, -212100, -187306, -174571, -162801, -204080, -187455, -236017, -241249, -271328, -292241, -214693, -311407, -318570]
2689c18570O8890L1554j4416j5435j9814L5219j8254q002J80K286N113o4823J7153
2676b98919P5214K7747l1653P2828O835n4044O157o9387L8697k4560o4565N2917
2664b62733M0694k3522K3040m808p2857j9173k2743M8446K8399O7333j8904K5896
2652a90932L6295p6511l5054J3736K2835J625K7965K6477P0309M2329n2755j6156
2640a29837j5230k7890L5144k2101K2298K3369n0311j4996K2881M5369j3900j5079
2628a40283j2488J8019L1135j7395n943N6688R2629R9243R6440Q1128k6878j05489
2616A66806m9337l1973k8997o8474n2475p8698J5785L1025j5302p9699j1336r252
2604b11927k5618j6340n241L2848O0290n8487k232m0502k9592M7835J5257P1945
$$ y = [-318570, -249680, -218126, -232542, -247977, -267791, -232572, -250826, -258828, -258648, -256362, -251249, -316072, -298919, -223705, -195958, -227611, -154783, -147948, -201992, -195835, -265222, -226525, -251085, -315650, -262733, -222039, -245561, -222521, -227329, -300186, -319359, -342102, -293656, -265257, -197924, -216828, -190932, -154637, -231148, -266202, -252466, -229631, -228006, -200041, -173564, -103255, -60926, -113681, -129837, -145067, -172957, -137813, -159914, -137616, -114247, -164558, -179554, -156673, -111304, -125204, -140283, -152771, -134752, -103617, -121012, -126955, -70267, 22362, 121605, 218045, 299173, 272295, 166806, 117469, 85496, 56499, -11975, -64450, -143148, -127363, -96338, -111640, -191339, -202675, -211927, -237545, -253885, -259126, -226278, -165988, -224475, -226707, -267209, -296801, -248966, -233709, -161764]
2592a61764K2105m274J508L772r1939M2714j6619K4695J2336k0200o228M1354
2580a52540L322J0940J4981J778l2304l3534L3189q6284j1812O0029j2740m1985
2568b46960J04931j5684M116k1700m3356P22M8706K5743l3766L3830K6829j0237
2556a26826o4244l5556j091L1726N3733k612q5365Q057M0584J5590K4520J6438
2544a25046q9785K2953L0123j9197M3069L7186k0067l2027k1531J5943J5263r621
2532a52737N0177o4215n829j3711K1016R780K4179j0694m2386O0236j9499p564
2520a51247j9390P8210K4528k5850K3447N3889N966p6918p7227K7752j7337K1581
2508a32596O9899J4R5316P8780o1044n6149k6160K3373J853J4792j4524K1364
$$ y = [-161764, -139659, -143933, -142425, -138653, -230592, -187878, -204497, -179802, -167466, -187666, -193894, -152540, -149218, -138278, -123297, -121519, -153823, -187357, -154168, -240452, -252264, -192235, -204975, -246960, -142029, -157713, -153597, -175297, -218653, -217931, -169225, -143482, -177248, -143418, -116589, -126826, -191070, -226626, -227717, -195991, -142258, -144870, -230235, -222178, -181594, -166004, -141484, -125046, -214831, -191878, -161755, -180952, -137883, -100697, -120764, -152791, -174322, -158379, -143116, -152737, -102560, -166775, -172604, -186315, -165299, -155519, -131340, -142034, -184420, -124184, -143683, -151247, -170637, -92427, -67899, -93749, -70302, -16413, -10447, -87365, -164592, -136840, -154177, -132596, -62697, -62683, 32633, 111413, 50369, -5780, -31940, -8567, -6714, 8078, -6446, 14918]
2496A4918k0024J9792J6555k0906j6170M9917j7560p8294j3345R941J6531M4221
2484E576R988k5006n2595j714o963K3252N1861k4124o854K4166J1920Q732M046
2471B2285j0846l0814J4322J329L1388L0713P038p635l6883M6092J28221j8479
2459A76731j7738Q3342J5243o9079M1369J6087r912R3637o7498K6441o2484q31
2447B25308N153m4833j2187M4294j411M4440k0037P2583L5293l963k7972m003
2435C12665k1408M4455J8418R1M828M4974l667J0492N6633j1472m4954M0243M797
2422D56095J3008L2232j541k1956P2463M3530j3391m2145K2423m283O2418O2650
2410F81503j1517J8157j5191O8423O2457l7382M0157P7929L8675L7988M1049J09415
$$ y = [14918, -5106, 14686, 31241, 10335, -5835, 44082, 26522, -51772, -65117, -55176, -38645, 5576, 15564, -9442, -62037, -63751, -70714, -47462, 4399, -19725, -26579, -2413, 9507, 18239, 22285, 11439, -19375, -5053, -3724, 27664, 58377, 65415, 57780, 20897, 66989, 195210, 176731, 158993, 242335, 257578, 188499, 229868, 245955, 236043, 329680, 262182, 288623, 226139, 225308, 230461, 185628, 173441, 217735, 216324, 260764, 240727, 313310, 348603, 344640, 316668, 312665, 291257, 335712, 354130, 354221, 359049, 404023, 400356, 410848, 467481, 456009, 411055, 451298, 456095, 469103, 501335, 499794, 477838, 550301, 593831, 580440, 538295, 560718, 556435, 618853, 681503, 669986, 688143, 672952, 741375, 803832, 766450, 806607, 884536, 923211, 961199, 1002248, 1111663]
2398A111663J4863p501J7553R313J9003k7014O9500j394L5962P5877N3627K5928
2386A397380J32036J20560J49579N4762Q6629N0166J42421J25743R3666J38634
2376B491576K26555K66139K33493L57892L56169M30649P48889Q97768P72188M30732
2366G212050J75300J39482K42046M85380O54388J090176J548982K133396K765755
2357A6446955M212906P810377J6555297K3448043J8420865J189732j1280540j7149512
2349E9654123j5705988j1190767q342967n633600m283697k978431k440794j763929
2341G313950j149901l95485m9582J00258l63477n85012p22544o05660n11696l07816
2331B723035k38199k07110j74018j44323j52559j34272j55775j26747r8312n633
$$ y = [1111663, 1126526, 1119025, 1136578, 1145891, 1164894, 1137880, 1207380, 1205986, 1241948, 1317825, 1371452, 1397380, 1529416, 1649976, 1799555, 1854317, 1940946, 1991112, 2133533, 2259276, 2352942, 2491576, 2718131, 2984270, 3217763, 3575655, 3931824, 4362473, 5111362, 6009130, 6781318, 7212050, 7387350, 7526832, 7768878, 8254258, 8908646, 9998822, 11547804, 13681200, 16446955, 20659861, 28470238, 45025535, 68473578, 86894443, 88084175, 76803635, 59654123, 43948135, 32757368, 24414401, 18780801, 14497104, 11518673, 9077879, 7313950, 6164049, 5768564, 5718982, 5819240, 5455763, 4870751, 4148207, 3542547, 3030851, 2723035, 2484836, 2277726, 2103708, 1959385, 1806826, 1672554, 1516779, 1390032, 1291720, 1286087]
2321A286087p2931p6547p2829j4312q2137K8032m3344k8509j9173m8937k4013
2310H31387l0094j25090o5568m8415m1512l0171J8179p7032l9155N2862j1910
2299D33481o2267l0029k7917r075m2487J4934J0597j5929o3896O683J1459j8629
2287B06925k3125K4652l1947K6963o9397j7349N0730O0345n1206k8455l7457p122
2275A03557P5443j2819o335l7300R890J6593n6393k4657K4469K0426j2755l8665
2263F1454j6337m73J8400Q578m0082r38J0993o9366l5999N515N669j1216J863
2250f1939j2094j8251j9807N8372K4788p0437m3844L3907l1014R1012M1213q707
2238a6801K6042k1700J5457K770l1817m6016k6788L7079K4915r088k819n1625
$$ y = [1286087, 1213156, 1136609, 1063780, 1049468, 967331, 995363, 952019, 923510, 904337, 855400, 831387, 801293, 676203, 610635, 562220, 520708, 490537, 508716, 431684, 392529, 445391, 433481, 371214, 341185, 313268, 304193, 261706, 276640, 287237, 271308, 207412, 214095, 225554, 206925, 183800, 208452, 176505, 203468, 134071, 116722, 167452, 227797, 176591, 148136, 110679, 103557, 179000, 166181, 159846, 122546, 132436, 149029, 92636, 67979, 92448, 112874, 100119, 61454, 45117, 44644, 63044, 71622, 31540, 30602, 41595, -27771, -63770, -58255, -52586, -63802, -61939, -74033, -92284, -112091, -53719, -28931, -99368, -143212, -109305, -140319, -49307, -8094, -16801, 9241, -12459, 2998, 5768, -26049, -72065, -98853, -61774, -36859, -45947, -48766, -100391]
2226a00391l5297K5800L552K7133k305n3000k5670J4906o5012J04274k5545J6417
2214a15138L959l4669M5874j4485n9938P1338N9295K2501l4018r6282N3333j0436
2202a08666k6295l5720m5585J3464L0816O623O290m6025j0117P148M5076j2601
2190a75592j9684M4527O6328k3357L4645K6512m2497o76P4100l8570m2624L309
2178i3579R163n4080k4944j55K4229Q7755q0171M928J904L297n7119K4848J348
2165a52576l3373J7193J8363O829n3921N0779K5710k9536j4607n9002o1359O7836
2153b17664L124K5675M2193l6936n1709J0271M1199R296j0509j0050N1662L0590
2141a12858L9790m7861o6680m4999l3408L2662J02110L5070j2463l8391K5784
$$ y = [-100391, -135688, -109888, -106336, -79203, -81508, -134508, -160178, -145272, -210284, -106010, -131555, -115138, -111179, -145848, -99974, -114459, -174397, -103059, -43764, -21263, -55281, -151563, -98230, -108666, -134961, -170681, -216266, -202802, -171986, -165363, -159073, -205098, -215215, -208067, -162991, -175592, -195276, -150749, -84421, -107778, -73133, -46621, -89118, -89794, -15694, -54264, -96888, -93579, -84416, -138496, -163440, -163595, -139366, -51611, -131782, -126854, -124950, -121653, -178772, -153924, -152576, -185949, -168756, -150393, -143564, -197485, -146706, -120996, -150532, -165139, -224141, -285500, -217664, -214540, -188865, -146672, -183608, -235317, -225046, -183847, -174551, -185060, -195110, -143448, -112858, -73068, -120929, -187609, -232608, -266016, -233354, -131244, -96174, -108637, -147028, -121244]
2130a21244n2822p8801R246M3319j1933j2136L1526L8448K5405r905j469M8392
2118i1974j9720k8320m6658M6393J3881n9309k2684L7452J0412L3219M6201m2215
2106a23322J4626N7357o9526m3215N0104j8238j6427J9464q320j3015L4376K2893
2094i3243m1579J5103J682l5008K5833Q1632M9247O1731J8006L4467J8054J06985
2082B42910O4570j27513m8901j28743m9975N3089k8800q0511q528k5512j7606
2071a55520J1418L4808n9474J0632j0702r350l046J6030o7564M6090j9361j4082
2059b20121l4087L2754N5376M7448o4965k3602M9410l45l5279N7676L4023l849
2047a05561m7191k8164J3342P245L940m5663j1100Q226N0459l001L8701L088j6853
$$ y = [-121244, -174066, -252867, -243621, -200302, -212235, -224371, -192845, -154397, -128992, -138897, -140366, -91974, -111694, -140014, -186672, -140279, -126398, -185707, -208391, -170939, -160527, -127308, -81107, -123322, -108696, -51339, -120865, -164080, -113976, -132214, -148641, -129177, -137497, -150512, -116136, -93243, -134822, -119719, -118037, -153045, -127212, -45580, 3667, 65398, 83404, 117871, 135925, 242910, 307480, 179967, 131066, 2323, -47652, 5437, -23363, -103874, -112402, -137914, -155520, -144102, -109294, -168768, -158136, -168838, -178188, -181234, -165204, -232768, -186678, -206039, -220121, -254208, -221454, -166078, -118630, -183595, -207197, -157787, -158132, -193411, -135735, -101712, -105561, -152752, -180916, -167574, -160329, -156389, -202052, -213152, -204926, -154467, -157468, -118767, -115679, -132532]
2034a32532k9510N651J7419K0274N0696p8399k0042j7760N2398P2991p2168M5872
2022h5110o908r189k7193j6998N358K6421j9188n2794j9131R6966j3882K4590
2010i7058j9512r8123P1844O5817K0597p5516p6195J2104P379j4768M7943J0878
1998a44610m4192j7122O8973l0278o6722N3333m3735M3858j6084k4408P2540K4648
1986a23799j744n066k7249n4048p009O9065j2836M2136n2330J7033O7862o4333
1974a52318k8976L2686K2120r4651J7455N4940k6235p4557L5446M3412J397j9206
1962a88487k300j2396r0601K0626R7878N6593k0718k0241m4755M3399M3864j0864
1950a28002P357J2448m9093L2783q48m2607p681R7573k423m4385k4097m5407N9326
$$ y = [-132532, -162042, -156391, -138972, -118698, -68002, -146401, -166443, -184203, -131805, -58814, -130982, -85110, -92018, -101207, -128400, -145398, -140040, -113619, -132807, -185601, -204732, -107766, -121648, -97058, -116570, -214693, -142849, -77032, -56435, -131951, -208146, -196042, -188663, -203431, -155488, -144610, -188802, -205924, -136951, -167229, -233951, -180618, -224353, -180495, -196579, -220987, -148447, -123799, -125543, -130609, -157858, -211906, -218915, -149850, -162686, -120550, -172880, -155847, -87985, -152318, -181294, -148608, -126488, -221139, -203684, -148744, -174979, -249536, -214090, -170678, -169281, -188487, -190787, -203183, -293784, -273158, -175280, -118687, -139405, -159646, -204401, -161002, -117138, -128002, -120645, -108197, -157290, -124507, -125355, -167962, -175643, -78070, -80493, -124878, -148975, -194382, -135056]
1937a35056L3803m1923j04338L6542J40699R640m2615j9116m5459Q0923o3433
1926a50333q178J9828J0785J7442k6843K1998K7197l6896J5775M5322q0436m4506
1914a88845n6097M1795M7286n300N0383l3187K450N16M2277K4925m0148j6787
1902a30732k4372j838l8562O293J6053r532K7094K1545l0379M8506M1298j5892
1890i0518m289j3832K0989j4698q6485M3384Q8800q5576j5777k4386l5124J9329
1878a98183n4905L2740N559L8865N8839m9205j363J4904l3271k3510N1195J2356
1866a45979j2990O6526N6434n5656j27636K2891P3847J1161l6361J479K1088q2129
1854b07325L4057p465k3929O6870M7788o402m5652M3933Q155P3367L295M8769
$$ y = [-135056, -101253, -143176, -247514, -210972, -70273, -60633, -103248, -122364, -167823, -86900, -150333, -158511, -138683, -127898, -110456, -137299, -115301, -88104, -125000, -109225, -63903, -144339, -188845, -244942, -203147, -155861, -161161, -110778, -143965, -141515, -140999, -98722, -73797, -113945, -130732, -155104, -156942, -195504, -189211, -173158, -182690, -155596, -134051, -164430, -115924, -74626, -90518, -94807, -108639, -87650, -102348, -188833, -145449, -56649, -142225, -158002, -182388, -217512, -198183, -253088, -220348, -214789, -175924, -117085, -166290, -167653, -152749, -186020, -209530, -158335, -145979, -158969, -92443, -36009, -91665, -219301, -196410, -122563, -111402, -147763, -146284, -125196, -207325, -173268, -180733, -204662, -137792, -90004, -96406, -142058, -98125, -89970, -16603, -13308, 35461]
1842C5461k0412o2080m5421M5143k5293q2962K0712J5905K1437m9380k924j3252
1830a63066K1983J4443M5715l7210k8548J4886N299p057N6346J7405j7613j9454
1818i6871j0076J1783M502o3558J2663K6545J8782l1583P6189K1071m5292k8741
1806a04586l1916L0168J696J5113j3678q65M4070L474K29o8627j3314N1593l3904
1793a20547j1060M2327k0796L9739J4674m4206J8987q393O90j064q3554K4101
1781a49102M3805M3997p6589o8728P3891l4052K0399P6791P203K5008J9143l5230
1769e3464M3363J7027p7352n3202M8859J8222n9474l6356O6911J9412R3157j8808
1757H295n8620K0429J7552r6199R58O7583n3536J7649N3007j5159k1156k0820
$$ y = [35461, 15049, -47031, -92452, -47309, -72602, -155564, -134852, -118947, -97510, -146890, -149814, -163066, -141083, -126640, -80925, -118135, -146683, -131797, -126498, -133555, -77209, -59804, -77417, -96871, -106947, -95164, -90662, -154220, -141557, -115012, -96230, -127813, -51624, -30553, -75845, -104586, -136502, -106334, -104638, -89525, -103203, -104068, -59998, -56524, -56295, -124922, -138236, -86643, -120547, -131607, -89280, -110076, -70337, -55663, -99869, -80882, -89275, -88585, -89649, -173203, -149102, -105297, -61300, -137889, -206617, -132726, -166778, -146379, -69588, -62385, -37377, -18234, -53464, -10101, 6926, -70426, -123628, -74769, -56547, -116021, -152377, -85466, -66054, 27103, 8295, -50325, -29896, -12344, -108543, -107585, -40002, -93538, -75889, -22882, -38041, -59197, -80017]
1745h0017n5582k4698P1111Q3285l5775n1749j5993p533n3447n4401L0567J4971
1733a79261L8381L1823M7476j9223n3922L0141M026K2143j6859K8225L5191m4616
1721g6475J2626l9778m8580l9735L5609O9305J761m5372N2158K0529o8162m2787
1709a68901K8262K7721R2377k5014r1419m491J3908m651L6813m585m4469J6275
1697a28174M7455Q993n3191j4320q299P0893L6094j3521m8356l1722j8349L1976
1685a20521K9780N014M7693o292P716n0332o7187L4304R0862m7871j0549k341
1673h9724J8708K2965j433m5138n906N2625k5262J2086k9613l5993K1722L5770
1661f9193j9705M0910L4477j2708K073l9500k071L318L5573J6732m2584J9367
$$ y = [-80017, -135599, -160297, -89186, -5901, -41676, -93425, -109418, -116951, -170398, -224799, -194232, -179261, -140880, -109057, -61581, -80804, -134726, -104585, -100559, -78416, -95275, -67050, -31859, -76475, -63849, -103627, -152207, -191942, -156333, -87028, -85267, -130639, -78481, -57952, -126114, -168901, -140639, -112918, -20541, -45555, -136974, -141465, -127557, -132208, -95395, -99980, -144449, -128174, -80719, -71726, -124917, -139237, -147536, -76643, -40549, -54070, -102426, -134148, -152497, -120521, -90741, -85727, -38034, -44326, -36610, -86942, -154129, -119825, -28963, -76834, -87383, -89724, -71016, -48051, -49484, -94622, -100528, -47903, -73165, -61079, -90692, -126685, -104963, -69193, -88898, -47988, -13511, -26219, -24146, -63646, -65717, -62399, -26826, -10094, -52678, -33311]
1649c3311K75k7526L226J9866k0807M7194j5460j6512m4753J5356L1608N4730
1637A3886p4267r6181J7537K2433L7549K2938O368J1891M635j08836P2369N9097
1625a0581l3411r325k1143P9750J1648k76k8157l1607m0042M6996K4479n0564
1613f2233k7265m296O1786p682m1523Q5074o1043k0191o5955M6219R1543k134
1601g700k517J4932n9938m0536L6691k5981j732r382O4591j5744j3183l3407K5102
1588f8804j4965k9182O716l8474O4171R115P305k312K7829k4141J2475L434k6222
1575g3055k0858j1865L3185L0322p068R04J0272j0999J0654l7938J0578N7711
1563h157l0371O0094L3003p5294k873l611k4482K8662P4376o5184j6722P415O3154
$$ y = [-33311, -33036, -60562, -57336, -37470, -58277, -11083, -26543, -43055, -87808, -72452, -40844, 13886, -60381, -156562, -139025, -116592, -79043, -56105, -49737, -37846, -33211, -142047, -69678, -10581, -43992, -53317, -74460, 5290, 16938, 16662, -11495, -43102, -83144, -36148, -11669, -62233, -89498, -93794, -32008, -39690, -81213, 3861, -57182, -77373, -143328, -97109, -5566, -7700, -10217, 4715, -55223, -95759, -59068, -85049, -86781, -96163, -31572, -47316, -60499, -93906, -68804, -83769, -112951, -106235, -144709, -80538, -71423, -64118, -66430, -38601, -62742, -50267, -46833, -73055, -93913, -105778, -72593, -42271, -49339, -48435, -38163, -49162, -38508, -76446, -65868, -8157, -38528, 21566, 54569, -20725, -23598, -27209, -51691, -23029, 51347, -13837, -30559, -23144, 40010]
1550D0010l9386m1417J5728r469n4797P9802j2291k7302n857j091K7148J6971
1538a1951K7140n133n8475Q742N4579k5444m8455m249K7194k5618M068O7177o8906
1525e9331k5926K4293l4125K4097J468j5701J5512K5546N279j7740J9206J4441
1513b2981R390j528j4061k3948L3548j389n0449K7542p181J0839m2437q524K5689
1500f5490k2412j024k0122N7275M1986m5081m4908K3635k3576M6052N2749n0291
1488e1207K3805l2866j9436J7389Q66P4841k1945k9247J7592j9953N5319m748
1476A0410m3256k9480m8522J02249M2905J7241n4295Q251K8837l1994m1169k3145
1464f1968M068L8262l06k074J753M8057k3419o2000O7050j7910P1464p2344L5901
$$ y = [40010, 624, -40793, -25065, -34534, -89331, -9529, -21820, -49122, -54979, -56070, -28922, -11951, 15189, 10056, -48419, -39677, 14902, -10542, -58997, -63246, -36052, -61670, -57602, 9575, -59331, -85257, -60964, -95089, -70992, -69524, -85225, -69713, -44167, -38888, -56628, -37422, -22981, -13591, -15119, -29180, -53128, -19580, -20969, -71418, -43876, -51057, -40218, -82655, -91179, -65490, -87902, -88926, -109048, -51773, -9787, -54868, -99776, -76141, -99717, -53665, -916, -51207, -27402, -60268, -79704, -62315, -61449, 13392, -8553, -37800, -20208, -40161, 15158, 10410, -32846, -62326, -110848, -8599, 34306, 51547, -2748, 5503, 34340, 2346, -38823, -61968, -57900, -19638, -19944, -22018, -20265, 27792, 4373, -57627, 9423, -8487, 62977, -9367, 26534]
1451B6534m8260o11j8583m0664N8908J4568K2288j6016N503L9454k8495l84l1654
1438a7412l4426j067L5322J4352m5226Q700J36704q7199J2738L5848N958Q828
1426G3120q0230l573j6440K5333L3936k769r035L286J5770K1065p1346l4309j7552
1413f2744L6134K0150N826K7879J2840n908n5301L827l0035k892O6278o3275N4947
1400G726O8049p4323j5980j7414J0797l8944j1844L8392j6356k0805r500m744
1388h4946K4103O1328n3787o7969J5020K5612J4392M6573k3201m7259O7657J97
1376b2280k4570n449l1764J4681P7062M2381R455O3428m1781r5092n0438l7593
1364a01960J7522M2296J4338l8398P8142n309m6356L6097p6209K4568K7831k0645
$$ y = [26534, -21726, -22337, -40920, -81584, -22676, -8108, 14180, -1836, 3667, 43121, 14626, 14242, -17412, -51838, -52905, -17583, -3231, -48457, -39757, 96947, 9748, 22486, 58334, 64292, 73120, -7110, -10683, -27123, -1790, 32146, 29377, 20342, 23628, 39398, 60463, -10883, -45192, -62744, -26610, -6460, -634, 27245, 40085, 34177, -21124, -17297, -47332, -50224, 16054, -47221, 7726, 75775, 1452, -14528, -31942, -21145, -60089, -71933, -33541, -49897, -70702, -80202, -84946, -60843, 485, -53302, -121271, -106251, -80639, -66247, -19674, -42875, -90134, -22477, -22280, -46850, -52299, -84063, -69382, 7680, 50061, 59516, 122944, 81163, -13929, -64367, -101960, -84438, -42142, -27804, -66202, 11940, 6631, -39725, -3628, -79837, -55269, -27438, -48083]
1352d8083n0993L9241j1385Q0108j8167o1264K3950L3536J0001o9699L151L6159
1340c3445l358k2958k1695l0139l7275L0378N9680N9803q5K5748Q184l6059P284
1327F063L5651m9877R101K4185k8591J2241K3400k8574m8527K2970K160k3190
1315d2988L0091O8485M8059p3033m9979q382K640j4760r560J9236K3304M1904
1303C5017j6506q5559J6343k0243j1357O1637Q340q587n3966N1079m6866k1969
1291i2637K4669L6450j1806O2088k0426m8698r5009O8543O2233j3822K6459L4607
1279C2651j5362j3742J246K8389n9489J3289K6874k5816k7272k4209J5836j5852
1267f3457K0484N7095j946N3602p1932o9176n4962J9196M7868J7527L9912J0354
$$ y = [-48083, -99076, -59835, -71220, 8888, -9279, -70543, -46593, -13057, -3056, -72755, -69604, -33445, -36803, -59761, -81456, -111595, -148870, -118492, -58812, 991, 906, 26654, 34838, -1221, 6063, 41714, -8163, 938, 25123, -3468, 8773, 32173, 3599, -44928, -21958, -19798, -42988, -12897, 55588, 103647, 30614, -19365, -27747, -25107, -39867, -49427, -30191, -6887, 35017, 18511, -67048, -50705, -70948, -82305, -20668, -12328, -20915, -74881, -23802, -70668, -92637, -67968, -31518, -43324, 18764, -1662, -50360, -145369, -76826, -14593, -28415, -1956, 32651, 17289, 3547, 4793, 33182, -26307, -13018, 13856, -11960, -39232, -63441, -47605, -63457, -42973, 14122, 12176, 65778, -6154, -75330, -130292, -111096, -63228, -45701, -5789, 4565]
1255D565j5180n8849L542M7047R0788q3518K0671P0375M96m3140J9279r0950K4337
1242a0537O6315o583n8726L6284j5061K1170m8527k9686J2750J2106j9806N6891
1230A6590K7315p8222L3291j307M7853r550l2663L407j7574K3074o6955k6208
1218h0949j0298L2662O7898O1884j810L213l3683m2230j4388M2618N4356k279
1206G6994l884l5366m0736o0277N6208k6840k2957M5333L4520J8658q446L670
1194C6877K6233m8154m9722J0824M5136P157n9197L1549j5341O8139K001l4775
1182B0727N3578p9035K1492K0099K437j0559L9695k8933m7971m4986K1977K7268
1170d211J703K8696n5037m266o1327M4066K9901R022Q5871o7982k2859k6853L2325
$$ y = [4565, -10615, -69464, -65922, -18875, 71913, -11605, 9066, 79441, 79937, 36797, 56076, -34874, -10537, 55778, 49195, -9531, 26753, 11692, 32862, -15665, -45351, -32601, -20495, -40301, 16590, 43905, -34317, -1026, -2333, 45520, 35970, 3307, 6714, -10860, 12214, -54741, -80949, -91247, -58585, 9313, 71197, 69387, 72600, 38917, -3313, -17701, 24917, 79273, 76994, 73110, 37744, -2992, -63269, -7061, -33901, -56858, -11525, 22995, 41653, 33207, 36877, 63110, 14956, -34766, -23942, 21194, 28351, -30846, 703, -14638, 53501, 55502, 20727, 74305, -4730, 16762, 36861, 39298, 28739, 68434, 39501, -8470, -53456, -31479, -4211, -2508, 26188, -28849, -33115, -94442, -50376, -20475, -11453, 74418, 6436, -16423, -43276, -10951]
1157a0951l0554K9453q997J9841N0641k1433l5308K980M6983l1962k522P2618
1145H0789k9662l346N437l3007j09871L6842k4995K9223N8793p7490M8074O6426
1133D7213l7410k0718K5119m217J8708J460m7047J8913J6491l820N1968j0530
1121E6130J7811r9456L1625L3229n0723k5554O726Q2831l4559j735J2584j5616
1109A3293j229J3483J6088j4461j9846l8669O772k9543L2154j3029o174L0547
1097a0614L2737m6850K1054M4641Q472r7339J4607o385j1378N4891K961O663m1327
1084b7867M1999M7570L2693n7601j5083m1140R711O2809n9953m5250L6588K0434
1072D910l4434M1181Q844J1653n0705p159j7572M2681K3296J6224o3260r882P1792
$$ y = [-10951, -41505, -12052, -21049, -1208, 49433, 28000, -7308, -4328, 42655, 10693, 8171, 80789, 51127, 47781, 53218, 20211, -89660, -52818, -77813, -48590, 10203, -67287, -19213, 47213, 9803, -10915, 14204, 9987, 28695, 30155, -16892, 2021, 18512, 14692, 66660, 56130, 73941, -25515, 6110, 39339, -11384, -36938, -30212, 52619, 18060, 16325, 28909, 13293, 12064, 25547, 41635, 27174, 7328, -31341, -24569, -54112, -21958, -34987, -41161, -10614, 22123, -24727, -3673, 40968, 49440, -47899, -33292, -39677, -51055, 3836, 6797, 13460, -27867, 14132, 61702, 94395, 36794, 21711, -19429, -9718, 53091, -6862, -52112, -15524, 4910, -29524, 11657, 20501, 32154, -18551, -25710, -43282, -601, 22695, 38919, -24341, -34223, 37569]
1059C7569n164J5789L2150p4225K5996m8568L123M6936m1858N0604K3685l2179
1047C3858M385J7427m1526O2910P4548o9852q8017J8637l9665J2165L038R610
1035b482k2132O196N5534L3841p9461q042P0798n2531l1325K4365l1308o704m9494
1022i2745L8591M6422P0127O0622l4364n5224l7619k8234M2644j9545O5229J3544
1010F9448N8089k7528p8184L3463m836l0629o6890P0084K9000k9030R158n2848
998b0703M5584k0348L956p262k3804J8230N2391K3010k4060m3780l8883K6670
986h999J3078J8260J0134j4125k6787R3359r1846K8719J6401j9982m5216l2702
974e9706k9032O3862J37719j8988q1069l9360M1984k2833k7633M9749K2034L5996
$$ y = [37569, 32405, 48194, 80344, 6119, 32115, -16453, -13330, 33606, -8252, 42352, 66037, 33858, 38243, 55670, 14144, 77054, 151602, 81750, -6267, 12370, -27295, -15130, -12092, -2482, -24614, -18418, 37116, 70957, -8504, -16546, 54252, 1721, -29604, -5239, -36547, -43251, -92745, -54154, -7732, 62395, 123017, 88653, 33429, -4190, -32424, 10220, -9325, 55904, 69448, 127537, 100009, 21825, 55288, 50452, 19823, -47067, 23017, 52017, 22987, 32145, -20703, 24881, 4533, 8489, 1227, -22577, -4347, 48044, 71054, 46994, 3214, -35669, -8999, 4079, 22339, 32473, 18348, -8439, 84920, -6926, 21793, 38194, 18212, -27004, -59706, -88738, -24876, 112843, 93855, 12786, -26574, 15410, -7423, -35056, 14693, 36727, 72723]
962G2723p5881l8714M5464J0522M6256q866k5045O2418n1777k2090M3025k268
950E5767k2560l478l2543Q932J0179M1368k5820k7676M78K3070Q1652p1267o638
937C1464R296l7861M2287L646p2048M14l0916J1628M5225J3902l5884k1660L1017
924i490J0586n4358k0412K6972J9745Q827K4234K6061K1088l4146M3217j2076
912E0248M0700m4330K4653m6908n4360O6577O8163J8546r933J4082j4270q8618
900B4550O720j4073o6056R4692k8547N7015m9771K7832l81L981p04M3913m7279
887E1892p841J3962p4395J4052j0714K2251K1678k0029j5855K3210m6054K6942
875i01M4517M7490n2966L272k6610K71l4573O0427K791n36K1010l6926m1082N3576
$$ y = [72723, -3158, -41872, 3592, 14114, 60370, 51504, 26459, 88877, 37100, 15010, 58035, 55767, 33207, 29729, -2814, 6118, 16297, 57665, 31845, 4169, 4647, 27717, 109369, 38102, 31464, 40760, 2899, 45186, 48832, -23216, -22802, -53718, -42090, 3135, 17037, -18847, -40507, -9490, 1096, -53262, -73674, -46702, -26957, -18130, 6104, 32165, 53253, 19107, 62324, 50248, 90948, 46618, 71271, 24363, -29997, 36580, 104743, 123289, 113356, 127438, 113168, 24550, 31270, 17197, -48859, 45833, 17286, 74301, 24530, 52362, 51981, 55962, 55258, 99171, 51892, 44051, 58013, -16382, -2330, -13044, 9207, 30885, 10856, -4999, 18211, -27843, -901, 43616, 91106, 38140, 41412, 14802, 15073, -19500, 40927, 43718, 43182, 64192, 27266, -13816, 39760]
861C9760L2794l2686M1231m5112O3511L3093r6924n1312L7109K3411L7310j3444
849F8741J1423n2052k5403M5249K4500o478n570J5890n2463j4536J8131L6068
837F3500J9972l3519l4924K8238M7620m5239M792L1144j01415n7915M7732K0745
825i269j0012J2477L6196j9826J6506l4262N6145p697j3742M5927l4294j6365
813B1784K8203j9646q509k5020J9022n859J4563L0104j1306k8203o055l6776n3501
800h1199N3457N3279L9980K2068p738K5027m3993j2695j40143q271O1715j0575
788d9088O0146J0191J0145K277Q6775M1607j2649p1257q397L186n7062j943R738
775B3669R072J6199n5612L489J03410k1064m1749o015M3778J1068q2112j7753
$$ y = [39760, 72554, 39868, 81099, 35987, 99498, 132591, 35667, -15645, 21464, 44875, 82185, 68741, 80164, 28112, 2709, 47958, 72458, 65980, 60410, 76300, 23837, 9301, 27432, 63500, 83472, 49953, 15029, 43267, 90887, 45648, 50440, 81584, -19831, -77746, -30014, -9269, -19281, -6804, 29392, 9566, 26072, -8190, 47955, 40258, 26516, 72443, 38149, 21784, 49987, 30341, 21832, -3188, 15834, 9975, 24538, 54642, 43336, 15133, 9078, -27698, -81199, -27742, 25537, 65517, 87585, 79847, 104874, 60881, 48186, -91957, -100228, -38513, -49088, 11058, 21249, 31394, 33671, 120446, 162053, 149404, 78147, 69750, 72936, 15874, 13931, 23669, 32741, 48940, -6672, -3183, 100227, 79163, 37414, 31399, 75177, 86245, 4133, -13620]
763a3620n9866O914J1468L3753Q450K3539j7306j8044K5342L0812M3912n0622
751B4732k58K7700k0921M2930J2992O541m781p5657J9387j0091n0312K3813O8058
738F4133j4175n874k6168j1760K7462l4162l260N1349Q2379j4465p2827k210J5927
725E6349k196L4430j8217l070j5678m652l6183K5698J1361J8032l002j2366Q2151
712A32657n115n2105K700p9085q534M1100R128n201l3782j6138K2792o0949L1677
699b0855R2358N735k2126l7810P581m219K9289J5936l8385L6133j2773n1385K1578
686B1057N5891K5322m248n7405K2446n3327k3298L9680q0794k2628P420J0487
674e9397R1117N4401q101K327l0347n9759K7917L1480n0868j7931k4393M6621
$$ y = [-13620, -73486, -66572, -55104, -21351, -12901, 10638, -6668, -24712, 630, 31442, 75354, 24732, 24474, 52174, 31253, 74183, 87175, 93716, 88935, 13278, 32665, 22574, -27738, -3925, 64133, 49958, 44084, 17916, 6156, 33618, -544, -3804, 47545, 129924, 115459, 42632, 40422, 56349, 54153, 88583, 70366, 67296, 51618, 46966, 10783, 36481, 47842, 65874, 62872, 50506, 132657, 127542, 75437, 78137, -948, -9482, 31618, 40746, 35545, 1763, -14375, 8417, -52532, -20855, 71503, 77238, 55112, 17302, 24883, 20664, 49953, 65889, 27504, 63637, 50864, -521, 21057, 76948, 102270, 98022, 40617, 63063, 9736, -13562, 26118, -54676, -77304, -69884, -59397, 31720, 86121, 78020, 80347, 50000, -9759, 18158, 49638, -1230, -19161, -43554, 3067]
662C067M8871j2082j0545k3754k894K3539j7655k4808m613J2096J76L6490q2070
649e4182J2144O3988K4804l1621K2354k9571n755J3985o666j0802K7517j2123
637A4072r9679O5035O9821P814o179o507o0360n3428N8702L5192o4384k8420K8462
624c9859L0391K3369N5313l4100j9575M6760j5893J9419j2088o8875o5468O2340
612a8266O7790L0416J5425J8298l8189j1380l6232K7056R239k4764j1701j610
600B6082L8280l596o3434O1561L6935l1858j0403N201l5489l371L262m2528k6677
587d6035Q0430K954J826N124m5142N1039M3031M1479l6344Q462n3538l7239K3899
574C9946M4997k2034j11528K6046J4969O8229r941n1297K3839r850k426P0918
$$ y = [3067, 51938, 39856, 29311, 5557, 2663, 26202, 8547, -16261, -20874, -8778, -8602, 27888, -54182, -42038, 21950, 46754, 15133, 37487, 7916, 2161, 16146, 9480, -1322, 26195, 14072, -85607, -20572, 49249, 57063, 50884, 44377, -15983, -69411, -10709, 24483, -39901, -68321, -39859, -9468, 13901, 69214, 35114, 15539, 62299, 46406, 65825, 53737, -15138, -80606, -18266, 49524, 79940, 95365, 113663, 75474, 64094, 27862, 54918, 64157, 39393, 27692, 26082, 64362, 60766, -2668, 58893, 95828, 63970, 53567, 58768, 23279, 19908, 23170, -19358, -46035, 34395, 37349, 39175, 44299, -843, 50196, 93227, 134706, 98362, 106824, 53286, 16047, 39946, 84943, 62909, -48619, -22573, -7604, 60625, 50684, -613, 23226, 13376, 10950, 81868]
562H1868J0468m3796l7529K4029r904m8766L6315o2611K6308L2524M5425M9718
550A04049j1777p6746N3273p4392M7638L0873n27n4100K2094P3867l6870R543
538H6925K073l2701p3884J3069K2311M8763L3220m3401L996n5017r228L9215j9188
525A6153R441M261j8626K9888o3770J1463O1092l8181J466Q9650l079k8285k2755
512D8718R973J4407J3236n6248J9475R5020l456j45046o2946O294L4431k2610
500d8752o698O0158l2817K6250K571J3910j2252P299m7511l919N3599k9497k215
487a9874q813j471k8805M6782L4872k8491O277k9893L8761L5942l8961m4360p953
474d5987M1866K474N429n390j3980N0896l1384J0188m5600Q0921P916q218m0822
$$ y = [81868, 92336, 48540, 11011, 35040, 25136, -23630, 12685, -49926, -23618, 8906, 54331, 104049, 92272, 15526, 68799, -5593, 42045, 72918, 72391, 18291, 40385, 114252, 77382, 86925, 88998, 56297, -17587, -4518, 17793, 66556, 99776, 56375, 60371, 5354, -3874, 35341, 16153, 25594, 29855, 11229, 41117, -22653, -11190, 49902, 11721, 13187, 102837, 99758, 71473, 48718, 58691, 73098, 86334, 30086, 49561, 144581, 141125, -3921, -66867, -60573, -26142, -48752, -55450, 4708, -28109, -1859, 712, 14622, 2370, 9669, -37842, -41761, 11838, -17659, -19874, -28687, -30158, -58963, -12181, 22691, -5800, 477, -29416, 9345, 45287, 6326, -38034, -45987, -4121, -1647, 3782, -1608, -15588, 35308, 3924, 14112, -31488, 49433, 57349, 49131, 8309]
461H309r551L7776k0440l1076L5635j6404J0469L8165o3075J5320j8534m3306
449e6712K5568L2845m801r665K886K3957K427m9692M1017M1143j1746p177K8085
436E8135k9040N157k9208K3330j8589k5449j4987l056L6207p7348K6879M6261
424a708J3198k3426l5425Q315j3140J0454m919R3882l694M1852j8264l3936J6423
411D9612o960o8450k8167J934O8489J3223L0247j9769k6085J9634n7237j2318
399c5847J1266L9212j230L151p8691m9873P9983M8635j525m0285l5006M0877p13
386b0046N6983n5378Q7117k5682j2189o8399j6873M6765L0136k2383k5670L4048
374H429k0118r026j1818L682M6101K3535J2962K4032L7672o0739M1878m4451K6788
$$ y = [8309, -1242, 36534, 16094, -14982, 20653, 4249, 14718, 52883, -10192, 5128, -13406, -56712, -31144, 1701, -3100, -12765, -9879, 14078, 16505, -33187, 7830, 48973, 37227, 30050, 58135, 29095, 34252, 5044, 28374, 9785, -15664, -30651, -33707, 2500, -74848, -47969, -1708, 11490, -11936, -47361, -39046, -52186, -41732, -46651, 47231, 43537, 85389, 67125, 33189, 49612, 42652, -25798, -53965, -52031, 16458, 29681, 59928, 40159, 14074, 33708, -23529, -35847, -24581, 14631, 13401, 16552, -62139, -112012, -32029, 16606, 15081, -25204, -60210, -19333, -20046, 36937, -18441, 68676, 42994, 30805, -37594, -54467, -7702, 22434, 51, -25619, 8429, -11689, -20715, -32533, -28851, 17250, 40785, 53747, 77779, 115451, 54712, 96590, 52139, 78927]
361G8927P4365p5237l9226m5892J0059m825m6658K4508K9012J3285r622K3029
349C1725j44M1142l5177j9843P0655o3850n8000K5015J7479n3956J9216J5231
337a0507J5060k3389m8301j7318L2516L0103n2616O757m5374K0478K8074L5188
325b9329m200l4965K4436M2357j0160k4118M6832M9472p9506l2985P3477J6035
313C7346r3305m2348J10190p269J3622M0599N2014j5008L8369j32007n0686L6948
301a1535m910k8137k3959J8021L555k1378Q0427L9702k8268J6191O0323M1095
289A41127n8168p7668k7731L0619K910m9936j7721r303N5359J0390j3721K277
277a1566P559M4420j7520k2449L6960j3737L3949l3033l978M240j0456m2056K0181
$$ y = [78927, 153292, 78055, 38829, -7063, 2996, -1829, -48487, -23979, 5033, 18318, 8696, 31725, 31581, 72723, 37546, 17703, 88358, 24508, -33492, -8477, 9002, -44954, -25738, -10507, 4553, -18836, -67137, -84455, -51939, -21836, -74452, -67695, -113069, -92591, -64517, -29329, -33529, -68494, -44058, -1701, -11861, -35979, 10853, 60325, -19181, -52166, 21311, 37346, -55959, -98307, 11883, 4614, 18236, 58835, 110849, 95841, 134210, 2203, -48483, -11535, -16445, -44582, -68541, -50520, -46965, -68343, 12084, 51786, 23518, 39709, 100032, 141127, 82959, 5291, -22440, 8179, 11089, -38847, -56568, -65871, -10512, -122, -13843, -11566, -4007, 40413, 22893, 444, 37404, 23667, 57616, 24583, 20605, 24845, 14389, -27667, -7486]
264g486L7214K9322q4620q6072Q9653o097M9011k0385o369k1784r929l4689J7557
251e4674L8242K0758k0494m3241N4571O0275j9345r5092r761M4027N1022o6996
239d0708m5892N4508J98M4729j3255l1677M8738N1642j5700O981K584n8210K2355
226B6293M3971j00539j8735O390J2779M121n314J6370k566Q796j7882R985K2887
213F556N761k9533l9822K3894k6710K2955M0639K1681m7017K3608M9006p0172
201a9154K0595l9672j3247M3463L5654m2906j4134K5204n026K0533j0048K970
189D232K2553j2058m7544J4621k0130K6294k0453k4222M4628O0841K1697n8796
177A1663p9764L3874j8196J9787J4492J4782J4630J3372M7897l1952K1983n7577
$$ y = [-7486, 29728, 59050, -25570, -111642, -21989, -28086, 20925, 540, -5829, -27613, -37542, -72231, -54674, -16432, 4326, -16168, -59409, -4838, 55437, 36092, -59000, -68761, -24734, 26288, -40708, -86600, -32092, -31894, 12835, -420, -32097, 16641, 68283, 52583, 59564, 62148, 3938, 26293, 70264, -30275, -49010, -42620, -29841, -25720, -31034, -14664, -17230, -8434, -26316, -16331, 6556, 12317, -17216, -57038, -33144, -59854, -36899, 3740, 25421, -21596, 2012, 51018, -19154, 1441, -38231, -51478, -8015, 27639, -15267, -29401, -4197, -9223, 11310, 1262, 4232, 26785, 14727, -32817, -18196, -38326, -12032, -32485, -56707, -12079, 48762, 70459, 11663, -68101, -34227, -52423, -32636, -18144, -3362, 11268, 24640, 72537, 40585, 62568, 4991]
165D991m0646o260K7337P4457K2795p1507l9224L1844m86m3030J209J1111N5096
152B7687j2064J8017L2877j071l7115o764j3886J1040q068N032m6978n7724J8663
139g0354K2790O2431j0436j0078j6052J1477m9003L2028o832J2213O1228j9184
127B0228l248R959j5248m5026j2701j7851j871j8968R5294J6839q8732K8960K0148
114a2217O077N6694m3834m3561P822J4190m4024M531M6468J0667O240k6892J3174
101d665K5610k5939q006L914K8792J3502j6164O465p9474k2875L3970O397j6197
88e4670o002K7183j0680L442k9657R989K2259n134N2251n843q246k0688N7977
75C2181k176l567l580m7952K0967l3523L1014k6114n5045L5209j4689J9897J7938
$$ y = [4991, -35655, -41915, -14578, 59879, 82674, 11167, -28057, 3787, 3301, -39729, -38520, -27409, 27687, 15623, 33640, 66517, 65446, 28331, 21567, 7681, 18721, 10653, 15685, -31293, -89017, -70354, -47564, 14867, 4431, -5647, -21699, -10222, -59225, -27197, -34029, -21816, 39412, 20228, 16980, 26939, 11691, -33335, -46036, -63887, -65758, -84726, 10568, 27407, -61325, -32365, -12217, -6140, 50554, 6720, -36841, -29019, -14829, -58853, -54322, -7854, 2813, 9053, -17839, -4665, 20945, -4994, -13000, -9086, 19706, 33208, 17044, 23509, -55965, -78840, -44870, -38473, -54670, -60672, -33489, -44169, -40727, -70384, -60395, -38136, -43270, 8981, 3138, -5108, -25796, 32181, 30005, 26438, 22858, -25094, -4127, -37650, -6636, -32750, -87795, -52586, -67275, -47378, -29440]
62b9440j8836J602K6942L6317l356j1339M5699k1650K5018j4511o8529K5451J232
49e400K0496n4606N026P581L362j338n5292L0371N3374K6067j9437l5439j4013
36c9248J5578J6278m981k1845J7363Q0336j8021k6538q570q211J5341J5243J0980
23D3705j8833j9540Q248l1558m5539j7874J4766K7558j7502M3086O2692K7454
11G6663o0289l1055l8709k1407j629k332O980K6052N4910K2991m0083
0g908
$$ y = [-29440, -48276, -46674, -19732, 16585, 13229, 1890, 47589, 25939, 50957, 36446, -32083, -6632, -5400, 15096, -39510, -34484, -26903, -23541, -24879, -80171, -49800, 3574, 29641, 10204, -25235, -39248, -23670, -7392, -12373, -34218, -16855, 63481, 45460, 18922, 10352, 2141, 17482, 32725, 43705, 24872, 5332, 13580, -17978, -63517, -81391, -66625, -39067, -56569, -13483, 49209, 76663, 16374, -14681, -53390, -74797, -76426, -78758, -71778, -45726, 9184, 32175, -7908]
$$ Imaginary data points
##PAGE= N=2
##DATA TABLE= (X++(I..I)), XYDATA
16383b071413l93L2913N9975Q462J1749q859K6794L5416P1009j978O774J4027
16371a815524L8246O2288o658M9702M6815L8824J3765K6289M1195L3142O093Q515
16359a457308M9723J3931K2084J2889N3005N0679M6185K4321L0750L3162n397
16348a125976M6307P606N0111M3142K8252M1159j858k9209Q481R2411J00088J4378
16336g25108p030M2218k389q952O6509J9679R958J8603M2948J3077K5728L5040
16324d69719Q2555J6077k9725K2879K8837K6831J9856P0694J4721L699L3733M4004
16312a35558N4498L1812k3335r110J543O7757O0700j917P8890M1933M572k9863
16300A41922O2956O4702k958m2919J8595M389N439N9931N3124q629J9582M6238
$$ y = [-2071413, -2071806, -2038893, -1978918, -1970456, -1958707, -1967566, -1940772, -1905356, -1834347, -1836325, -1829551, -1815524, -1777278, -1714990, -1721648, -1671946, -1625131, -1586307, -1572542, -1546253, -1505058, -1471916, -1465823, -1457308, -1407585, -1393654, -1371570, -1358681, -1305676, -1254997, -1208812, -1184491, -1153741, -1120579, -1125976, -1079669, -1072063, -1021952, -978810, -950558, -909399, -911257, -940466, -931985, -839574, -739486, -725108, -732138, -689920, -692309, -701261, -634752, -615073, -605115, -586512, -543564, -530487, -504759, -469719, -387164, -371087, -400812, -377933, -349096, -322265, -302409, -231715, -216994, -213295, -179562, -135558, -81060, -49248, -72583, -81693, -80150, -12393, 48307, 46390, 125280, 167213, 171785, 141922, 204878, 269580, 266622, 223703, 242298, 246687, 252126, 312057, 365181, 356552, 376134, 422372]
16288D22372L5950j860N9404N8104L324o170q635J2889K6269O1296L3958q532
16276F88369N0852P4179L0230j2735J9807k6221M8380M6845l2639K211k1785J6768
16264H84261o107P4752R535L9555p614M8607L4220l7573K2979L8036N5383L7648
16252A193682j3759O2085m4011M308J4314O9148p323k0787m60J4910M3497j955
16240A313649O278K5983m14N3679M1870m4511J7639j2618M4190K0506j0364N0005
16228A505892J8094K6558J1915k7961q150K2251Q1635K0300m2032N184K7708J08052
16216A749446l7026k3513O108M1334J8714k4211J9072K0230P140P1042q524m9739
16204A790073K4319N570P755j6805N282R155J0654J6270M2878L5250l9776o205
$$ y = [422372, 458322, 456462, 515866, 573970, 577294, 571124, 562489, 575378, 601647, 662943, 696901, 688369, 739221, 813400, 843630, 830895, 850702, 824481, 872861, 919706, 887067, 889278, 867493, 884261, 878154, 952906, 962441, 1001996, 994382, 1042989, 1077209, 1039636, 1062615, 1100651, 1156034, 1193682, 1179923, 1242008, 1197997, 1202305, 1216619, 1285767, 1278444, 1257657, 1257197, 1272107, 1315604, 1313649, 1319927, 1345910, 1345496, 1399175, 1441045, 1396534, 1414173, 1401555, 1445745, 1466251, 1455887, 1505892, 1523986, 1550544, 1562459, 1534498, 1526348, 1548599, 1630234, 1650534, 1608502, 1613686, 1641394, 1749446, 1712420, 1688907, 1695015, 1736349, 1755063, 1730852, 1749924, 1770154, 1777294, 1848336, 1839812, 1790073, 1814392, 1819962, 1827717, 1810912, 1816194, 1825349, 1836003, 1852273, 1895151, 1930401, 1890625, 1884420]
16192A884420Q7664k6743J1771P4912L2485k094J4662J1431r5507j4151K0143
$$ y = [1884420, 1972084, 1945341, 1957112, 2032024, 2064509, 2062415, 2077077, 2088508, 1993001, 1978850, 1998993]
$$ [...]
##END NTUPLES=NMR SPECTRUM
##END=
