##TITLE=1H_DE-80H_X3
 200.13MHz, d2o
 8 sc
 
 19ns.26.2.2025
##JCAMPDX= 6.0         $$ Bruker NMR JCAMP-DX V2.0
##DATA TYPE= NMR SPECTRUM
##DATA CLASS= NTUPLES
##ORIGIN= UXNMR, Bruker Analytische Messtechnik GmbH
##OWNER= pz
$$ XWIN-NMR		Version 3.5
$$ Wed Mar 18 10:03:12 2026 Russian Standard Time (UT+4h)  Yarkov@DPX200
##.OBSERVE FREQUENCY= 200.1313
##.OBSERVE NUCLEUS= ^1H
##.ACQUISITION MODE= SIMULTANEOUS
##.ACQUISITION SCHEME= undefined
##.AVERAGES= 8
##.DIGITISER RES= 18
##SPECTROMETER/DATA SYSTEM= spect
##.PULSE SEQUENCE= zg30
##.SOLVENT NAME= DMSO
##.SHIFT REFERENCE= (INTERNAL, DMSO, 0, 15.4957)
##AUDIT TRAIL= $$ (NUMBER, WHEN, WHO, WHERE, WHAT)
$$ ##TITLE= Audit trail, XWIN-NMR		Version 3.5
$$ ##JCAMPDX= 5.01
$$ ##ORIGIN= Bruker BioSpin GmbH
$$ ##OWNER= Yarkov
$$ C:/Bruker/XWIN-NMR/data/yarkov2/nmr/H-C/1/pdata/1/auditp.txt
$$ ##AUDIT TRAIL=  $$ (NUMBER, WHEN, WHO, WHERE, WHAT)
(   1,<2026-03-18 10:01:59.28 +0400>,<Yarkov>,<DPX200>,
      <created by zg, POWCHK disabled, PULCHK disabled
       configuration hash MD5:
       00 E9 B6 7A A2 85 ED C7 34 08 36 98 17 FE 4E 26
       data hash MD5: 16K
       DA 5A C4 AF 59 E6 B3 23 2E 11 EB 2B 54 B7 29 37>)
(   2,<2026-03-18 10:02:03.64 +0400>,<Yarkov>,<DPX200>,
      <Start of raw data processing
       efp BC_mod = 2 LB = 0.25 FT_mod = 6 PKNL = 1 PHC0 = -5299.148 PHC1 = 6.821927 SI = 16K 
       data hash MD5: 16K
       97 36 25 93 16 D5 63 79 CA 50 1C 7A AE E5 C1 FB>)
$$ ##END=
$$ 
$$ hash MD5
$$ 36 3E FD 8F 6C 4F 27 5B 3E C7 53 F1 FA 4B 91 80
##$RELAX= 
##$RELAX= 
##$RELAX= 
##$RELAX= 
##$RELAX= 
##$RELAX= 
$$ Bruker specific parameters
$$ --------------------------
##$DU= <C:/Bruker/XWIN-NMR>
##$EXPNO= 1
##$NAME= <H-C>
##$PROCNO= 1
##$TYPE= <nmr>
##$USER= <yarkov2>
##$AMP= (0..31)
100 100 100 100 100 100 100 100 100 100 100 100 100 100 100 100 100 100 
100 100 100 100 100 100 100 100 100 100 100 100 100 100 
##$AQSEQ= 0
##$AQ_mod= 1
##$AUNM= <au_zg>
##$AUTOPOS= <>
##$BF1= 200.13
##$BF2= 200.13
##$BF3= 200.13
##$BF4= 200.13
##$BF5= 200.13
##$BF6= 200.13
##$BF7= 200.13
##$BF8= 200.13
##$BYTORDA= 1
##$CFDGTYP= 0
##$CFRGTYP= 5
##$CHEMSTR= <none>
##$CNST= (0..31)
1 1 145 1 1 1 1 1 1 1 1 1 1 1 1 1 1 1 1 1 1 1 1 1 1 1 1 1 1 1 1 1 
##$CPDPRG= <>
##$CPDPRG1= <>
##$CPDPRG2= <>
##$CPDPRG3= <>
##$CPDPRG4= <mlev>
##$CPDPRG5= <mlev>
##$CPDPRG6= <mlev>
##$CPDPRG7= <mlev>
##$CPDPRG8= <mlev>
##$CPDPRGB= <>
##$CPDPRGT= <>
##$D= (0..31)
0 0.7 0 0 0 0 0 0 0 0 0 0.03 0 0 0 0 0 0 0 0 0 0 0 0 0 0 0 0 0 0 0 0 
##$DATE= 1773813718
##$DBL= (0..7)
120 120 120 120 120 120 120 120 
##$DBP= (0..7)
150 150 150 150 150 150 150 150 
##$DBP07= 0
##$DBPNAM0= <>
##$DBPNAM1= <>
##$DBPNAM2= <>
##$DBPNAM3= <>
##$DBPNAM4= <>
##$DBPNAM5= <>
##$DBPNAM6= <>
##$DBPNAM7= <>
##$DBPOAL= (0..7)
0.5 0.5 0.5 0.5 0.5 0.5 0.5 0.5 
##$DBPOFFS= (0..7)
0 0 0 0 0 0 0 0 
##$DE= 6
##$DECBNUC= <off>
##$DECIM= 32
##$DECNUC= <off>
##$DECSTAT= 4
##$DIGMOD= 1
##$DIGTYP= 9
##$DL= (0..7)
0 120 120 120 120 120 120 120 
##$DP= (0..7)
$$ [...]
##$SUBNAM2= <"">
##$SUBNAM3= <"">
##$SUBNAM4= <"">
##$SUBNAM5= <"">
##$SUBNAM6= <"">
##$SUBNAM7= <"">
##$SUBNAM8= <"">
##$SUBNAM9= <"">
##$SW= 18.0517328524113
##$SWIBOX= (0..15)
0 0 2 0 0 0 0 0 0 0 0 0 0 0 0 0 
##$SW_h= 3612.71676300578
##$TD= 16384
##$TD0= 1
##$TE= 0
##$TE2= 300
##$TE3= 300
##$TEG= 300
##$TL= (0..7)
0 120 120 120 120 120 120 120 
##$TP= (0..7)
150 150 150 150 150 150 150 150 
##$TP07= 0
##$TPNAME0= <>
##$TPNAME1= <>
##$TPNAME2= <>
##$TPNAME3= <>
##$TPNAME4= <>
##$TPNAME5= <>
##$TPNAME6= <>
##$TPNAME7= <>
##$TPOAL= (0..7)
0.5 0.5 0.5 0.5 0.5 0.5 0.5 0.5 
##$TPOFFS= (0..7)
0 0 0 0 0 0 0 0 
##$TUNHIN= 0
##$TUNHOUT= 0
##$TUNXOUT= 0
##$USERA1= <user>
##$USERA2= <user>
##$USERA3= <user>
##$USERA4= <user>
##$USERA5= <user>
##$V9= 5
##$VALIST= <valist>
##$VCLIST= <CCCCCCCCCCCCCCC>
##$VD= 0
##$VDLIST= <DDDDDDDDDDDDDDD>
##$VPLIST= <PPPPPPPPPPPPPPP>
##$VTLIST= <TTTTTTTTTTTTTTT>
##$WBST= 1024
##$WBSW= 4
##$XGAIN= (0..3)
0 0 0 0 
##$XL= 0
##$YL= 0
##$YMAX_a= 52147
##$YMIN_a= -48761
##$ZGOPTNS= <>
##$ZL1= 120
##$ZL2= 120
##$ZL3= 120
##$ZL4= 120
##$ABSF1= 0
##$ABSF2= 0
##$ABSG= 0
##$ABSL= 0
##$ALPHA= 0
##$AQORDER= 0
##$ASSFAC= 0
##$ASSFACI= 0
##$ASSFACX= 0
##$ASSWID= 0
##$AUNMP= <proc_1d>
##$AZFE= 0.1
##$AZFW= 0.1
##$BCFW= 0
##$BC_mod= 2
##$BYTORDP= 0
##$COROFFS= 0
##$CY= -3
##$DATMOD= 1
##$DC= 0
##$DFILT= <>
##$DTYPP= 0
##$F1P= 0
##$F2P= 0
##$FCOR= 1
##$FTSIZE= 16384
##$FT_mod= 6
##$GAMMA= 0
##$GB= 0
##$INTBC= 1
##$INTSCL= 3.241238e-09
##$ISEN= 128
##$LB= 0.25
##$LEV0= 0
##$LPBIN= 0
##$MAXI= 10000
##$MC2= 0
##$MEAN= 0
##$ME_mod= 0
##$MI= 1.114404
##$NCOEF= 0
##$NC_proc= -9
##$NLEV= 6
##$NOISF1= 3.799351
##$NOISF2= 2.8
##$NSP= 0
##$NTH_PI= 0
##$NZP= 0
##$OFFSET= 15.4957
##$PC= 1
##$PHC0= -5299.148
##$PHC1= 6.821927
##$PH_mod= 1
##$PKNL= yes
##$PPARMOD= 0
##$PSCAL= 0
##$PSIGN= 0
##$REVERSE= no
##$SF= 200.130005203309
##$SI= 16384
##$SIGF1= 3
##$SIGF2= 2
##$SINO= 0.751879
##$SIOLD= 32768
##$SREGLST= <19F.Aceton>
##$SSB= 0
##$STSI= 16384
##$STSR= 0
##$SW_p= 3612.71676300578
##$SYMM= 0
##$S_DEV= 0
##$TDeff= 16384
##$TDoff= 0
##$TI= <>
##$TILT= no
##$TM1= 0
##$TM2= 0
##$TOPLEV= 0
##$USERP1= <user>
##$USERP2= <user>
##$USERP3= <user>
##$USERP4= <user>
##$USERP5= <user>
##$WDW= 1
##$XDIM= 16384
##$YMAX_p= 428703521
##$YMIN_p= -4706493
$$ End of Bruker specific parameters
$$ ---------------------------------
##NTUPLES= NMR SPECTRUM
##VAR_NAME=  FREQUENCY,     SPECTRUM/REAL,   SPECTRUM/IMAG
##SYMBOL=    X,             R,               I
##VAR_TYPE=  INDEPENDENT,   DEPENDENT,       DEPENDENT
##VAR_FORM=  AFFN,          ASDF,            ASDF
##VAR_DIM=   16384,         16384,           16384
##UNITS=     HZ,            ARBITRARY UNITS, ARBITRARY UNITS
##FACTOR=    0.220516191357247, 1,           1
##FIRST=     3101.15449811511, 0,            0
##LAST=      -511.562264890675, 0,           0
##MIN=       -511.562264890675, -4706493,    0
##MAX=       3101.15449811511, 428703521,    0
$$ Real data points
##PAGE= N=1
##DATA TABLE= (X++(R..R)), XYDATA
$$ [...]
8281E54398k21051l2302K16322k4808n557q3954J35308n05351J80638J94212n1683
8270C56172L15870k37081L1022m90492k96706L25235N70627K32379O37787k35102
8260A209711q87763l67176J14480j7774N16480l4177l28213j36871J18495K0187
8250B07379k17810K06504J56993J89016k75828k45603M78875l206Q4041k11987
8240C68374r9319M13521p5569l39286J19792j24536N68266J4174k20197j36146
8230D89074L45903l35339p63847L49814q2422j43791J04975L91542k45853o16264
8220e06208P9167N31477L21305j13784m17876J30458j64202n8720O76271Q2423
8210E60311J52454J55801m79777N13192P11551q32275p76290L39784P74313M39985
$$ y = [554398, 333347, 301045, 517367, 492559, 487002, 403048, 538356, 33005, 213643, 407855, 356172, 672042, 434961, 465983, -24509, -321215, 4020, 574647, 807026, 1444813, 1209711, 321948, -45228, 69252, 51478, 567958, 533781, 205568, 68697, 187192, 207379, -10431, 196073, 353066, 542082, 266254, 20651, 499526, 496320, 580361, 368374, 269055, 682576, 607007, 267721, 387513, 262977, 831243, 845417, 625220, 489074, 834977, 499638, -264209, 85605, 3183, -140608, -35633, 355909, 110056, -506208, -427041, 104436, 425741, 311957, -105919, 24539, -139663, -198383, 477888, 560311, 712765, 868566, 388789, 901981, 1613532, 781257, 4967, 344751, 1119064, 1559049]
8200A559049o03089K23402q4465N56185m39714O08127J024266J952256o476607
8191a680590l025903K419449J195728L79431l20498J231648o74281N10597k83240
8182b47659J69673m63314N58523N64926l57474K08073N47145n06367J06090l81700
8172A97916k09348l35495j12837L61434j8925n08344L40821k1310L66282N35031
8162E95225K97359m15832m19879M18473L8917K03561j90409j478l89922j54245
8152a8230j5087j58083L8313j48679N83885k55710k90919N24351j68817m48069
8142c57045N08363k90665R6020M29128J66862j31501m87582K49829n94028K82536
8132a28083P62011j20467k92721n1206j93171k19946N15582L7413n22552L82375
$$ y = [1559049, 955960, 1179362, 1094897, 1651082, 1211368, 1819495, 2843761, 4796017, -1680590, -4706493, -2287044, -1091316, -711885, -1032383, 199265, -475016, 35581, -247659, -77986, -541300, 17223, 582149, 224675, 432748, 979893, 473526, 579616, 197916, -11432, -346927, -459764, -98330, -117255, -625599, -284778, -306088, 60194, 595225, 892584, 476752, 56873, 475346, 514263, 717824, 527415, 525937, 136015, -18230, -33317, -191400, -153087, -301766, 282119, 26409, -264510, 259841, 91024, -357045, 151318, -139347, -43327, 385801, 552663, 421162, -66420, 183409, -410619, -128083, 633928, 513461, 220740, 169534, -23637, -243583, 271999, 309412, -213140, 169235]
8122A69235M99939K67320l65648j88125q8000j26635l88991J96917k65941k61133
8112e51062J79710L12923M65411j33965l7013K62231l40913j09022J07935P4477
8102B30712k0715K55741j03998m40141N11868M29598O0451j67495l19029M92204
8092I29196k03680J8062j90916p17292K70075M66610l90023l85574J93854J14320
8082A04632l70333j38519M02195j61052J32180K22081m52002k02388L18062O54892
8072E09748K223N1819m37152m43714P10483n0689n96337M68986N44763J99261
8062I59391l56697q54651K45604j32862J71899k74621j32265O21907L97184R4818
8052G39707k28299m50740L55658q9039K44273k30002J47835j89570j8563l15315
$$ y = [169235, 669174, 936494, 570846, 382721, 294721, 168086, -220905, -23988, -289929, -551062, -371352, -58429, 406982, 273017, 236004, 498235, 157322, 48300, 156235, 230712, 209997, 465738, 361740, -78401, 433467, 863065, 923516, 756021, 436992, 929196, 725516, 743578, 552662, -164630, 105445, 572055, 182032, -203542, -9688, 104632, -265701, -404220, -2025, -163077, -30897, 191184, -260818, -463206, -145144, 509748, 511971, 563790, 126638, -317076, 393407, 342718, -253619, 215367, 760130, 959391, 602694, -251957, -6353, -139215, 32684, -241937, -374202, 247705, 644889, 739707, 511408, 60668, 416326, 327287, 571560, 341558, 489393, 299823, 281260, -34055]
8042c4055j28736m7018K49241k23485J38670N84213n8273n46789m0010m0649k72781
8031d19672N5240R66981k67659k59332P7621j72900K85690m21134J31957N35717
8021E12509K69706j83057M4500o10463l30178N06290M01393n29368L6864k9197
8011H8999p9615j81478M89177k09819P02752K43382m74046o62564M60150j22515
8001B54423J71689n2692j10865m68295Q9542K23943m23J38755j73814n80109R232
7990d98614P83949l7066l5612k483l05703K9811Q17206j89715Q4519L65300J34607
7979A146199o89961J13605k0998J3244o79731L31741L2201K25562j6297k91312
7969A64253j63937L60734J45673o31558K98815J37872J79307m43890K21871L65240
$$ y = [-34055, -162791, -209809, 39432, -184053, -45383, 538830, 480557, -66232, -106242, -146891, -419672, -364432, 602549, 334890, 75558, 153179, -19721, 265969, -155165, -23208, 512509, 782215, 599158, 643658, 33195, -296983, 209307, 610700, 81332, 118196, 88999, 9384, -172094, 317083, 107264, 810016, 1053398, 579352, -83212, 376938, 254423, 426112, 373420, 262555, -205740, -116198, 107745, 107322, 246077, 72263, -507846, -498614, 285335, 248269, 212657, 210174, -95529, -65718, 751488, 561773, 646292, 1011592, 1146199, 456238, 569843, 548845, 562089, -117642, 214099, 246300, 471862, 455565, 164253, 316, 361050, 506723, -124835, 173980, 311852, 491159, 47269, 269140, 634380]
7959F34380K18309j8045j03960k04107n95020M28016O01565j30106k04339n22746
7949A03947K71578k29073L05601J0682o0500l54501k36415O6882L6702R8202M26155
7938D39260J4730l98580n60j4259M43795j95241N63511L0990n83361L86877P67954
7927A455116o76553l40402n86459N05839O49602o11196l99760M2986L86015N2948
7917D78136J24958n40010J89638N50407K66419r9483K209q7305j98548O1121k52441
7906D95101l3004j11566O1218l51341o0873J61387N05593K05009m84486J84863
7896E71901n33057l26108L30143J51135J97129J96757l43409k83771J86854K42304
7886C89878L28108K80688j96878k72622k63424n1395L07333l36997J35416P2107
$$ y = [634380, 852689, 834644, 730684, 526577, -68443, 359573, 961138, 831032, 626693, 103947, 375525, 146452, 452053, 462735, 402235, 47734, -188681, -121799, -85097, 13105, 439260, 453990, 55410, 54850, 40591, 484386, 289145, 852656, 883646, 300285, 687162, 1455116, 778563, 438161, -148298, 357541, 1007143, 395947, -3813, 39173, 425188, 478136, 603094, 63084, 252722, 803129, 1069548, 970065, 972274, 884969, 686421, 747542, 495101, 462097, 350531, 411749, 60408, -465, 160922, 666515, 871524, 387038, 571901, 38844, -287264, 42879, 194014, 391143, 587900, 244491, -39280, 147574, 389878, 717986, 998674, 801796, 529174, 265750, 214355, 521688, 184691, 320107, 392214]
7876C92214J41910k26626j32337N02298p0086K27234k27830j87713Q2875J60702
7866F62641K40700M64572q45443j05130L68293O15032k6191j28388q7205P8662
7856A237543j57899j136177K80284P68560Q2760l8891j78207o44900L76271R6537
7846F85881m6954J44531K31908J71931K63007m56613m19322M7922M93679k48385
7836H67585L3216l72112J1470J87075N26449L02720n11395L4205J95724k95925
7826I79012P7969N16836k95788k11525o561J12270N86700K87765m45687m83837
7816A117154O18659K90432j01713J97291L16983m13643J104841Q73556k004929
7807A998631k36361n55827M57488l1654j75821r4264J20149J53552j65992M16553
$$ y = [392214, 534124, 307498, 175161, 677459, 607373, 834607, 606777, 419064, 501939, 662641, 903341, 1367913, 522470, 417340, 785633, 1400665, 1374474, 1246086, 1158881, 1237543, 1079644, -56533, 223751, 992311, 1075071, 1036180, 857973, 213073, 589344, 685881, 638927, 783458, 1015366, 1187297, 1450304, 993691, 574369, 622291, 1115970, 867585, 900801, 528689, 540159, 727234, 1253683, 1556403, 1045008, 1079213, 1274937, 979012, 1056981, 1573817, 1278029, 1066504, 1059943, 1172213, 1758913, 2046678, 1600991, 1117154, 1735813, 2026245, 1924532, 2121823, 2438806, 2025163, 3130004, 4003560, 1998631, 1762270, 1206443, 1663931, 1632277, 1456456, 1362192, 1482341, 1635893, 1469901, 1886454]
7797A886454L83451l14041K7284M25807j62476j64352Q1815k35198L38325L12450
7787B579519n24455J78744o4742Q5986K8189O3153K08689O1438L70422O5982o22775
7776B430150J66412N04760O79208J15153j18654l22049N89680M06909m37421j8675
7766C995473M60427J86437Q11768L55799k1827N06244j14573O75567J98874O68717
7756G722906O43277L55007O14731k098N51714J385390N13691J74271L45872K72695
7746A2577456K66248O88401R99562J79957J72199L03560q55k4536m30201k99237
7736A4432554l95371l5584N2303l8802L30603q7504N15110m6432k88876L53743
7726A4791744L06015Q6873R6738M66607k01641K4925k87110m91150M5868n30194
$$ y = [1886454, 2269905, 1955864, 1983148, 2408955, 2246479, 2082127, 2163942, 1928744, 2267069, 2579519, 2055064, 2233808, 2169066, 2255052, 2283241, 2346394, 2555083, 2616521, 2986943, 3052925, 2430150, 2596562, 3101322, 3780530, 3895683, 3777029, 3454980, 4044660, 4451569, 4014148, 3995473, 4455900, 4642337, 5454105, 5809904, 5788077, 6294321, 6179748, 6855315, 7054189, 7722906, 8366183, 8721190, 9335921, 9333823, 9885537, 11270927, 11784618, 11958889, 12304761, 12577456, 12843704, 13532105, 14531667, 14711624, 14883823, 15187383, 15186528, 15161992, 14731791, 14432554, 14037183, 14001599, 14053902, 14015100, 14345703, 14258199, 14773309, 14726877, 14438001, 14791744, 15097759, 15184632, 15281370, 15747977, 15546336, 15571261, 15284151, 14793001, 14838869, 14308675]
7716A4308675n17946p35883n86254k70967m13233l41563l46108l92566m12087
7707A0292068k43610J40181l71660k99666J61633j69517P2536m99551K79444N37336
7697I899194p2130m54106j14003O76354O73787J102422J78218k00338M02968N85359
7687A2677725J87085M8539J58752n6310L50156M05618p4807O81765j24696j03214
7677A4150613N65158r0612N8156j12347m09130j76871J90434J13598N1436L30699
7667A4671134l92414l02957m9273j66639J31524j92418M68832K21659j00435o29090
7657A3659923j19947j36203J1039j62848n74465o22462k30263q8794r95828q28065
7647I912087o18625j57497L76381m27051p35710k02339p87223j51512p64212l70915
$$ y = [14308675, 13790729, 13054846, 12468592, 12197625, 11784392, 11442829, 11096721, 10704155, 10292068, 10048458, 10188639, 9816979, 9517313, 9678946, 9509429, 9581965, 9082414, 9361858, 9899194, 9827064, 9372958, 9258955, 9935309, 10609096, 11711518, 11889736, 11689398, 12092366, 12677725, 12864810, 12913349, 13072101, 13015791, 13365947, 13771565, 13696758, 14378523, 14253827, 14150613, 14715771, 14625159, 14683315, 14570968, 14161838, 13984967, 14175401, 14288999, 14340435, 14671134, 14278720, 13975763, 13926490, 13759851, 13891375, 13698957, 14167789, 14389448, 14289013, 13659923, 13539976, 13403773, 13414812, 13251964, 12677499, 12055037, 11824774, 11735980, 10740152, 9912087, 9293462, 9135965, 9512346, 9085295, 8349585, 8147246, 7360023, 7208511, 6444299, 6073384]
7637F073384m78105K24016L69141m92816r30280n91222M67505K41726l99321k6228
7627D457800l20504n56390K26379l64853k70600l28197L27852L60979l64730k11703
7617B956033n37454m63807J21855K60331J28900k84680j83640N11941K21180l63575
7607B367084k06804l07630j00279k57647N15459L39325L1578j78607L74015j59052
7597B417442o787p86367j47755M76587J7188l62690L80323N52781m98215J09632
7587B152139L54804k19374n29547K28245m99599Q4189l16588r708J52658l00152
7577A097067N0882L338k93385J82738k09983L74660P8031k38444O563L5340N2094
7566A138901K59190j36823m45117L8906J88199Q0948J61693M89652L59842L07543
$$ y = [6073384, 5595279, 5819295, 6188436, 5695620, 4765340, 4174118, 4641623, 4883349, 4484028, 4457800, 4137296, 3580906, 3807285, 3442432, 3171832, 2843635, 3171487, 3532466, 3167736, 2956033, 2418579, 1954772, 2076627, 2336958, 2465858, 2181178, 1997538, 2509479, 2730659, 2367084, 2160280, 1852650, 1752371, 1494724, 2010183, 2349508, 2381086, 2202479, 2576494, 2417442, 2410655, 1624288, 1476533, 1953120, 1970308, 1607618, 1987941, 2540722, 2042507, 2152139, 2506943, 2287569, 1758022, 1986267, 1486668, 1570857, 1254269, 1244561, 1397219, 1097067, 1147949, 1151287, 857902, 1040640, 830657, 1205317, 1283348, 1044904, 1051467, 1086807, 1138901, 1398091, 1261268, 816151, 855057, 1043256, 1124204, 1285897, 1775549, 2135391, 2442934]
7556B442934j025013m39457K32703L78488j1306l46958m22164K72383N21345k49404
7546A353551l87262p6190p5969k79251J56959P6323l13246k96226Q42538k71370
7536G29857j85827L8485K50731l33026j07283j61266K96640J5956j72669J59858
7526E31456K65531K37185l26313K14258k5543m59225J47777k78819j25232N41663
7516G22738j77665m69485O1393O6737K08681R06369k66045p5755K69267M98425
7506A744660n08191m74639n70401k99110M63162O68282m76285n81431k0121M42451
7496C88377p942J23182j60944L72129K64549k01471o68360K41252L41778j52180
7486E40370L39090J59315M62618p34057K84016L0408k05109J24273m75188K4864
$$ y = [2442934, 1417921, 978464, 1211167, 1589655, 1578349, 1231391, 809227, 1081610, 1602955, 1353551, 966289, 890099, 814130, 534879, 691838, 768161, 454915, 158689, 1001227, 729857, 544030, 582515, 833246, 500220, 392937, 231671, 528311, 544267, 371598, 531456, 796987, 1034172, 707859, 922117, 896574, 437349, 585126, 306307, 181075, 722738, 545073, 75588, 136981, 203718, 412399, 1318768, 1052723, 976968, 1246235, 1744660, 1236469, 761830, 191429, -107681, 355481, 1023763, 547478, -33953, -54074, 388377, 380435, 503617, 342673, 714802, 979351, 777880, 109520, 350772, 692550, 540370, 879460, 1038775, 1501393, 767336, 1051352, 1081760, 876651, 1000924, 525736, 550600]
7476E50600J37849J43458j20430k30491n13763K93539O73929k43872l64584K56691
7466E82926O4908j94067K76361j6907J50790r06597J96891m9629k34272M57518
7456C27922K19380r7604J32077j56762L81287J86845q12542m90334M78707M75915
7446F44891m44375L99697n3719l97121J54372N62635O7527n20692j6475l19843
7436G6897P0917j32775l35976k94607O12333K80591k66509J29479M06096K332
7426E48778k06290P5541k51564M79540K54571Q142m74267k71038M10134L81811
7416I55358o93145M21523r4154j83014J96924j83983K60008l8380j22396J38172
7406F56913l70380p9360J40729N13002j82653l75344j54535n33963m0879N05825
$$ y = [550600, 688449, 831907, 711477, 480986, -32777, 260762, 934691, 690819, 326235, 582926, 647834, 453767, 730128, 713221, 864011, -42586, 154305, 104676, -129596, 327922, 547302, 449698, 581775, 425013, 806300, 993145, 180603, -309731, 168976, 644891, 200516, 600213, 546494, 149373, 303745, 866380, 933907, 413215, 396740, 76897, 147814, 15039, -320937, -615544, -3211, 277380, 10871, 140350, 546446, 548778, 342488, 418029, 166465, 646005, 900576, 908718, 434451, 163413, 573547, 955358, 262213, 683736, 589582, 406568, 603492, 419509, 679517, 641137, 518741, 656913, 286533, 207173, 347902, 860904, 678251, 302907, 148372, -385591, -426470, 79355]
7396G9355L61451K40164j02915K3598j131M42932m91017k29763L76773j51846
7386E47601m5319L9027J49120p7385j46126k24700J68694j20402M3902k9133j93522
7375A11757k62925r263K15333k00743Q1687K55382q8479K10175J35131O83368
7365A131423j00394r26791n7128M34452k90314k41554J52844K00520J50349K20003
7355F73410n46524m2116l64819M01956J09662K15610j66486M85986K06567n93540
7345C79706L97804j84627n2164l30732q46401N13248M54715k26500J62772K05459
7335D73280l33674O0209J06478K53950j10254l8012k50504k13657q4280p5293
7325b11757M4027R6833K48879M73246K3478m37604K52646j713k11702m8423M65800
$$ y = [79355, 440806, 680970, 578055, 601653, 600522, 1043454, 552437, 322674, 699447, 547601, 502282, 541309, 690429, 613044, 466918, 242218, 410912, 290510, 334412, 305279, 111757, -151168, -160431, 54902, -145841, -64154, 191228, 102749, 312924, 448055, 1131423, 1031029, 104238, 47110, 481562, 191248, -50306, 102538, 303058, 453407, 673410, 126886, 84770, -280049, 121907, 231569, 447179, 280693, 766679, 973246, 379706, 777510, 592883, 540719, 209987, -636414, -123166, 331549, 105049, 267821, 473280, 139606, 199815, 306293, 560243, 449989, 411977, 161473, -52184, -136464, -211757, -167730, -70897, 177982, 651228, 674706, 237102, 489748, 488035, 276333, 227910, 693710]
7314F93710O7570J17332l06017J59471n97484L62920r8868k33359J85331j97108
7304A53498l37662K2454Q4745k6466r3324N41658N03124m6584n27004j95480j79602
7293a00643O9347J64301M35625m24064K65025J96258J37830n12692q16757r4876
7283f80646L52917L60721j5200k36268N09912K85142J66924J35303m51529L7931
7273D65207J21234K66293p25986K07736J87465k51756q42851L44069N92579O27327
7263I91317l85739l39908m80792K59074K91560K57802q90631O54745J43771k39555
7253B61644q5370k39763K45456j95253p4621j19288O02444M46491K96736r6789
7243A041687k2345m16013j1201j03731l00949J58584k54267P2364j1395m78773
$$ y = [693710, 761280, 878612, 572595, 732066, 134582, 497502, 398634, 165275, 350606, 153498, -184164, -161710, -76965, -103431, -196755, 344903, 848027, 801443, 274439, 78959, -100643, -31296, 133005, 568630, 144566, 409591, 605849, 743679, 230987, -585770, -680646, -327729, 32992, 17792, -218476, 291436, 576578, 743502, 878805, 427276, 465207, 586441, 852734, 126748, 334484, 521949, 270193, -572658, -228589, 363990, 991317, 605578, 265670, -215122, 43952, 335512, 593314, -297317, 357428, 501199, 261644, 176274, -63489, 181967, -13286, -87907, -207195, 395249, 841740, 1138476, 1041687, 1019342, 603329, 592128, 488397, 187448, 346032, 91765, 164129, 152734, -326039]
7233c26039K81747J72485p5144L32901M26820k91510K31439m7126o84021k40753
7223b19201M05983o265J77376o1741K43693k38813K41103J45198L06692M10539
7213A404564j106103n38472k08620j12684N46796k04375K98614M6650j97899L52471
7203B80942j75304J18399J58432K10723k67001R219j64489j34790L01868M42591
7193G80590L11485k60549l75226j907L85216j45106J68735k23952l3699j25356
7183D80231k33619l42323J5692j41154o0048Q05813J25683q11708R889N1579L96601
7172B96636K76221M7059j57736k39050M34584r1589L21839k76213K41016l83846
7162D68921k46329L04709j7663L62850j05530o15652Q0979j7852J31404L22704
$$ y = [-326039, -44292, 128193, 53049, 385950, 812770, 521260, 752699, 705573, 21552, -219201, 186782, 180517, 357893, 296152, 539845, 301032, 542135, 687333, 994025, 1404564, 298461, -240011, -448631, -561315, -14519, -218894, 79720, 126370, -71529, 280942, 105638, 224037, 382469, 593192, 326191, 335410, 170921, 36131, 337999, 780590, 1092075, 831526, 456300, 454393, 839609, 694503, 863238, 639286, 605587, 480231, 246612, -95711, -80019, -221173, -281221, 524592, 650275, -161433, -151544, -99965, 296636, 572857, 619916, 462180, 223130, 657714, 566125, 887964, 611751, 852767, 468921, 222592, 527301, 509638, 872488, 766958, 151306, 232285, 214433, 345837, 668541]
7152F68541R9988l89383l03316K21564m89559J02642N26997m65012J56546o4880
7142F4128J25254K7490L03430j30629j33459Q6777k85113P7710j58738M46402
7132D23252Q3224o05q62241J09442L60163j62259N18447J40550l98231M12250
7122F23992M81475l07919j40337p3023m4668J33762o9908l35798M07918N3834
7112G29328J52096j59049p35287k10349O0857M38053K58591k9727p2602J40869
7102E72780l38548n52047k32442Q17724K43918k35720J30763m2924k58112M47505
7092E52897L61704m26110K89206K92881l30720o24043K95363L25301l76302m74028
7082a13851J69642N14056L5711K44072o24334j37957L29103j94542M63551l87470
$$ y = [668541, 768529, 379146, 75830, 297394, -192165, -89523, 437474, -27538, 129008, 64128, 189382, 216872, 520302, 389673, 256214, 342991, 57878, 135588, -23150, 423252, 506476, 505871, -356370, -246928, 113235, -49024, 469423, 609973, 211742, 623992, 1105467, 797548, 657211, 584188, 539520, 673282, 603374, 267576, 675494, 729328, 881424, 722375, -12912, -223261, -162404, 275649, 534240, 504513, 431911, 572780, 234232, -317815, -550257, 267467, 511385, 275665, 406428, 363504, 105392, 552897, 914601, 488491, 777697, 1070578, 739858, 115815, 411178, 736479, 360177, -113851, 55791, 569847, 605558, 849630, 225296, 87339, 416442, 221900, 685451, 297981]
7072B97981N44893K36431n19687n55040j26269M76764K51498J51428J38461J56051
7062A052511L32741n12386k99760l7663K08139J8429j20408m14794j64227j25250
7052f2668N04709J94023k57497J6713N2924L88300K07308j76878l65045o1786
7042D40103m50564O81453l9336M2529m84399J52082J71268n33962l3338j15207
7032a69371J15454M99845n72403l0504L82383r9432P52664m82752j61052l88814
7022a53982P78316L3407k79259L33311o52760k45259N80820r8301J5289M06004
7012G17586O2249r8529l13029J35692p1091k77747j69772M47921J35297K89195
7002H57772o30571k42976K28587P15430l04693k97810j65408k07646N31432J21069
$$ y = [297981, 842874, 1079305, 559618, 4578, -121691, 355073, 606571, 757999, 896460, 1052511, 1385252, 872866, 573106, 535443, 743582, 762011, 641603, 226809, 62582, -62668, 442041, 636064, 378567, 395280, 448204, 836504, 1043812, 866934, 501889, 440103, -10461, 670992, 631656, 674185, 189786, 341868, 513136, -20826, -54164, -169371, -53917, 445928, -126475, -156979, 225404, 125972, 878636, 395884, 234832, -153982, 624334, 657741, 378482, 711793, 59033, -186226, 394594, 296293, 311582, 717586, 779835, 681306, 368277, 503969, 432878, 155131, -14641, 433280, 568577, 857772, 227201, -15775, 212812, 928242, 623549, 325739, 160331, -47315, 484117, 605186]
6992F05186p20544N75543J45426m57462q2843P3241M47056l47380J08223j94242
6982A52204K17730l32341l0936N80676k49590q6377j65699N48101L54516j65474
6972H22810p853p8683k60956N514K27633L6281n0712Q0038k79906J25691J71927
6961G91784l09819K31570j80573J66823K54123o20728n15438L20019M17520J0547
6951E65828j93552n9088K10843R7844N85297m13632n4538K48526j27684N85506
6941A445350R3740m27560n14440o05251J53631O11786N48971j33730n97293K0510
6931E95714j66881m82669l7275J89777j46750K19861k0588M41900j52363l96516
6921D4210L33410M13740O9058k19225q5402m76389J49535L90569k89442l48201
$$ y = [605186, -115358, 460185, 605611, 148149, 65306, 138547, 585603, 238223, 346446, 152204, 369934, 37593, 6657, 587333, 337743, 251366, 85667, 633768, 988284, 822810, 814957, 736274, 475318, 480832, 708465, 744746, 694034, 774072, 494166, 619857, 791784, 481965, 713535, 532962, 699785, 953908, 333180, -182258, 137761, 555281, 565828, 372276, 313188, 524031, 621875, 1207172, 793540, 739002, 987528, 859844, 1445350, 1539090, 1111530, 597090, -8161, 145470, 757256, 1306227, 1172497, 575204, 595714, 428833, -53836, -91111, 98666, -48084, 171777, 151189, 593089, 440726, 44210, 377620, 791360, 860418, 641193, 555791, 79402, 228937, 619506, 330064, -18137]
6911a8137M32553L81701k90482k24793R0563K60310o4221k13045K75316N32168
6901A161933m05390r9798k12677l55309O18641P3436k53101n0130l01874J11049
6891B86780n3735K60791M53191r3115j51346K06719L17045p9505j88841k02901
6881G55083n23414K19387l1318J99123p20778J47985L57430J05298N3747j34423
6871D28120l20042m56056R59929k4622j02993j714o89635J08654l13071K82451
6861a28979L02249j22781J23920P0669K9703J26326K37611M74484j37638n12700
6851D62864l11656M33572L52101k16223k68920l21747L40330M62199j45137l66385
6841D20998J50597k59027J37813K79200j13733n75523N09279l18675n14158L92744
$$ y = [-18137, 414416, 796117, 505635, 280842, 371405, 631715, 567494, 354449, 629765, 1161933, 756543, 656745, 444068, 88759, 707400, 780836, 527735, 477605, 175731, 286780, 233045, 493836, 947027, 853912, 702566, 909285, 1226330, 1146825, 957984, 755083, 231669, 451056, 419738, 618861, -101917, 46068, 403498, 508796, 562543, 428120, 108078, -347978, 611951, 587329, 484336, 482622, -207013, -98359, -411430, -128979, 173270, 50489, 174409, 245078, 274781, 401107, 638718, 1113202, 975564, 462864, 151208, 584780, 936881, 720658, 451738, 129991, 470321, 932520, 787383, 420998, 571595, 312568, 450381, 729581, 615848, 40325, 549604, 230929, -283229, 109515]
6831A09515J73304k48981Q4228M73452j35304m51242k92732Q9733M13866J37388
6821C53227l32161J3502J25399L70209j11344Q5177o49622l30677Q31106M47281
6811H02097r0719n44853J53956K24843J02651n33123O11209j00318k81591k65295
6801G8857L83376j93355k46160q0951L65334j1161J86980M08505k9693k16274
6791F45458O49831J88367m40971J03294q56881j14399K79381q9958J54813L18317
6781H37252k1508k21758q94839K17994L94682j71453L88782J63257m93150K35296
6771D34555k34716M01238M42370k12094l52592j53307q15K82886R7103K14906
6761I19534k16332m14770L4960K86031l20770j5430J53123M06718K75331n00178
$$ y = [109515, 282819, 33838, 118066, 591518, 456214, 4972, -287760, -198027, 215839, 353227, 21066, 34568, 159967, 530176, 418832, 504009, -145613, -476290, 354816, 802097, 711378, 166525, 320481, 545324, 647975, 114852, 726061, 625743, 344152, 78857, 462233, 268878, 22718, -58233, 307101, 295940, 482920, 891425, 861732, 645458, 1295289, 1483656, 1042685, 1145979, 289098, 174699, 454080, 364122, 518935, 837252, 815744, 593986, -300853, -82859, 311823, 140370, 529152, 692409, 199259, 434555, 199839, 601077, 1043447, 831353, 478761, 325454, 324639, 607525, 704628, 919534, 703202, 288432, 323392, 609423, 288653, 273223, 426346, 833064, 1108395, 608217]
6751F08217k50679j18140j51960N3952L81378n04519l3443l23676J85295J2822
6741a40753K15975M48717J96730l85927l20414M12175L80843k87956J64048K61535
6731I44973k87460n43817k56057L06923J93512L2348m1086K5341j84050n01394
6721c10767n06883R78074l40289J86469k1246j24300L25663L2902K29866O7061
6711E16550M2646k75108M74758K6022j28806n63064K43396L67347m00170l01716
6701A855j98033M58903K20596J63053J46621n57699l09701M93740k29651P9928
6691B69612K33728P0741l9480m01618j57105n2063K28175m88267M5940J58134
6681a32203r4106J083253K84129k03350j1926K26894l86402l83455k62623n3859
$$ y = [608217, 357538, 239398, 87438, 141390, 522768, 18249, -15194, -338870, -153575, -140753, 75222, 523939, 720669, 334742, 14328, 426503, 807346, 519390, 683438, 944973, 657513, 113696, -142361, 164562, 358074, 390422, 349336, 374677, 190627, -310767, -817650, 160424, -179865, 6604, -14642, -138942, 186721, 219623, 449489, 516550, 559196, 284088, 758846, 784868, 656062, 92998, 336394, 703741, 303571, 1855, -196178, 262725, 483321, 646374, 792995, 235296, -74405, 419335, 189684, 269612, 503340, 574081, 534601, 132983, -24122, -76185, 151990, -336277, -290337, -132203, -226309, 856944, 1141073, 937723, 925797, 1152691, 766289, 382834, 120211, 66352]
6671F6352K05869l54985M7949M26141k84329J14898J17108j81312K80956n81364
6661a42717k47939L88572N32613n9075k50505R0614j80919k64347Q16019l00668
6651C81648l5420k09836l617M27545j89293L72398l16689j41073J74243N9738
6641E19644j20923N18914K4332K1627n0448n72765m06425Q45037R2726l98112
6631D73607j51437J31697j13733k65521k03933L49655K71632j83895q0216M30639
6621F58495r3216l54078P2259J26359M03009j4239q23003l6754O3277j64528L09465
6610A47046k15568j14267k5449O8125j67437N12245J3546R6527K36994r874M3395
6599E85283K08743k24852M5140N6498J44432o4267r5467k29462l78553L04138
$$ y = [66352, 272221, -82764, -34815, 391326, 106997, 221895, 339003, 157691, 438647, -142717, -390656, -2084, 530529, 471454, 220949, 311563, 130644, -133703, 682316, 381648, 346228, 136392, 132775, 560320, 371027, 743425, 426736, 285663, 459906, 519644, 398721, 917635, 941967, 963594, 913146, 340381, -66044, 778993, 871719, 473607, 322170, 453867, 340134, 74613, -129320, 220335, 491967, 308072, 227856, 658495, 565279, 211201, 283460, 409819, 812828, 798589, -24414, -61168, 2109, -162419, 147046, -68522, -182789, -208238, -140113, -307550, 204695, 218241, 314768, 551762, 541888, 585283, 794026, 569174, 614314, 670812, 815244, 750977, 655510, 426048, 47495, 351633]
6589C51633m01365M3005K50960k41656r8473L76319J09729Q6380P21461l75293
6579H22700l31798M29611J3379o27259K41685L35409k49564l5917K10126N1738
6569H60110L1488J6621L55018o51314p87714J48689N6913J41504L77149k15088
6559C33376j05025N5410j38506K07407L09265j11930j50107L42117P98654k64142
6549A276519j27751l14777l12765N0366n14717K42369J76478M74128q37622K5227
6539A37455O39225m53906n18228M99009L58982k89050O0237K25018j01681m89685
6529F7376J77813L83689m29823l4131k09092N26404j9282k14838L90359J58783
6519G97258j69487m32599N79142o1736L1859k17589m9414K40503J28675k05546
$$ y = [351633, -49732, -6727, 244233, 2577, -95896, 280423, 390152, 476532, 1197993, 822700, 490902, 920513, 933892, 306633, 548318, 883727, 634163, 598246, 808372, 860110, 891598, 908219, 1263237, 611923, -175791, -27102, 29811, 171315, 548464, 333376, 228351, 283761, 145255, 352662, 661927, 549997, 399890, 742007, 1540661, 1276519, 1148768, 833991, 521226, 571592, 56875, 299244, 475722, 949850, 112228, 137455, 776680, 322774, -195454, 303555, 662537, 373487, 433724, 658742, 557061, 67376, 245189, 628878, 199055, 164924, -44168, 482236, 462954, 248116, 638475, 797258, 627771, 195172, 774314, 712578, 744437, 526848, 477434, 717937, 846612, 641066]
6509F41066j4418n38499M8871O15603n2228m46371j25336J71888N14965K11758
6499A027299J47274m81136n23274r43k73237Q6044J50855L74167N21179J92383
6489A220611r95183n31972M07577L22632K17548L08442m02105k38999K21563J70135
6479G00249k01517L41364L10510n94622K91793J02696k24691n2363M2348N26738
6469A242505k77537k44797O48479k26407k40048j82132l53131o2458K83965k39861
6459C48578j09481M87705k14011K9400r0474O69989R9789m12793O7286K22034
6449A098022J26479o01294O4474O86716m94030J63064j10771n57205K40124K81417
6439H96996j60230M1659J04273q0316J0807K10940L6043j67732l51338p367L83835
$$ y = [641066, 626648, 88149, 137020, 752623, 700395, 254024, 128688, 300576, 815541, 1027299, 1174573, 693437, 170163, 169220, -104017, -17973, 132882, 507049, 1028228, 1220611, 225428, -306544, 101033, 423665, 641213, 949655, 547550, 308551, 530114, 700249, 498732, 840096, 1150606, 555984, 847777, 950473, 725782, 673419, 715767, 1242505, 964968, 720171, 1368650, 1142243, 902195, 720063, 366932, 304474, 588439, 348578, 239097, 726802, 512791, 542191, 451717, 1121706, 1221495, 808702, 875988, 1098022, 1224501, 623207, 687681, 1374397, 880367, 1043431, 932660, 375455, 615579, 896996, 736766, 778425, 882698, 802382, 813189, 1024129, 1060172, 892440, 541102, 533735, 917570]
6428I17570k96629k73125L50720j8007M85981m5218n23790L02934j11732n27843
6418B60861j27031L24324M12012N47771p59978k47127K70129K4599j60310m6840
6408D98410P9087l33029L3183L26218K77507M59735j46993q37515M49374K04809
6398A010786L64853L60757l02407m13185m41435K88420N0303J43522M14513l18005
6388A158122k70185L99734J0775j07458m55330M93030Q3094L73648n29255n44652
6378F11523Q08416j61250n6910k34304L58258l2203k04283J18957K48758L1442
6368A488404m80175k78557N17860M48839O8556j60349l23969J25847J25512n32022
6358I99946L92343J58360j73137P9023m3631N5301K15571K81240j2026J82107
$$ y = [917570, 620941, 347816, 698536, 680529, 1166510, 1121292, 597502, 900436, 788704, 260861, 133830, 458154, 870166, 1417937, 657959, 410832, 680961, 705560, 545250, 498410, 577497, 244468, 277651, 603869, 881376, 1341111, 1194118, 356603, 805977, 1010786, 1375639, 1736396, 1433989, 1020804, 579369, 867789, 918092, 1061614, 1476127, 1158122, 887937, 1287671, 1298446, 1190988, 735658, 1228688, 1311782, 1685430, 1156175, 611523, 1419939, 1258689, 1201779, 967475, 1325733, 1293530, 1089247, 1208204, 1456962, 1488404, 1008229, 729672, 1247532, 1696371, 1764927, 1604578, 1280609, 1406456, 1531968, 999946, 1392289, 1550649, 1377512, 1456535, 1412904, 1468205, 1683776, 1965016, 1952990, 2135097]
6348B135097o03260J8946l64276o37239n9164K85266N68168M24813Q8193M7591
6338A904135k47898m42751k33657J48353J39753j28954k17341J96396Q7528M4253
6328A249817M97374j4245J52652l24141k02939L54394l76320k95589o5623J86542
6318A161922K00662J3469r4480K98297l09246m74491k25893J310O85027m95283
6308G61294k77265K75247K07585M71978M03182j62055j70290J12363J76053k11186
6298A586906L551L08917o0746K2366J02089n60753m1100M46042k58362j98263
6288A350647j36033M56556l20040q8236L72731J77894j5830J10539j5328l07922
6278A584978n90679L70501p5516M07564L53685j04772m22756n4633J59291l67572
$$ y = [2135097, 1531837, 1550783, 1186507, 549268, 490104, 775370, 1343538, 1768351, 1856544, 1904135, 1656237, 1213486, 979829, 1128182, 1267935, 1138981, 921640, 1118036, 1205564, 1249817, 1747191, 1732946, 1885598, 1561457, 1358518, 1712912, 1336592, 1041003, 975380, 1161922, 1362584, 1376053, 1281573, 1579870, 1270624, 796133, 570240, 571550, 1256577, 761294, 484029, 759276, 966861, 1438839, 1842021, 1679966, 1509676, 1622039, 1798092, 1586906, 1590457, 1899374, 1838628, 1860994, 1963083, 1402330, 1361230, 1807272, 1548910, 1350647, 1214614, 1671170, 1351130, 1262894, 1635625, 1813519, 1797689, 1908228, 1892900, 1584978, 994299, 1364800, 1289284, 1696848, 2050533, 1945761, 1523005, 1468372, 1627663, 1260091]
6268A260091r5072M42252L48182J14780M01122k36008l34720k05260P39202j30030
6258B304539n23K7920J80081k72831N1680Q83640k70873o6368o7295k20812J78574
6247B727732m31064M02364K58287l38802r6518J96992K62363p2543m1168J29148
6237B996791l06066R15537L86668m02784O62245K37924n35810O73690O96150r6947
6227E227398L75418j36423j30018P70606M52293l06036J70528J87766N9768R2879
6217F764179J84883L68358M6095N49523J87880J3651J42701q8208O59784L92720
6207I221566J48518N77147L0937M9468K21971J97783N48328P86290j98182k55286
6197A1328540o5470N48966M87582K93334N09994j58002N0044L81623L12704L13980
$$ y = [1260091, 1165019, 1607271, 1955453, 2070233, 2471355, 2235347, 1900627, 1695367, 2434569, 2304539, 2304016, 2331936, 2512017, 2239186, 2290866, 3174506, 2903633, 2837265, 2769970, 2549158, 2727732, 2296668, 2699032, 2957319, 2618517, 2521999, 2718991, 2981354, 2908811, 2867643, 2996791, 2690725, 3606262, 3992930, 3590146, 4252391, 4490315, 3954505, 4628195, 5324345, 5227398, 5602816, 5466393, 5336375, 6106981, 6559274, 6253238, 6423766, 6611532, 6671300, 6764179, 6949062, 7317420, 7363515, 7913038, 8100918, 8114569, 8257270, 8169062, 8828846, 9221566, 9370084, 9947231, 9978168, 10027636, 10249607, 10447390, 10995718, 11782008, 11583826, 11328540, 11263070, 11812036, 12299618, 12592952, 13102946, 12944944, 12994988, 13376611, 13689315, 14003295]
6187A4003295O52716k73251L04192K36451L77550j68857L70131O41886j755j33815
6177A6008543N60783N42398N62631L64068j70734J87058j45074J9683n187M10617
6167A8334786O46625J81220N4665N93644J31676j11658j4830K24576N23684P95728
6157B1360116K57698J51112M96787P21413M45994j63275K35635J013715R52812
6148B5472007L12035P18697J103103R43087O40393L09098J59511j30936K22274
6139B9749269j09606l2913k10845N33016J43847n37293o01597q8122J40591o16738
6129B8369609r20641n38147o79541p37427n93335n58710j349976j259410o31441
6120B1100981j072645n22938p99921r16875k45143p35836k38111L3070l90799
$$ y = [14003295, 14656011, 14382760, 14686952, 14923403, 15300953, 15132096, 15502227, 16144113, 16142358, 16008543, 16569326, 17111724, 17674355, 18038423, 17867689, 18054747, 17909673, 17929356, 17924169, 18334786, 18981411, 19162631, 19217296, 19810940, 19942616, 19830958, 19816128, 20040704, 20564388, 21360116, 21617814, 21768926, 22265713, 22987126, 23433120, 23269845, 23505480, 24519195, 25472007, 25784042, 26502739, 27605842, 28548929, 29189322, 29498420, 29657931, 29526995, 29749269, 29639663, 29606750, 29395905, 29928921, 30072768, 29535475, 28933878, 28845756, 28986347, 28369609, 27448968, 26910821, 26231280, 25493853, 24900518, 24341808, 22991832, 21732422, 21100981, 20028336, 19505398, 18705477, 17788602, 17543459, 16807623, 16569512, 16602582, 16211783]
6111A6211783l04391n18028p43079n08437N83547k02601m29037L18771K92712
6102A4701240n36924m1404j73736M07702K50611N8802O43541Q34247L18830J08453
6092A6571362L9000K24389N62335J353902J098975J619360J376937K19587J253275
6083B4319122J635792J380791J693642J968887J093423J523028J232039j64673
6075C4682051k79997n95998k29884q61252j122992k82173r44388j531302q34928
6066B7999137J23534l30816l99823K56009o19935K28179L37537k57182l81619
6057B6955021n75035m69922p10135p41556j874386j456625l61254q07122q98048
6048A9060938j110658r20063q29539j23583J81160k4275m60681q26575K57538
$$ y = [16211783, 15907392, 15389364, 14646285, 14137848, 14721395, 14518794, 14089757, 14408528, 14701240, 14164316, 14122912, 13949176, 14356878, 14607489, 14666291, 15309832, 16144079, 16462909, 16571362, 16610362, 16834751, 17397086, 18750988, 19849963, 21469323, 22846260, 23065847, 24319122, 25954914, 27335705, 29029347, 30998234, 32091657, 33614685, 34846724, 34682051, 34402054, 33806056, 33576172, 32714920, 31591928, 31309755, 30365367, 28834065, 27999137, 28122671, 27791855, 27392032, 27648041, 27028106, 27256285, 27593822, 27336640, 26955021, 26379986, 25910064, 25199929, 24458373, 22583987, 21127362, 20766108, 19958986, 19060938, 17950280, 17030217, 16200678, 16077095, 16258255, 16233980, 15773299, 14946724, 15204262]
6039A5204262L31359M81794L12205K87199M20800R19073N24758L41656K6755Q66536
6029A9716397Q43593o22369j7995o54315m21747l01161m22207l82288Q6085o93844
6019A7130149p6712k8865m55633j39524J25122K28959k6062P20350N41514J47413
6009A8166711N19477P09418M18336J157229k19077l05045M30101l58564m55646
6000B0062940P2208n74748o55855L8026O68650J21111k02971m96785q62283n1328
5990A8118965l69553m95938r61228n71151p17631r17061n7021P8272m79354n74382
5980A3053918J37057L25706M26122l53229l15515j13205L67254J34962M84567
5971A4147637L93270P93818O91541O01152m04849o95428K5457r9181o12563n06875
$$ y = [15204262, 15535621, 16017415, 16329620, 16616819, 17037619, 17956692, 18481450, 18823106, 18849861, 19716397, 20559990, 19937621, 19919626, 19265311, 18843564, 18542403, 18120196, 17737908, 17823993, 17130149, 17053437, 17024572, 16568939, 16429415, 16554537, 16783496, 16757434, 17477784, 18019298, 18166711, 18686188, 19395606, 19813942, 20971171, 20752094, 20447049, 20877150, 20518586, 20062940, 20135148, 19560400, 18904545, 18942571, 19611221, 19732332, 19529361, 19032576, 18170293, 18118965, 17749412, 17253474, 16292246, 15721095, 15003464, 14086403, 14029382, 14107654, 13628300, 13053918, 13190975, 13516681, 13942803, 13589574, 13274059, 13160854, 13528108, 13663070, 14147637, 14540907, 15334725, 16026266, 16627418, 16222569, 15527141, 15552598, 15453417, 14840854, 14333979]
5961A4333979o69681n27086p21887r86120n03602j72679o61927o70673n41138
5952H879186J40444l77038j76754m58974J16432J49155l32152K68354K63683K14395
5942H686731L4316Q39434K84832j08710K24300K31256l91369k87356j61754m51104
5932H900576J3265l86428J79637k25130o43689q8341K17076l22792j29064J7n74326
5921F940801m30357K6478l06850J7308k23538K15763J1793k09556J87837o51340
5911E578339O09815j48273j65483k36304O20175n6176k84159j41906J00887l07532
5901E569383O70740K24810P8002j257027q01682L8503q2887O542l67985j68222
5891C910177j57496m45365R1697J80420k33677n86243M50562K33219l11976l49318
$$ y = [14333979, 13664298, 13137212, 12415325, 11429205, 10925603, 10752924, 10090997, 9420324, 8879186, 9019630, 8642592, 8465838, 8006864, 8123296, 8272451, 7940299, 8208653, 8472336, 8686731, 8721047, 9560481, 9845313, 9736603, 9960903, 10192159, 9800790, 9513434, 9351680, 8900576, 8913841, 8527413, 8707050, 8481920, 7838231, 7749890, 7966966, 7644174, 7515110, 7515127, 6940801, 6510444, 6536922, 6230072, 6247380, 6023842, 6239605, 6251398, 6041842, 6229679, 5578339, 6188154, 6039881, 5874398, 5638094, 6258269, 6202093, 5917934, 5776028, 5876915, 5569383, 6240123, 6464933, 6542935, 5285908, 4484226, 4522729, 4439842, 4446384, 4078399, 3910177, 3752681, 3307316, 3399013, 3579433, 3345756, 2759513, 3210075, 3443294, 3131318, 2782000]
5881B782000k4094K08886j31213J89023m16240l66029k33970J28912N71017l76085
5871B332207m88080j19689k01156J32421N92093j73636j25917L02648P3949o10680
5861A714160J14317j22404M27028r6339j92679L44845N2941m22430n7776O7715
5851A829378l02594j65672n54893O66837l37707o1036l10511K60324L20464j71996
5841A172594j1746K1023P78934k09537n99403M7340o93613N51414K29949j48784
5831A138171M70746k84564m49239L61264L45234N240J07878J72368n9532j19891
5821A687675o6761l8994l26097N7421m02091J12434K95276L36338o11203M4075
5811A088073L54743M3878K36611K11363L36049j09054l20904k77772n24067K5648
$$ y = [2782000, 2757906, 2966792, 2835579, 3024602, 2608362, 2242333, 2008363, 2137275, 2708292, 2332207, 1844127, 1724438, 1523282, 1655703, 2247796, 2074160, 1948243, 2250891, 2324840, 1714160, 1828477, 1706073, 2133101, 2036762, 1844083, 2188928, 2241869, 1819439, 1761663, 1829378, 1526784, 1361112, 806219, 1473056, 1135349, 1074313, 763802, 1024126, 1344590, 1172594, 1160848, 1181871, 1960805, 1751268, 1151865, 1199205, 505592, 1057006, 1286955, 1138171, 1608917, 1324353, 875114, 1236378, 1581612, 1586852, 1694730, 1867098, 1807566, 1687675, 1620914, 1581920, 1255823, 1313244, 911153, 1023587, 1318863, 1655201, 1043998, 1088073, 1442816, 1486694, 1723305, 1934668, 2270717, 2161663, 1840759, 1562987, 1038920, 1064568]
5801A064568K60992j45444p69129l20548N48931K51622K39664L87275j38291r9052
5791A280588n69130L11930J70072k25280j94089j48334L90266L44562M463k19769
5781A145279L8216K12038M89498q52287J99414J16747m11488L11557j78916j03367
5771I66691J38344J8883j66491m51520j53996L59512K72696k7792k94995L76798
5761A038130N44117L6954m33823j56078K82494l39589N6303O4356m1085J72137
5751A223916P9830m0261K17881J3704l80174L63478m44702r3937L02867j00329
5741A142273j4859m33387R10897Q3848p06306k69482J28281J47624M83845j42805
5731A329929k24441k2704n8651l1910K72011m60648m12566O86380Q3605m1183
$$ y = [1064568, 1325560, 1180116, 410987, 90439, 639370, 890992, 1130656, 1517931, 1379640, 1280588, 711458, 1023388, 1193460, 968180, 774091, 625757, 1016023, 1360585, 1365048, 1145279, 1183495, 1395533, 1885031, 1032744, 1232158, 1348905, 937417, 1248974, 1070058, 966691, 1105035, 1123918, 957427, 505907, 351911, 711423, 984119, 956327, 661332, 1038130, 1582247, 1619201, 1185378, 1029300, 1311794, 972205, 1028508, 1092864, 1051779, 1223916, 1303746, 1263485, 1481366, 1495070, 1114896, 1478374, 1033672, 939735, 1242602, 1142273, 1127414, 694027, 1604924, 1688772, 982466, 712984, 841265, 988889, 1472734, 1329929, 1105488, 1082784, 1024133, 992223, 1264234, 803586, 391020, 1077400, 1161005, 1119822]
5721A119822M50272k77769K06828K04159k49701k59515j24096p2555J34724m35870
5711F96299k8029N79561k82515K54626K52674k0216l43145n235q3750M82996n7783
5700A445483k87992K70465L54718K57275k57026n62198m99490p0189N24722r4623
5690A081145M67575K4260r13202j38193P02878O5586k46877k03773m48619M09356
5680H00136K94351m64143K17053M20054K42079K63344m97334P5547N6277m48299
5670I59065j55818N62266j43000J59888k97473n22555L51302M16170K97989m46457
5660A181377q2455j88878k53562J09522r3270p9941O1802R43764J2367o86890
5650I23836J63337M8717l82740L38967q4214L02771K85227m46483l57508J46312
$$ y = [1119822, 1570094, 1292325, 1499153, 1703312, 1453611, 1194096, 1070000, 997445, 1132169, 696299, 668270, 1247831, 965316, 1219942, 1472616, 1452400, 1109255, 1104020, 1020270, 1503266, 1445483, 1157491, 1427956, 1782674, 2039949, 1782923, 1220725, 721235, 651046, 1175768, 1081145, 1548720, 1572980, 659778, 521585, 1224463, 1290049, 1043172, 839399, 390780, 800136, 1094487, 630344, 847397, 1267451, 1509530, 1772874, 1275540, 1351087, 1407364, 959065, 803247, 1365513, 1222513, 1382401, 1084928, 562373, 913675, 1329845, 1627834, 1181377, 1098922, 910044, 656482, 766004, 672734, 592793, 654595, 1598359, 1610726, 923836, 1087173, 1135890, 753150, 1092117, 1007903, 1310674, 1595901, 1149418, 791910, 938222]
5640I38222M79733Q6822o5005m07116J59755L81224l42239L61699K72579n87887
5630A277787K16121K48316k19015j21735M62069j77705j39247m2026J1528L89833
5620A905926M0904o35851R4267k42969J2702J19883m3895K88874Q5154M6050o58146
5609A012899L76945j28973L28808K50690M8112l22972k8221j25871N1979J01092
5599A564488k9830N24395J01830J08334k23894m49404J6650k19361M082M16545
5589A813835j26877k31778j90688L64368K39535P5185n6502l30591k50449L53153
5579A659191m319K13495K50350P33876J39477l47060m38391m61545l14990L97813
5569A827897P3334j06423j70969j68150M44495Q80254j60780p96710m7807L75173
$$ y = [938222, 1417955, 1504777, 1439772, 1032656, 1192411, 1573635, 1231396, 1593095, 1865674, 1277787, 1493908, 1742224, 1523209, 1401474, 1863543, 1685838, 1546591, 1504565, 1516093, 1905926, 1946830, 1310979, 1405246, 1162277, 1174979, 1294862, 1250967, 1539841, 1624995, 1671045, 1012899, 1389844, 1260871, 1589679, 1840369, 1888481, 1565509, 1537288, 1411417, 1463396, 1564488, 1534658, 2059053, 2160883, 2269217, 2045323, 1595919, 1612569, 1393208, 1397290, 1813835, 1686958, 1455180, 1264492, 1628860, 1868395, 1943580, 1887078, 1556487, 1306038, 1659191, 1654872, 1868367, 2118717, 2852593, 2992070, 2645010, 2206619, 1745074, 1430084, 1827897, 1901231, 1794808, 1623839, 1455689, 1900184, 2780438, 2619658, 1822948, 1775141, 2150314]
5559B150314L2823k49096K02715N64225j19250l36924J52755n01757N45453Q06448
5549C247706j04505K1502j33944j79181O49876J93381m5542q2699P0321m75891
5539C161024K99029N34770l1739Q9146l63141N29163m76500K94999L91589l51826
5529D076514k6488L07850k95302O75483M45108o5551P6575l50003J80395M22570
5519E447151K49611n01935k19451N28296N20740M31463O1616m4846N90800j21575
5509F941870O86363L01970J14694P8923m27278J26240O85056M71729M07004k10154
5499I176417j51675Q40826l48335j88438P403K05914M10658K19901M99951K17324
5489A0889946J4700l39611L03240l00338R9257J81175R4297N15394q595j60530
$$ y = [2150314, 2183137, 1934041, 2136756, 2700981, 2581731, 2244807, 2397562, 1895805, 2441258, 3247706, 3143201, 3164703, 3030759, 2851578, 3501454, 3694835, 3649293, 3566594, 3636915, 3161024, 3460053, 3994823, 3963084, 4052230, 3689089, 4218252, 3741752, 4036751, 4428340, 4076514, 4050026, 4357876, 4062574, 4738057, 5183165, 5117614, 5194189, 4844186, 5024581, 5447151, 5696762, 5194827, 4975376, 5503672, 6024412, 6455875, 6517491, 6472645, 7063445, 6941870, 7628233, 7930203, 8044897, 8123820, 7696542, 7822782, 8507838, 8979567, 9386571, 9176417, 9024742, 9865568, 9517233, 9328795, 9336198, 9542112, 9952770, 10172671, 10672622, 10889946, 10904646, 10565035, 10868275, 10567937, 10667194, 10848369, 10942666, 11458060, 11449465, 11288935]
5479A1288935J90932P27618M27068j85214N80834O40293L14597j74225P4279J96761
5469A4081878N40032K1112Q7994N30104n7460p8020P02803J06286L6578J37497
5459A6108804P99189j80882M41579N45787m56500j21492J26102O15030M40687
5450A8318304l91885m55750P07397L39344P29365K45387r2598n26201j00100k98334
5440A8474929J093721K76510k49520Q12894K75628j22753J91121N81001L76898
5431B1710429K01327J95271Q1432R96273J067318J007666M07461M72595R57627
5422B7097399N01559O21790J577673J482788O76513R51283J332011J236086J931918
5413C7409020J833411K215583K661137K859422K762777L154975L879395M323376
$$ y = [11288935, 11479867, 12207485, 12634553, 12449339, 13030173, 13670466, 13985063, 13810838, 13885117, 14081878, 14621910, 14643022, 14731016, 15261120, 15203660, 15125640, 15828443, 15934729, 15971307, 16108804, 16907993, 16727111, 17168690, 17714477, 17257977, 17136485, 17262587, 17877617, 18318304, 17926419, 17470669, 18178066, 18517410, 19246775, 19492162, 19399564, 18873363, 18773263, 18474929, 19568650, 19845160, 19595640, 20408534, 20684162, 20561409, 20752530, 21333531, 21710429, 21911756, 22107027, 22188459, 23184732, 24252050, 25259716, 25667177, 26139772, 27097399, 27598958, 28220748, 29798421, 31281209, 31957722, 32909005, 34241016, 35477102, 37409020, 39242431, 41458014, 44119151, 46978573, 49741350, 52896325, 56775720, 61099096]
5405F1099096N590613N675451O988664Q858463J0037573J1987156J3957499J7147305
5397A41341820K0764897K5109375L1125090L8187445M3942205M5863000M1465000
5390C87798832K9132073J1772616p308114k3210074l4201292l9856470m0957341
5383B83170230l8848845l5220124l0591675k4965606k0717616j7238934j3693928
5376A01893502j1570229q854933p496396o249849n166069m646004l876033l357488
5368E0676501l622796k675143k677277k932758k037542j352035j477045j813460
5360C2088445j665591j730152r34591q31270j595194o81647r14115j187616p07029
5351B1841240j168007m79878m55049m06792m67998q36888n04463r06485r04749
$$ y = [61099096, 66689709, 72365160, 79353824, 88212287, 98249860, 110237016, 124194515, 141341820, 162106717, 187216092, 218341182, 256528627, 300470832, 346333832, 387798832, 416930905, 428703521, 421395407, 398185333, 363984041, 324127571, 283170230, 244321385, 209101261, 178509586, 153543980, 132826364, 115587430, 101893502, 90323273, 81468340, 73971944, 67722095, 62556026, 57910022, 54033989, 50676501, 47053705, 44378562, 41701285, 38768527, 36730985, 35378950, 33901905, 32088445, 30422854, 28692702, 27758111, 26926841, 25331647, 24650000, 23735885, 22548269, 21841240, 20673233, 20193355, 19738306, 19331514, 18863516, 18026628, 17522165, 16615680, 15710931]
5342A5710931J06877o387o27209r60016M4314o64173q86702j50129l95348J02057
5332A2274215K01651n80855k53866m6512o07829J03248q9434p59474K70526M07426
5322A0919096m49763Q2923m63691J65644k8952k15874l39491K3707N9216J44986
5312I897801n44003K24579O54273j76214j25195j90008r3916r2840n98008J29433
5302I085902Q80859O3539l84999K47887L44120j25115K11005L49413k30550l66941
5292A0075120J14379l20025N23988M4293j72293j58724M81802K63316j79067l84012
5282A0288777J8705j95658J9420R2724k63593K96549p8800n85910L43034Q95078
5272A0830326L43011l0056K58333K655k07893o41376M95744L91437Q6386K30112
$$ y = [15710931, 15817808, 15811421, 15184212, 14224196, 14268510, 13604337, 12717635, 12567506, 12172158, 12274215, 12475866, 11895011, 11641145, 11594633, 10986804, 11090052, 11000618, 10241144, 10511670, 10919096, 10469333, 10552256, 10088565, 10254209, 10225257, 10009383, 9669892, 9693599, 9752815, 9897801, 9353798, 9578377, 10232650, 10056436, 9931241, 9741233, 9647317, 9554477, 8956469, 9085902, 9966761, 10030300, 9645301, 9893188, 10237308, 10112193, 10323198, 10672611, 10442061, 10075120, 10189499, 9869474, 10393462, 10437755, 10265462, 10106738, 10588540, 10851856, 10672789, 10288777, 10307482, 10111824, 10131244, 10223968, 9960375, 10256924, 10178124, 9592214, 9935248, 10830326, 11173337, 11143281, 11401614, 11404269, 11196376, 10555000, 11050744, 11442181, 11528567, 11758679]
5262A1758679k08950O98715L71457k90666L27582K95091j30612L77479K97291
5253A3496066m1715L11448l68094l01098O55741O42184j40178k90581L02294L19397
5243A4585464K04409M01172J06969k21571O0011J61384j39566k83944O36114R3466
5233A5603908m75296L96030k21585L20011k56l79116K62296r4284K59687O25293
5223A6296688P9698m69205P5524M28361K17636k27305R2221L95045N72101l16341
5213A7144423k41041N87023K82621k07307K68906Q0995m14664M6262K67858k37405
5203A7577671j62546k90103L26005R79654m85457k35534J06941Q6040M4705k15504
5193A7731872L89607k21569l45098O34562r1628J35634m6929l05267J75919m66869
$$ y = [11758679, 11549729, 12248444, 12619901, 12329235, 12656817, 12951908, 12821296, 13198775, 13496066, 13454351, 13765799, 13397705, 13096607, 13752348, 14394532, 14254354, 13963773, 14266067, 14585464, 14789873, 15191045, 15298014, 15076443, 15136454, 15297838, 15158272, 14874328, 15510442, 15603908, 15128612, 15524642, 15303057, 15623068, 15622812, 15243696, 15505992, 15411708, 15671395, 16296688, 16376386, 15907181, 15982705, 16411066, 16628702, 16401397, 16493618, 16888663, 17460764, 17144423, 16903382, 17490405, 17773026, 17565719, 17834625, 17915620, 17500956, 17547218, 17815076, 17577671, 17415125, 17125022, 17451027, 18430681, 17945224, 17709690, 17816631, 17902671, 17947376, 17731872, 18121479, 17899910, 17554812, 18189374, 18097746, 18233380, 18186451, 17881184, 18057103, 17590234]
5183A7590234j82705Q8782k89604j58959O58649J3133k88057o32657j74825m401
5173A6619590J02143M51275l93633j2012m22765k35743O82786M98025m8891N49983
5163A7790758M23976l4963L54170o2687k76304k291M56155K38900J25828M21090
5153A9434632L84701l03863m48533k60139J58650k3816J58207n39968n06705j78766
5143A7874400K29511k4924n785N26890m73875q33278M69766M88977r928n86935
5133A7654819K90706j65059r74397m94267P43785J27081m54045N3063m39271l40403
5123A6002012l26671R1472o90088o30858j45309o54836j34018j94236k27679m46773
5113A2643016q8108l45925n89652j74969j93435o02689m94963R1440J62661p27045
$$ y = [17590234, 17407529, 17496311, 17206707, 17047748, 17706397, 17719530, 17431473, 16798816, 16623991, 16619590, 16721733, 17173008, 16779375, 16767363, 16344598, 16108855, 16791641, 17289666, 17240775, 17790758, 18214734, 18179771, 18533941, 18471254, 18194950, 18192659, 18648814, 18887714, 19013542, 19434632, 19819333, 19515470, 19066937, 18806798, 18965448, 18941632, 19099839, 18559871, 18053166, 17874400, 18103911, 18078987, 18073202, 18600092, 18126217, 17292939, 17762705, 18251682, 18241754, 17654819, 17945525, 17780466, 16806069, 16311802, 17055587, 17182668, 16728623, 16781686, 16342415, 16002012, 15675341, 15766813, 15076725, 14445867, 14300558, 13645722, 13511704, 13317468, 13089789, 12643016, 12554908, 12208983, 11619331, 11444362, 11250927, 10648238, 10153275, 10244715, 10407376, 9680331]
5103I680331j80875j27241k05443o0098q7746m17520m95436L2694k24841k26424
5093G687401o05761O45682k47288l06063p3827m3979r38981J23084R5900M36551
5083F772719k50485M59371L21739j44331K66923j66182O847o46595J24883K9183
5073F774072K42453j19l54216J07858M2779J2975j0803K28245M56393M07902J19781
5062H027320J46871j21599J44074l7969K17512Q7249K59083P1814L47807M82248
5052I624410J3515m6611J94940J341477m34631r1544M38926m04576M25729j907
5042A1059728K43368o04930k53580J56721J57864J8886O42002m8074j86201p0144
5032A1115640K83899L11215j05502L67977J6036M98535P37943r3485l08961J12873
$$ y = [9680331, 9499456, 9372215, 9166772, 9106674, 9018928, 8601408, 8105972, 8138666, 7913825, 7687401, 7081640, 7727322, 7480034, 7173971, 7100144, 7056165, 6117184, 6240268, 6336168, 6772719, 6522234, 6981605, 7303344, 7159013, 7425936, 7259754, 7266601, 6620006, 6744889, 6774072, 7016525, 7016406, 6662190, 6770048, 6812827, 6825802, 6814999, 7043244, 7499637, 7907539, 8027320, 8174191, 8052592, 8196666, 8158697, 8376209, 8463458, 8722541, 8794355, 9142162, 9624410, 9637925, 9591314, 9786254, 11127731, 10693100, 10601556, 11040482, 10635906, 11061635, 11059728, 11303096, 10698166, 10444586, 10601307, 10759171, 10778057, 11420059, 11371985, 11185784, 11115640, 11399539, 11710754, 11605252, 11973229, 11989265, 12487800, 13225743, 13132258, 12823297, 12936170]
5022A2936170N82332L63684j77439M02736P75913j17955k07088j34533k54190
5013A4169630O00064N68466o4353k79232K54198j62181m7799L30906M43276j8436
5003A5794539K47566J52745M00605O6253o43001m44174K08089p07566K74658K8686
4993A5378400L19580J72560j05127k19871J65900L64415j39297j97357K36360
4984A5975563Q3485o09716K97414p105J1632n7067J28933n77877K80134J88531
4974A5713927m87818l19267p2022M01395J1670R9876J32873K94228p5297N671
4964A5705236p94808K73826J72511l40366l13894K81711K8364n77753k26987k0898
4954A4186942p9222q3036N06840J30471l2532L72420n3867K50977j24018k52304
$$ y = [12936170, 13518502, 13882186, 13704747, 14107483, 14883396, 14765441, 14558353, 14423820, 14169630, 14769694, 15338160, 15273807, 14994575, 15248773, 15086592, 15038793, 15369699, 15812975, 15794539, 16042105, 16194850, 16595455, 16661708, 16018707, 15574533, 15782622, 15075056, 15349714, 15378400, 15697980, 15870540, 15765413, 15545542, 15711442, 16075857, 15936560, 15739203, 15975563, 16059048, 15449332, 15746746, 15739641, 15751273, 15694206, 15823139, 15245262, 15525396, 15713927, 15226109, 14906842, 14834820, 15236215, 15247885, 15347761, 15480634, 15774862, 15699565, 15705236, 14910428, 15184254, 15356765, 15016399, 14702505, 14984216, 15012580, 14434827, 14207840, 14186942, 14107720, 14024684, 14531524, 14661995, 14629463, 15001883, 14948016, 15198993, 15074975, 14822671]
4944A4822671J9911j42924L03258M4050o58169K14126J78183m0802q1442l91391
4934A4267471j3630k27303K26772K1328j81273o3924J11385K95076j71319M7080
4924A4311663k16032l87712m84860K32898R50018K43233l50872j09739Q76791
4915A5065388j03273l21540o23745p8353k14315k11632K32423k90303k51414m41591
4905A2761645J58084J366k34988R17L2241L58444l41142j45368j753K30591l81387
4894A2438650l78006M7302P61344K65071k42263K09711l26031K35643l33468K3582
4884A2701535L10686N63973j34358L79600M271j70218P20709L99258K07503L18287
4874A5301246M82180N08854N41090L25116M58649L55329J09260L31906J097715
$$ y = [14822671, 14842582, 14699658, 15002916, 15046966, 14388797, 14602923, 14781106, 14740304, 14658862, 14267471, 14253841, 14026538, 14253310, 14274638, 14093365, 14029441, 14140826, 14435902, 14264583, 14311663, 14095631, 13707919, 13223059, 13455957, 14405975, 14649208, 14298336, 14188597, 15065388, 14962115, 14640575, 14016830, 13938477, 13724162, 13512530, 13744953, 13454650, 13203236, 12761645, 12919729, 12921095, 12686107, 12687024, 12719265, 13077709, 12736567, 12591199, 12589446, 12820037, 12438650, 12060644, 12107946, 12869290, 13134361, 12892098, 13101809, 12775778, 13011421, 12677953, 12701535, 13012221, 13576194, 13441836, 13821436, 13825707, 13655489, 14376198, 14775456, 14982959, 15301246, 15783426, 16292280, 16833370, 17158486, 17617135, 17972464, 18081724, 18413630, 19511345]
4865A9511345N56894N00746J61352j9918M70874N11366J40170M40297l34672N36451
4855B2474905P29900P36659J130393J085550Q02032J090725O83578R28046N41233
4846C0203021Q83578J104439J131704Q19962M02630J25182M70569O19143k09347
4837C5550881m62003n10426J24241m78541n01306q8118l38505j88171q1504m48837
4827C2577711l80109L54597J85100N47644J95124j59783K7022J439390O00988
4818C5387684o79873J42859Q15570J055307o12551o53153m83983r17266o71662
4809C3382932j98628n59429m53429o84985j4103q4594k34194o8768n75964o46498
4799B9862340n94148k61988o14254q00126o39587k69295q7923n70457l85843q13849
$$ y = [19511345, 20068239, 20568985, 20730337, 20710419, 21181293, 21692659, 21832829, 22273126, 21938454, 22474905, 23204805, 23941464, 25071857, 26157407, 26959439, 28050164, 28733742, 29661788, 30203021, 31086599, 32191038, 33322742, 34142704, 34545334, 34670516, 35141085, 35760228, 35550881, 35088878, 34578452, 34702693, 34224152, 33722846, 33634728, 33296223, 33108052, 33026548, 32577711, 32197602, 32552199, 32737299, 33284943, 33480067, 33320284, 33347306, 34786696, 35387684, 34707811, 34850670, 35666240, 36721547, 36108996, 35455843, 34971860, 34054594, 33382932, 33184304, 32624875, 32171446, 31486461, 31472358, 31387764, 31153570, 31084802, 30508838, 29862340, 29268192, 29006204, 28391950, 27591824, 26952237, 26682942, 26595019, 26024562, 25638719, 24824870]
4789B4824870j055106q94100n65044l8380n84905n42429m75199q67304l56360
4780A9446043k04253o0384p05844n74396n13165o36760J00969k13052o93054m40421
4770A5505683Q2749M17888l92112n24800r75594j31034n91833k85117J18546J6076
4760A3240452l70776M59572k08081n71031n14239j31418q6559k48477K98197N2184
4750A1919824k96199l66719p421J53602P76894O6389N3729j66147J84962R2851
4740A2411765k37968K09305K10890K92935L51042p31399K57579N03974k89216
4731A2978907L68421N75907j21248J93295L49484Q54628P94438j19666K33292
4722A6107458P35120O7175j1786K67465M3542R64207l11641R4452J235005J475425
$$ y = [24824870, 23769764, 22875664, 22310620, 22272240, 21687335, 21144906, 20669707, 19802403, 19446043, 19241790, 19181406, 18475562, 17901166, 17388001, 16751241, 16852210, 16639158, 15946104, 15505683, 15588432, 16006320, 15614208, 15089408, 14113814, 13982780, 13390947, 13105830, 13224376, 13240452, 12869676, 13329248, 13121167, 12550136, 12035897, 11904479, 11817920, 11569443, 11867640, 11919824, 11623625, 11256906, 11249485, 11403087, 12179981, 12246370, 12300099, 12133952, 12318914, 12411765, 12173797, 12383102, 12593992, 12886927, 13237969, 12506570, 12764149, 13268123, 12978907, 13347328, 13923235, 13801987, 13995282, 14344766, 15199394, 15993832, 15874166, 16107458, 16842578, 16909753, 16897967, 17165432, 17208974, 18173181, 17861540, 17955992, 19190997, 20666422]
4712B0666422Q69041N89863Q45889R10913Q35189P39034Q29862P91092J092138
4703B8169443J265206N69466J210172J373005N73248O46851J196423N61090N98472
4694C6163376J508362K01532L55782J50980P45293J234038L88244L04813P24442
4685D1776862Q15259J227219J447889J670388J227931K038747J482368J173928
4677E2860591J637044K132542J588529O75615J125492J353971O92650J52960k4501
4668F2194893q44072j051550n24744r68487j466945j343029j459088j863005p58440
4659E1915533r25478q10250r13962j038874m04508j037016p20787n4092m51456
4650D5559110p43386q83628q06458l04630j217435p31149j405092j142293o42861
$$ y = [20666422, 21535463, 22125326, 22971215, 23882128, 24717317, 25456351, 26286213, 27077305, 28169443, 29434649, 30004115, 31214287, 32587292, 33160540, 33807391, 35003814, 35564904, 36163376, 37671738, 37873270, 38229052, 38380032, 39125325, 40359363, 40747607, 41052420, 41776862, 42592121, 43819340, 45267229, 46937617, 48165548, 50204295, 51686663, 52860591, 54497635, 56630177, 58218706, 58894321, 60019813, 61373784, 62066434, 62219394, 62194893, 61350821, 60299271, 59774527, 58806040, 57339095, 55996066, 54536978, 52673973, 51915533, 50990055, 50179805, 49265843, 48226969, 47822461, 46785445, 46064658, 46010566, 45559110, 44815724, 43932096, 43125638, 42821008, 41603573, 40872424, 39467332, 38325039, 37682178]
4641C7682178r19770o13184j401027j426920p28155j249694r77850n14394o38860
4632B9212324r96988j234201k81816m49711m67297k18966M34258Q1164m63907
4623B5614860M18389P74332J154260J112520Q76621R54841J976294J964169K180060
4614C7026346L065218L372859M753794O331334P930898J0128915J0782499J0587763
4606I3979626Q338216O732471O562303O919498R532890J2529836J6012947J5796860
4598A76404647J1372594O567895K966401J494684L708522P873112J2535240J3813805
4590B36736900R119123J332165n118377r048446j0558706q481224n226613k829652
4582B05925170k257594o081831j0468320j2568434j3985227j3729626j1526343
$$ y = [37682178, 36762408, 36149224, 34748197, 33321277, 32593122, 31343428, 30365578, 29851184, 29212324, 28215336, 26981135, 26699319, 26249608, 25782311, 25563345, 25997603, 26078767, 25614860, 26033249, 26807581, 27961841, 29074361, 29950982, 30905823, 32882117, 34846286, 37026346, 40091564, 43464423, 48218217, 54549551, 62480449, 72609364, 83391863, 93979626, 102317842, 109050313, 115612616, 122532114, 132065004, 144594840, 160607787, 176404647, 187777241, 194345136, 197311537, 198806221, 202514743, 210387855, 222923095, 236736900, 245856023, 247188188, 242069811, 233021365, 222462659, 213981435, 208754822, 205925170, 203667576, 197585745, 187117425, 174548991, 160563764, 146834138, 135307795]
4575A35307795q861095p266186q312984q625630r376055j0043202j0459660r225473
4567F3137510q163921p116377n754213n587237m301802k977513k209771j546680
4559B5479996j479156j603741j362135r68972p80023p74274o21776j207953r26485
4550A5755481j16541l35029o74278k82951o32544r2604m76518l74067p85178j25617
4540A1860154l11093j010877k74168l37352o00005P1340j21502n96309P3939k6191
4530H727936o19961J52578j39798j06093l62057m30157j21675l14890J85354P5693
4520G046930l45625k22541l67666j32265K0836o999K08312L26832K84886L5763
4510F848463n29585j177781j25006L15229J46068j85186j68754M7479p4500J32253
$$ y = [135307795, 126446700, 119180514, 110867530, 102241900, 92865845, 82822643, 72362983, 63137510, 54973589, 47857212, 42102999, 36515762, 32213960, 29236447, 27026676, 25479996, 24000840, 22397099, 21034964, 20065992, 19285969, 18511695, 17889919, 16681966, 15755481, 15638940, 15303911, 14629633, 14346682, 13714138, 13621534, 13145016, 12770949, 11985771, 11860154, 11549061, 10538184, 10264016, 9926664, 9326659, 9397999, 9276497, 8680188, 8754127, 8727936, 8107975, 8260553, 8120755, 8014662, 7652605, 7222448, 7100773, 6785883, 6971237, 7046930, 6701305, 6478764, 6111098, 5978833, 5999669, 5992670, 6200982, 6527814, 6812700, 6848463, 6318878, 5141097, 5016091, 5331320, 5477388, 5292202, 5123448, 5170927, 5096427, 5228680]
4500E228680j89640o09728L79255j64737l93299L64984l02097j98980L25203n9480
4490D380161K92164J37800m40445o24311k67303K0458l32592L02075R2950k96014
4480C264943L51846m8772k6019j31673m95740l65154L82742R3664K63414l97260
4470B891991N44936K24812n72653R9124l31511j54663o9538P30043k70860M15590
4460C507271p47212m48578m6770M33465Q3769J43279K4300L00765n19591l93813
4450B336885N42473j44353k27447k72979n26672L23128N25503n52958n4770k7461
4440A921349L12543J8406K28969K2332j00049j51166K76738n31477q1676L31358
4430B247327k83422K6355L35097m57370M3761j59728k556R0211J57693P48804
$$ y = [5228680, 5039040, 4429312, 4808567, 4643830, 4250531, 4615515, 4313418, 4114438, 4439641, 4380161, 4672325, 4810125, 4369680, 3745369, 3478066, 3498524, 3165932, 3468007, 3560957, 3264943, 3616789, 3568017, 3541998, 3410325, 2914585, 2549431, 2932173, 3025837, 3289251, 2891991, 3436927, 3661739, 3089086, 3188210, 2856699, 2702036, 2632498, 3362541, 3091681, 3507271, 2760059, 2311481, 2264711, 2698176, 2781945, 2925224, 2949524, 3250289, 2730698, 2336885, 2879358, 2735005, 2507558, 2234579, 1707907, 2031035, 2556538, 2003580, 1948810, 1921349, 2233892, 2252298, 2481267, 2503599, 2403550, 2252384, 2529122, 1997645, 1915969, 2247327, 1963905, 1990260, 2325357, 1867987, 1911748, 1752020, 1749464, 1839675, 1997368, 2746172]
4420B746172n26301L0527O11708K34632m64467l53693J31371l28252o8819l02703
4410A710175l94586j32485O7056Q48152k60942n06460J57585J28067j34903P5260
4400A556919K67718q97881N45654K97696m2159K76787L51639o19292n23790L63984
4390A577275J78235J85437K41273l52623j75408K55982m9357K60380k70749k37474
4380A612971M15305r4422k93503m34807L41626N38675N32482K03816k26544p06842
4370A888757m4825j66276K95417L64078k39376l40458J6905L78557J05254O62007
4360B920040j59341m11219j46279m05371K946O05977k0788k84668l78666K56892
4350A979523M54194o18677K02090L14384K97578K3373j67683j58748j53217O04725
$$ y = [2746172, 2219871, 2250398, 2862106, 3096738, 2632271, 2278578, 2409949, 2081697, 2012878, 1710175, 1315589, 1183104, 1250160, 2098312, 1837370, 1330910, 1488495, 1616562, 1481659, 1556919, 1824637, 926756, 1472410, 1770106, 1727947, 2004734, 2356373, 1737081, 1213291, 1577275, 1755510, 1940947, 2182220, 1829597, 1654189, 1910171, 1860814, 2121194, 1850445, 1612971, 2028276, 1933854, 1640351, 1205544, 1547170, 2085845, 2618327, 2822143, 2595599, 1888757, 1843932, 1677656, 1973073, 2337151, 2097775, 1757317, 1774222, 2152779, 2258033, 2920040, 2760699, 2349480, 2203201, 1797830, 1800776, 2406753, 2385965, 2101297, 1722631, 1979523, 2433717, 1815040, 2017130, 2331514, 2629092, 2652465, 2484782, 2326034, 2172817, 2777542]
4340B777542J76890k29884K71958L09215M7447J61977o51329P84866M23055J41709
4330D213446m6730L20527M81101L23877K84495k36101m8743O69210j9527L7251
4320E978806j31921L11050O27351L8775O44291k50551J12146N28360L02941K78774
4310H440022M19074J87032M0535k0768N08747J88195l890o4083p5217O57381K42218
4299A0519246J56754n40354k10866M15076O79796N05785Q752J60806n57628n20671
4289A0616696L53786k80005O24197K93163K87941n30202M88552j42781k29633
4280A1481714M34097L06600K32195j63759J44568M27236j17842j72531J44593
4271A2716871J7880J92042N35058K09852j48849O38761L70992N75396J98117N60865
$$ y = [2777542, 2954432, 2724548, 2996506, 3305721, 3353168, 3515145, 2863816, 3648682, 4071737, 4213446, 4166716, 4487243, 4968344, 5292221, 5576716, 5340615, 5291872, 5961082, 5941555, 5978806, 5846885, 6157935, 6785286, 6824061, 7468352, 7217801, 7329947, 7858307, 8161248, 8440022, 8859096, 9046128, 9086663, 9065895, 9574642, 9762837, 9758947, 9694864, 9619647, 10277028, 10519246, 10676000, 10135646, 9924780, 10339856, 11019652, 11525437, 11534189, 11694995, 11137367, 10616696, 10970482, 10690477, 11314674, 11607837, 11895778, 11365576, 11854128, 11711347, 11481714, 11915811, 12222411, 12454606, 12290847, 12435415, 12862651, 12744809, 12572278, 12716871, 12734751, 12926793, 13461851, 13671703, 13522854, 14161615, 14532607, 15108003, 15306120, 15866985]
4261A5866985k69518j84061L55584M71459n4558L30237M50634k19853N14973K73536
4251A7535418L71943k93641J01659N48288j98814L81039K93846K39640k95169
4242A8684209L98122j08238j35576k68656m13916l72069l10636j43191n4748p9833
4232A7195468l35614n5214m14226m25912l71840j1024k85371Q2309M55860k19224
4222A5615212n44540J4217O11302m06810L87152K64356Q16342J497675K704964
4213B0959870L579541M146026K509047r42370q42301k196450l058557k652836
4205B1501970k212295k284976j540941o92839p77690j140220K21751L03652m28322
4196A2950090k64649O1770k0448o6700L55833l09056J11380o7909n54803j04257
$$ y = [15866985, 15597467, 15413406, 15768990, 16240449, 16185891, 16516128, 16966762, 16746909, 17261882, 17535418, 17907361, 17613720, 17715379, 18263667, 18064853, 18445892, 18739738, 18979378, 18684209, 19082331, 18974093, 18838517, 18569861, 18155945, 17783876, 17473240, 17330049, 17275301, 17195468, 16859854, 16804640, 16390414, 15964502, 15592662, 15581638, 15296267, 15378576, 15834436, 15615212, 15070672, 15084889, 15696191, 15289381, 15676533, 15940889, 16757231, 18254906, 20959870, 24539411, 28685437, 31194484, 30252114, 29409813, 27213363, 24154806, 21501970, 19289675, 17004699, 15463758, 14770919, 13993229, 12853009, 13074760, 13378412, 12950090, 12685441, 12747211, 12726763, 12660063, 13015896, 12706840, 12818220, 12750311, 12195508, 12091251]
4186A2091251k38001k38601l34191p721K69167k81497j13652p67160o02686l35875
4176I441034k00035J42215j22335m40767m18896o7841k04393n31318q39117j51543
4166F607004N68176j41665n35253j52172j13947m207R2446o96173j87083Q6269
4156E523395K10323p69839k51402j21527p6965K02958N6901M4349K8958n58542
4146D288609k56826O2417J7464M50911Q9647q70151k59355M60414p8753K78113
4136D182490l03439j86937R5242N6116J95060l56619j65360J22270L89509k64929
4126C763403N7522L47202J8640j94637J70565k64487j15097K8774k26873L21526
4116C906538M82939j74157m15760p5381k56596K56202O49153N9995l99346K47940
$$ y = [12091251, 11853250, 11614649, 11280458, 11272737, 11541904, 11260407, 11146755, 10379595, 9776909, 9441034, 9240999, 9383214, 9260879, 8820112, 8401216, 8333375, 8128982, 7597664, 6758547, 6607004, 7175180, 7033515, 6498262, 6346090, 6232143, 6227936, 6320382, 5624209, 5437126, 5523395, 5733718, 4963879, 4712477, 4590950, 4513985, 4716943, 4773844, 4818193, 4847151, 4288609, 4031783, 4094200, 4111664, 4562575, 4652222, 3782071, 3522716, 3983130, 3904377, 4182490, 3879051, 3692114, 3787356, 3843472, 4038532, 3681913, 3516553, 3638823, 4028332, 3763403, 3820925, 4168127, 4186767, 3992130, 4162695, 3898208, 3783111, 3811885, 3585012, 3906538, 4389477, 4215320, 3799560, 3724179, 3467583, 3723785, 4372938, 4432933, 4033587, 4281527]
4106D281527l39513L40852m11390M05918l2777m96440R9528m41275N44524P96065
4096D747019J50123L01971r5302K22755o5457J52052n59023K91609k7275m09479
4086D708993j69671P56803K81038j64879j73298K97662P75367N9726n64309L59360
4076F166792O08636O95754o9521l50248j18734k65320M43349L96486P90991M63292
4066H761477J52068J12310Q89288n03745p25267Q02612J072830M20923q3720L17560
4056A1216336O26441M15449N57983M44586j71260M32844J64190O62915P27511
4047A5076995p4254M59763R20609R13713M80568J04457K31012L68463O88140R97392
4037B0166858O03635N92925P51907L73214M09382L9249J35117N80280M22914N84641
$$ y = [4281527, 3942014, 4282866, 3871476, 4277394, 4244617, 3748177, 3847705, 3406430, 3950954, 4747019, 4897142, 5199113, 5103811, 5326566, 5261109, 5413161, 4854138, 5145747, 5118472, 4708993, 4539322, 5296125, 5577163, 5412284, 5238986, 5536648, 6312015, 6371741, 5807432, 6166792, 6775428, 7471182, 7401661, 7051413, 6932679, 6667359, 7110708, 7507194, 8298185, 8761477, 8913545, 9025855, 9915143, 9411398, 8686131, 9488743, 10561573, 10982496, 10898776, 11216336, 11842777, 12258226, 12816209, 13260795, 13089535, 13522379, 13686569, 14349484, 15076995, 15002741, 15462504, 16383113, 17296826, 17777394, 17881851, 18112863, 18481326, 19169466, 20166858, 20770493, 21363418, 22115325, 22488539, 22897921, 22937170, 23072287, 23652567, 24075481, 24660122]
4027B4660122L03341J414473Q66880O26761M28119J176005O41295Q60602Q70647
4018C1848245P48996J288025M73161m8226L63259J081174O37298L54104O17176
4009C7363212M3573P0689M17346P24587O16531m0451K26950L60793M55833N86107
3999D0825170M61510Q03424L31618N45326R75109J275914J037902J257263J095563
3990D8608799Q34139J439803J152088R46685J610640J009544R37622P00745P04550
3981E7944615M17119R11376M63977J23312R80909N37495M37014l52919m22017
3972F1040881M41287L98443L17225N40131P93315m7747K89083K48588m6046K65632
3962F4240792J31077L28874l17150K41283L41650m79974k00742q7651L39452M64648
$$ y = [24660122, 24963463, 26377936, 27244816, 27871577, 28299696, 29475701, 30116996, 30977598, 31848245, 32597241, 33885266, 34358427, 34310201, 34673460, 35754634, 36391932, 36746036, 37363212, 37406785, 37477474, 37894820, 38619407, 39235938, 39195487, 39422437, 39783230, 40239063, 40825170, 41286680, 42090104, 42421722, 42967048, 43942157, 45218071, 46255973, 47513236, 48608799, 49442938, 50882741, 52034829, 52981514, 54592154, 55601698, 56539320, 57240065, 57944615, 58361734, 59273110, 59737087, 59860399, 60841308, 61378803, 61815817, 61462898, 61040881, 61482168, 61880611, 62197836, 62737967, 63531282, 63483535, 63772618, 64021206, 63975160, 64240792, 64371869, 64700743, 64383593, 64624876, 64966526, 64486552, 64285810, 64198159, 64537611, 65002259]
3952F5002259L70817p17682r05004j26672J29466J07202j63619m49131l69933
3943F2877703k16014n63148m11001j353616p09265j712038n36224k29317j285188
3934E5861892r52441j111173j120895q57393j030688r00036n87499Q8205m48533
3925D8941439j033073l94545o54696n0198K56571o84814m50374K0924m39615j72843
3915D5338776O47777K22537M13988q84284k21876J86152n58042r8068m87257m73194
3905D4086509o85575m25713m16591L13321o79470j49938n27963o16458k9936r44199
3895C9923987m89371j15924m18401l29582M9607o98371k94065K47332M21122j50299
3885C8146035p58434q50563m43436n54267J73288m40057K14742q54251l47646
$$ y = [65002259, 65373076, 64655394, 63750390, 63623718, 63753184, 63860386, 63696767, 63247636, 62877703, 62661689, 62098541, 61687540, 60333924, 59624659, 57912621, 57376397, 57147080, 55861892, 54909451, 53798278, 52677383, 51819990, 50789302, 49889266, 49301767, 49389972, 48941439, 47908366, 47513821, 46859125, 46808927, 47065498, 46380684, 45930310, 45951234, 45511619, 45338776, 45986553, 46209090, 46623078, 45738794, 45516918, 45703070, 45145028, 45046960, 44559703, 44086509, 43400934, 42975221, 42558630, 42871951, 42192481, 42042543, 41514580, 40898122, 40868186, 39923987, 39434616, 39318692, 38900291, 38570709, 38620316, 37921945, 37627880, 37875212, 38296334, 38146035, 37387601, 36537038, 36093602, 35539335, 35712623, 35272566, 35487308, 34633057, 34285411]
3876C4285411o39985q08060m07929o64029L70637l48330l87079k15817L34363
3867C1519182o50346k6497K45403k51618P873M98941J090573J183817P74845N98360
3857C4990533J213022J078525J877004J714255J703701K052430J864585K307741
3849D8801796K237807K488385K865782K735165J991704K309002K352991K208396
3841F7991028J780898J133254J330842J230916K96394P7674k73873J53425J62368
3832G3882926o63677l36566k70009o96665n34221p22968j426795q56086m52936
3823F7923003q78535o62571k136156j266914j782764k371137j715310k003530
3815E5106086j880125k300119j891542j882393k465907k503555j638157r53163
$$ y = [34285411, 33645426, 32837366, 32429437, 31765408, 32136045, 31787715, 31400636, 31184819, 31519182, 30868836, 30842339, 31087742, 30836124, 30843997, 31342938, 32433511, 33617328, 34392173, 34990533, 36203555, 37282080, 39159084, 40873339, 42577040, 44629470, 46494055, 48801796, 51039603, 53527988, 56393770, 59128935, 61120639, 63429641, 65782632, 67991028, 69771926, 70905180, 72236022, 73466938, 73763332, 73841006, 73567133, 73720558, 73882926, 73219249, 72882683, 72612674, 71916009, 71381788, 70658820, 69232025, 68375939, 67923003, 67044468, 66381897, 64245741, 62978827, 61196063, 58824926, 57109616, 55106086, 53225961, 50925842, 49034300, 47151907, 44686000, 42182445, 40544288, 39591125]
3807C9591125j073309j190556k174514q69002r94859j123907j186632k28579p06747
3798C0043020o13286k02057n65708j59759k90113r14683K02105J52464j289412
3789B6362571k9013J13226o23293l54544m96023o37277m38293j38077j29207o11105
3779B3018965m66269p38804N6203j086941q02490p81501l29631l60997j2985k66150
3769A8229400j141471n50113o23379k67073P0382Q8978p11785j199006n21176
3760A3374757k52812l18193k31622J50548n77318p54103k11466K4896l65554k28942
3750A0610191J79172j32786k57121K22965p60175o42734n47026N46526J54890
3741I373902r77782k67304P7309m14234L55626k98598j010975j25121r031K62624
$$ y = [39591125, 38517816, 37327260, 35152746, 34283744, 33288885, 32164978, 30978346, 30749767, 30043020, 29429734, 29227677, 28661969, 28502210, 28212097, 27297414, 27499519, 27651983, 26362571, 26333558, 26446784, 25823491, 25468947, 24972924, 24335647, 23897354, 23759277, 23630070, 23018965, 22552696, 21813892, 21870095, 20783154, 19980664, 19199163, 18869532, 18508535, 18495550, 18229400, 17087929, 16537816, 15914437, 15647364, 15717746, 15806724, 15094939, 13895933, 13374757, 13121945, 12803752, 12572130, 12722678, 12145360, 11391257, 11179791, 11204687, 10839133, 10610191, 10789363, 10656577, 10399456, 10622421, 9862246, 9219512, 8672486, 9219012, 9373902, 8396120, 8128816, 8206125, 7791891, 8147517, 7848919, 6837944, 6712823, 6703792, 6966416]
3731F966416k62216j85245J48935M5442l85807M83831n72648k68318l71619J42968
3721E741739K47244j41482j52110k86073L84966L65596l13604q24348l41946r8480
3711D581502M24765N7223K98960P630l85317m25670Q56736M38539k70081k21238
3701E363049n08577K45284K3868P5984j06429k60333N31663K9390O40614L93920
3691F428433K87721j38639K5750j71608j75976L57415q0837j99052N2623M27412
3681F813242L53142J13888J76471L02545L00957M66609n9888K24652j99187L6553
3671H528984P45540K1790K64933N52736j57695J93265m82316P81855l7789O25672
3661A1036975J187059k84963O81290N22810l39482j61243K79394K0628J87945
$$ y = [6966416, 6704200, 6518955, 6667890, 6713332, 6327525, 6811356, 6238708, 5970390, 5598771, 5741739, 5988983, 5847501, 5695391, 5409318, 5794284, 6159880, 5846276, 5021928, 4679982, 4581502, 5006267, 5063490, 5362450, 5370080, 4984763, 4559093, 5415829, 5854368, 5584287, 5363049, 4854472, 5099756, 5123624, 5199608, 5093179, 4832846, 5364509, 5393899, 6034513, 6428433, 6716154, 6577515, 6603265, 6431657, 6255681, 6613096, 6532259, 6333207, 6385830, 6813242, 7166384, 7280272, 7456743, 7759288, 8060245, 8526854, 8466966, 8691618, 8492431, 8528984, 9274524, 9296314, 9561247, 10113983, 9956288, 10149553, 9667237, 10449092, 10411303, 11036975, 12224034, 11939071, 12620361, 13143171, 12803689, 12642446, 12921840, 12942468, 13130413]
3652A3130413O50468P3153J068123J60819J54572Q27520O65786Q0480J98845N00610
3642A7510789M04678K62371L53985M9046L86115L32478L43711j26584R9031K87629
3632A9903249j0488O89867k6079n57495l44408M22337O04853J8466L5778P31296
3622B1467376M07510J21625J85013K66126N04150R42275L82837P63343J26752
3613B5167007P11371P43182J083346R79931M98598J048098K91613N45215Q31842
3604C1900203j9596K11099P18220p3517K61916K4226o10871o51012l44254l6301
3594C1380113p27467l93656m42810p73807k82210m30107p65037j189750o65793
3585B5709476r51363m51736k10157q73436J18866l54085k68292n20775l02526
$$ y = [13130413, 13780881, 13854034, 14922157, 15082976, 15237548, 16065068, 16730854, 16811334, 17010179, 17510789, 17915467, 18177838, 18531823, 18580869, 18966984, 19299462, 19643173, 19516589, 19615620, 19903249, 19892761, 20582628, 20556549, 19999054, 19654646, 20076983, 20681836, 20700302, 20736080, 21467376, 21874886, 21996511, 22181524, 22447650, 22951800, 23894075, 24276912, 25040255, 25167007, 25878378, 26621560, 27704906, 28684837, 29183435, 30231533, 30523146, 31068361, 31900203, 31880607, 32091706, 32809926, 32736409, 32998325, 33022551, 32411680, 31760668, 31416414, 31380113, 30652646, 30258990, 29816180, 29042373, 28760163, 28330056, 27565019, 26375269, 25709476, 24758113, 24306377, 24096220, 23222784, 23341650, 22987565, 22719273, 22198498, 21895972]
3576B1895972N31984L17149r5521J26621J41744L02924L12397M15959k67326k11064
3566B3470839L97434M20293Q23638J76108k78666Q6863M25786L20356N4275k12723
3556B5684203n69270M17816o3731J18246J35081n64686p30166n59594K45767n58820
3546B3554846m71837o8883o41492n22910k65533J6011m57171m62446k53677n89368
3536A9837540l29363j8997k07108j45596l77534n59250q65000k99688n9006k43317
3526A6732681o89085K18796k30581l13898j56955n37891n06760n23112o0857l39434
3516A3592904k43043j31191m43552l43672J00921n4229Q3878l07475j07501k37289
3506A1909751N14333K9805K01185j83246K67766N56908j10718K88126N47191R71884
$$ y = [21895972, 22427956, 22745105, 22649584, 22776205, 22917949, 23220873, 23533270, 23949229, 23681903, 23470839, 23868273, 24288566, 25112204, 25288312, 25009646, 25096509, 25522295, 25842651, 25896926, 25684203, 25114933, 25532749, 25469018, 25587264, 25722345, 25157659, 24427493, 23867899, 24113666, 23554846, 23083009, 23014126, 22372634, 21849724, 21584191, 21600202, 21143031, 20680585, 20426908, 19837540, 19508177, 19489180, 19282072, 19136476, 18758942, 18199692, 17334692, 17035004, 16975998, 16732681, 16043596, 16262392, 16031811, 15717913, 15560958, 15023067, 14516307, 13993195, 13932338, 13592904, 13349861, 13218670, 12775118, 12431446, 12532367, 12478138, 12562016, 12254541, 12147040, 11909751, 12424084, 12453889, 12655074, 12471828, 12739594, 13296502, 13185784, 13473910, 14021101, 14992985]
3496A4992985O85331L57180O883J52603J100147Q72424M22053O13396J19663q7426
3486A9235239R44737N31678k04157k18348J21610p00585k54539o56983k22063
3477A8576589l0225P2779K32022M34303J75039P26047R86954J82140k85953r0164
3467B0979531N40879P71818K11414l16478O07275r32886m89741l99350k43757
3458B0728705j041287j181983l92186j18922l11714r22598K54455p3351N8987
3449A7000106j03446L82323K15687M96141l46867k57122O05258j08181m8120q5202
3439A7750577Q0006L54658q28940m98474K60422m37515M74173J64900j15705j07473
3429A7096629j00368k60201j30270k00418k44815J22624m85398j83013j40103
$$ y = [14992985, 15678316, 16035496, 16042379, 16194982, 17295129, 18167553, 18589606, 19203002, 19322665, 19235239, 20179976, 20711654, 20507497, 20289149, 20410759, 19710174, 19455635, 18798652, 18576589, 18546364, 18619143, 18851165, 19285468, 19460507, 20186554, 21173508, 21355648, 21069695, 20979531, 21520410, 22292228, 22503642, 22187164, 22794439, 21861553, 21371812, 20972462, 20728705, 19687418, 18505435, 18113249, 17994327, 17682613, 16760015, 17014470, 16941119, 17000106, 16896660, 17278983, 17494670, 17990811, 17643944, 17386822, 17992080, 17883899, 17835779, 17750577, 17830583, 18185241, 17356301, 16857827, 17118249, 16680734, 17154907, 17319807, 17204102, 17096629, 16996261, 16736060, 16605790, 16405372, 16160557, 16283181, 15797783, 15614770, 15474667]
3420A5474667n42530l8189n99407k26495j7265j21972K57125P95308M01417P00550
3410A6083209K59174J062540q019J81640K96249n9636l15232K78436L62428j015371
3400A7125418o49212J1346p48605o58991o84466n34641k33248j5623m43195n60368
3390A2608415k5468l29119R4165m3562Q43843p15164m36022L14656M93642j124692
3380A1680694k71946J37519k26850p10446q44558o20207l80390j62229o81184
3371G920403n75885k4121K6800n11916m02344K36580O30115m86300l33714K42100
3361F721718j19659o77089K28017R89966M34138K11848J51388j7428j47817o45312
3351G129770l56960M62903p34908o95822L29744K50816m57776o18682j77754k23014
$$ y = [15474667, 14932137, 14893948, 14294541, 14068046, 14050781, 13928809, 14185934, 14981242, 15382659, 16083209, 16342383, 17404923, 17396904, 17578544, 17874793, 17815157, 17499925, 17778361, 18140789, 17125418, 16476206, 16487552, 15738947, 15079956, 14395490, 13860849, 13627601, 13611978, 13168783, 12608415, 12582947, 12253828, 12347993, 12304431, 13148274, 12433110, 11997088, 12311744, 12805386, 11680694, 11408748, 11546267, 11319417, 10608971, 9764413, 9144206, 8763816, 8601587, 7920403, 7344518, 7320397, 7347197, 6835281, 6432937, 6669517, 7299632, 6813332, 6479618, 6721718, 6602059, 5924970, 6152987, 7142953, 7577091, 7788939, 7940327, 7922899, 7775082, 7129770, 6772810, 7235713, 6500805, 5804983, 6134727, 6385543, 5927767, 5309085, 5131331, 4908317]
3341D908317K67141m21337l13395O49735K41201m94928K29835j30138n5021J891
3331D883301l49005l13954J63999M18537l27612j33635J32018o06142K64143J6849
3321D148499K06554K55196r7189j35087n18852K18864K63875m91050j82389P39679
3311D408100L82399k82952m67725o23284M98584j08875n92300k04950P04512M81228
3301D194737K42587l21498l636m8367l7672p68063J88189M19401J5758K73374
3291D154810n05818K44910m22004K36147M04263q4527m4809M32564l95158R3100
3281D113478k50100J56193L26225J26457m6603K80092N33523M62246k9740j65161
3271E506610m74035k18281P3358K76803J21240j4391j70388O53318j59022k93671
$$ y = [4908317, 5175458, 4754121, 4440726, 5090461, 5331662, 4836734, 5066569, 4936431, 4881410, 4883301, 4534296, 4220342, 4384341, 4802878, 4475266, 4341631, 4473649, 3867507, 4131650, 4148499, 4355053, 4610249, 4513060, 4377973, 3859121, 4077985, 4341860, 3850810, 3668421, 4408100, 4790499, 4507547, 4039822, 3416538, 3915122, 3806247, 3213947, 3008997, 3713509, 4194737, 4437324, 4115826, 4112190, 4063823, 4026151, 3258088, 3446277, 3865678, 3881436, 4154810, 3648992, 3893902, 3471898, 3708045, 4112308, 4027781, 3982972, 4415536, 4020378, 4113478, 3863378, 4019571, 4345796, 4472253, 4425650, 4705742, 5239265, 5701511, 5671771, 5506610, 5032575, 4814294, 4887652, 5164455, 5285695, 5271304, 5100916, 5754234, 5595212, 5301541]
3261E301541L13730K36837L52192J25519J22421l20447j88521R2343J40963J119123
3251G295701N89994J58275L65551r6999j89617K71021O32972J95367M2557K5339
3241I290161J35178N1458O00412J60033K4858P31456O36548r0306J91480O58863
3231A2390141Q20707P15965N23743O50633Q87019R32438M33673L60277Q03667
3222A8518263J481809J185301J342429K074041J976135K502767K486434L042021
3214C4609200M007088M472666N297206N939105P084633Q706586J0420487J2410611
3206I2947582J2917735J2401277J0153066N141050p35281m837728q462887j1040961
3198A08483853j1396339j1286268j0297722r500899p519300o450127n385349m317211
$$ y = [5301541, 5615271, 5852108, 6204300, 6329819, 6452240, 6131793, 5943272, 6035615, 6176578, 7295701, 7885695, 8043970, 8409521, 8312522, 8122905, 8393926, 9026898, 9222265, 9264822, 9290161, 9425339, 9476797, 10077209, 10237242, 10262100, 10993556, 11630104, 11539798, 11731278, 12390141, 13210848, 13926813, 14450556, 15101189, 15988208, 16920646, 17354319, 17714596, 18518263, 20000072, 21185373, 22527802, 24601843, 26577978, 29080745, 31567179, 34609200, 38616288, 43088954, 48386160, 54325265, 61409898, 70116484, 80536971, 92947582, 105865317, 118266594, 128419660, 133560710, 132825429, 127987701, 119524814, 108483853, 97087514, 85801246, 75503524, 66002625, 58483325, 52033198, 46647849, 42330638]
3190D2330638l390353k032901k206272k063915j468154p71541m39862o28557j004499
3181B8324584o31091k99049K25396P58987J41343M48428J135069N50891K036999
3172C2691557K245056K114118L061717L046093L900793M564045M835058O459156
3164F2917593Q020165R102954J1308674J2017403J1023898R394304N040153l34191
3156A28490953m729898q044740j0382064j0963537j1427381j0464039q469598
3149F4009696o733417n513889n102849m738824l353265k339348k389330k375296
3141C1463478j978327j683510j354706j436266j195296j188493o03949m34450
3133B1588481r29763m11632q93833o73921l8081J78600l45279o35076L33028K45799
$$ y = [42330638, 38940285, 36907384, 34701112, 32637197, 31169043, 30397502, 29957640, 29329083, 28324584, 27693493, 27394444, 27619840, 28378827, 28520170, 28968598, 30103667, 30654558, 32691557, 34936613, 37050731, 40112448, 43158541, 47059334, 51623379, 56458437, 62917593, 70937758, 80040712, 91349386, 103366789, 114390687, 123784991, 128825144, 128490953, 123761055, 115716315, 105334251, 94370714, 82943333, 72479294, 64009696, 57276279, 51762390, 46659541, 41920717, 38567452, 36228104, 33838774, 31463478, 29485151, 27801641, 26446935, 25010669, 23815373, 22626880, 22022931, 21588481, 20658718, 20247086, 19353253, 18679332, 18641251, 18819851, 18474572, 17839496, 18172524, 18418323]
3123A8418323j04025j68111J6184K71678k19055m72067j82531k1594L29858J93984
3113A8062644L14463J88422N80158J28120P15682L70255L6313P08014N34870J014532
3103B2653473O83657M33123P20669O44186J037362R03409N57033J092879L26710
3094B9052501J589694J277343J742854K369659J874250K227736L021353K643334
3086D5798724K949137L828542L571389M556953N684686O403720P304983Q091925
3078H8190059Q615173J0618664J2468405J3932557J6888927J8620933J9837816
3071A89172534K0145151J8563810J6362710J2116276P057713J697465k666653
3064B62449006n983117p576290o493067n613298l699373j022813J367175J110462
$$ y = [18418323, 18314298, 18146187, 18162371, 18434049, 18214994, 17742927, 17560396, 17538802, 17868660, 18062644, 18377107, 18565529, 19145687, 19273807, 19989489, 20359744, 20396057, 21104071, 21638941, 22653473, 23337130, 23770253, 24490922, 25135108, 26172470, 27075879, 27632912, 28725791, 29052501, 30642195, 31919538, 33662392, 36032051, 37906301, 40134037, 43155390, 45798724, 48747861, 52576403, 56147792, 60704745, 66389431, 72793151, 80098134, 88190059, 96805232, 107423896, 119892301, 133824858, 150713785, 169334718, 189172534, 209317685, 227881495, 244244205, 256360481, 263418194, 265115659, 262449006, 256465889, 248889599, 242396532, 236783234, 233083861, 232061048, 233428223, 234538685]
3056B34538685J25690j323110l869248m888699n036487m809290l600660l693795
3048B07443086l504303n147185q320194j0112387j2066991j4345446j4324626
3041A39621954j3548342j3494246j2435772j0460067q675200p627498p521796
3034F5859033o016934m738770l880334l933718l216973l060572l064647j679921
3026C6267164k317060j906629j734633j133087j350202j627491j251565q17510
3018B4128987j117239j197675o94023r70042p72650p46353j149913j98151m41208
3009A6841733m29306j63184o12804j235305l24242p74947j87777j29939o64438
3000A2319791J11788n64148o56861P951q87198q22024K30570q0337n2200k79855
$$ y = [234538685, 234664375, 233341265, 229472017, 224583318, 219546831, 214737541, 211136881, 207443086, 203938783, 198791598, 190471404, 180359017, 168292026, 153946580, 139621954, 126073612, 112579366, 100143594, 89683527, 81008327, 73380829, 65859033, 59842099, 55103329, 51222995, 47289277, 44072304, 41011732, 37947085, 36267164, 33950104, 32043475, 30308842, 29175755, 27825553, 26198062, 24946497, 24128987, 23011748, 21814073, 21120050, 20150008, 19377358, 18631005, 17481092, 17282941, 16841733, 16412427, 16249243, 15636439, 14401134, 14076892, 13301945, 13114168, 12984229, 12319791, 12431579, 11867431, 11210570, 11218521, 10331323, 9509299, 9739869, 9659532, 9607332, 9327477]
2990I327477J26417q97699n499L61772m42935K4365n04862k91125J68384l49401
2980G516894p908l24428m80864m3847m84575k33452N57175r9862Q5200J39707
2970F624040j5488n24462n43735m8798j53617l00247k64198K04367k80764l93644
2960D303454k29745p5967j7760j05713M44335l48124m46800K75005k18436m37016
2950C143233L0901M88631j79948l37269M97883J72853n3089L1042j6394P3516
2940C851359m73640k67437m09261l77902O8990j82200N373K69942K0805L47655
2930B853684M37553k64394j24251k41250p19760K06221k9275K28302r5248k45643
2920B005939k96866R3685M34029N61530m22866k78845m44730j30460Q05289k66148
$$ y = [9327477, 9453894, 8556195, 8550696, 8912468, 8469533, 8493898, 7989036, 7697911, 7866295, 7516894, 7508986, 7184558, 6703694, 6659847, 6175272, 5941820, 6498995, 6399133, 6484333, 6624040, 6608552, 6084090, 5540355, 5491557, 5337940, 5037693, 4773495, 4977862, 4697098, 4303454, 4073709, 3997742, 3979982, 3874269, 4318604, 3970480, 3523680, 3798685, 3580249, 3143233, 3174134, 3662765, 3482817, 3145548, 3643431, 3816284, 3763195, 3794237, 3777843, 3851359, 3377719, 3110282, 2701021, 2323119, 2392109, 2209909, 2215282, 2485224, 2506029, 2853684, 3291237, 3026843, 2902592, 2661342, 1941582, 2147803, 2118528, 2346830, 2251582, 2005939, 1709073, 1802758, 2236787, 2798317, 2375451, 2096606, 1651876, 1521416, 2326705, 2060557]
2910B060557n66457K27024l13245K64068r4737J09037m20336k25620J42685o5761
2900A117215k22868K8479J047596k23429o47987m1293L56002n921M29695l22210
2890A515279k04304J65410p0179m57870K08605L79940q5175M92870k53759j73794
2880A517023J6525k64579L45832k42716m75869k37678P07275L07939J01364l62108
2870A413008l8543k36262O1204K79223n27761l3645q5593r3004M21991j90774
2860I69844l66247J76993j49879j08291K37664J15241n6695n4085R0774j75059
2850F80260L37480k10099L10878m41465J50871m9384j66138O57063j43556r6604
2840A029306n85272K59936o1450J31267l26087k07023N21496M13242M2306m45694
$$ y = [2060557, 1494100, 1721124, 1407879, 1671947, 1577210, 1686247, 1265911, 1040291, 1182976, 1117215, 894347, 922826, 1970422, 1746993, 1099006, 1057713, 1413715, 1407794, 1837489, 1515279, 1310975, 1476385, 1406206, 948336, 1156941, 1536881, 1451706, 1944576, 1690817, 1517023, 1533548, 1268969, 1614801, 1372085, 896216, 658538, 1365813, 1673752, 1775116, 1413008, 1374465, 1138203, 1199407, 1478630, 950869, 917224, 831631, 738627, 1160618, 969844, 603597, 780590, 630711, 522420, 760084, 875325, 818630, 764545, 855319, 680260, 1017740, 807641, 1118519, 677054, 827925, 778541, 612403, 1269466, 1125910, 1029306, 444034, 703970, 642520, 773787, 447700, 240677, 762173, 1175415, 1217721, 772027]
2830G72027N70116N02537m25379n79089J52272k53409r7663K68376K05072m04458
2820G10402k82763N9119p933K26714m4299j16210j61665K62374k79991j86313
2810A79435L71937n75938J50599N04066k11325M96165j89743l65105k02040Q1926
2800B39977K32120L81249j96406L05369J79358j28902j46161m1354N68308N54326
2790A947884k80569M0210o8553m47730M39055l2458j27921L42236n11566M93508
2780A794096j11615m24881k21227J03202L74769m28280O35665L34572P4758k55011
2770A876048l83553r9385l15062J62820R2663l80987L84544L4296P2867K76455
2760A720706m31692l91893L43266j15594J98401n19060J01479K89429J38849n16228
$$ y = [772027, 1342143, 1844680, 1419301, 840212, 992484, 739075, 641412, 909788, 1114860, 710402, 427639, 486758, 478825, 705539, 661240, 545030, 383365, 645739, 365748, 179435, 551372, -24566, 126033, 630099, 418774, 914939, 725196, 360091, 158051, 239977, 472097, 853346, 656940, 962309, 1141667, 1012765, 866604, 825250, 1393558, 1947884, 1667315, 1707525, 1638972, 1191242, 1630297, 1597839, 1469918, 1812154, 1300588, 1794096, 1682481, 1257600, 1036373, 1139575, 1514344, 1086064, 1721729, 2056301, 2131059, 1876048, 1492495, 1393110, 1078048, 1240868, 1333531, 952544, 1337088, 1371384, 1444251, 1720706, 1289014, 897121, 1240387, 1124793, 1323194, 804134, 905613, 1195042, 1333891, 817663]
2750H17663j18518j73958L0365J29141j74370O07457J37066k56277l49883j82290
2740D66396k30430N27107m81561L2668j92048L80691L13130j53575k0673k25655
2730D16050K47737L67246l55779K01294Q1483n84l72027m0099L20702l63709O08
2719E02922L8314q6599M60465k12865n94288K91569j36673R5539Q1775p6388K32040
2708E95811l62480k92040K19963k23783k93988O6120L61153M46948l72184o4663
2698H0857R5392K43868K50988q43376M17075M27142k61104K86817J57128m94361
2688C60426m43431P5176J92547Q8886p1625m08253k8854J01853m0701k46945j04468
2677e25389L27926P687r6820P07204q2927l8628l16136Q9790K41520J63583L54205
$$ y = [817663, 699145, 525187, 555552, 684693, 510323, 1117780, 1254846, 998569, 648686, 466396, 235966, 763073, 281512, 314180, 122132, 502823, 815953, 662378, 641705, 416050, 663787, 1031033, 675254, 876548, 958031, 957447, 585420, 545321, 866023, 502314, 502922, 541236, 454637, 915102, 702237, 107949, 399518, 262845, 358384, 440159, 363771, 595811, 233331, -58709, 161254, -62529, -356517, -290397, 70756, 517704, 145520, 80857, 176249, 420117, 671105, -172271, 244804, 671946, 410842, 697659, 854787, 360426, -83005, -7829, 184718, 273604, 201979, -206274, -235128, -133275, -173976, -420921, -525389, -197463, -189776, -286596, 420608, 337681, 299053, -17083, 72707, 314227, 477810, 832015]
2666H32015m45170j20629K57371P0918m46709k42650j47073K73329l78742q8867
2656d36207L44301L1411J76050J51480P0009l53825N7843L53521j54319k56376
2646a6112K56037l76248j28211j87088J75774M4377K18165J62580r8428J08002
2636A58848J46511L98111p55796k51600J75631n4898j02492j47078O63069o64558
2626d34252l04192M21408L27745J94812m72814j61716M74696l36541K13346M59579
$$ y = [832015, 386845, 266216, 523587, 594505, 147796, -94854, -241927, 31402, -347340, -436207, -91906, -60495, 115555, 267035, 337044, -16781, 41062, 394583, 240264, -16112, 239925, -136323, -264534, -451622, -275848, -231471, -13306, 149274, 50846, 158848, 305359, 703470, -52326, -303926, -128295, -183193, -285685, -432763, 230306, -434252, -738444, -317036, 10709, 205521, -267293, -429009, 45687, -290854, -77508, 382071]
$$ [...]
##END NTUPLES=NMR SPECTRUM
##END=
