##TITLE=1H_DE-80H_X3
 200.13MHz, d2o
 8 sc
 
 19ns.26.2.2025
##JCAMPDX= 6.0         $$ Bruker NMR JCAMP-DX V2.0
##DATA TYPE= NMR SPECTRUM
##DATA CLASS= NTUPLES
##ORIGIN= UXNMR, Bruker Analytische Messtechnik GmbH
##OWNER= pz
$$ XWIN-NMR		Version 3.5
$$ Thu Mar 26 10:32:18 2026 Russian Standard Time (UT+4h)  Yarkov@DPX200
##.OBSERVE FREQUENCY= 200.1313
##.OBSERVE NUCLEUS= ^1H
##.ACQUISITION MODE= SIMULTANEOUS
##.ACQUISITION SCHEME= undefined
##.AVERAGES= 8
##.DIGITISER RES= 18
##SPECTROMETER/DATA SYSTEM= spect
##.PULSE SEQUENCE= zg30
##.SOLVENT NAME= DMSO
##.SHIFT REFERENCE= (INTERNAL, DMSO, 0, 15.4803)
##AUDIT TRAIL= $$ (NUMBER, WHEN, WHO, WHERE, WHAT)
$$ ##TITLE= Audit trail, XWIN-NMR		Version 3.5
$$ ##JCAMPDX= 5.01
$$ ##ORIGIN= Bruker BioSpin GmbH
$$ ##OWNER= Yarkov
$$ C:/Bruker/XWIN-NMR/data/yarkov2/nmr/H-C/1/pdata/1/auditp.txt
$$ ##AUDIT TRAIL=  $$ (NUMBER, WHEN, WHO, WHERE, WHAT)
(   1,<2026-03-26 10:31:28.85 +0400>,<Yarkov>,<DPX200>,
      <created by zg, POWCHK disabled, PULCHK disabled
       configuration hash MD5:
       00 E9 B6 7A A2 85 ED C7 34 08 36 98 17 FE 4E 26
       data hash MD5: 16K
       5C 47 04 CF 43 C0 C3 F2 72 C7 8F F3 B7 17 C2 35>)
(   2,<2026-03-26 10:31:38.89 +0400>,<Yarkov>,<DPX200>,
      <Start of raw data processing
       efp BC_mod = 2 LB = 0.25 FT_mod = 6 PKNL = 1 PHC0 = -5299.148 PHC1 = 6.821927 SI = 16K 
       data hash MD5: 16K
       0B 1C F7 C9 AC A6 B8 F3 D0 8E 1A 9E 49 66 0C 09>)
$$ ##END=
$$ 
$$ hash MD5
$$ A2 25 64 87 95 16 26 01 46 2F D5 B5 6F 0A 55 D1
##$RELAX= 
##$RELAX= 
##$RELAX= 
##$RELAX= 
##$RELAX= 
##$RELAX= 
$$ Bruker specific parameters
$$ --------------------------
##$DU= <C:/Bruker/XWIN-NMR>
##$EXPNO= 1
##$NAME= <H-C>
##$PROCNO= 1
##$TYPE= <nmr>
##$USER= <yarkov2>
##$AMP= (0..31)
100 100 100 100 100 100 100 100 100 100 100 100 100 100 100 100 100 100 
100 100 100 100 100 100 100 100 100 100 100 100 100 100 
##$AQSEQ= 0
##$AQ_mod= 1
##$AUNM= <au_zg>
##$AUTOPOS= <>
##$BF1= 200.13
##$BF2= 200.13
##$BF3= 200.13
##$BF4= 200.13
##$BF5= 200.13
##$BF6= 200.13
##$BF7= 200.13
##$BF8= 200.13
##$BYTORDA= 1
##$CFDGTYP= 0
##$CFRGTYP= 5
##$CHEMSTR= <none>
##$CNST= (0..31)
1 1 145 1 1 1 1 1 1 1 1 1 1 1 1 1 1 1 1 1 1 1 1 1 1 1 1 1 1 1 1 1 
##$CPDPRG= <>
##$CPDPRG1= <>
##$CPDPRG2= <>
##$CPDPRG3= <>
##$CPDPRG4= <mlev>
##$CPDPRG5= <mlev>
##$CPDPRG6= <mlev>
##$CPDPRG7= <mlev>
##$CPDPRG8= <mlev>
##$CPDPRGB= <>
##$CPDPRGT= <>
##$D= (0..31)
0 0.7 0 0 0 0 0 0 0 0 0 0.03 0 0 0 0 0 0 0 0 0 0 0 0 0 0 0 0 0 0 0 0 
##$DATE= 1774506688
##$DBL= (0..7)
120 120 120 120 120 120 120 120 
##$DBP= (0..7)
150 150 150 150 150 150 150 150 
##$DBP07= 0
##$DBPNAM0= <>
##$DBPNAM1= <>
##$DBPNAM2= <>
##$DBPNAM3= <>
##$DBPNAM4= <>
##$DBPNAM5= <>
##$DBPNAM6= <>
##$DBPNAM7= <>
##$DBPOAL= (0..7)
0.5 0.5 0.5 0.5 0.5 0.5 0.5 0.5 
##$DBPOFFS= (0..7)
0 0 0 0 0 0 0 0 
##$DE= 6
##$DECBNUC= <off>
##$DECIM= 32
##$DECNUC= <off>
##$DECSTAT= 4
##$DIGMOD= 1
##$DIGTYP= 9
##$DL= (0..7)
0 120 120 120 120 120 120 120 
##$DP= (0..7)
$$ [...]
##$SUBNAM2= <"">
##$SUBNAM3= <"">
##$SUBNAM4= <"">
##$SUBNAM5= <"">
##$SUBNAM6= <"">
##$SUBNAM7= <"">
##$SUBNAM8= <"">
##$SUBNAM9= <"">
##$SW= 18.0517328524113
##$SWIBOX= (0..15)
0 0 2 0 0 0 0 0 0 0 0 0 0 0 0 0 
##$SW_h= 3612.71676300578
##$TD= 16384
##$TD0= 1
##$TE= 0
##$TE2= 300
##$TE3= 300
##$TEG= 300
##$TL= (0..7)
0 120 120 120 120 120 120 120 
##$TP= (0..7)
150 150 150 150 150 150 150 150 
##$TP07= 0
##$TPNAME0= <>
##$TPNAME1= <>
##$TPNAME2= <>
##$TPNAME3= <>
##$TPNAME4= <>
##$TPNAME5= <>
##$TPNAME6= <>
##$TPNAME7= <>
##$TPOAL= (0..7)
0.5 0.5 0.5 0.5 0.5 0.5 0.5 0.5 
##$TPOFFS= (0..7)
0 0 0 0 0 0 0 0 
##$TUNHIN= 0
##$TUNHOUT= 0
##$TUNXOUT= 0
##$USERA1= <user>
##$USERA2= <user>
##$USERA3= <user>
##$USERA4= <user>
##$USERA5= <user>
##$V9= 5
##$VALIST= <valist>
##$VCLIST= <CCCCCCCCCCCCCCC>
##$VD= 0
##$VDLIST= <DDDDDDDDDDDDDDD>
##$VPLIST= <PPPPPPPPPPPPPPP>
##$VTLIST= <TTTTTTTTTTTTTTT>
##$WBST= 1024
##$WBSW= 4
##$XGAIN= (0..3)
0 0 0 0 
##$XL= 0
##$YL= 0
##$YMAX_a= 89426
##$YMIN_a= -85615
##$ZGOPTNS= <>
##$ZL1= 120
##$ZL2= 120
##$ZL3= 120
##$ZL4= 120
##$ABSF1= 0
##$ABSF2= 0
##$ABSG= 0
##$ABSL= 0
##$ALPHA= 0
##$AQORDER= 0
##$ASSFAC= 0
##$ASSFACI= 0
##$ASSFACX= 0
##$ASSWID= 0
##$AUNMP= <proc_1d>
##$AZFE= 0.1
##$AZFW= 0.1
##$BCFW= 0
##$BC_mod= 2
##$BYTORDP= 0
##$COROFFS= 0
##$CY= -3
##$DATMOD= 1
##$DC= 0
##$DFILT= <>
##$DTYPP= 0
##$F1P= 0
##$F2P= 0
##$FCOR= 1
##$FTSIZE= 16384
##$FT_mod= 6
##$GAMMA= 0
##$GB= 0
##$INTBC= 1
##$INTSCL= 3.241238e-09
##$ISEN= 128
##$LB= 0.25
##$LEV0= 0
##$LPBIN= 0
##$MAXI= 10000
##$MC2= 0
##$MEAN= 0
##$ME_mod= 0
##$MI= 1.114404
##$NCOEF= 0
##$NC_proc= -8
##$NLEV= 6
##$NOISF1= 3.799351
##$NOISF2= 2.8
##$NSP= 0
##$NTH_PI= 0
##$NZP= 0
##$OFFSET= 15.48025
##$PC= 1
##$PHC0= -5299.148
##$PHC1= 6.821927
##$PH_mod= 1
##$PKNL= yes
##$PPARMOD= 0
##$PSCAL= 0
##$PSIGN= 0
##$REVERSE= no
##$SF= 200.130008295629
##$SI= 16384
##$SIGF1= 3
##$SIGF2= 2
##$SINO= 0.751879
##$SIOLD= 32768
##$SREGLST= <19F.Aceton>
##$SSB= 0
##$STSI= 16384
##$STSR= 0
##$SW_p= 3612.71676300578
##$SYMM= 0
##$S_DEV= 0
##$TDeff= 16384
##$TDoff= 0
##$TI= <>
##$TILT= no
##$TM1= 0
##$TM2= 0
##$TOPLEV= 0
##$USERP1= <user>
##$USERP2= <user>
##$USERP3= <user>
##$USERP4= <user>
##$USERP5= <user>
##$WDW= 1
##$XDIM= 16384
##$YMAX_p= 392520712
##$YMIN_p= -953479
$$ End of Bruker specific parameters
$$ ---------------------------------
##NTUPLES= NMR SPECTRUM
##VAR_NAME=  FREQUENCY,     SPECTRUM/REAL,   SPECTRUM/IMAG
##SYMBOL=    X,             R,               I
##VAR_TYPE=  INDEPENDENT,   DEPENDENT,       DEPENDENT
##VAR_FORM=  AFFN,          ASDF,            ASDF
##VAR_DIM=   16384,         16384,           16384
##UNITS=     HZ,            ARBITRARY UNITS, ARBITRARY UNITS
##FACTOR=    0.220516191357247, 1,           1
##FIRST=     3098.06263268134, 0,            0
##LAST=      -514.654130324442, 0,           0
##MIN=       -514.654130324442, -953479,     0
##MAX=       3098.06263268134, 392520712,    0
$$ Real data points
##PAGE= N=1
##DATA TABLE= (X++(R..R)), XYDATA
$$ [...]
5170A0102594k7223j61929J77695j4527J13294j0813P2735L20632o4502Q376K01592
5159A0717924K4537l28807j0204Q9018m9582L81704J01006J79703M6919l29615
5149A0822603J95150K01478o8676n2295K10456K31953L99334p4206p0757l64110
5139A1430930J42034K12644L80777R7296j35143O698J75458L88152K90019k36345
5129A2752520j6150K52601p2795J55134J19657J7657R5159K74781J44324m47346
5119A3275542J26948r3287K72574J79165K66566k56064M044K27574K63405n008
5109A4261459j05420j37612Q5604K33350J15369l08869N269J57467J94831J12856
5099A4614304j21964J9166j58912J68311j32292K20101K32155o6562j30440p6044
$$ y = [10102594, 10075371, 9913442, 10091137, 10076610, 10189904, 10179091, 10251826, 10572458, 10507956, 10516332, 10717924, 10742461, 10413654, 10403450, 10492468, 10442886, 10824590, 10925596, 11105299, 11152218, 10822603, 11017753, 11219231, 11150555, 11098260, 11308716, 11540669, 11940003, 11865797, 11795040, 11430930, 11572964, 11785608, 12166385, 12263681, 12128538, 12135236, 12310694, 12698846, 12988865, 12752520, 12736370, 12988971, 12916176, 13071310, 13190967, 13208624, 13303783, 13578564, 13722888, 13275542, 13402490, 13309203, 13581777, 13760942, 14027508, 13771444, 13775488, 14003062, 14266467, 14261459, 14156039, 14018427, 14104031, 14337381, 14452750, 14143881, 14149150, 14306617, 14501448, 14614304, 14492340, 14511506, 14352594, 14520905, 14388613, 14608714, 14840869, 14774307, 14643867, 14567823]
5089A4567823K15343L237j65300n5646K43579J52743O5123M4747k63012K63083
5079A5071720j01272p5100R3280N2637K04605l6004J89059k40556k73998J57300
5069A5041671L13658J12324j73709j8061l4766J00866j40045j07079j36733L78307
5059A5336433K68721Q1857P5903j98836j60210L1148J94700L8430k20663L7839
5049A5485322J36311J87735r5283M892J23253N5499R7158J2074k91040p5395K03066
5038A5843592J31958M10237R7188j59550J13936L96983j00269o9319J5586k0247
5028A6660095L42718J46773j71272j08741J72390L748K69417N3350j6019l2428
5018A7320031j96148M19580j51525m7285K06258j13176J48364J69689l11409k65312
$$ y = [14567823, 14783166, 14786403, 14621103, 14565457, 14809036, 14961779, 15026902, 15071649, 14808637, 15071720, 14970448, 14895348, 14988628, 15041265, 15245870, 15209866, 15398925, 15158369, 14884371, 15041671, 15355329, 15467653, 15293944, 15275883, 15241117, 15341983, 15201938, 15094859, 14958126, 15336433, 15605154, 15687011, 15762914, 15564078, 15403868, 15435016, 15629716, 15668146, 15447483, 15485322, 15621633, 15809368, 15714085, 15718977, 15842230, 15897729, 15994887, 16006961, 15715921, 15640526, 15843592, 15975550, 16385787, 16482975, 16323425, 16437361, 16834344, 16734075, 16664756, 16680342, 16660095, 17002813, 17149586, 16978314, 16869573, 17041963, 17045711, 17315128, 17368478, 17352459, 17320031, 17123883, 17543463, 17391938, 17344653, 17550911, 17437735, 17586099, 17755788, 17444379, 17179067]
5008A7179067M764K68331K02084k40858j17336J28618L15578M6483o3254r9715
4998A7623762o5062K71485l8210j13335m79061j28333k1547k078K93930J66784
4988A7508335K8698l8353M0811P9639J06208j94868j02399j73062L11016k53386
4978A7312639J2002R3818k58763j60350K65259k2826m14076l23201J33458K69823
4968A6907783M3462J7474k94608k49010J65406k16824n2187R6291K1254p3984
4958A6365057j06756q9159k75021K0120L29966j26000l95260R0637j08558k35965
4948A5469061n4520m8655j58675j24105L42401O2410l39817k27938l9825l7425
4938A4842912j1948o9463M8762j06104L8429Q4210R5028p1244j33781k94979K50515
$$ y = [17179067, 17183831, 17452162, 17654246, 17413388, 17296052, 17424670, 17740248, 17786731, 17723477, 17623762, 17558700, 17830185, 17791975, 17678640, 17199579, 17071246, 17049699, 17047621, 17341551, 17508335, 17537033, 17498680, 17539491, 17619130, 17725338, 17530470, 17428071, 17255009, 17566025, 17312639, 17324641, 17418459, 17159696, 16999346, 17264605, 17241779, 16827703, 16504502, 16637960, 16907783, 16951245, 16968719, 16674111, 16425101, 16590507, 16373683, 16321496, 16417787, 16439041, 16365057, 16258301, 16169142, 15894121, 15914241, 16244207, 16118207, 15722947, 15813584, 15705026, 15469061, 15414541, 15365886, 15207211, 15083106, 15425507, 15487917, 15148100, 14920162, 14880337, 14842912, 14830964, 14761501, 14810263, 14704159, 14742588, 14826798, 14921826, 14850582, 14716801, 14421822, 14672337]
4927A4672337J84917l87627Q6012j7176l2526J11998J25430j93532l08635K43066
4917A4484264M79649k28171J19139j36238M7169q4390J30491j07605K7731P6246
4907A4808285K4379O1266K1002J65485k4741P6157L70128K17239j67539k2222
4897A5529439N2515J26719N26770j86833j34537M70824K77719j371p5010Q641
4887A6594876P9770J37514l3154j13855J24053K22676K46992o4935m1252k37867
4877A6914818J71780j5422K08543J52393K40507p3038L9698L57540N4835k54844
4867A7796810o1018K42003K63751p5424l14775J33382K66424Q2524J18429K94801
4857A8746907l81441l0716J71818J44617j90968J80273N4455L17741K11807J95782
$$ y = [14672337, 14857254, 14469627, 14555639, 14538463, 14505937, 14617935, 14743365, 14549833, 14241198, 14484264, 14963913, 14735742, 14854881, 14718643, 14765812, 14681422, 14811913, 14704308, 14732039, 14808285, 14832664, 14893930, 14914932, 15080417, 15055676, 15131833, 15501961, 15719200, 15551661, 15529439, 15581954, 15708673, 16235443, 16048610, 15914073, 16384897, 16662616, 16661245, 16586235, 16594876, 16674646, 16812160, 16779006, 16665151, 16789204, 17011880, 17258872, 17193937, 17152685, 16914818, 17086598, 17071176, 17279719, 17432112, 17672619, 17599581, 17639279, 17996819, 18051654, 17796810, 17735792, 17977795, 18241546, 18166122, 17851347, 17984729, 18251153, 18333677, 18452106, 18746907, 18365466, 18334750, 18506568, 18651185, 18460217, 18640490, 18694945, 19012686, 19224493, 19420275]
4847A9420275J3929r1740j47490p539L76676J73883K6382R6234L46930J3162N6595
4836B0277297j55629j46524J33326L32545J25420K1912J4836J97243L33673M3495
4826B1177594J13442j01729J34607M24120J05390K91348L22357k7618K05517K60486
4816B2905514K60734l57245k45542K27919L5334j31457J20486K90361J9222J90525
4806B3315851K00744j76557K5763j12297K7965K00589J92912P7601k14489J01746
4796B3639828J39826L92326q3259r3662l6472K10828L12100q0986l13397j10933
4786B3976199j595l5604m522l53976m01106j99550K32951j39936Q657J57613J3620
4775B3252751k34361L2577j00863j2673J62566J27332M42j33803K4804l9410k02805
$$ y = [19420275, 19434204, 19342464, 19194974, 19187435, 19564111, 19737994, 19764376, 19860610, 20207540, 20220702, 20277297, 20121668, 19975144, 20108470, 20441015, 20566435, 20588347, 20603183, 20800426, 21134099, 21177594, 21291036, 21189307, 21323914, 21748034, 21853424, 22144772, 22467129, 22439511, 22645028, 22905514, 23166248, 22809003, 22563461, 22791380, 22826714, 22695257, 22815743, 23106104, 23125326, 23315851, 23516595, 23340038, 23365801, 23253504, 23281469, 23482058, 23674970, 23752571, 23538082, 23639828, 23779654, 24171980, 24088721, 23995059, 23958587, 24169415, 24481515, 24400529, 24087132, 23976199, 23974604, 23939000, 23934478, 23580502, 23179396, 22979846, 23212797, 23072861, 23081518, 23239131, 23252751, 23018390, 23050967, 22950104, 22937431, 23099997, 23227329, 23227771, 23093968, 23118772, 23079362, 22876557]
4764B2876557R4415K29055J88294j55146j67230j9035J20740J35092L67038j89910
4754B3479870o6954q4989K20312J52370J4192j87514N6089J27333P8435L18612
4744B4107756O5640J89040N6411J97611K06192O5303N9033L45321k92845N3171
4734B5052633N29133K54306m9673K2986M45448K26103O4167R0025J1946M71760
4724B7118834L91812J87114K99212K01324J85315K45210L04184K53272K40236
4715B9426513J59775K32643L65588M83663P62435K24681L99341M90019N66325
4706C3110983N19278Q67745N67279P32452Q68800N78296N10145L77435N98010
4697C8730423Q92373O61593L87666L23825N30660L37166L44055N42429J69268
$$ y = [22876557, 22970972, 23200027, 23388321, 23233175, 23065945, 23046910, 23167650, 23302742, 23669780, 23479870, 23412916, 23327927, 23548239, 23700609, 23714801, 23527287, 23583376, 23710709, 23789144, 24107756, 24173396, 24362436, 24418847, 24616458, 24822650, 24887953, 24946986, 25292307, 24999462, 25052633, 25581766, 25836072, 25786399, 25809385, 26254833, 26480936, 26545103, 26635128, 26647074, 27118834, 27510646, 27697760, 27996972, 28198296, 28383611, 28628821, 28933005, 29186277, 29426513, 29586288, 29818931, 30184519, 30668182, 31430617, 31655298, 32054639, 32544658, 33110983, 33630261, 34498006, 35065285, 35797737, 36666537, 37244833, 37754978, 38132413, 38730423, 39622796, 40284389, 40672055, 40995880, 41526540, 41863706, 42207761, 42750190, 42919458]
4688D2919458M08488P49744K25862L43710M50796O55210M92152K71248Q00914
4679D7317582R30228N82490O76953J072178P87538P00247Q92150P45322L06329
4670E4011017P81027N36222K44691N40714k5523m6481k67802o40031q33321q09671
4660E3490842o67019q79075j445397p35964o31402j154702q18597q03976q44599
4651D5510111r63052p99986r31410p36111r54640j093560r16590m43735p28036
4642C7942991j198207r35338r15998j017188r90702p92940j127334j271110j263746
4633B8430428r51770j019777q02782r62794j171231p91499r88565j013209q68546
4624A9860255n47232p94908l83262n21425n68309r40735p99844k18543m75425
$$ y = [42919458, 43327946, 44077690, 44303552, 44647262, 45098058, 45753268, 46245420, 46516668, 47317582, 48247810, 48830300, 49507253, 50579431, 51366969, 52067216, 52959366, 53704688, 54011017, 54792044, 55328266, 55572957, 56113671, 56088148, 56041667, 55773865, 55133834, 54300513, 53490842, 52823823, 51944748, 50499351, 49763387, 49131985, 47977283, 47158686, 46354710, 45510111, 44547059, 43747073, 42815663, 42079552, 41124912, 40031352, 39114762, 38671027, 37942991, 36744784, 35809446, 34893448, 33876260, 32885558, 32092618, 30965284, 29694174, 28430428, 27478658, 26458881, 25656099, 24693305, 23522074, 22730575, 21742010, 20728801, 19860255, 19313023, 18518115, 18134853, 17613428, 17045119, 16104384, 15304540, 15085997, 14610572]
4615A4610572o87438r6012j41350o00269k49978k63685k64296l65695l37701k54492
4605A1349656o07058j60000L5659k99324l29267l75239k27342M8547O7019l45118
4595I157533k23931j47109M2536J25712l72906n29169J52882j52502k58989m58321
4585G335736j70131J5550n91183R9735L7923k15704k80921R882j29579Q0500O0477
4574F252285n12868l7507J10225J78787l67728n19633l12008J69897j15429j11025
4564D734996j8494j58321N9569J12473k74247j09697N4681O0577q5783l83058
4554C992696j95459j85370K53689J03668o4766l4522N6652j01378L4651L3228
4544C893089m90602k33290J61102K80235l03469j19537k45389l18225M76249K73649
$$ y = [14610572, 13923134, 13827122, 13685772, 13085503, 12835525, 12571840, 12307544, 11941849, 11604148, 11349656, 10742598, 10582598, 10618257, 10318933, 9989666, 9614427, 9387085, 9435632, 9502651, 9157533, 8933602, 8786493, 8829029, 8954741, 8581835, 8052666, 8205548, 8053046, 7794057, 7335736, 7165605, 7181155, 6589972, 6689707, 6727630, 6511926, 6231005, 6240887, 6111308, 6191808, 6252285, 5739417, 5701910, 5812135, 5990922, 5623194, 5103561, 4791553, 4961450, 4846021, 4734996, 4716502, 4558181, 4617750, 4730223, 4455976, 4346279, 4400960, 4461537, 4375754, 3992696, 3797237, 3611867, 3865556, 3969224, 3904458, 3869936, 3926588, 3825210, 3859861, 3893089, 3402487, 3169197, 3330299, 3610534, 3307065, 3187528, 2942139, 2623914, 3100163, 3373812]
4534C373812J15403j93724n9407j42272q3261M43314r3613k21391P1957j17704
4524C093114j1515j37444L0585j34404K24211L2520r9657l37791J3210J31634
4514B804463J17819j27292M7189n4033k59276J25738K7368k38915P0260J65400
4504B678721J44882n3147j36959J25850J38136J64412j67826m20702J00402J87660
4494B761429p4459p1269K9811L7531k41434J59948O6327J64758J39402l64434
4484B607610o9819L5249L42162j92643k09083J66756o4407j38218J14123L49507
4474B941237k46144j85564l7204J37975R3567k4314o8461r0090J91112j56912
4464B555202n0394M4220J93187k35030k30658J82104l7447J62026j79762J37450
$$ y = [3373812, 3489215, 3295491, 3236084, 3093812, 3010551, 3453865, 3360252, 3138861, 3210818, 3093114, 3081599, 2944155, 2974740, 2840336, 3064547, 3097067, 2997410, 2659619, 2672829, 2804463, 2922282, 2794990, 2842179, 2788146, 2528870, 2654608, 2681976, 2443061, 2513321, 2678721, 2823603, 2770456, 2633497, 2759347, 2897483, 3061895, 2894069, 2473367, 2573769, 2761429, 2686970, 2615701, 2645512, 2683043, 2441609, 2601557, 2667884, 2832642, 2972044, 2607610, 2537791, 2573040, 2915202, 2722559, 2513476, 2680232, 2615825, 2477607, 2591730, 2941237, 2695093, 2509529, 2472325, 2610300, 2703867, 2679553, 2611092, 2521002, 2712114, 2555202, 2504808, 2549028, 2742215, 2507185, 2276527, 2458631, 2421184, 2583210, 2403448, 2540898]
4454B540898j02953j66398J6550j69835l2124J74497j5684J09265J03269P1282
4444B528767j71217K22936j65576P2747q5525J9020O5736j70008j8207J17399
4434B416072L2958K90152p8961j75167j53136L57338l8481j44605O1788P6178
4424B644136M8620O0227p5447R8700P6043n0063m204O360j09514K73397J18169
4413C086424m39869J03359J8687N9086O8673R4727k44173p3660K38343L6277p8748
4402B869126R1006j9478j33607J11301j51789J23903K57001k64402Q8525q3182
4392B888404J60810K29323l148j0521k7155j71288N8227j84018l4224J36174J40428
4381C183012q4633P9001J13059k2070L1014j25293K34424O1817J6513q2680m068
$$ y = [2540898, 2437945, 2271547, 2288097, 2118262, 2086138, 2260635, 2244951, 2354216, 2457485, 2528767, 2357550, 2580486, 2414910, 2487657, 2402132, 2421152, 2486888, 2316880, 2298673, 2416072, 2449030, 2739182, 2660221, 2485054, 2331918, 2689256, 2650775, 2506170, 2567958, 2644136, 2692756, 2752983, 2677536, 2776236, 2852279, 2802216, 2798012, 2804372, 2694858, 2968255, 3086424, 2646555, 2749914, 2768601, 2827687, 2896360, 2991087, 2746914, 2673254, 2911597, 2947874, 2869126, 2960132, 2940654, 2807047, 2918348, 2766559, 2890462, 3147463, 2883061, 2971586, 2888404, 3049214, 3278537, 3275389, 3264868, 3237713, 3066425, 3124652, 2940634, 2906410, 3042584, 3183012, 3098379, 3177380, 3290439, 3268369, 3299383, 3174090, 3408514, 3470331, 3486844, 3404164, 3400096]
4370C400096j1924p1887K30119J49666J31584j82341K12053j21484P003K39924
4360C982809L40567k6800n4944J73603L6144K3116M831K45512K85731J6812J41266
4349E168647o6905j73472m1459J19214J27325l03088K42095J04995j79366J60155
4339E158141j1132L70485j04860K59418Q2087L23709M39955l28646K35291M48453
4329F872901L22669J31240N74948J18571M40445P56888K77947M57651O31692J129105
4319A1714057R10434R83122J261764J468089K137287K648411L237254M320714
4311B8681132O245669Q708038J0678007J2230381J2788247Q546832j343577j1562545
4303G4972184j6445623j4399564r377338o070326m754905l231060k299545j536385
$$ y = [3400096, 3388172, 3316285, 3546404, 3696070, 3827654, 3645313, 3857366, 3735882, 3742885, 3982809, 4323376, 4296576, 4241632, 4415235, 4451379, 4474495, 4479326, 4724838, 5010569, 5027381, 5168647, 5101742, 4928270, 4886811, 5006025, 5133350, 4830262, 5072357, 5177352, 4997986, 5158141, 5147009, 5517494, 5412634, 5672052, 5754139, 6077848, 6517803, 6189157, 6424448, 6872901, 7195570, 7326810, 7901758, 8020329, 8460774, 9217662, 9495609, 9953260, 10584952, 11714057, 12624491, 13607613, 14869377, 16337466, 18474753, 21123164, 24360418, 28681132, 34926801, 43634839, 54312846, 66543227, 79331474, 87878306, 86534729, 74972184, 58526561, 44126997, 34749659, 28679333, 23924428, 20693368, 18393823, 16857438]
4295A6857438j327244q86498n88763q97684p78210o23869l65197m35596j43864
4286A0810513n05595k55206j69419r8136l84822j60593K40335j29171j07062K95886
4276I536730j36447m7558L47840J5907l64206k16975L00394l29646J54952L19938
4266I580929P2297m64198k93383l1350o4209j45208J13477P2355l23903L56240
4256H873047P6931j03351j40657J8380J38240J09724k53008P3780j0368J62665
4246H945383J36277P6355J93049j0828r9304M3513k3618j31217L99577k9036O7565
4235I567716J74433K87909q0633n1447K40287J16743j34666J37086K08670j67372
4225A0298726P4079J47458m0143p2876M39692o2018K2369j57884O1565P0373J39130
$$ y = [16857438, 15530194, 14643696, 14054933, 13157249, 12379039, 11755170, 11389973, 10954377, 10810513, 10304918, 10049712, 9880293, 9782157, 9397335, 9236742, 9477077, 9347906, 9240844, 9536730, 9400283, 9352725, 9700565, 9716472, 9352266, 9135291, 9435685, 9106039, 9260991, 9580929, 9653226, 9189028, 8895645, 8864295, 8800086, 8654878, 8768355, 8840710, 8516807, 8873047, 8949978, 8846627, 8705970, 8724350, 8862590, 8972314, 8719306, 8793086, 8782718, 8945383, 9081660, 9158015, 9351064, 9340236, 9240932, 9284445, 9260827, 9129610, 9529187, 9500151, 9567716, 9742149, 10030058, 9949425, 9897978, 10138265, 10255008, 10120342, 10257428, 10466098, 10298726, 10372805, 10520263, 10480120, 10407244, 10846936, 10784918, 10807287, 10649403, 10710968, 10781341, 10920471]
4214A0920471l26365j93403L388J31439M09M1448j36965j25973O9005r8367J837
4203A0286924n3886J38232J19557j19404j02128K23630k38162K9284Q0418Q3102
4193A0447567o8491P8232P9617j97432p4745q6677l86j69242r418o3505l5159
4182I900361M4194k7543n70868N0527L09391K08446K16784p8072k90952P0525
4172I832793J73321j692j08041j62475R4927k10336J8020j10505j69122J78989
4162I535879m8533j23530P7280J33475N2620J73982K35643M546j15840R0551J08732
4151A0124805l23537k56517J30701K6631j36955J65420j16615j49542K65048M24172
4141A0153611l09163m1081N9679j46753L0154j96895j24660P4973l68399J78468
$$ y = [10920471, 10594106, 10400703, 10404091, 10535530, 10535939, 10577387, 10440422, 10314449, 10383454, 10285087, 10286924, 10233038, 10371270, 10490827, 10371423, 10269295, 10492925, 10254763, 10284047, 10364465, 10447567, 10379076, 10457308, 10536925, 10339493, 10264748, 10178071, 10177685, 10008443, 9999025, 9935520, 9900361, 9944555, 9917012, 9346144, 9396671, 9706062, 9914508, 10131292, 10053220, 9762268, 9832793, 10006114, 10004422, 9896381, 9733906, 9828833, 9618497, 9636517, 9526012, 9356890, 9535879, 9487346, 9363816, 9441096, 9574571, 9627191, 9801173, 10036816, 10041362, 9925522, 10016073, 10124805, 9801268, 9544751, 9675452, 9702083, 9565128, 9730548, 9613933, 9464391, 9729439, 10153611, 9844448, 9803367, 9863046, 9716293, 9746447, 9549552, 9424892, 9499865, 9131466, 9309934]
4131I309934J14880L59363J75721l33454M5144J85660k22109l09194J78979n3322
4121I451602k7744J91482k98066j10838L45432L24001J56590L24491l266j57812
4111A0195872Q6873J83022j0010J13217J64713j24797J11768K22260n6418j0928
4101A0875572J17657L10668M64566J79270J12600J97061J63908K20038K36567
4092A2877907Q3360L2798O93534N67196K1254m3831L78337M02136P57116K20985
4082A5990792R8078N1094L59765M84940K26362M03609M31632K89918O78283M05351
4072A9419824L32245L83487N14040M41907L12614M11341N21510O37508N86990
4063B3561466Q77782M51458M95456L70730N72221M21216O64984N37550Q93615
$$ y = [9309934, 9424814, 9784177, 9959898, 9626444, 9671588, 9857248, 9635139, 9325945, 9504924, 9451602, 9423858, 9615340, 9317274, 9206436, 9551868, 9875869, 10032459, 10356950, 10353684, 10195872, 10282745, 10465767, 10455757, 10568974, 10733687, 10608890, 10720658, 10942918, 10886500, 10875572, 10993229, 11303897, 11768463, 11947733, 12060333, 12257394, 12421302, 12641340, 12877907, 12961267, 12994065, 13687599, 14254795, 14276049, 14232218, 14610555, 15012691, 15769807, 15990792, 16088870, 16139964, 16499729, 16984669, 17211031, 17614640, 18046272, 18336190, 19014473, 19419824, 19752069, 20135556, 20649596, 21091503, 21404117, 21815458, 22336968, 22974476, 23561466, 24439248, 24890706, 25386162, 25756892, 26329113, 26750329, 27415313, 27952863, 28846478]
4054B8846478M23239L46710P56873N79881O48143P49439M12125O69834M98583
4045C3931305P28728N58456P42612N63112M31657K77448P79472L60912P35544
4036C9109246O56569L55826N99705O31767O50861K16890N01567N03326N31696
4027D3757453P96440Q30889M61908M14983L91992O03024Q40968O73367J192339
4018D9963363P46138P35951P49662M72702Q27570P06015Q57879M49904O84822
4009E6194006Q11849L54402K87893Q81715Q11106N64094O95439O46901J88094
4000F1435499N66097Q08533L00501J93431K80055K60769l2500L80082M9672m30603
3990F3811536R1017L11194K02539p8256J18191L9148N5011J54733J27718l3243
$$ y = [28846478, 29269717, 29616427, 30373300, 30953181, 31601324, 32350763, 32762888, 33432722, 33931305, 34660033, 35218489, 35961101, 36524213, 36955870, 37233318, 38012790, 38373702, 39109246, 39765815, 40121641, 40721346, 41353113, 42003974, 42220864, 42722431, 43225757, 43757453, 44553893, 45384782, 45846690, 46261673, 46653665, 47256689, 48097657, 48771024, 49963363, 50709501, 51445452, 52195114, 52667816, 53495386, 54201401, 55059280, 55509184, 56194006, 57005855, 57360257, 57648150, 58529865, 59340971, 59905065, 60600504, 61247405, 61435499, 62001596, 62810129, 63110630, 63304061, 63584116, 63844885, 63812385, 64192467, 64242139, 63811536, 63902553, 64213747, 64416286, 64338030, 64456221, 64495369, 64550380, 64705113, 64832831, 64799588]
3980F4799588L1660k8223j2666L89085N9981n15078k17809O3896j88446l18921
3970F4063067j53375j62548p29707o49506p58341r08764m94765m59903n05018
3961E9241140n90317o94762o49633n60059o67283o41422l44221l45011n39430
3952E4209002p05031o69945p75518n61855n43012n31304m85393p53658p68894
3943D8414392m42933q08366m47208l79489j060627o87876m01527p01810p81546
3934D2703010o95715q90028n74297p11557o75383j301307p96828m94500m53459
3925C6109936p51744m18494p13911p46906l98107m77525q11330o37890n0235m16544
3915C0687250l86638l96158k53544q43570l72719r0997m67544j67299j44623m45312
$$ y = [64799588, 64831248, 64803025, 64790359, 65179444, 65239425, 64724347, 64506538, 64570434, 64381988, 64063067, 63909692, 63747144, 63017437, 62367931, 61609590, 60700826, 60206061, 59746158, 59241140, 58650823, 57956061, 57306428, 56746369, 56079086, 55437664, 55093443, 54748432, 54209002, 53503971, 52834026, 52058508, 51496653, 50953641, 50422337, 49936944, 49183286, 48414392, 47971459, 47163093, 46715885, 46336396, 45275769, 44587893, 44186366, 43484556, 42703010, 42007295, 41117267, 40542970, 39831413, 39156030, 37854723, 37057895, 36563395, 36109936, 35358192, 34939698, 34225787, 33478881, 33080774, 32603249, 31791919, 31154029, 31103794, 30687250, 30300612, 29904454, 29650910, 28807340, 28434621, 28343624, 27876080, 27708781, 27564158, 27118846]
3905B7118846m46519j43257n63677o07689k01265j18267k56790m1382k81357n47367
3895B3911276m10332J5157k28646l30491l51598j18654l09422K8023K25680m19007
3885B2011986J12990Q2881P7284p8157J56640j33522j38254L85079n7911m36249
3875B1982767J34292K02257q3413j12165M18961O2736L14665L57176M54964P51684
3865B4483924K21074P42292P99229P83674M26606O32424P35343R77101M55297
3856C0256964K18817R50291M78227L81716R49252N32284K79970O15943N62784
3847C5226248M27296L96380L82323K81414K11662j84465j0338j17645K44556m2133
3837C6815298m65671j43560K2769l21811l17563l1303j27473m62131n02691j25513
$$ y = [27118846, 26672327, 26529070, 25965393, 25357704, 25156439, 25038172, 24781382, 24740000, 24458643, 23911276, 23500944, 23516101, 23287455, 22956964, 22605366, 22486712, 22177290, 22205313, 22430993, 22011986, 22124976, 22207857, 22285141, 22206984, 22363624, 22230102, 22091848, 22476927, 22419016, 21982767, 22117059, 22319316, 22235903, 22123738, 22542699, 22605435, 22920100, 23277276, 23732240, 24483924, 24704998, 25447290, 26246519, 27030193, 27456799, 28089223, 28824566, 29801667, 30256964, 30475781, 31426072, 31904299, 32286015, 33235267, 33767551, 34047521, 34663464, 35226248, 35653544, 36049924, 36432247, 36713661, 36925323, 36740858, 36730520, 36612875, 36857431, 36815298, 36349627, 36206067, 36228836, 35907025, 35589462, 35558159, 35430686, 34968555, 34465864, 34340351]
3827C4340351j23321j44206K3758n36395o54682k24886j83948n69405p34544l13039
3817C0879683o61855o21979l07731l32219m58331k66964l29061o32515k40897
3808B7028131J8521m38266l73922K0875n33050n23573j14683n37338o31958m90817
3798B3423920m61558j79780l65097l09677k64494k92703l00760m16343k42842
3789B0590666m3316l29707k81690j23007k49836k32823R5686k659j86453j9230
3779A9217631k78140J02434J0145l28930j96425K9134K86601j00777l49753L98708
3769A8790628J2052q2046K95230K79716J72648k49247J00848K47513L64327O0316
3759A9991985L38032K5203J93612J39001j35673J42029M63196K63326K4052J90614
$$ y = [34340351, 34217030, 34072824, 34096582, 33560187, 32905505, 32680619, 32496671, 31927266, 31192722, 30879683, 30217828, 29595849, 29288118, 28955899, 28497568, 28230604, 27901543, 27269028, 27028131, 27046652, 26608386, 26234464, 26255339, 25722289, 25198716, 25084033, 24546695, 23914737, 23423920, 22962362, 22782582, 22417485, 22107808, 21843314, 21550611, 21249851, 20833508, 20590666, 20547350, 20217643, 19935953, 19812946, 19563110, 19330287, 19425973, 19423314, 19236861, 19217631, 18939491, 19041925, 19052070, 18723140, 18526715, 18555849, 18842450, 18741673, 18391920, 18790628, 18802680, 18720634, 19015864, 19295580, 19468228, 19218981, 19319829, 19567342, 19931669, 19991985, 20330017, 20355220, 20548832, 20687833, 20552160, 20694189, 21157385, 21420711, 21444763, 21635377]
3749B1635377O7974J51648j41094K43810j74866k21013J78162m7783L1118p5668
3739B1647665l5126l36715n8333Q9526K99068L138k72642L72320Q8488J30737
3729B1928126J44979m30659q6238K18079j6587m2923k16287J49713N4755j58286
3719B1544672l17998j24410M0224K5878l28695J67082m8535l10623L8048N6457
3709B0742100j9755l44814l44600j03760l81617n58442q0173j34701j8235o6556
3699A8689447l24513n38415j86608n7902l91705o3756j26989j10033k96896l09124
3689A6283506P1013k31419l28787k56499l55141j74764j67513r1823k75476l36510
3679A4136587O3345j62051k37203j89098k09569k58810K32356K2807j73052l53991
$$ y = [21635377, 21703351, 21854999, 21713905, 21957715, 21782849, 21561836, 21739998, 21692215, 21723333, 21647665, 21612539, 21275824, 21217491, 21307017, 21606085, 21609223, 21336581, 21708901, 21797389, 21928126, 22073105, 21642446, 21556208, 21774287, 21757700, 21714777, 21498490, 21648203, 21702958, 21544672, 21226674, 21102264, 21142488, 21168366, 20839671, 21006753, 20958218, 20647595, 20685643, 20742100, 20722345, 20377531, 20032931, 19929171, 19547554, 18989112, 18908939, 18774238, 18756003, 18689447, 18364934, 17826519, 17639911, 17582009, 17190304, 17126548, 16999559, 16889526, 16592630, 16283506, 16354519, 16123100, 15794313, 15537814, 15182673, 15007909, 14840396, 14748573, 14473097, 14136587, 14199932, 14037881, 13800678, 13611580, 13402011, 13143201, 13375557, 13398364, 13225312, 12871321]
3669A2871321k38571M11517p0220m334J88595o97j7491Q848K1136j34634l54409
3658A2681061J92945K38162J78586m09256k06978K37107j25018K08246J27739
3649A3122594r4683J68244L5496j96946k29947l5300j54454p8113J24207j30346
3639A2530752k44832k95956k92783l52674r9351l8609k65066l89366q4881J43071
3629A0610305L48999j74900m32950j88063L8385L49848L04807j8065j25428P0799
3619A0783737k96792k2929K46265k34461K28504L44217m90741k98654J63857J50688
3609A0573691J71275p8486k4043n08517K07823K42451M139j14816Q1990J36217
3599A0691724p3461J55981l21399K8915O2678L4161m2733p5940j57262J62767
$$ y = [12871321, 12632750, 13044267, 12974047, 12969713, 13158308, 13157611, 13140120, 13148968, 13170104, 13035470, 12681061, 12874006, 13112168, 13290754, 12881498, 12674520, 12911627, 12786609, 12994855, 13122594, 13027911, 13196155, 13231651, 13034705, 12804758, 12769458, 12615004, 12536891, 12661098, 12530752, 12285920, 11989964, 11697181, 11344507, 11245156, 11206547, 10941481, 10552115, 10467234, 10610305, 10959304, 10784404, 10351454, 10163391, 10201776, 10551624, 10856431, 10838366, 10712938, 10783737, 10486945, 10464016, 10710281, 10475820, 10704324, 11048541, 10557800, 10259146, 10423003, 10573691, 10744966, 10666480, 10642437, 10133920, 10341743, 10584194, 10588333, 10473517, 10555507, 10691724, 10618263, 10774244, 10452845, 10481760, 10544438, 10578599, 10535866, 10459926, 10302664, 10465431]
3589A0465431k1630n5766J55498O791k03728p8892J82158r6823n57740J31018
3579I926317k71492j08228M239k17530l53392j13007J2430q3248k41291k94629
3569H260169k23930k06411J41482k53878k71205k41766J16842n7676M3594j92348
3559G114873j26156j11842l60369j55093r5665l74195N3416k2020j57636j09498
3549E655815J9191l23098R3102J32764j3072j95029l3383J5691K83005l9722k58004
3538E337260k23548K25677J86730k8958o7971o1388j92216K06143J13025k96831
3528E197923L910j77953O5215O7731N7191o8773k32796Q8860k8772K9649K53889
3517E256074l70647j30488o820K67735m65130j81188J94817j82466J19073J35961
$$ y = [10465431, 10443801, 10388035, 10543533, 10550324, 10346596, 10267704, 10449862, 10353039, 9795299, 9926317, 9654825, 9546597, 9550836, 9333306, 8979914, 8866907, 8879337, 8796089, 8554798, 8260169, 8036239, 7829828, 7971310, 7717432, 7446227, 7204461, 7321303, 7263627, 7307221, 7114873, 6988717, 6876875, 6516506, 6361413, 6265748, 5891553, 5944969, 5922949, 5765313, 5655815, 5675006, 5351908, 5445010, 5577774, 5564702, 5369673, 5336290, 5351981, 5634986, 5595264, 5337260, 5113712, 5339389, 5526119, 5497161, 5429190, 5367802, 5175586, 5381729, 5494754, 5197923, 5201833, 5023880, 5089095, 5156826, 5214017, 5145244, 4912448, 5001308, 4972536, 5002185, 5256074, 4885427, 4754939, 4748119, 5015854, 4550724, 4369536, 4564353, 4381887, 4500960, 4636921]
3507D636921k47955j20528R7370O2679J91779l5965p9254P7346J73502J22921
3497D878816j02276m0972M0308J14360j12123J47059j89505o4545j12567K94290
3487D852845l6961N0008J42882J66399L82418J25722m7677K04862j4989K14043
3477F039552K52614K00782L46055J82494L06949L02794K16650j40138j50494n6959
3467G500299l7259k09795j55624m58867k66676q6465j10715l04088j98011M0365
3457E713164K52158j2351k6734j51823K8221Q9736K11414j26556m86058j26232
3447E364939K65923O8141o2057J43269l6647R9056k2825k6816J1753J49289O5653
3436F019678J32227r6884N3942l85330J40380M31889p8707Q3729J76147N9677
$$ y = [4636921, 4388966, 4268438, 4365808, 4428487, 4620266, 4584301, 4505047, 4582393, 4755895, 4878816, 4776540, 4735568, 4775876, 4890236, 4778113, 4925172, 4735667, 4671122, 4558555, 4852845, 4815884, 4865892, 5008774, 5175173, 5557591, 5683313, 5635636, 5840498, 5825509, 6039552, 6292166, 6492948, 6839003, 7021497, 7328446, 7631240, 7847890, 7707752, 7557258, 7500299, 7463040, 7253245, 7097621, 6638754, 6372078, 6285613, 6174898, 5870810, 5672799, 5713164, 5965322, 5952971, 5926237, 5774414, 5802635, 5892371, 6103785, 5977229, 5491171, 5364939, 5630862, 5699003, 5636946, 5780215, 5743568, 5842624, 5819799, 5792983, 5804736, 5954025, 6019678, 6151905, 6055021, 6108963, 5723633, 5864013, 6295902, 6217195, 6300924, 6477071, 6536748]
3426F536748r0271R0891J11613K73540J74215R8217K74895k00978J9017L47239
3416G635126N1644l7710L74145M14428K57015K62974L56621J26489K32792Q4246
3406I757770l80794O17227K94509l379J05921K13473J29109M01554j04704j15913
3396A0914773J70871K90962Q0634K00254j71338j07163K46298K82808J44861j47112
3386A1905848J31840J83379M2205K63294J20126k38845r4200K41900K69132r8082
3376A2726597N9772P8034j5184M76031K01534j36658p712L50427J43417J08945
3366A3985203K26582j11598j19387J44093K46801P7073L44709L65796J42952j80605
3356A5121619M45659M04241K06413K24222M32657K11674R170M65307L64588j95227
$$ y = [6536748, 6446477, 6537368, 6648981, 6922521, 7096736, 7194953, 7469848, 7268870, 7287887, 7635126, 7686770, 7649060, 8023205, 8437633, 8694648, 8957622, 9314243, 9440732, 9673524, 9757770, 9376976, 9994203, 10288712, 10285333, 10391254, 10604727, 10733836, 11135390, 11030686, 10914773, 11085644, 11376606, 11457240, 11657494, 11486156, 11378993, 11625291, 11908099, 12052960, 11905848, 12037688, 12221067, 12263272, 12526566, 12646692, 12407847, 12313647, 12555547, 12824679, 12726597, 12786369, 12864403, 12849219, 13325250, 13526784, 13390126, 13382414, 13732841, 13876258, 13985203, 14211785, 14100187, 13980800, 14124893, 14371694, 14448767, 14793476, 15159272, 15302224, 15121619, 15567278, 15971519, 16177932, 16402154, 16834811, 17046485, 17055655, 17520962, 17885550, 17690323]
3346A7690323J72811L15668K37911N07068L21121j86875J7659P32494K19413J30122
3336B0157715L24191J8681J34890J98844M55477L86147K20590L23368J76113m3680
3326B2352336K70360J37358J54637L64991J72787m411K46989k7038l30730m8221
3316B3289058K94422K7049j48362o7876j21300m2627R8588L97193j13401j52971
3306B3459773J91247J34701J57259J38824K38886l9221N0171L86586L54543o786
3296B5065983M55270N41604M38146O91211M29776k875N69989O05124L04215M60697
3286B9559140O45770P40656M57937J242600Q18888N12778P45570Q34226P51306
3277C6308871M85767L79624J7743L34672L56209n40068o01353p07445p24136q79833
$$ y = [17690323, 17863134, 18178802, 18416713, 18923781, 19244902, 19058027, 19075686, 19808180, 20027593, 20157715, 20481906, 20500587, 20635477, 20834321, 21289798, 21675945, 21896535, 22219903, 22396016, 22352336, 22622696, 22760054, 22914691, 23279682, 23452469, 23448058, 23695047, 23668009, 23337279, 23289058, 23583480, 23610529, 23462167, 23394291, 23272991, 23230364, 23328952, 23726145, 23612744, 23459773, 23651020, 23785721, 23942980, 24081804, 24320690, 24281469, 24331640, 24718226, 25072769, 25065983, 25521253, 26062857, 26501003, 27192214, 27621990, 27619115, 28189104, 28794228, 29098443, 29559140, 30204910, 30945566, 31403503, 32646103, 33464991, 33977769, 34723339, 35557565, 36308871, 36794638, 37174262, 37192005, 37526677, 37882886, 37342818, 36741465, 36034020, 35309884, 34430051]
3267C4430051p70870r65160j277870q83730p15296r92245q46054p56304q52391
3258B6370131o85613n57248n61881p23061n94986l02200n28124m25435o44123
3249B1347460k84949k97186o8694l55214m32121l17195j9279j56613l44763j25349
3239A8946097j87233l68676J12853K712m22262j94674m06286j61690l0059K28337
3229A7519119l27044j93610P7355K93426j11292K4230k2691l8733K68492M6691
3219A7535943J33261K47781N35424J08260k23491M37100J96993m7326Q46195P29241
3209B0499381L4390M40353P42950K25002j9077Q11298L49363J41150M90148Q88973
3199B4603931M23517L99140O30303M41423L88559J086668L82636L69888R21962
$$ y = [34430051, 33659181, 32694021, 31416151, 30532421, 29817125, 28824880, 27978826, 27222522, 26370131, 25684518, 25127270, 24565389, 23842328, 23247342, 22945142, 22417018, 21991583, 21347460, 21062511, 20765325, 20696631, 20341417, 19909296, 19592101, 19572822, 19416209, 19071446, 18946097, 18758864, 18390188, 18503041, 18505753, 18083491, 17888817, 17482531, 17320841, 17290782, 17519119, 17192075, 16998465, 17075820, 17369246, 17257954, 17282184, 17259493, 17220760, 17489252, 17535943, 17669204, 17916985, 18452409, 18560669, 18337178, 18774278, 18971271, 18923945, 19770140, 20499381, 20533771, 20974124, 21717074, 21942076, 21922999, 22734297, 23083660, 23224810, 23714958, 24603931, 25027448, 25426588, 26056891, 26498314, 26886873, 27973541, 28356177, 28726065, 29648027]
3190B9648027P15051Q50114J132950J310057J153683J751885J986639K058166
3182D0606572K203450K729934K846495L064255L861345M476581M338718N239742
3174F9367092O409413O023725O631076P198762O852614O244398N666264M307054
3166A18700398K204886J080879K05017j193431j608388j360733j789284j839949
3158A14399395j611430k194713l096396k907458l018409m401326m611548m343895
3150H8214220n362730n161631m822511m749650m416163l935189l666161l250808
3142E2849377k846298k561028k493563k125079j673760j786100j935007j035047
3134C6393495j602603j734022q84148j004170j186315j260969o67361o28818q89783
$$ y = [29648027, 30363078, 31213192, 32346142, 33656199, 34809882, 36561767, 38548406, 40606572, 42810022, 45539956, 48386451, 51450706, 55312051, 59788632, 64127350, 69367092, 75776505, 81800230, 88431306, 95630068, 102482682, 108727080, 114393344, 118700398, 120905284, 121986163, 122191180, 120997749, 119389361, 118028628, 116239344, 114399395, 112787965, 110593252, 107496856, 104589398, 101570989, 97169663, 92558115, 88214220, 82851490, 77689859, 72867348, 68117698, 63701535, 59766346, 56100185, 52849377, 50003079, 47442051, 44948488, 42823409, 41149649, 39363549, 37428542, 36393495, 34790892, 33056870, 32172722, 31168552, 29982237, 28721268, 28053907, 27425089, 26535306]
3125B6535306q69428o90897n05823m11070l76222q90565j60753k32330j80919
3116B2217299k30001j18599n4100o99511L02559R4587l20870M19981k5386l87715
3106B1198244L94725M90215J33970j67956M67023J83194j19532K47787L63472
3097B3191142p9323J22053P17660L15912L55891O01846K34812K10873J034043
3088B6704909Q74611O80697J160301J074892J020416R52046J228452J181070J309173
3079C6186567J980073J589080J481998K194068J956960J803922K222365K313344
3071E1728377J556260J648682K086986J826448J112573J292783J496262J564654
3063F4313025K247426L009075L093388L669693M810057M805625N070675N205477
$$ y = [26535306, 25665878, 24974981, 24469158, 24058088, 23681866, 22791301, 22630548, 22398218, 22217299, 21987298, 21868699, 21814599, 21115088, 21417647, 21512234, 21191364, 21611345, 21585959, 21198244, 21592969, 22083184, 22217154, 22049198, 22516221, 22699415, 22579883, 22827670, 23191142, 23111819, 23233872, 23951532, 24267444, 24623335, 25225181, 25459993, 25670866, 26704909, 27579520, 28260217, 29420518, 30495410, 31515826, 32467872, 33696324, 34877394, 36186567, 38166640, 39755720, 41237718, 43431786, 45388746, 47192668, 49415033, 51728377, 53284637, 54933319, 57020305, 58846753, 59959326, 61252109, 62748371, 64313025, 66560451, 69569526, 72662914, 76332607, 81142664, 85948289, 91018964, 96224441]
3055I6224441L871332K333515J891566R66235J54626O35661J755471K580267M265405
3046A14678519N957224P287786Q111939R145510R365644P920534N764477K204669
3038A70436302k609006o583467j0173369j2237130j2545320j1878535j1252597
3031A03156878j0199795q311031p284531o940282n206893l957938m539393m017292
3023E2699723k904716k927732k453562k341967k485788j842953j239794j182063
3015C5321148j392152r91953j158782p97409m69277j45154j60997N88N37186L81056
3005C1124254K76518O58574R30305J201635J558116J898473K025936K509596K966740
2996D5150147L556953L651996M053955M174356L871031L577493K562878J530915
$$ y = [96224441, 100095773, 102429288, 104320854, 105287089, 105441715, 106077376, 107832847, 110413114, 114678519, 120635743, 127923529, 136035468, 145180978, 154546622, 162467156, 168231633, 170436302, 167827296, 161243829, 151070460, 138833330, 126288010, 114409475, 103156878, 92957083, 84646052, 77361521, 70421239, 65214346, 61256408, 56717015, 52699723, 49795007, 46867275, 44413713, 42071746, 39585958, 37743005, 36503211, 35321148, 33928996, 32937043, 31778261, 30980852, 30511575, 30366421, 30205424, 30206012, 30743198, 31124254, 31400772, 32059346, 32989651, 34191286, 35749402, 37647875, 39673811, 42183407, 45150147, 48707100, 52359096, 56413051, 60587407, 64458438, 68035931, 70598809, 72129724]
2988G2129724N12563J52570j63449k77010P7330J27630l1600m12356p70865k185770
2978F9158767l371680l685693m245272m232145m064072m210482l834652l466729
2970C8048042k661501k831806k571115k350450k164050j450462j290378j286313
2962B1441967j671506j124285j052600j127059p94417m82657q33162p49611l02175
2953A3304495n76827p19146k51058m14188l45084k07569n77648r9263j58508k79664
2943I675540l19903l29013j72838J28884j97692j45940k61727o49475m65359m2635
2933G219842k28604l04114j525r2392j80911r1133j94635j26661k05978K8807
2923E822696k30001o2796K01383J02476l51328m17482J19183j5244j50162k03947
$$ y = [72129724, 72642287, 72794857, 72631408, 72354398, 72431728, 72559358, 72527758, 72115402, 71344537, 69158767, 65787087, 62101394, 57856122, 53623977, 49559905, 45349423, 41514771, 38048042, 35386541, 32554735, 29983620, 27633170, 25469120, 24018658, 22728280, 21441967, 19770461, 18646176, 17593576, 16466517, 15672100, 15189443, 14356281, 13606670, 13304495, 12727668, 12008522, 11757464, 11343276, 10998192, 10790623, 10212975, 10113712, 9955204, 9675540, 9355637, 9026624, 8853786, 8982670, 8784978, 8639038, 8377311, 7727836, 7262477, 7219842, 6991238, 6687124, 6685599, 6593207, 6412296, 6321163, 6126528, 5999867, 5793889, 5822696, 5592695, 5529899, 5731282, 5833758, 5482430, 5064948, 5184131, 5168887, 5018725, 4814778]
2913D814778j61552j66361N8609l32131j89731J1855J3800o2877m6541O2777q7710
2902C914916l35214Q8118l67491m4525J76069k07004q0446J38692j59433q9763
2892C033919l4874m4280j1357j3788L24510m7646m08495K58119k06208K6516q6155
2881B790261J07434J45522J56726l02512n55319J27378J07319k1751M2754K76495
2871B874307k62295j87204j31188n4501K7119k6793m6308M7378Q18j84886j4110
2860B042337j27980Q8401J10108o6748j80385O4391l14405j10869L19811m7176
2850A777485n2267J41349r4771k27847J52072j76722J44490o479l37571r4116
2840A225623K23186r031n8243J0759J11641o5121K11090K0200k8659k00980j04944
$$ y = [4814778, 4653226, 4486865, 4545474, 4213343, 4023612, 4035467, 4049267, 3986390, 3939849, 4002626, 3914916, 3579702, 3667820, 3300329, 3255804, 3431873, 3224869, 3144423, 3283115, 3123682, 3033919, 2999045, 2954765, 2943408, 2929620, 3254130, 3206484, 2797989, 3056108, 2849900, 2876416, 2790261, 2897695, 3043217, 3199943, 2897431, 2342112, 2469490, 2576809, 2555058, 2597812, 2874307, 2612012, 2424808, 2293620, 2239119, 2266238, 2239445, 2193137, 2240515, 2241333, 2056447, 2042337, 1914357, 2002758, 2112866, 2046118, 1865733, 1930124, 1615719, 1504850, 1824661, 1777485, 1725218, 1866567, 1771796, 1543949, 1696021, 1519299, 1663789, 1657310, 1319739, 1225623, 1448809, 1439778, 1381535, 1392294, 1503935, 1438814, 1649904, 1670104, 1641445, 1440465, 1335521]
2829A335521k93418R466J79093r3596k34992J46543K10211K05643q1860r8388
2819A284223P7468j79785J17025k99663j22788m8457P2381L0676J34763L1163
2809A097006k25743o1160K2858l3986K41368l5151K14202J12290J31685l07157
2799A156212j61218J11142J63648k79912k89940M8701J53264J42825k01694M11101
2789A254129o8132l05970L7955J12737m0180o7467j48653K43558k5272Q699j80652
2778H20752M1887L3744K23017j35449j34727L0901K20211J38477m0715m31478
2768G66620J81564J47015k4026J91137M4865J0709n8999M4371O3334j77239j40592
2757A048759K34023J41789J81706j3193l18213q4929l6041o4636N1892k70174
$$ y = [1335521, 1042103, 1051569, 1230662, 1137066, 902074, 1048617, 1258828, 1464471, 1382611, 1284223, 1361691, 1181906, 1298931, 999268, 876480, 828023, 900404, 931080, 1065843, 1097006, 871263, 810103, 832961, 798975, 1040343, 1005192, 1219394, 1331684, 1463369, 1156212, 994994, 1106136, 1269784, 989872, 699932, 748633, 901897, 1044722, 843028, 1254129, 1185997, 880027, 917982, 1030719, 990539, 923072, 774419, 1017977, 992705, 1001404, 820752, 862639, 896383, 1119400, 983951, 849224, 880125, 1100336, 1238813, 1198098, 766620, 948184, 1095199, 1071173, 1262310, 1307175, 1317884, 1258885, 1303256, 1366590, 1189351, 1048759, 1282782, 1424571, 1606277, 1593084, 1274871, 1189942, 1153901, 1089265, 1141157, 870983]
2747H70983k10812m3104N2013K06263q535k00888J45961k37949K25272J49407
2737I48611k01237n55505J50874m7106j84663K44980J28462O9418K70241J3715
2727H37790l57435j66870J56997r3427j49785J43500J61113Q795m0453L08412
2717H08637k20804l32229J14792K19105J02230K66890M3165l67015m5754l3738
2707E55279J31112k47027J83926L01493k20570j51841J93017Q4472l2922J98407
2697I95346L1396P392m6719l81713j74751L04485k54525k79553J84637K66632
2687F52627k48399Q5188L555k77139N9560L23678O4374j22706P0035l73051j44910
2676I2812L97540J81739l76861l34025K54139K24179k12674J7121j18780j30903
$$ y = [870983, 660171, 617067, 669080, 875343, 866808, 665920, 811881, 573932, 799204, 948611, 747374, 191869, 342743, 295637, 110974, 355954, 484416, 553834, 824075, 837790, 480355, 313485, 470482, 377055, 227270, 370770, 531883, 540678, 500225, 808637, 587833, 255604, 370396, 589501, 691731, 958621, 1001786, 634771, 589017, 555279, 686391, 439364, 623290, 924783, 704213, 552372, 745389, 829861, 796939, 995346, 1026742, 1034134, 987415, 605702, 430951, 735436, 480911, 201358, 385995, 652627, 404228, 489416, 492971, 215832, 275392, 599070, 663444, 540738, 610773, 237722, 92812, 490352, 672091, 295230, -38795, 215344, 439523, 226849, 243970, 125190, -5713]
2666e713K54889N05385k64988J48368m253j46723J18112K835k51969k50705J90790
2655B96028J62405j66367J29845K6711k40208L79567J00984j27628j68104J23248
2645E16481O323j47242j12583J2488K54235K50943l43902q500k82328J45213K0851
2634C11979K19293n7955k71826p7885m7831N10955J4663l11423J533K10646J68837
2623F70986J53910j93458k29866P6294J40271J7454J34247k05156m92297J75061
2613B47446P96330j71463m76923K83377l1251j54443L10211k21727k3029M11466
2603I69994L59518J23803J37851J70237K40097J45896J90840l56804m92560l10947
2593A177925J159j81976l56078k78528j81565K28846N69643k88868o47053L00390
$$ y = [-5713, 249176, 754561, 489573, 637941, 633688, 486965, 605077, 607912, 355943, 105238, 296028, 458433, 292066, 421911, 448622, 208414, 587981, 688965, 561337, 393233, 516481, 522804, 375562, 262979, 275467, 529702, 780645, 436743, 428243, 145915, 291128, 311979, 531272, 473317, 201491, 123606, 75775, 586730, 601393, 289970, 291503, 502149, 670986, 824896, 631438, 401572, 477866, 618137, 635591, 769838, 564682, 72385, 247446, 1043776, 872313, 395390, 678767, 647516, 493073, 803284, 581557, 558528, 969994, 1329512, 1453315, 1591166, 1761403, 2001500, 2147396, 2338236, 1981432, 1488872, 1177925, 1179084, 997108, 641030, 362502, 180937, 409783, 979426, 690558, 43505, 343895]
2583C43895L00520k8520J35424J7393m10044L2305J44506k7136m15869P2946K05573
2572C70993j08062J18940K53241m09861m2078L25039j39718k74541J77991Q6473
2562C58417k20352K67651J98722k67822k00821Q3188K15590J92200J54765l39271
2552D42267q6101N8383n7170l38098J88719K76281j52308J70681K13392m21829
2542B94217k56605M58158R4108k31190J8763p7890p6623L70097L24600n93816
2532C23819l52479L06583P16484j08268L64291j26525m53654K36283K61325k45538
2522I22321k38336j18922J340J59593J68007j33458l36970K07805K67322l1950
2512H66752q2705L36538m95865k5053P3448j0222k82102k0612K70021Q1388J17889
$$ y = [343895, 644415, 615895, 751319, 768712, 358668, 390973, 535479, 508343, 92474, 165420, 370993, 262931, 381871, 635112, 225251, 183173, 508212, 368494, 93953, 271944, 358417, 138065, 405716, 604438, 336616, 135795, 218983, 434573, 626773, 781538, 442267, 356166, 414549, 357379, 19281, 208000, 484281, 331973, 502654, 716046, 294217, 37612, 495770, 589878, 358688, 377451, 299561, 222938, 593035, 917635, 323819, -28660, 277923, 994407, 886139, 1250430, 1123905, 670251, 906534, 1167859, 922321, 683985, 565063, 566403, 725996, 894003, 760545, 423575, 631380, 898702, 866752, 784047, 1120585, 624720, 599667, 673115, 662893, 380791, 360179, 630200, 711588, 829477]
2501H29477k7545m46957K52354M06093K953k87465J71338M3303j64020J82342
2491I61873j04550l86653J54372O8294M07499k25320K0279o8964l3271n50J40137
2480I33146K6855M0489q1497k42560q6464K80779p1157l90159P82514O2297j87499
2469A066744r9133j13490L5517J60329J59637j95822k21180j15001M12731n3048
2459A037284j8945J10774J59797J9804J20824l7938j86763K42931n12561q0208
2449H54999L54294m2246j14249K48382K49666o338N5854J34162L8236K10359J69458
2438B152577r6563k30285K24601Q9002m3624J34744J39337j61208M98579q5662
2428B621498l29071J71427K46660R0249K13357p9131l73826O2898L73572k8708
$$ y = [829477, 801932, 354975, 607329, 1013422, 1016375, 728910, 900248, 943551, 779531, 961873, 857323, 470670, 625042, 693336, 1100835, 875515, 895794, 826830, 793559, 793009, 933146, 960001, 1000490, 918993, 676433, 589969, 870748, 799591, 409432, 1191946, 1254243, 1066744, 967611, 854121, 889638, 1049967, 1209604, 1013782, 792602, 677601, 1090332, 1037284, 1018339, 1129113, 1288910, 1308714, 1429538, 1391600, 1204837, 1447768, 935207, 854999, 1209293, 1167047, 1052798, 1301180, 1550846, 1544508, 1600362, 1734524, 1772760, 1983119, 2152577, 2056014, 1825729, 2050330, 2139332, 2095708, 2230452, 2369789, 2208581, 2707160, 2621498, 2292427, 2463854, 2710514, 2800763, 3014120, 2934989, 2561163, 2624061, 2997633, 2968925]
2418B968925j47071N7456O4688j88448l59496J21064q2666k78783M90636L52242
2408B998547l40331K24653K20667j38053L32855L34208p881j9018o43K36048J22415
2397C963467r7825j7124Q8964J6161M04478K25464R6390R1987J93675J18776J09128
2386E193541J92937J91367M88208K54532L44815J61584J35843j8728L99253M64354
2376G807706n0329n5511K09899J49058K20001J84161Q7224j69775N1884N85072
2366I019390O40202K39553M79184J64420Q32086J126834O57857N14678J005133
2357A4679337Q03151P74928R81886J467167J482561K003303J921792K604735L009721
2348B9728581L756929L990565L719639K870050K374383K650384N141645P401257
$$ y = [2968925, 2821854, 2879310, 2943998, 2755550, 2396054, 2517118, 2434452, 2155669, 2646305, 2998547, 2658216, 2882869, 3103536, 2965483, 3298338, 3632546, 3624665, 3605647, 3605004, 3841052, 3963467, 3865642, 3848518, 3937482, 3953643, 4358121, 4583585, 4679975, 4771962, 4965637, 5084413, 5193541, 5386478, 5577845, 6066053, 6320585, 6665400, 6826984, 6962827, 6944099, 7343352, 7807706, 7757377, 7701866, 7911765, 8060823, 8280824, 8464985, 8552209, 8382434, 8434318, 9019390, 9659592, 9899145, 10378329, 10542749, 11374835, 12501669, 13159526, 13674204, 14679337, 15482488, 16257416, 17239302, 18706469, 20189030, 22192333, 24114125, 26718860, 29728581, 33485510, 37476075, 41195714, 44065764, 46440147, 49090531, 54232176, 61633433]
2340F1633433R192655J2465425J6572086K2337007L0843026M2161965N0719163
2333B45924760N8810493N7417271L0368188k4994884o7392978p7192508n8260819
2326A64679523l7784529k6674193k0077101j5245698r564921o612256m459602
2319D4261223l451309k270618j883844j694448k598031l557964l391633l022318
2311B2391058k446512j674598j429565j141510j209618q10983p25361p67247l46901
2302A1838763n97416n86826r9274k01152j25518p89504m94066q8147l03765n94426
2292G958669m47409m74624n28488k96042O0443m12451J7701l58522q06521o2132
2282D650624K4583j36746J0927O132l50233J83578N2380n10551j26590K87333
$$ y = [61633433, 70826088, 83291513, 99863599, 122200606, 153043632, 195205597, 245924760, 304735253, 362152524, 392520712, 367525828, 300132850, 222940342, 164679523, 126894994, 100220801, 80143700, 64898002, 55333081, 48720825, 44261223, 40809914, 38539296, 36655452, 34961004, 32362973, 28805009, 25413376, 22391058, 19944546, 18269948, 16840383, 15698873, 14489255, 13678272, 12952911, 12185664, 11838763, 11241347, 10654521, 10555247, 10354095, 10228577, 9439073, 8945007, 8856860, 8553095, 7958669, 7511260, 7036636, 6508148, 6212106, 6272549, 5860098, 5877799, 5519277, 4712756, 4650624, 4675207, 4538461, 4549388, 4555520, 4205287, 4388865, 4441245, 3930694, 3804104, 4091437]
2272D091437L0686k13636k12332K07926J0525J18324j62009l57650k89927k62961
2262B960383J05241j46031P416q4744J01166j60277j36527j93954l12477Q0545
2252B220741o9368q6673r4371r4301p003k10227J15013J64970l45359k93444j61531
2241A138447j7250L64722K03526o37237j37711J70943m5387n2930J09806l9633
2231A057296o812L80272j61738j51394k3513O616n8214K34490j59394O9877j2034
2220A175452K21726n073j29141Q1749k50530k13139L92699K33188m74771j29211
2210I02949J72678M8479K5585K35461m16755l43469K00557P3581m17299K04520
2200F86287Q3291j3531n3942L21180k14449q8266J14450n9263j41753N3671k63285
$$ y = [4091437, 4122123, 3908487, 3696155, 3904081, 3914606, 4032930, 3870921, 3513271, 3223344, 2960383, 3065624, 2919593, 2927009, 2842265, 2943431, 2783154, 2646627, 2452673, 2140196, 2220741, 2151373, 2064700, 1970329, 1876028, 1869025, 1658798, 1773811, 1938781, 1593422, 1299978, 1138447, 1121197, 1485919, 1689445, 1052208, 914497, 1085440, 1040053, 987123, 1096929, 1057296, 1050484, 1430756, 1269018, 1117624, 1094111, 1100727, 1042513, 1277003, 1117609, 1187486, 1175452, 1397178, 1392105, 1262964, 1344713, 1094183, 881044, 1273743, 1506931, 1032160, 902949, 1075627, 1124106, 1149691, 1385152, 968397, 624928, 825485, 899066, 481767, 686287, 769578, 756047, 702105, 1023285, 808836, 720570, 835020, 775757, 634004, 687675, 424390]
2189D24390n0918L14808m5561k28093j64491J03831j75605J92477K18564n6371
2179E33031l08786L93971j05379l47732K12993J13079q0104l06094j49390K31192
2169A86781j49627j78330M72490J69778o4627J04716m2455k70023N4120k36614
2159D6209k80288O04522L3538K1322O0984j1650m01603J7941K72456l03531l49514
2148b89614K17689O4454J23315k291K74333k03265j16272M77204l01863k01325
2138D2365J40424L6880k94322m4935m7013J28667J86719J97616n3112p0706j09989
2127A12594q7548j89677K70433K62626k86478R1239r0619K31285j58635J25501
2117B80721j47154j03831K38653k78362j19881K61242J7553J1331K6459m1454
$$ y = [424390, 373472, 688280, 642719, 414626, 250135, 353966, 178361, 370838, 589402, 533031, 224245, 618216, 512837, 165105, 378098, 491177, 411073, 104979, -44411, 186781, 37154, -141176, 331314, 501092, 436465, 541181, 498726, 228703, 282823, 46209, -234079, 370443, 403981, 425303, 486287, 474637, 73034, 90975, 363431, 59900, -289614, -71925, -7471, 115844, 113553, 387886, 184621, 68349, 545553, 243690, 42365, 182789, 219669, -74653, -119588, -166601, -37934, 148785, 346401, 293289, 222583, 112594, 25046, -164631, 105802, 368428, 81950, 173189, 82570, 313855, 155220, 280721, 133567, 29736, 268389, -9973, -129854, 131388, 148941, 160272, 186731, 145277]
2107A45277k71955R4935J50737r1468M8483Q0992J13739k17354P5341k27212j55714
2096b54199l22725K08085J03577j5050J75333k6111j57020J21329N73634n012
2086D01841n37822J09514o5829J06496K75576o5618m26323J76302J83175K3893
2076A81205o4964n2207R801J99294K45208k20804n8050K68275k05412P9440M05779
2065G87565M59256P6150J83898L37700l9864k7128k76606l16495l13261k10160
2055F61055j36511k18330j56379J48714L471m7271n220j03915l923K84086j96782
2044B28995k03442J86196J34011j52846l03186o8480k42305J95753K25869n0067
2034d9502O7688r4659K30501J61227j91616j65066j83462l50445R9778J99404
$$ y = [145277, -126678, -31743, 118994, 27526, 76009, 157001, 270740, 53386, 128727, -98485, -254199, -576924, -368839, -265262, -280312, -104979, -131090, -288110, -166781, 406853, 401841, -135981, -26467, -92296, 14200, 289776, 224158, -202165, -25863, 157312, 181205, 116241, 64034, 73835, 273129, 518337, 297533, 239483, 507758, 302346, 381786, 787565, 1246821, 1322971, 1506869, 1844569, 1804705, 1777577, 1500971, 1184476, 871215, 661055, 524544, 306214, 149835, 298549, 302020, 254749, 249529, 145614, 141691, 425777, 228995, 25553, 211749, 345760, 192914, -110272, -178752, -421057, -225304, 565, -49502, 18186, -76473, 154028, 315255, 123639, -41427, -224889, -575334, -475556, -276152]
2024b76152J5376K4070k4366j00194J70883J47755k30648l7529L86648J75263
2014B51106j64597j37655P7617p1790j80865Q3654r5041K46424r1813j3202j8989
2003a15151j41315j94808j6343J61592p6459r7968K6500O45642j53362M2775p3553
1992G550j64241k41512O1108L07653j55731J19699K00455k01904j2082K02185
1982A23180j53115o0518N7550P7571k77038q7943J36250J393K17808o3956j26312
1971a55130r4603J83783J16182J363Q6516o2111m59267K25702n6415j54941J5269
1960c53652K25227J09119k31323K44200K7931M6018j42197j54465K01606J93412
1950A65876j30146l82642L8780L42352J3996j56396j56207M5353P1539j7906o727
$$ y = [-276152, -260776, -236706, -261072, -361266, -190383, -42628, -273276, -310805, 75843, 251106, 86509, -51146, 26471, -45319, -226184, -142530, -237571, 8853, -82960, -96162, -115151, -256466, -451274, -467617, -306025, -382484, -480452, -453952, 191690, 38328, 81103, 7550, -156691, -398203, -337095, -29442, -185173, -65474, 134981, -66923, -79005, 123180, -29935, -90453, -32903, 44668, -232370, -320313, -184063, -182670, 35138, -28818, -155130, -249733, -65950, 50232, 51595, 138111, 76000, -383267, -157565, -213980, -368921, -353652, -128425, -19306, -250629, -6429, 21502, 67520, -74677, -229142, -27536, 165876, 35730, -346912, -308132, 34220, 48216, -108180, -264387, -219034, -147495, -165401, -172128]
1939a72128O5570J02146k5588O8425k00461N714j42644J47507k1085K6185m67
1928a46826j98517J6919j32056J57740m8625L9208J9687J93419J10629k70487
1918b58909K81325Q1721p2904p7175N4911k75060m7509K70631r5859Q5883q6285
1907a39230L3555l36269J62680J50275Q562J7515r5587J69585J87573k35012o3009
1896a39362J40104K40626j2732m16668k02739L71801m27972K25690K48212j52565
1886a25605q5127M3758L6943l1272N9248l15084L9168L07843J35641j75027k00188
1875c09702K6668J90887J21207m3834j1525J75397O8918R9205k57296k10430n9065
1864b09570k3293L59110p8650J05894k39168N1630R0342l2048l07304L3596K77646
$$ y = [-172128, -106558, -4412, -30000, 38425, -162036, -156322, -298966, -151459, -172544, -146359, -146826, -345343, -328424, -460480, -302740, -351365, -312157, -292470, -99051, 11578, -258909, 22416, 104137, 31233, -45942, 8969, -266091, -313600, -42969, -138828, -52945, -139230, -105675, -441944, -279264, -128989, -120427, -102912, -198499, -28914, 158659, -76353, -139362, 742, 241368, 228636, -188032, -390771, -18970, -446942, -221252, 26960, -125605, -210732, -166974, -130031, -161303, -102055, -417139, -377971, -70128, 65513, -109514, -309702, -283034, -92147, 29060, -14774, -26299, 149098, 218016, 317221, 59925, -150505, -209570, -232863, 126247, 47597, 153491, -85677, -34047, 56295, 24247, -283057, -249461, 28185]
1853B8185p8535k19701j47366q0102Q0517J63241K37235J49377k91417j14707
1843b73273n5331L04749l22803k19945K10995k6225j00128J07739J87047j86034
1833c73209K21497J84915l65615M7831q8497k53434L31863K45373k08748k8688
1823b86712K72955l6110l80604K04745o3083m2367K67855J53506j96021j72225
1813b78061J25108j35006k6595K66284j38508l02152J85723K55616o2842L7044
1803g3389P8454l90775n7181L69306O9409J69213k50568P5709j46459K86361n8696
1792G1384J7494k7977l4531k12029j25505J20926K44465k11477O177J11207l25903
1781c65769J4318J31663K01538j82855J98285J19546j60639Q8085R9225k90206
$$ y = [28185, -50350, -270051, -417417, -497519, -417002, -253761, -16526, 132851, -158566, -273273, -328604, -23855, -346658, -566603, -355608, -381833, -481961, -374222, -187175, -373209, -151712, 33203, -332412, -284581, -373078, -626512, -294649, -49276, -258024, -286712, -13757, -49867, -430471, -225726, -288809, -331176, -63321, 90185, -105836, -278061, -152953, -287959, -314554, -48270, -186778, -488930, -303207, -47591, -110433, -73389, 5065, -385710, -442891, -73585, -4176, 165037, -85531, -9822, -156281, 130080, 71384, 88878, 60901, 26370, -185659, -311164, -190238, 54227, -157250, -151073, -39866, -365769, -351451, -219788, -18250, -201105, -2820, 116726, -43913, 44172, 143397, -146809]
1771a46809k38156K08288l6176k85784O8713K72200K35081k98409L13988k28319
1761a35383l90095Q9703k7042K82911J84290n864j7513J64777l083k71664j92725
1750c21688K36786k03938p7753J94641n4307J77754N6572j92016l71682M60360
1740i5271j0228m8414J92994K6121m7759L5841j68112J97058l5156k32266l2250
1729b17442L7155J22944j97053Q0763J02380N600J59230o1016m38064j36857L61255
1718a81105J77181j86347M0366P8371Q5646p4468J17505K41315j83997j6255l50135
1707b51923j64429K85169J57407k30367k50582R5933k3063L25696J44223m2062
1697D6002k42971N747K40257k01261k74209R4489j7680n0191L54613N8999l01527
$$ y = [-146809, -384965, -176677, -212853, -498637, -429924, -157724, 77357, -221052, 92936, -135383, -525478, -435775, -462817, -179906, 4384, -1480, -18993, 145784, 142701, -128963, -321688, -84902, -288840, -366593, -171952, -226259, -48505, 8067, -183949, -555631, -95271, -105499, -153913, 39081, 65202, 17443, 53284, -114828, 82230, 47074, -185192, -217442, -180287, -57343, -254396, -173633, -71253, -65653, 93577, 32561, -405503, -542360, -181105, -3924, -190271, -149905, -71534, 14112, -60356, 57149, 298464, 114467, 98212, -251923, -416352, -131183, 26224, -204143, -454725, -358792, -381855, -56159, 88064, 46002, -196969, -191222, 49035, -152226, -426435, -331946, -349626, -399817, -45204, 13795, -287732]
1686b87732K70830K8630j99005J88286M9999j71961r4709M62J2019p4372J39371
1675a38182K39834K0352n703K94478j27729l52866K85416n1635r0907m3341k0881
1664H836j38357J85200K46096q401l55873j9644J48567j79511Q5371j73428k48812
1653d49956L33567K75863j56289J00564k20100k1629J22937k09089p6757J49862
1643a51027K92492m798j86681l86422k4098Q1731K14397K32431R0324n4873o2446
1632D1030O411k80102J9041M7115k9661j19049K59029j71326k64495L73294K2095
1621i6618l1956k14163p9322j27276L00218K77823k95043J44074p3466j13801
1611c09530J47291N675o1268Q3964J01821M6995j810l4819Q9685J02693o5374
$$ y = [-287732, -16902, 11728, -187277, 1009, 51008, -120953, -215662, -215200, -203181, -277553, -138182, 101652, 122004, 116301, 410779, 283050, -69816, 215600, 163965, 73058, 29717, 8836, -129521, 55679, 301775, 293374, -62499, -82143, 66424, -113087, -27716, -201144, -449956, -116389, 159474, 3185, 103749, -116351, -137980, -15043, -224132, -300889, -151027, 141465, 136667, -50014, -436436, -460534, -378803, -164406, 68025, 158349, 103476, 41030, 47441, -232661, -213620, -166505, -196166, -315215, -56186, -227512, -492007, -118713, -96618, -128574, -342737, -422059, -549335, -249117, 28706, -266337, -122263, -195729, -309530, -162239, -156564, -217832, -133868, -32047, 14948, 13138, -21681, 68004, 170697, 105323]
1600A05323l38479k2388K61625n046J18461P7712j79768l69267K9229K05916J51036
1589C4354m2815k43783R4310K791J74001J67961j14998l61173K54502J83520k39264
1578i0594M1027j4888n7047J26775p1636q7530L0947j5636n0124m5607M41595
1567B07282q4158k54021K9779k6252J3890r1330L1757Q971j57519J11829o1881
1556b71653J44184K67002j28312M6835N8879K01974j57452k93569J97986R9314
1546A65188o8871l45301K05331K06871j42298j66058n0988k5175L1461p6418q7786
1535c54044n362r9949R8362K50704j5819k88935n3128K08396j56162n0677J81251
1524b85363j53604o8389L30797M04181k8776j17421k05470L4889k7014j37898
$$ y = [105323, -233156, -255544, 6081, 1035, 119496, 197208, 17440, -351827, -322598, -116682, 34354, -8461, -252244, -157934, -155143, 18858, 186819, 71821, -289352, -34850, 148670, -90594, -49567, -64455, -121502, 5273, -66363, -153893, -122946, -138582, -188706, -234313, 207282, 123124, -130897, -101118, -127370, -113480, -204810, -173053, -164082, -321601, -209772, -271653, -127469, 139533, 11221, 58056, 116935, 318909, 161457, -132112, 65874, 165188, 96317, -248984, -43653, 163218, 20920, -145138, -196126, -221301, -189840, -266258, -354044, -359406, -459355, -360993, -110289, -126108, -415043, -468171, -259775, -415937, -466614, -285363, -438967, -507356, -176559, 227622, 198846, 81425, -124045, -89156, -116170, -254068]
1514b54068K81335K03413r0732Q2961j54636l03703J13344j58312J26215q9281
1504b43464j02387J32948M23450k5481j28794J25954k76983o9732q5326K2600
1494b27215j34588K01865j92K68636k7351k69630j17566j09936K14354j3369J30994
1483h3998q9135J6917p8112K51858J05056k07772k368J949j55202N0207J99218
1472H618j28826j04416M23300l4668j30875N5202k42709k00453p8038L36482n9268
1461a55651k96328O9058L30544j02767R3932K85379n2696k70M179k38243r080
1450g1943n9096R2274j72188r2909K53557L2844R6991q9834j56563J35691K68797
1439B37621k48990l5481N5737K41278k32025j72027J64410q7701K15857L2368
$$ y = [-254068, 27267, 230680, 139948, 222909, 68273, -235430, -122086, -280398, -154183, -243464, -345851, -212903, 210547, 185066, 56272, 182226, -94757, -164489, -249815, -227215, -361803, -159938, -160130, 108506, 81155, -188475, -306041, -415977, -201623, -214992, -83998, -173133, -156216, -234328, 17530, 122586, -85186, -87554, -85605, -240807, -190600, 8618, -120208, -224624, 198676, 164008, 33133, 88335, -154374, -354827, -432865, -96383, -155651, -451979, -382921, -52377, -155144, -61212, 224167, 171471, 171201, 175380, -62863, -71943, -131039, -38765, -210953, -303862, -50305, -17461, 79530, -10304, -166867, -31176, 237621, -11369, -46850, 8887, 250165, 18140, -153887, 10523, -77178, 138679, 171047]
1429A71047o928l18861J86720j23628k6336o9659j825j69479L51411K4621J35433
1418A52516n1206l60152J76813l8343N5556O7362p4087L1214q4222M0097J35184
1407E0732l34702j24643R7856M61868L78170k73544q8879R6415j7504k30152J89862
1396B05479J14192m7394M4129l69474l82486K96810P0912j82529N8300p0752m3967
1385c06780J39153L37017j85709j33399m6987J86222Q2314J81078m9144N9863
1375B63628j37894m0127M0772J6699L0751q2754k47673L70968L8478k14867l87128
1364c49147L67859m1468l49939L18986j853j06672o445N6306N0439N2532J20033
1353A10631j03165j01999L58700j03168j90544M1898j00658j3479K03065P1184
$$ y = [171047, 164119, -154742, 31978, -91650, -117986, -187645, -189470, -358949, -7538, 17083, 152516, 101310, -258842, -82029, -120372, -64816, 2546, -71541, -40327, -124549, -84452, 50732, -283970, -408613, -310757, 151111, 529281, 255737, 166858, 263273, 245769, 15617, 205479, 319671, 272277, 316406, -53068, -435554, -138744, -67832, -250361, -192061, -262813, -306780, -167627, 169390, -16319, -149718, -196705, -10483, 71831, 252909, 203765, 263628, 125734, 85607, 126379, 143078, 173829, 91075, -156598, 214370, 252848, 37981, -349147, 18712, -22756, -372695, -53709, -55562, -162234, -168679, -112373, -61934, -9402, 110631, 7466, -94533, 264167, 160999, -29545, 12353, -88305, -101784, 101281, 172465]
1343A72465k95380k37878J52228j04678j25645M2349R2010j601j23075K13003
1333b16202j3734J8453J33914J69136l19765j03497K15217k00885K76191J61378
1323A20206k92414j25132J80382Q6837K8039p886k84950n2032M17674P9421l64625
1312b14480J00240k21615m9741J99191k8889k44462J87647L37118P3846K28k6476
1301A12607j5528k71066R8453j84505Q3441J90108J03290Q4267j91254n197j37239
1290a32623m23219L00881M3694k466l7282Q3832O5970L6784J03219K6449r2387
1279b7148j96772R8339K37796j31513k32090k8853J36715K04874j53275j10472
1269b02399M0024j83038j021K35358J20595j84584o9571K2827r161m64773K43898
$$ y = [172465, -122915, -360793, -208565, -313243, -438888, -396539, -304529, -306130, -429205, -216202, -229936, -211483, -77569, 91567, -228198, -331695, -116478, -317363, -41172, 120206, -172208, -297340, -116958, -30121, -2082, -9968, -294918, -346950, 70724, 150145, -214480, -114240, -335855, -385596, -186405, -215294, -459756, -272109, 65009, 138855, 139083, 112607, 97079, -173987, -75534, -260039, -176598, 13510, 116800, 201067, 9813, 4616, -132623, -555842, -254961, -211267, -213733, -251015, -167183, -101213, -64429, 38790, 65239, -27148, -223920, -125581, 112215, -19298, -251388, -280241, -143526, 61348, -91927, -202399, -162375, -345413, -346434, -111076, 9519, -175065, -244636, -221809, -230970, -695743, -451845]
1258d51845P9487J24408K5822l519J30426k06878M39046K14804k97755q6893R7622
1247F4725j73729K8689K54637o4862j70287K21818L86990k34591m28748l23429
1237d38787n5595J22433K38713p2639k24129J16487L41499M36298l56706j64422
1227e6848r3886R7584k7239r7982l1598L02679J0574N321J94601k80618k66707
1216b44119L51013j8727k25677J05537r9023j19496J23700O4334L8620n1247p5066
1205a50151N2593K17256m5468j94363J94127J577j89031j10281P5916J27805l15455
1194c35475m9562L69712J33072k9070J25526J45811l50202j47570R1705J04279
1184E8226k07324J40124J00902k32163K61109K18387k30789O770j18400l05424
$$ y = [-451845, -372358, -247950, -222128, -225647, -95221, -302099, 136947, 351751, 53996, -32897, 64725, -109004, -80315, 174322, 109460, -60827, 160991, 547981, 313390, -115358, -438787, -494382, -371949, -133236, -205875, -430004, -313517, 27982, 464280, 107574, -56848, -150734, -53150, -80389, -178371, -209969, 92710, 103284, 108605, 303206, 22588, -244119, 106894, 88167, -137510, -31973, -130996, -250492, -126792, -62458, -23838, -75085, -150151, -97558, 119698, 74230, -120133, 73994, 75571, -113460, -223741, -147825, -20020, -335475, -385037, -15325, 117747, 88677, 214203, 360014, 9812, -137758, -46053, 58226, -149098, -8974, 91928, -140235, 120874, 339261, 108472, 115242, -3158, -308582]
1174c08582M35392J78093j49530l44004L4563k6078j04667M16084p5155m45048
1164c88932O5999L23281p8208q1506j68104J57322N5576K43414j44057k42828
1154b58043M6096K01443J35693j73171j96882K9146J13519q784J21119k40668
1144b30532j21940N0354K08482P9774K16041k90630l10235Q8462J25916R3740
1134i0568k44714K76114m0089r647l2859J33178j54461J90781K79942j77851n1614
1123G8212k53070J33425j94417K40119j51527j09456J06905m5458n653O9098L9007
1112i2815M9045m4442m8936j74610J40122K43830q1138p6956O4506k3974j24668
1101a70036n5501n9737j9870Q2619j18809J08696J85774J91724K5741k32200k11702
$$ y = [-308582, 126810, 304903, 155373, -188631, -154068, -180146, -284813, 131271, 56116, -388932, -322933, 348, -77860, -159366, -327470, -170148, -114572, 128842, -15215, -258043, -211947, -10504, 125189, -47982, -244864, -215718, -102199, -110983, 10136, -230532, -352472, -302118, -93636, -13862, 202179, -88451, -398686, -310224, -184308, -90568, -335282, -59168, -99257, -108904, -141763, -8585, -163046, 27735, 307677, 129826, 78212, -174858, -41433, -235850, 4269, -147258, -256714, -149809, -195267, -200920, -131822, -92815, -43770, -88212, -137148, -311758, -171636, 72194, -8944, -85900, -21394, -45368, -170036, -225537, -285274, -305144, -222525, -341334, -232638, -46864, 144860, 170601, -61599, -273301]
1090b73301L7342J37965j89153L0603R0537n9206l0087j0229j8764j4339K9525
1079b69107K02963J82891l82739p8892L81211K01646j02119n3512j63615j05181
1069a86454K66206O8889O9106j29744O9984j41019J30502R9474q0823l09899j49049
1058b92827J77386K25891k6049j65692o2411p3230j2238J42556l73245L21706
1048a38153P6452l8543k5723l37355J31875M4312L20395r3984j02411j43421k7779
1037c34335J90017M4194p672k62313m0799K70509M09232k0341k51935j22008K65832
1026A40381l1898j20393k31573P0480m5662M7288K81277l34955j65320J13483
1016b76892K21265K21008j03199j87272o4475P3561M08368k97487l90327K17539
$$ y = [-273301, -235959, -97994, -287147, -256544, -166007, -225213, -255300, -265529, -284293, -298632, -269107, -66144, 116747, -265992, -344884, 36327, 237973, 135854, 82342, -81273, -186454, 79752, 148641, 217747, 88003, 157987, 16968, 147470, 246944, 166121, -143778, -292827, -115441, 110450, 84401, -81291, -143702, -216932, -229170, -86614, -459859, -138153, -61701, -100244, -125967, -463322, -331447, -287135, 33260, -60724, -163135, -306556, -334335, -144318, -100124, -107796, -370109, -410908, -140399, 268833, 248492, -3443, -125451, 140381, 108483, -11910, -243483, -173003, -218665, -171377, 109900, -225055, -390375, -276892, -55627, 165381, 62182, -125090, -189565, -116004, 292364, -5123, -395450, -177911]
1006a77911K44729J03446M3439k37555K19073o4414k27902L81629k2190k35911
996B6433P9766K12008r8419l6485k24160j27252N5233K23991P217l62910M5114
985a99464k1547J94489m1356k05726L23126n2279K31888m6418k47462k5779J73492
974H2964J11416k40868Q947k9893m8082Q4031K02897k22346j97903j84427L45500
963h7764J93743l4048j60972O6836J4872k987R5324k03966k40763J80095M0906
952a38724O0282p5747j9525J27485J80212k4996k31233k48636J27453J46079J95155
941I7805P013l44645J1744q9786J58739r4146j57611J15757l6666K54603N8307
930a8886r2129j19139Q0665R269J07670l7388k3057j68653J19055l5235R3437
$$ y = [-177911, 66818, 170264, 213703, -23852, 195221, 130807, -97095, 284534, 262344, 26433, 106199, 318207, 219788, 183303, -40857, -168109, -112876, 111115, 118332, -244578, -199464, -221011, -26522, -67878, -273604, 49522, -2757, 229131, 182713, -64749, -90528, 82964, 194380, -46488, -37541, -67434, -115516, -31485, 171412, -50934, -248837, -433264, -87764, 105979, 71931, -89041, -22205, -7333, -10320, 85004, -118962, -359725, -179630, -138724, -78442, -154189, -173714, -46229, 133983, 108987, -122246, -370882, -243429, -97350, 97805, 104818, -239827, -228083, -317869, -159130, -253276, -410887, -295130, -331796, -77193, -18886, -111015, -230154, -149489, -140220, -32550, -69938, -92995, -261648, -142593, -177828, -84391]
919h4391j6912k1874K43225j8995j64873k5300q8261k0955O2075r3390L8225J57739
907c3687K627k79391M88120J31397k48780k60229K88826k26505r8935P5117j74805
896c36245J53674L07404j7262o2789J8341n7242J26841L7792k53200J74916j73989
885h1759J08360l0727J44068j69194k0812R5485R3501j21879j17998J8606J33948
874E1599J60014r5474l79942r6322R9623J42122j00883k13638j48709K89710L02847
863A0947j02431L6259k89947l1909Q0281M56043J10658k82185m8907n1486j7535
852a30212J176Q7679j97255j41949M19940K37k07931j99658m3663L28739M47290
841C64393j39649m52091j42983Q2714o2674J88614J6112k54449j40290M04184
$$ y = [-84391, -101303, -123177, 120048, 101053, -63820, -89120, -177381, -198336, -136261, -229651, -191426, -33687, -31060, -310451, 177669, 309066, 60286, -199943, 88883, -137622, -236557, -161440, -336245, -182571, 124833, 107571, 44782, 63123, 5881, 132722, 170514, -82686, 92230, -81759, 26601, -4126, 139942, -29252, -50064, 45421, 138922, 17043, -100955, -82349, 51599, 211613, 116139, -263803, -360125, -260502, -118380, -219263, -432901, -581610, -291900, 10947, -91484, -55225, -345172, -377081, -296800, 159243, 269901, -12284, -61191, -112677, -130212, -129036, -41357, -238612, -380561, 39379, 39616, -168315, -367973, -411636, -82897, 364393, 224744, -227347, -370330, -287616, -350290, -161676, -145564, -400013, -540303, -136119]
831a36119J62815k64974Q5576J58694j99715J91926k71089k11918L29444K46921
821I1561N6681k89826m8208M6916J44783k4648k87870j47229K89101J27557n7871
810i9053J97170n4293l65519k7545M06326M8476l0312j19804j49381J56647Q3753
799D6465k41858l18173q539L90811J56970P135J93529m1172k04427J72070m5813
788A06998p1926p8226J49648k85755k43926K70001K6128j79241L75834K02039
778B71574m84212j95233L67275K6203P9289J67256l45616j94215R8079L28622
768A19022j53338j94217l4055k15768L66908L41010n25359j83031M64873r8571
758a12526j93382M84071l00824l0041L52674J82273l31927j70775L58481m14418
$$ y = [-136119, 26696, -238278, -152702, 5992, -193723, -1797, -272886, -484804, -155360, 91561, 148242, -141584, -189792, -142876, 1907, -22741, -310611, -457840, -168739, -41182, -99053, 98117, 43824, -321695, -349240, 57086, 105562, 75250, -44554, -193935, -37288, 46465, -195393, -513566, -522105, -131294, 25676, 32811, 226340, 185168, -19259, 152811, 106998, 35072, -43154, 106494, -179261, -423187, -153186, -127058, -306299, 69535, 271574, -212638, -407871, -40596, -14393, 64896, 232152, -113464, -307679, -209600, 119022, -34316, -228533, -262588, -478356, -111448, 229562, -295797, -478828, -13955, -112526, -305908, 178163, -122661, -152702, 199972, 382245, 50318, -120457, 238024, -176394]
748a76394M4490K06199j6074l51648j02428K39825J7977J01875k94845r629R6581
737b44071J7238n9799o3743n1062L97735p0016k2839j45231j00139K66586L23711
726B48370k02620m48330P3699L71484J03328K0839r2695n28670J26268O72104
716C43777k28708m36420J04256j76609K66651J97811O2606j53446j43678L85923
706B22163K15825k9831k85336j11321l247L98679l8878l05165j06326M5889j9200
695a6748J29089L5946m31261k40196P8509N04904N7496O4609K0582n0681P1636
684B23885L4738k28903m7653L2453J52322j2482Q3057j11793k74974K89267J58920
673B98837n32543k68087J40067L46629P9631J9540k69359k53132J18277L96483
$$ y = [-176394, -131904, 74295, 58221, -293427, -395855, -156030, -138053, -36178, -331023, -340652, -244071, -226833, -286632, -350375, -401437, -3702, -73718, -96557, -241788, -341927, -75341, 248370, 45750, -402580, -328881, 42603, 145931, 166770, 74075, -454595, -328327, 343777, 115069, -321351, -217095, -393704, -127053, 70758, 133364, -20082, -163760, 222163, 437988, 408157, 122821, 11500, 8253, 406932, 368054, 62889, -43437, 2452, -16748, 112341, 148287, -282974, -523170, -444661, 60243, 117739, 182348, 202930, 152249, 223885, 258623, 29720, -17933, 14520, 166842, 154360, 237417, 125624, -149350, 139917, 298837, -233706, -501793, -361726, -15097, 64534, 84074, -185285, -438417, -320140, 76343]
663G6343k08552k91487J48562n3139J16888J03445J45455l14276k6398M21685
653A18526J90110M4477p0253m42519l19139L43023K26772n11989P8637L25831
643a6524J00278K7962R9820l29797N6231L13379j57346q4235k57610k8787L30680
632E4051R0976j36262k81603m0754R2181K6702J22739j75765q4420K42980L25370
621B36195N8586l63552j90676J69837O12J66905l6718j55818J09253R5250m938
610H4936k84726J7992j45782l00848J91642K43258j38190j2055K13899k2213J94040
599D1953j93485l09042J1649M41946L05644m07202k48822K15180K52911j9966
589I0766p4100j83968j50924L66367K93431l32102l06496j99837L26184K42358
$$ y = [76343, -132209, -423696, -275134, -328273, -211385, -107940, 37515, -276761, -303159, 118526, 308636, 353113, 282860, -159659, -478798, -135775, 90997, -420992, -342355, -16524, 83754, 111716, 211536, -118261, -62030, 251349, 94003, 9768, -247842, -276629, 54051, 145027, 8765, -272838, -313592, -221411, -194709, -71970, -247735, -332155, -89175, 236195, 294781, -68771, -259447, -89610, -88998, 77907, 41189, -114629, -5376, 89874, 84936, -199790, -181798, -327580, -628428, -436786, -193528, -331718, -343773, -129874, -152087, 41953, -151532, -460574, -448925, -6979, 298665, -108537, -357359, -142179, 110732, 90766, 16666, -167302, -318226, 48141, 341572, 9470, -297026, -496863, -170679, 71679]
579G1679J35494j19873p8283j69703q8006l36006J16798J32986l51490N25973
569a60431M21925n5542m88904J98189J32085l2688J24829J04363p23128O1144
559d18158K63943J0878j52956R6864L85758J32924j75204p9124j40125j05897
549a81097K97164q2656j44424j13664O9094j72503Q8325J50392o3668J75421O3450
538H5834r215J51803j29594k913R1422P3122J04867n05539o7260M65127l48371
527i0717J86048M2596k59254K20898M15189l76214k45763N1694L4553j65978k037
516a88985J86661o8881k00948K18723L08319q7103m9702m86017n6927K53441K79447
505A08028l0845j51165j81615L907K90912l51131k32938o4196K80914L57498n1171
$$ y = [71679, 207173, 87300, 9017, -160686, -248692, -584698, -467900, -334914, -686404, -160431, 261494, 205952, -282952, -84763, 47322, 14634, 139463, 243826, -479302, -418158, -154215, -143337, -296293, -199429, 186329, 319253, 144049, 64925, -75200, -181097, 116067, 33411, -111013, -224677, -155583, -328086, -239761, -89369, -153037, 22384, 85834, 76619, 228422, 98828, 95915, 187337, 260459, 365326, -140213, -207473, 257654, -90717, 95331, 137927, -121327, 99571, 514760, 138546, -107217, -55523, -20970, -186948, -188985, -2324, -71205, -272153, -53430, 254889, 167786, 118084, -367933, -424860, -171419, 108028, 77183, -73982, -255597, -251690, 39222, -311909, -544847, -609043, -328129, 29369, -21802]
494b1802N3864J8930k58917J75928J99491j54164J49387K2528r483m0931j40227
483e396j51761p8666J82119L14874m1639j65213j68109K01035P230o0369k77366
472b43261j59813O5365J8288O2157k68604j9715K95837j34901Q5236P1588J1779
461b16044P8000j05492R040J5731J17212k31501J22845K75597J27688m35790N3656
450a89058K02755J51366k3442j89450k07414O0767J88200L6696k51664J36080
440h5164K1118J26495K46447l53732j98302k87830L10829J47655J08259l03410
430b67635N8122N7533j28735k5295k5041J22572P4084R8408J07860j91184n0703
419a70014l52115j92911N59021L4279j84916k9324J72509j32080M9956k5002p5144
$$ y = [-21802, 32062, 50992, -207925, -31997, 167494, 13330, 162717, 185245, 175762, 134831, -5396, -157157, -235823, -53704, 261170, 219531, 54318, -113791, 87244, 94474, 34105, -243261, -403074, -337709, -319421, -257264, -525868, -545583, -249746, -384647, -299411, -227823, -216044, -138044, -243536, -234496, -218765, -101553, -333054, -210209, 65388, 193076, -242714, -189058, 13697, 165063, 141621, -47829, -255243, -194476, -6276, 30420, -221244, -85164, -64046, 62449, 308896, -44836, -243138, -530968, -220139, -72484, 35775, -267635, -209513, -151980, -280715, -306010, -331051, -208479, -134395, -35987, 71873, -119311, -170014, -522129, -715040, -156019, -121740, -306656, -335980, -163471, -295551, -245595, -270597, -345741]
408c45741M45322N2582M8824k53596P9670k7067M8551R2254m8114l33663k0996
397b61974J01429k14166K00766J39902k81396j49107K41103R1028r5469J47649
387h0235J62564j34733r7026Q7926k01419L0311L14010m5822K31656j48591k44803
376a26162J77588L3555l9623K914q5595m5432j29483J53106P5896j10717m2219
365a36172K710J33954J61268k47084k0494K15397q9109R5419r0156k73561J75667
354g2161j0605N6326j21071P7743R477R2560K74134j27042m30970J58241K40307
343A46939K71296R0113j39193m39195K3023O5073J07952j83265J55874J97640
333B96257R9796j06656m23971p3991J17562k63786L8497K12755N4360J13820l6145
$$ y = [-345741, 99581, 152163, 200987, -52609, 27061, -6, 48545, 140799, 92685, -240978, -261974, -160545, -374711, -173945, -34043, -315439, -464546, -223443, -132415, -227884, -80235, 82329, -52404, -149430, -61504, -262923, -232612, 81398, 35576, 267232, 118641, -126162, 51426, 84981, 45358, 48272, -37323, -82755, -212238, -59132, 16764, -93953, -136172, -133462, 492, 161760, -85324, -105818, 109579, 20470, 115889, 25733, -247828, -72161, -82766, -26440, -147511, -69768, -60291, 32269, 306403, 179361, -251609, -93368, 146939, 418235, 508348, 369155, -70040, -47017, 18056, 126008, -57257, 98617, 296257, 396053, 289397, -134574, -208565, -91003, -354789, -316292, -103537, -49177, 64643, 28498]
322B8498m6542k41613j73451j09464L85494J16095j59416k92990J00000M8338
312c45051J45774J28505J08175m6034n957k527K67170N0295j19245j09451j2931
301E8723k01190P4043k12628O0211J86353O8663K1605j3782m5479M08729p9344
290C25904l59848j56648o3574R3927K19512L9044j29669M111k50597J18263K00562
279D0987j29247q0087L3861J27669J32071P143j15942j55538K31812k14279m00313
268e21863L8086L183l4686J60363P4038q9588J20088j53639L87213J24671k70810
257a62944L570p1725M1409J9019N8968M4197K6521o8988J17451K1123J34289l74041
245b11151n8055N6337o651J94665J02484K2375l76411J59076K70855k76452j83231
$$ y = [28498, -18044, -259657, -433108, -542572, -157078, -40983, -200399, -493389, -393389, -345051, -199277, -70772, 37403, -8631, -14588, -17115, 250055, 300350, 181105, 71654, 58723, -142467, -68424, -281052, -220841, -34488, 34175, 55780, 41998, -3481, 405248, 325904, -33944, -190592, -254166, -160239, 59273, 98317, -31352, -27241, -277838, -159575, 40987, -88260, -168347, -134486, -6817, 125254, 132397, 16455, -139083, 92729, -121550, -521863, -483777, -480594, -515280, -354917, -280879, -370467, -250379, -404018, -16805, 107866, -162944, -159374, -231099, -189690, -170671, -111703, -67506, -40985, -109973, 7478, 28601, 162890, -211151, -269206, -212869, -219520, -24855, 77629, 100004, -276407, -117331, 153524, -122928, -306159]
234c06159J76615J05331k06541J47339O5950Q1229j3184M5637n3095k61807m1184
223b59869r4697J61982K39514r1283j99671M7492J87721J53413l45071k8644J24362
212a04751j05019j6781J12511m3661l8259J25018j70640p7497k1781j62985J43699
201c60146K72134j45286J60178q4124j15917P6142Q6517j15149p6352L65894J84861
190B48752k83883N710Q1572N4275p96j85475j56888K02702O1431L2995m9186j2492
178a283m05228j11020K50917o2057j52908J99130O5899J02078J0452l33936k40342
167f78298L59313J35145j75503K34334L13274j92391l12150J22163J58779n315
157d0649k62565l1829K29557J65941k45840J10105r3011j22406O543J42881j30337
$$ y = [-306159, -129544, -24213, -230754, -83415, -17465, 63764, 50580, 96217, 43122, -218685, -259869, -354566, -192584, 46930, -44353, -244024, -196532, -8811, 144602, -200469, -229113, -104751, -209770, -226551, -114040, -157701, -195960, -70942, -241582, -319079, -340860, -503845, -360146, -88012, -233298, -73120, -157244, -273161, -197019, -110502, -225651, -302003, 63891, 248752, -35131, -29421, 52151, 106426, 105630, -79845, -236733, -34031, 27400, 60395, 11209, -1283, -406511, -517531, -266614, -328671, -481579, -282449, -216550, -114472, -104020, -437956, -678298, -318985, -183840, -359343, -125009, 188265, -4126, -316276, -194113, -35334, -40649, -303214, -335043, -105486, 60455, -185385, -75280, -168291, -290697, -284154, -141273, -271610]
146b71610j5709K18365J07411k10565j82296J04934J37405R1327n6078k26459
136c03275k3526N497J01938J06787Q3556j62153L5932p9619L3729n1617n8268
125c11019J47435J10617L64460l90617k24250l4368P4620J55320J0992N2908k86023
114c29925j73810M87926j24624n4154J08898o0672j8997p8943J01071j51935J22898
103a72267J24889K30830l0099j42954j85478o9127R6045J82635j32275j17013
93b14814N0778m7432K44399J04684q1090n1838k32342J12739K524l2937R8157
82d7172o2784j33592L8175q2563j96319J65417R0941j88347J69649O8594j97832
71c75833J50589J30855P2585j43369m90K1160l7674K54511k75769j57090N6777
$$ y = [-271610, -287319, -68954, 38457, -172108, -354404, -249470, -112065, -20738, -76816, -303275, -326801, -321304, -219366, -112579, -29023, -191176, -155244, -234863, -201134, -252751, -311019, -163584, -52967, 311493, -79124, -303374, -337742, -263122, -107802, -96810, -43902, -329925, -503735, -15809, -140433, -194587, -85689, -146361, -165358, -244301, -143230, -295165, -172267, -47378, 183452, 153353, 10399, -175079, -244206, -148161, 34474, -97801, -214814, -164036, -211468, 32931, 137615, 56525, 4687, -227655, -114916, -112392, -145329, -47172, -109956, -243548, -205373, -287936, -484255, -318838, -227897, -416244, -246595, -178001, -375833, -225244, -94389, -21804, -165173, -165663, -144503, -182177, 72334, -203435, -360525, -303748]
60c03748J38459n8173q4741K89247J04215k69081j384J36981O4878j8169l5956
49c7472j92630O8162J54767j22222J13475J80829l21262j01002j03063L6373J72452
38a51593j97723J52346j9974l6337o5393J28392m4729J13633J14396o3961j20031
27a90974J6529J23018q1638q3886J32824r3972J0143j12512R1761L7423k7723
16a79007k18931j2030J10395l3986K3463J3711k7560J41195j22421o4749R9746
5b70174j2807M3350J52774N9415l8784
0f6226
$$ y = [-303748, -165289, -223462, -308203, -18956, 85259, -183822, -185206, -48225, 16653, -1516, -37472, -230102, -161940, -7173, -129395, -15920, 164909, -156353, -257355, -360418, -324045, -151593, -349316, -196970, -216944, -253281, -318674, -190282, -235011, -121378, -6982, -70943, -190974, -174445, -51427, -133065, -216951, -84127, -178099, -167956, -280468, -188707, -151284, -179007, -397938, -409968, -299573, -333559, -310096, -296385, -323945, -182750, -305171, -369920, -270174, -282981, -239631, -86857, -27442, -66226]
$$ Imaginary data points
##PAGE= N=2
##DATA TABLE= (X++(I..I)), XYDATA
16383b012424N1068j38995K99296k5596J4718O2323j6500j16143K0351n6657K10628
16372a707931J95010N9171j61715j16264K64411K4247j36616L9805L28871P2122
16362a138889J3921j09522q7205K52639L2521j10542J01580J52142j88252j9707
16352a101314K71750l1907n2711L4203k12428l5957K74554K2492q3126J6481J13670
16341g84293r761j1669J5216j487K59235J79628K1673l53726M0124K93625p0983
16330d22418j75660K74296k70038j2101R3422k00524R7191J80746J5750j6886
16320d36222J30948J79843p5824J1353J42059N7932j73722m6749L7591j33957
16310c06748J52284m1959Q7823n7269r7653J91779J10010j77813l8953J1213K88735
$$ y = [-2012424, -1961356, -2100351, -1801055, -1826651, -1811933, -1749610, -1766110, -1882253, -1861902, -1918559, -1707931, -1512921, -1453750, -1615465, -1731729, -1467318, -1443071, -1579687, -1539882, -1211011, -1138889, -1124968, -1234490, -1321695, -1069056, -1036535, -1147077, -1045497, -893355, -1081607, -1101314, -829564, -861471, -914182, -879979, -1092407, -1128364, -853810, -831318, -914444, -897963, -784293, -794054, -805723, -790507, -791994, -532759, -353131, -331458, -685184, -645060, -351435, -422418, -598078, -323782, -593820, -605921, -512499, -713023, -615832, -435086, -419336, -436222, -305274, -125431, -201255, -189902, -47843, 10089, -163633, -210382, -172791, -306748, -154464, -196423, -108600, -165869, -263522, -71743, 38267, -139546, -178499, -167286, 121449]
16299A21449J79856j96986q7556J63292K83396j58194L6445j54297N3945J49589
16289C90939R9253j95748P4947J99018k31732L3013J54573L5791j93607J8166
16279C84613P5892L7745J06136J286J4468M5171p2448n2539M6630R6232K41485
16268I24671J8608j75081j52657q9313J55838K49483J5550j94625j50718n727
16258E96029L37824J62310j33688j05612L04314L55959k45063j37290p2696q4510
16248I77577R5329K0313J56344j20517K71249M2677k14951p8863m553p5630K97660
16237A366635K32156l8704J2407k8092l18790j6847K22224q3048k42722J4579
16227A119798J70089r3399J09105K87944j71535J86378J97749j66157k80836O0308
$$ y = [121449, 301305, 104319, 16763, 180055, 463451, 305257, 341702, 187405, 241350, 390939, 490192, 294444, 369391, 568409, 336677, 369690, 524263, 560054, 366447, 384613, 460505, 498250, 604386, 605672, 620140, 665311, 592863, 540324, 586954, 683186, 924671, 943279, 768198, 615541, 526228, 682066, 931549, 947099, 752474, 601756, 596029, 933853, 1096163, 962475, 856863, 1161177, 1517136, 1272073, 1134783, 1062087, 977577, 1072906, 1093219, 1249563, 1129046, 1400295, 1442972, 1228021, 1149158, 1144605, 1068975, 1366635, 1598791, 1560087, 1572494, 1544402, 1225612, 1208765, 1430989, 1347941, 1105219, 1119798, 1289887, 1196488, 1305593, 1593537, 1422002, 1608380, 1806129, 1639972, 1359136, 1419444]
16217A419444O8918J14906n9970J17907k20727j59152L45594k8657j41720l8769
16207A417774p9701k4287L96669r2469j21484K20201J81474R2737R6190K8825
16197B115929k84560k36671K31676M1876k10768o8721J01063l0400K15543o1101
16187A813866j78515q1669L14709K88249j77588J11552O6777L8445m3314q5612
16177B066900j03295P9248K28566K5961m09689J93096L8146j22930K76136j9836
16167B252303l66614j5420L47029j52686l00046K24961k5202O8442P6212L7278
16157B146257k73026j27967K98213M1776P4275m9893j45774j97260K38908K2027
16147B027536j54620R5442o5573j73044L42099J21688m98769N8544M33838j1333
$$ y = [1419444, 1488362, 1603268, 1543298, 1661205, 1440478, 1281326, 1626920, 1598263, 1456543, 1417774, 1338073, 1313786, 1710455, 1617986, 1496502, 1716703, 1898177, 1990914, 2087104, 2115929, 1831369, 1594698, 1826374, 1868250, 1657482, 1588761, 1689824, 1659424, 1874967, 1813866, 1635351, 1553682, 1868391, 2156640, 1979052, 2090604, 2157381, 2195826, 2152512, 2066900, 1963605, 2042853, 2271419, 2297380, 1887691, 2080787, 2118933, 1996003, 2272139, 2252303, 1885689, 1870269, 2217298, 2064612, 1764566, 1989527, 1964325, 2032767, 2108979, 2146257, 1873231, 1745264, 2043477, 2085253, 2159528, 2109635, 1963861, 1766601, 2005509, 2027536, 1872916, 1968358, 1902785, 1729741, 2071840, 2193528, 1694759, 1753303, 2187141, 2175808]
16137B175808l19853J2087L44739k32054L55571P0225k18848k58502J31914j62828
16127A898259Q5925J08920P9054k25865L33244J82212k64006j22220n1918k52854
16117A770751O0909M64548k15268l9474Q3879J07636J0776j64842K49103p9784
16107B248234k39840N27865q7817l8000j75572m7400j36115K73391P0619m65305
16097A930060J92102J80565J5647k15594o686k58725L23478K91666k85018j07530
16087B059965K14145R8702j35950k5795N3276l11639K23554L07131R009j94721
16077B297677r73k53427r8500K69016K07633n3410k7934o7809k86042K91325K29725
16066B507281j38788m10309M53654J85007Q9523j00306k19229j91160K07632l9394
$$ y = [2175808, 1855955, 1868042, 2212781, 1980727, 2336298, 2406523, 2187675, 1929173, 2061087, 1898259, 1984184, 2093104, 2172158, 1946293, 2279537, 2461749, 2197743, 2075523, 2023605, 1770751, 1831660, 2296208, 2080940, 2041466, 2125345, 2232981, 2243757, 2078915, 2328018, 2248234, 2008394, 2536259, 2448442, 2410442, 2234870, 2187470, 2051355, 2324746, 2395365, 1930060, 2122162, 2302727, 2318374, 2102780, 2096094, 1837369, 2160847, 2452513, 2167495, 2059965, 2274110, 2372812, 2236862, 2211067, 2264343, 1952704, 2176258, 2483389, 2492398, 2297677, 2296704, 2043277, 1944777, 2213793, 2421426, 2368016, 2340082, 2272273, 1986231, 2277556, 2507281, 2368493, 1958184, 2411838, 2596845, 2686368, 2586062, 2366833, 2175673, 2383305, 2343911]
16056B343911k14415j10564M56834m8549l48717J33185R6617J6581N2217j17657
16046B259443j09162j04211M07402l1395m2445J92341K8132j79148k84378p0897
16036B065682p5377M89553m1529k58760R1201J22576l2240m1400l4756J570q1426
16025B205094k73838M11166M675m1920J10490M8465m158J91188n9396m75711j03906
16014B012149K16079q8749p7556M63899j39528n8772L0806j41227L8231J65716
16004B421048j9027j20708n3603L5650k79266j97650N34798j65495o0118L64075
15994B459704l7099j40200k67152L35141k7126n15M48682m09897l59189J01942
15984B104291M7678k2916J29398K04323N0368L7818K29974k99448j82849J79020
$$ y = [2343911, 2129496, 2018932, 2475766, 2427217, 2078500, 2211685, 2308302, 2324883, 2377100, 2259443, 2150281, 2046070, 2453472, 2422077, 2379632, 2571973, 2600105, 2420957, 2136579, 2065682, 1990305, 2479858, 2438329, 2179569, 2270770, 2393346, 2361106, 2319706, 2284950, 2286520, 2205094, 1931256, 2342422, 2347097, 2305177, 2415667, 2464132, 2459974, 2651162, 2591766, 2116055, 2012149, 2228228, 2139479, 2061923, 2525822, 2386294, 2327522, 2358328, 2217101, 2255332, 2421048, 2402021, 2281313, 2227710, 2263360, 1984094, 1786444, 2321242, 2155747, 2095629, 2459704, 2422605, 2282405, 2015253, 2350394, 2323268, 2322753, 2771435, 2361538, 2002349, 2104291, 2151969, 2129053, 2258451, 2462774, 2513142, 2550960, 2780934, 2481486, 2298637, 2477657]
15974B477657q621k50050J35501r0944k16124K26587K03925k9389k20149p5900
15964B152493j11384J84841j48187Q3159J2339j5724R357K5814J7544J31805q1755
15953B260302k8018J97125o6438k0221J82407n0925k52588k9048M6969J95917
15943B435482J59832l90946q8390K6057m133N090J82970k39812J21103L54468
15933B561721p0367n9095l38950j74260J00754M58143j6080K5754r0474k59900
15923B137246J05095j8701L0324j92153J09526P7492J06817o88m7216j34663l1410
15912B141669K48355j86869J3800L5148k6077J17782N8045M7917j33188l8379
15902B278203K105J75689p04j49317q906r7526n1687N585N6518K49481j22722
$$ y = [2477657, 2469036, 2218986, 2354487, 2263543, 2047419, 2274006, 2477931, 2448542, 2228393, 2152493, 2041109, 2225950, 2077763, 2160922, 2173261, 2157537, 2166894, 2192708, 2210252, 2342057, 2260302, 2232284, 2429409, 2362971, 2342750, 2525157, 2474232, 2221644, 2192596, 2239565, 2435482, 2595314, 2204368, 2115978, 2142035, 2137902, 2142992, 2325962, 2086150, 2207253, 2561721, 2491354, 2432259, 2093309, 1919049, 2019803, 2477946, 2461866, 2487620, 2397146, 2137246, 2242341, 2223640, 2253964, 2061811, 2171337, 2248829, 2355646, 2354958, 2307742, 2173079, 2141669, 2390024, 2203155, 2216955, 2252103, 2226026, 2343808, 2401853, 2449770, 2316582, 2278203, 2280308, 2455997, 2455293, 2305976, 2297070, 2199544, 2147857, 2153442, 2209960, 2459441, 2336719]
15891B336719j01904K10673J61212j73217j74421K19291j03208j2983K68774n4434
15881B576502j82198q5805K68679r9970k46451P1262R5627m8892J24977K34694
15871B708425k91150j13651j69117m2431j49056K36594L45842l32364J12045K86386
15861B591523l60400J61081R892k71890J34146j48472M6696r3814j3944N50679
15851B605497k07689k52330K01957J77839l7584j71055q5329k35013K2333R7286
15841B115912k53030J60073L04766k6715l11717K41226K41778j61804K9793k0985
15831B319297j43758J97921J50894N5286r2105q6422J64005O9922j29445J93781
15821B699376j65133K5378r9104k68973J2203Q9985K11544o5046K34550j36614
$$ y = [2336719, 2234815, 2445488, 2606700, 2433483, 2259062, 2478353, 2375145, 2362162, 2630936, 2576502, 2394304, 2308499, 2577178, 2477208, 2230757, 2302019, 2397646, 2348754, 2473731, 2708425, 2417275, 2303624, 2134507, 2092076, 1943020, 2179614, 2525456, 2193092, 2305137, 2591523, 2231123, 2392204, 2402096, 2130206, 2264352, 2115880, 2162576, 2068762, 2054818, 2605497, 2397808, 2145478, 2347435, 2525274, 2487690, 2316635, 2231306, 1996293, 2018626, 2115912, 1862882, 2022955, 2327721, 2301006, 1989289, 2230515, 2472293, 2310489, 2340282, 2319297, 2175539, 2373460, 2524354, 2579640, 2487535, 2401113, 2565118, 2635040, 2505595, 2699376, 2534243, 2559621, 2460517, 2191544, 2203747, 2293732, 2505276, 2440230, 2674780, 2538166]
15811B538166k87269j25906K83040Q4189j48272O781j57386J91431L10800K1945
15801B717519l40836j63693j17099Q8786Q0541L120J11542J03581J00334k5113
15791B558682l29098l9065q821L5414L59728N1897l44040m5815L08548L3256l399
15780B577287j58277N1993j10146L511L25412n6038r0883j15631q6772Q7403J97770
15769B625629J65375j8194j80685j73485j93940M9403K69061l16055J89074M2523
15759B458706j03979l17054R9093K47573O2995q0980k50248p1659J80228K57698
15749B482373j06066k5992j75944K86252n5084m2806m5248l8430o9275n1249L7047
15738B195578K7683J15430l4188K07719R4080l9173k95684O4626p9519j93061
$$ y = [2538166, 2250897, 2124991, 2408031, 2492220, 2343948, 2350729, 2193343, 2384774, 2695574, 2717519, 2376683, 2212990, 2095891, 2184677, 2265218, 2268338, 2379880, 2483461, 2583795, 2558682, 2229584, 2190519, 2181698, 2217112, 2576840, 2628737, 2284697, 2238882, 2547430, 2580686, 2577287, 2419010, 2471003, 2360857, 2364368, 2689780, 2633742, 2542859, 2427228, 2340456, 2427859, 2625629, 2791004, 2772810, 2592125, 2418640, 2224700, 2274103, 2543164, 2227109, 2416183, 2458706, 2354727, 2037673, 2136766, 2384339, 2447334, 2366354, 2116106, 2044447, 2224675, 2482373, 2376307, 2350315, 2174371, 2460623, 2405539, 2362733, 2317485, 2279055, 2209780, 2158531, 2195578, 2223261, 2338691, 2304503, 2512222, 2606302, 2567129, 2271445, 2336071, 2256552, 2063491]
15728B063491L33026k6726j03674K21561K60964l25349j70685K09437l15019j32176
15718B014850J71963J5960k88991j5482M22485M01421j22338j83054k1539j18860
$$ y = [2063491, 2396517, 2369791, 2266117, 2487678, 2748642, 2423293, 2252608, 2462045, 2147026, 2014850, 2186813, 2202773, 1913782, 1898300, 2320785, 2722206, 2599868, 2416814, 2395275, 2276415]
$$ [...]
##END NTUPLES=NMR SPECTRUM
##END=
