##TITLE=1H_DE-80H_X3
 200.13MHz, d2o
 8 sc
 
 19ns.26.2.2025
##JCAMPDX= 6.0         $$ Bruker NMR JCAMP-DX V2.0
##DATA TYPE= NMR SPECTRUM
##DATA CLASS= NTUPLES
##ORIGIN= UXNMR, Bruker Analytische Messtechnik GmbH
##OWNER= pz
$$ XWIN-NMR		Version 3.5
$$ Fri Mar 27 10:21:36 2026 Russian Standard Time (UT+4h)  Yarkov@DPX200
##.OBSERVE FREQUENCY= 200.1313
##.OBSERVE NUCLEUS= ^1H
##.ACQUISITION MODE= SIMULTANEOUS
##.ACQUISITION SCHEME= undefined
##.AVERAGES= 8
##.DIGITISER RES= 18
##SPECTROMETER/DATA SYSTEM= spect
##.PULSE SEQUENCE= zg30
##.SOLVENT NAME= DMSO
##.SHIFT REFERENCE= (INTERNAL, DMSO, 0, 15.4935)
##AUDIT TRAIL= $$ (NUMBER, WHEN, WHO, WHERE, WHAT)
$$ ##TITLE= Audit trail, XWIN-NMR		Version 3.5
$$ ##JCAMPDX= 5.01
$$ ##ORIGIN= Bruker BioSpin GmbH
$$ ##OWNER= Yarkov
$$ C:/Bruker/XWIN-NMR/data/yarkov2/nmr/H-C/1/pdata/1/auditp.txt
$$ ##AUDIT TRAIL=  $$ (NUMBER, WHEN, WHO, WHERE, WHAT)
(   1,<2026-03-27 10:20:09.32 +0400>,<Yarkov>,<DPX200>,
      <created by zg, POWCHK disabled, PULCHK disabled
       configuration hash MD5:
       00 E9 B6 7A A2 85 ED C7 34 08 36 98 17 FE 4E 26
       data hash MD5: 16K
       87 51 E9 30 03 6E 65 C4 2F 24 C2 D8 6A AC 97 BF>)
(   2,<2026-03-27 10:20:47.45 +0400>,<Yarkov>,<DPX200>,
      <Start of raw data processing
       efp BC_mod = 2 LB = 0.25 FT_mod = 6 PKNL = 1 PHC0 = -5299.148 PHC1 = 6.821927 SI = 16K 
       data hash MD5: 16K
       F2 72 44 86 F1 A0 30 3D 1B 8A EC 61 16 AE 4C EE>)
$$ ##END=
$$ 
$$ hash MD5
$$ D0 E5 08 97 41 C5 9A 07 CF BF 60 F7 6E ED 90 92
##$RELAX= 
##$RELAX= 
##$RELAX= 
##$RELAX= 
##$RELAX= 
##$RELAX= 
$$ Bruker specific parameters
$$ --------------------------
##$DU= <C:/Bruker/XWIN-NMR>
##$EXPNO= 1
##$NAME= <H-C>
##$PROCNO= 1
##$TYPE= <nmr>
##$USER= <yarkov2>
##$AMP= (0..31)
100 100 100 100 100 100 100 100 100 100 100 100 100 100 100 100 100 100 
100 100 100 100 100 100 100 100 100 100 100 100 100 100 
##$AQSEQ= 0
##$AQ_mod= 1
##$AUNM= <au_zg>
##$AUTOPOS= <>
##$BF1= 200.13
##$BF2= 200.13
##$BF3= 200.13
##$BF4= 200.13
##$BF5= 200.13
##$BF6= 200.13
##$BF7= 200.13
##$BF8= 200.13
##$BYTORDA= 1
##$CFDGTYP= 0
##$CFRGTYP= 5
##$CHEMSTR= <none>
##$CNST= (0..31)
1 1 145 1 1 1 1 1 1 1 1 1 1 1 1 1 1 1 1 1 1 1 1 1 1 1 1 1 1 1 1 1 
##$CPDPRG= <>
##$CPDPRG1= <>
##$CPDPRG2= <>
##$CPDPRG3= <>
##$CPDPRG4= <mlev>
##$CPDPRG5= <mlev>
##$CPDPRG6= <mlev>
##$CPDPRG7= <mlev>
##$CPDPRG8= <mlev>
##$CPDPRGB= <>
##$CPDPRGT= <>
##$D= (0..31)
0 0.7 0 0 0 0 0 0 0 0 0 0.03 0 0 0 0 0 0 0 0 0 0 0 0 0 0 0 0 0 0 0 0 
##$DATE= 1774592408
##$DBL= (0..7)
120 120 120 120 120 120 120 120 
##$DBP= (0..7)
150 150 150 150 150 150 150 150 
##$DBP07= 0
##$DBPNAM0= <>
##$DBPNAM1= <>
##$DBPNAM2= <>
##$DBPNAM3= <>
##$DBPNAM4= <>
##$DBPNAM5= <>
##$DBPNAM6= <>
##$DBPNAM7= <>
##$DBPOAL= (0..7)
0.5 0.5 0.5 0.5 0.5 0.5 0.5 0.5 
##$DBPOFFS= (0..7)
0 0 0 0 0 0 0 0 
##$DE= 6
##$DECBNUC= <off>
##$DECIM= 32
##$DECNUC= <off>
##$DECSTAT= 4
##$DIGMOD= 1
##$DIGTYP= 9
##$DL= (0..7)
0 120 120 120 120 120 120 120 
##$DP= (0..7)
$$ [...]
##$SUBNAM2= <"">
##$SUBNAM3= <"">
##$SUBNAM4= <"">
##$SUBNAM5= <"">
##$SUBNAM6= <"">
##$SUBNAM7= <"">
##$SUBNAM8= <"">
##$SUBNAM9= <"">
##$SW= 18.0517328524113
##$SWIBOX= (0..15)
0 0 2 0 0 0 0 0 0 0 0 0 0 0 0 0 
##$SW_h= 3612.71676300578
##$TD= 16384
##$TD0= 1
##$TE= 0
##$TE2= 300
##$TE3= 300
##$TEG= 300
##$TL= (0..7)
0 120 120 120 120 120 120 120 
##$TP= (0..7)
150 150 150 150 150 150 150 150 
##$TP07= 0
##$TPNAME0= <>
##$TPNAME1= <>
##$TPNAME2= <>
##$TPNAME3= <>
##$TPNAME4= <>
##$TPNAME5= <>
##$TPNAME6= <>
##$TPNAME7= <>
##$TPOAL= (0..7)
0.5 0.5 0.5 0.5 0.5 0.5 0.5 0.5 
##$TPOFFS= (0..7)
0 0 0 0 0 0 0 0 
##$TUNHIN= 0
##$TUNHOUT= 0
##$TUNXOUT= 0
##$USERA1= <user>
##$USERA2= <user>
##$USERA3= <user>
##$USERA4= <user>
##$USERA5= <user>
##$V9= 5
##$VALIST= <valist>
##$VCLIST= <CCCCCCCCCCCCCCC>
##$VD= 0
##$VDLIST= <DDDDDDDDDDDDDDD>
##$VPLIST= <PPPPPPPPPPPPPPP>
##$VTLIST= <TTTTTTTTTTTTTTT>
##$WBST= 1024
##$WBSW= 4
##$XGAIN= (0..3)
0 0 0 0 
##$XL= 0
##$YL= 0
##$YMAX_a= 86273
##$YMIN_a= -79773
##$ZGOPTNS= <>
##$ZL1= 120
##$ZL2= 120
##$ZL3= 120
##$ZL4= 120
##$ABSF1= 0
##$ABSF2= 0
##$ABSG= 0
##$ABSL= 0
##$ALPHA= 0
##$AQORDER= 0
##$ASSFAC= 0
##$ASSFACI= 0
##$ASSFACX= 0
##$ASSWID= 0
##$AUNMP= <proc_1d>
##$AZFE= 0.1
##$AZFW= 0.1
##$BCFW= 0
##$BC_mod= 2
##$BYTORDP= 0
##$COROFFS= 0
##$CY= -3
##$DATMOD= 1
##$DC= 0
##$DFILT= <>
##$DTYPP= 0
##$F1P= 0
##$F2P= 0
##$FCOR= 1
##$FTSIZE= 16384
##$FT_mod= 6
##$GAMMA= 0
##$GB= 0
##$INTBC= 1
##$INTSCL= 3.241238e-09
##$ISEN= 128
##$LB= 0.25
##$LEV0= 0
##$LPBIN= 0
##$MAXI= 10000
##$MC2= 0
##$MEAN= 0
##$ME_mod= 0
##$MI= 1.114404
##$NCOEF= 0
##$NC_proc= -8
##$NLEV= 6
##$NOISF1= 3.799351
##$NOISF2= 2.8
##$NSP= 0
##$NTH_PI= 0
##$NZP= 0
##$OFFSET= 15.49348
##$PC= 1
##$PHC0= -5299.148
##$PHC1= 6.821927
##$PH_mod= 1
##$PKNL= yes
##$PPARMOD= 0
##$PSCAL= 0
##$PSIGN= 0
##$REVERSE= no
##$SF= 200.130005648843
##$SI= 16384
##$SIGF1= 3
##$SIGF2= 2
##$SINO= 0.751879
##$SIOLD= 32768
##$SREGLST= <19F.Aceton>
##$SSB= 0
##$STSI= 16384
##$STSR= 0
##$SW_p= 3612.71676300578
##$SYMM= 0
##$S_DEV= 0
##$TDeff= 16384
##$TDoff= 0
##$TI= <>
##$TILT= no
##$TM1= 0
##$TM2= 0
##$TOPLEV= 0
##$USERP1= <user>
##$USERP2= <user>
##$USERP3= <user>
##$USERP4= <user>
##$USERP5= <user>
##$WDW= 1
##$XDIM= 16384
##$YMAX_p= 318652568
##$YMIN_p= -1280264
$$ End of Bruker specific parameters
$$ ---------------------------------
##NTUPLES= NMR SPECTRUM
##VAR_NAME=  FREQUENCY,     SPECTRUM/REAL,   SPECTRUM/IMAG
##SYMBOL=    X,             R,               I
##VAR_TYPE=  INDEPENDENT,   DEPENDENT,       DEPENDENT
##VAR_FORM=  AFFN,          ASDF,            ASDF
##VAR_DIM=   16384,         16384,           16384
##UNITS=     HZ,            ARBITRARY UNITS, ARBITRARY UNITS
##FACTOR=    0.220516191357247, 1,           1
##FIRST=     3100.71018562471, 0,            0
##LAST=      -512.006577381069, 0,           0
##MIN=       -512.006577381069, -1280264,    0
##MAX=       3100.71018562471, 318652568,    0
$$ Real data points
##PAGE= N=1
##DATA TABLE= (X++(R..R)), XYDATA
$$ [...]
7346 667167 845226 1031807 954671 1177219 1034553 418738 655929 568067 235258 582890
7336 582890 11117 -14237 119537 587170 709785 428958 731723 866220 1178962 1740916
7326 1740916 1834778 1602645 799910 858358 895599 603647 719022 636851 875049 713052
7316 713052 999409 1322706 827602 339084 449285 405430 420540 526504 826663 649121
7306 649121 428508 368475 660761 884738 999798 724602 708179 167562 92268 114148
7296 114148 118497 26807 -295893 216938 565878 641601 963480 750775 701044 408128 555552
7285 555552 776489 508074 144748 -171881 29319 89818 251694 706289 361655 264960
7275 264960 280566 213025 570875 654359 501335 683855 627771 687142 395091 344863 748447
7264 748447 567830 557346 141437 344384 205003 -88892 219321 227610 786317 1030510
7254 1030510 1106729 1028882 335117 520172 406491 -138112 -302901 -344930 273397 343108
7244 343108 767088 1124578 923518 1006179 615040 736729 601758 45864 96217 67364
7234 67364 -91778 228583 325776 885846 877608 634203 908872 1212453 953279 542726
7224 542726 384495 32081 -839667 -491454 114380 410262 550464 538479 865266 931755
7214 931755 982222 773542 539200 100345 -129500 -44191 152653 -185851 -158988 -125072
7204 -125072 -11775 228462 547696 1122039 861310 889848 699977 638230 301417 157246
7194 157246 229184 227845 126627 412779 516907 751567 831967 480231 958059 1216032
7184 1216032 896239 627380 390710 466267 47192 107512 337057 456679 379864 51680
7174 51680 523589 675208 930951 984544 883490 810711 312706 135215 118408 -335474
7164 -335474 -408542 -42788 561239 620846 909798 1141957 1001878 654251 649280 725526 501156
7153 501156 -51770 -211659 35900 -229384 17937 229361 488381 241309 169853 734012
7143 734012 481673 341353 107327 -158443 1256 -105043 523662 582381 244464 120180
7133 120180 254421 567576 30047 484447 773787 410661 216548 384217 515060 537095
7123 537095 243451 435351 597207 422083 453016 362630 484888 457334 53323 495439
7113 495439 572786 462716 190271 591404 734683 106394 137523 -4244 261285 114938
7103 114938 338656 670660 422119 521353 451905 402868 115151 -107421 16542 94272
7093 94272 434190 243867 142536 438661 370554 391270 466564 238875 410427 566010
7083 566010 818889 627779 372018 329732 720389 844100 694809 317543 601878 134546
7073 134546 130645 178459 317804 556508 207378 511312 798992 888297 954663 710678 541786
7062 541786 57579 -341423 -196721 -574455 -100223 178540 406308 784421 1038367 1366019
7052 1366019 1288458 895720 291609 93955 116100 -421810 -284190 -113696 119864 377480
7042 377480 812702 1111926 1046911 1162998 1100228 761434 191981 -492601 -825130 -794695
7032 -794695 -961781 -241433 596657 836845 1157802 1192513 1235175 877236 658930 496610
7022 496610 70768 -152452 -309390 -107831 279970 454492 686601 836368 854723 773464
7012 773464 733799 512524 109975 239353 333380 286278 181475 70454 277081 271486 316937
7001 316937 515156 524617 670687 588909 191006 48410 495549 631024 666365 528909
6991 528909 589015 632403 425187 514203 117208 -67263 49923 768444 752152 546672
6981 546672 663767 658081 563921 283770 168966 212101 -111407 -88955 16548 96861 22769
6970 22769 466256 923761 1073033 589110 168906 498684 373016 342302 479105 427516
6960 427516 452191 89529 406417 578681 499546 182295 440171 523236 134352 408358
6950 408358 427795 501117 203573 325371 472178 300151 116153 -126665 -52801 -149021
6940 -149021 139026 356373 237201 479504 394257 261239 305801 411061 282552 87100
6930 87100 -55584 34260 142119 443789 178496 734521 978004 1109516 1070739 803137
6920 803137 471525 286895 10717 -188929 248143 129574 80101 107996 669004 1243653
6910 1243653 1081582 1131851 871032 821449 469411 416109 96863 159252 212721 306420 754552
6899 754552 523851 501002 770507 527876 489993 542404 877506 804152 413805 655613
6889 655613 263771 -40893 -91601 330745 357524 -169166 -533436 -196694 392739 455692
6879 455692 654745 834535 966864 744900 555165 573048 714423 189678 -278992 -140969
6869 -140969 -303506 -118130 291506 483306 985107 796100 1099737 796802 306263 40803
6859 40803 -173185 -68721 -350116 135795 552457 456293 850235 932984 1128376 1149726
6849 1149726 1054961 1128995 479562 311098 -389329 -537047 -552754 -546031 125669 416312
6839 416312 599488 728712 726719 557426 662137 627103 420094 401137 51081 79718 -100683
6828 -100683 149441 431331 561474 694088 796229 891410 896320 679072 542690 374525
6818 374525 77122 116512 314868 76190 205187 -52838 152053 375187 725650 989298
6808 989298 912498 679815 597064 406536 448343 347257 309603 201648 -9280 71008 654265
6797 654265 676735 601302 728028 574494 754308 785347 889357 790981 108026 253455
6787 253455 349259 577518 481932 70512 278402 420240 376995 391861 897714 725001
6777 725001 169729 83521 399290 498875 314024 525278 289828 93679 -233970 -44228
6767 -44228 251362 173764 763622 625777 343664 559815 629929 720187 359891 268566 113000
6756 113000 136352 287837 270296 474492 50079 469459 648540 694855 673233 325347
6746 325347 275948 119634 147099 64215 13219 260618 187225 644377 677185 685095 430837
6735 430837 271097 7844 74662 397701 264277 143881 430741 567351 330369 830629
6725 830629 980028 391505 359358 -284130 -106538 -76109 -192487 183829 534519 590926
6715 590926 532577 732422 607066 181914 120084 15944 26619 -1845 331235 186771
6705 186771 176436 244909 474779 839860 928064 738670 812633 596018 293290 391090 269186
6694 269186 182847 560608 494714 571823 479665 493356 675110 549716 499436 505106 749741
6683 749741 677540 255124 207288 168486 77612 -253103 4408 113835 -103419 501901
6673 501901 738207 853995 1062469 885659 498066 422537 66852 488700 266737 2650
6663 2650 195597 7664 106806 523885 823855 1224864 830150 1236329 946102 858399
6653 858399 483374 8732 -208014 -333794 62097 253523 414608 803947 715387 957373
6643 957373 1116027 1005682 792230 302816 157721 -181923 16541 193110 50917 312010
6633 312010 401994 449871 976846 1178455 1210883 979432 568434 728351 135543 246073
6623 246073 237700 -10847 109315 411179 743922 760648 657817 736047 706544 536036 467198
6612 467198 452218 837919 739738 577223 723292 742294 381418 435152 522634 293027 668501
6601 668501 694149 680617 884713 301644 288269 552587 943278 1100525 791227 268762
6591 268762 -219348 -129268 33931 68325 -6847 173237 624693 739807 781443 950148
6581 950148 703693 259537 145821 121705 458810 407198 306150 433122 188196 592295
6571 592295 516071 758278 957679 831201 890252 607131 619466 298728 110954 92058
6561 92058 63403 628952 688181 351096 743955 785649 1022640 686587 622840 354329 10258
6550 10258 74850 106894 317268 342715 658944 696746 654476 937794 1164197 727899 415887
6539 415887 550333 538198 515635 227805 526857 504148 309508 430976 375434 586220
6529 586220 637603 595344 716914 536582 396743 594304 587517 424825 473898 556650 634597
6518 634597 531839 198116 33672 49834 -7913 451888 786007 1084871 1293794 1076134
6508 1076134 559284 438499 495743 644509 729829 295329 458321 410020 542594 781425
6498 781425 804145 911168 668529 940900 902092 795066 329578 -104780 -94482 -252051
6488 -252051 97900 238781 324695 612849 967276 1341353 1555366 1597861 1263605 537434
6478 537434 486325 350613 36696 286112 472547 479793 828092 882775 1260488 1309897 919241
6467 919241 829108 657147 701927 547263 346744 122280 207289 400141 597020 1128782
6457 1128782 1108605 1235938 1256932 837212 623437 445968 537936 447080 95553 462249
6447 462249 618410 838800 1010500 1194667 929879 1063818 1615253 1577742 1528761 1053343
6437 1053343 821589 1066009 879552 1061437 977437 1055911 891698 836091 1072554 874094
6427 874094 1170723 898806 889896 960894 645158 710418 869921 1137161 1194159 993987 1007156
6416 1007156 953281 753148 762600 766128 927988 1223077 1515770 1636105 1159913 1156633 1245071
6405 1245071 1476778 1731141 1143101 884762 983032 1098697 1526018 1193612 1420637 1363236
6395 1363236 1510631 1474396 1323678 1415303 837352 360577 610036 637799 931813 1013910
6385 1013910 1488933 1661317 1719441 2146634 2114621 1786785 1457030 1077372 1084207 672267
6375 672267 884345 1347693 1369248 1962730 1907644 2152598 2471072 2356988 2291443 1752042
6365 1752042 1823018 1777515 1603454 1646782 1294023 1717850 2132164 2769459 3100656 3241160
6355 3241160 3439167 2828904 2381210 2367816 2427269 2894782 2680262 3333273 3945051 4164543
6345 4164543 4448025 4212717 4030143 4119467 3922659 4436939 4426596 4579978 4779804 4791276
6335 4791276 5240917 5216836 5600865 5619385 5291040 5570706 5708749 6240624 6316628 6035329
6325 6035329 5973951 5904739 6295422 6639630 6888644 7715711 7558675 7730706 7728244 7808640
6315 7808640 7990327 7687471 8073859 8379927 8541659 9335360 9510206 9474287 9691264 9734354
6305 9734354 10196068 10518474 10405459 10563849 10498781 10542825 10681241 11016340 11243912 11400153
6295 11400153 11738905 11914836 12112066 12561189 12559212 12430423 11995332 11945724 12134490 12390261
6285 12390261 12656867 12917338 13078171 13293389 13567448 13823364 13948956 13494968 13277144
6276 13277144 13464107 13823263 13885863 14232622 13989155 14237249 14034430 14013196 14130262 14239135
6266 14239135 14130115 14181676 14108290 14288721 14071197 14147638 13989024 14027925 13943234 13891586
6256 13891586 13858889 13519907 13390369 13230988 12974575 12973220 13296022 13559972 13741368 13649744
6246 13649744 13435132 13187232 13081271 13070608 12305764 11910523 11693795 12147867 12503042 12222742
6236 12222742 12169011 12167470 12175841 12114160 11458587 11266207 10580601 10309894 10101559 9890229
6226 9890229 9975571 9669195 9504769 9188479 9265689 9604784 9469111 9026310 8314140 8118982
6216 8118982 7816256 7562653 7379996 7211325 7295139 7188941 7131173 7058255 6788794 6578013
6206 6578013 6675897 6201820 5929746 6090255 5927297 5672211 5314625 5410614 5602454 5320169
6196 5320169 5294942 4845235 4789597 4480195 4461280 4364003 4173329 4192963 4039882 3840221
6186 3840221 3611650 3519562 3883985 3243763 3121058 3047840 2877529 2796245 2779916 2703350
6176 2703350 2497929 2630378 2935459 2798319 2886241 2541847 2368390 2083358 1789565 2101261
6166 2101261 2371225 2326313 2353055 1976975 2070413 1960862 1942903 2193429 1985493 2157297
6156 2157297 2137126 2122108 2146751 1932857 1886491 1719307 1970570 2115316 1948168 2031130
6146 2031130 1802562 2208529 2129314 2059504 2457846 2220129 2065664 1978173 2400138 2275849
6136 2275849 1872294 1827225 1883628 1483908 1486150 1976238 2404357 2447084 2538252 2626359 2346595
6125 2346595 2293738 2107584 2206923 2502723 2145827 2414190 2711471 2861695 2703447 2514800
6115 2514800 3256194 3320988 3429433 3588236 3453487 3477894 3597837 3724871 3943132 4095803
6105 4095803 4609022 4704480 5336283 5096542 5297006 5447000 5433912 5520289 5253531 5277095
6095 5277095 5079052 4959277 5110273 4992964 5289692 5514920 5544388 6010891 6446818 6959701
6085 6959701 7497572 7617760 8329218 8778051 8285183 7945740 7599836 7583339 7189596 7187684
6075 7187684 7606931 7399510 7886755 7611845 7665019 7313869 6922037 6807188 6684364 7143848
6065 7143848 6905829 7014036 7242073 7055364 7620519 7808747 8057655 8477536 8197830 8004107
6055 8004107 7903817 7710555 7563187 7230010 7370646 7749752 8036623 9008810 9287876 9656737
6045 9656737 9823554 9937487 10695980 11338612 12372495 13084676 13596642 14692225 15107383
6036 15107383 15996777 16675299 16741807 16938628 16984688 17304766 17332862 17401476 17371952 17550769
6026 17550769 18000824 18257963 19016339 19987018 20715419 21795240 22629378 23374905 24554650
6017 24554650 25423160 26450806 27323498 27916562 28491633 28862974 29165900 29242548 29109338
6008 29109338 28761672 28147211 28406248 28103814 27748406 27921639 27906911 28313166 28423066 28361456
5998 28361456 28216579 27676083 27469039 26919787 26543676 25975866 25345167 24624941 23649723
5989 23649723 22796928 22244149 21743054 21510749 21181091 21053334 21026713 21372373 21810467 21833191
5979 21833191 22182194 22754122 23077681 23667200 23904426 24008392 24129599 23979089 23993433 23589283
5969 23589283 22984633 22657863 22277363 21577683 20524341 19426591 18319488 17127537 15933463
5960 15933463 14661318 14385635 13734619 13196207 12689662 12391588 12248704 11914759 12104875
5951 12104875 12307360 11932567 11821644 11808657 11834958 11843102 12371628 12893647 13261227 13851910
5941 13851910 14391447 14780038 15189213 15293143 15058214 14706922 14033050 13158800 12209491
5932 12209491 11541872 10857495 10202627 9938827 9560437 9147455 8370906 8091065 8157385 7800144
5922 7800144 7314705 6667772 6401979 5918284 5673234 5772349 5872365 6265545 6348435 6750678
5912 6750678 7071275 7097533 7396153 7597167 7699642 7800149 7761734 7519518 7366780 7135921
5902 7135921 6951056 6796461 6979443 6968798 6739837 6542089 5966776 5554091 5232310 5128419
5892 5128419 4872732 4333644 4333540 3940279 3882350 3784759 4024315 4509785 4128402 4739656
5882 4739656 4812480 4359138 4413794 4256104 4123080 4074737 4233847 4421526 4055066 4214713
5872 4214713 4509097 4773887 4954602 4861102 5051268 4786146 4401763 3873158 3455850 2794130
5862 2794130 2228969 2084503 2375480 2478268 2562788 2754684 3020190 2825856 2544316 2487051
5852 2487051 2436896 2140469 1830763 1619764 1556587 1322443 1516502 1788362 1530057 1898658
5842 1898658 2006221 2033756 2140432 1843038 1981972 1545114 1544595 1431311 1473070 1351181
5832 1351181 1400770 1501700 1627974 2054274 2234234 2280356 2257721 2418815 2220881 1943356
5822 1943356 2133463 1989916 1767927 1918734 1852233 1850896 1784309 1883920 1890688 2282804 2085140
5811 2085140 1967469 2168834 1844484 1633774 2014497 2045282 1995515 1919232 1936728 2046841
5801 2046841 1856522 2059795 2109853 2099811 2160036 1995042 2062317 2084736 2370228 2484105
5791 2484105 2638809 2784633 2664740 2631207 2720908 2909233 3121652 2800005 2979791 3076620
5781 3076620 3386295 3690167 3749394 4002572 4592735 4957070 4759270 4727847 5132871 5132818 5452551
5770 5452551 6483683 8291937 10398794 12672511 15834134 19885296 25135154 34409322
5762 34409322 45766067 58694197 64405596 56987421 45597626 34043225 24503647 18206052
5754 18206052 14007914 11544946 10008461 8758814 8050298 6960096 6178323 5395286 4817404
5745 4817404 4433340 3779940 3685616 3359841 3534506 3742728 3787204 3782788 3385215 3291446
5735 3291446 2748355 2671395 2515209 2404609 2671635 2604664 2570038 2828586 2935422 2595358
5725 2595358 2458163 2747721 2663174 2606955 2190523 2325232 2493487 2404233 2233561 2066128
5715 2066128 1950378 1790544 1964383 1741255 1603702 1941235 1925831 2062075 2230886 1955509
5705 1955509 1902964 1638925 1373042 1272833 1214312 1175335 1047914 1248607 1489536 1525442
5695 1525442 1569788 1591628 1644707 1836613 1695295 1747055 1513680 1370337 1048125 1015341
5685 1015341 1385115 1419495 1735124 1754584 1693575 1341310 1257266 1561249 1406971 1595231
5675 1595231 1485191 1222016 1493930 1499887 1347997 1422840 1391054 1502908 1322463 1422547
5665 1422547 998498 1112264 1263189 1227215 1439500 1210121 1097519 1339360 1200276 1290536
5655 1290536 1322005 1309739 1306209 1225844 1413009 1252419 1271514 1347680 844546 1146457 1150567
5644 1150567 822657 1114097 830272 1152890 1205814 1208067 1184501 856117 1426326 849184
5634 849184 815094 1000077 973637 1305626 955243 1518317 1446220 1436974 1455066 1425964 1645606
5623 1645606 1514068 1341075 1363546 1180618 1111722 995314 1292049 1477254 1206961 1396420
5613 1396420 1421372 1268603 1176196 905606 1293819 1023936 631797 741709 801742 1294448
5603 1294448 1579210 1798542 1995652 1773680 1780019 1493276 1485580 967320 685110 1162543
5593 1162543 1136994 1404858 1479899 1480940 1605233 1339295 1918150 1664257 1865028 1854820
5583 1854820 1485200 1377508 728878 489864 623960 1035370 1421497 1798999 2093327 1835636
5573 1835636 1675035 1720435 1543099 1334956 1054857 946982 1342486 1022466 1081589 1391509
5563 1391509 1543659 1965775 1989649 1916941 1738353 1146997 864608 881528 992723 1113543
5553 1113543 1122103 1468609 1648427 1955096 1890971 2060910 2129679 1649781 1513799 1127509
5543 1127509 1123349 1177573 1196630 1521664 1340433 1906797 2030369 1986271 2189047 2137058 1773525
5532 1773525 1952617 1784742 1475763 1598425 1558537 1780715 1965984 2247676 2517010 2313307
5522 2313307 2139658 2159489 2101118 2029555 2054033 2134132 1993713 1972643 2152412 2066000 2234639
5511 2234639 2269585 2360552 2264109 2182248 2091449 2208667 2214642 2223864 2264116 2769185 2622097
5500 2622097 2634253 2864605 2365071 2277876 2076905 2153188 2520958 2628922 2762759 2836426
5490 2836426 3211901 3094675 2964728 3072076 2873626 2911505 3055864 3109509 3054538 2788484
5480 2788484 3265221 3433504 3901182 4306354 3973524 4458561 4110074 4162930 4282116 4351286
5470 4351286 4282035 4352760 4657902 4578207 4892580 5364535 5533114 5769297 5896122 5724014
5460 5724014 5730163 5770274 5662616 5756251 6072114 6474734 6314143 6310712 6487803 6219040 6451008
5449 6451008 6265733 6567547 6801305 6734307 7272018 7101537 7405719 7436211 7367735 7594451
5439 7594451 7316137 7678967 7501435 7572338 7809081 7813867 8069416 7866677 8297823 8414654
5429 8414654 8185309 8557151 8497952 8535805 8709850 8579515 8891822 8830166 8899100 8927579
5419 8927579 9220633 9727956 9635188 9663336 9697504 9542554 9631718 9805393 9751356 9565134
5409 9565134 9601341 9914394 9632934 9567877 9824676 9932543 9929551 9784538 10144395 10153818 10125080
5398 10125080 9846430 9524434 9419752 9438513 9544483 9435217 9374286 9329757 8865541 9040747
5388 9040747 9168118 9283044 9584243 9358352 9170509 8947432 8992865 9008343 8556690 8327353
5378 8327353 8408140 8594021 8571547 8592774 8793306 8881631 8785318 8877194 9041637 8768964 8691923
5367 8691923 8370701 8264352 8094323 8081442 8278148 8500218 8490599 8297337 8642118 8534108
5357 8534108 8306418 8348816 8337890 8244338 7781774 7626269 7567909 7335773 7052360 7374818
5347 7374818 7852866 7852739 8013257 7871810 7990572 7956679 7756631 7887053 7556379 7540586
5337 7540586 7337919 7170775 7563183 7582632 7763448 7964588 8408648 8653722 8751893 8845004
5327 8845004 8286447 8010958 7914798 8129181 8188342 8296427 8281774 8311444 8956427 9115162
5317 9115162 9622846 9498048 9441636 9514684 9374402 9456766 9294398 9508002 9461472 9494720
5307 9494720 9994134 10516142 10850701 10879188 11106807 11257865 11566062 11442971 11101359 11330966
5297 11330966 11403991 11698267 11759273 12298649 12732930 13084874 13498371 13400530 13946195 14480319
5287 14480319 14644638 14880235 15249228 15409258 15168579 15758865 15815607 16323081 16998773 17498765
5277 17498765 18324879 18677134 19287626 19890463 19899015 20145252 20753652 21360919 22080560 22589843
5267 22589843 23273508 23646829 24351391 25586554 26446842 26719894 27395418 28261741 28928616
5258 28928616 29830869 30507010 31154099 32140769 33070581 34059627 35362175 36057200 36936401
5249 36936401 37767988 39211666 40544430 41603025 42997742 44054331 45110023 46339271
5241 46339271 47990213 49922444 51103748 52618467 54444831 55865773 57767342 59589735
5233 59589735 61798145 63358414 65294572 67606446 69287083 71259470 73124257 74848751
5225 74848751 76631032 78546847 80166260 81946713 83342032 84956140 86367159 87652535
5217 87652535 89095508 89866066 91213423 91783164 92315954 92399738 92313818 92427863 91537024
5208 91537024 91036117 90762768 90273357 89674703 88779514 88204076 86979878 85396645 84001665
5199 84001665 82613403 81185084 79502496 77447728 76011579 74497857 73099729 71296514
5191 71296514 69897907 68607623 67265511 66025456 64721204 63382225 61995749 60533329
5183 60533329 59022473 57584337 56162138 55109231 53871149 53112872 51912793 51381696
5175 51381696 50617052 49382039 48914272 48112253 47193111 46266232 45746585 45230100 44132601
5166 44132601 43300392 42608669 42123932 41677724 41264354 40658012 40338861 39800123 39563698
5157 39563698 39153882 38453231 37595574 36520288 36288836 35511272 34996408 34786995 34483597
5148 34483597 34528975 34277652 34259222 34336744 33386599 32637280 31838054 31319305 31031493 30288605
5138 30288605 30390269 29927323 29698691 29569940 29376432 29174740 28906947 28547650 28005382
5129 28005382 27327622 26722905 26417679 25804336 25315087 25011371 24950229 24749311 24360671 24213070
5119 24213070 23387479 22780274 21725768 21328582 20802060 20126733 20085531 19812266 19645313
5110 19645313 19220676 18706100 18022625 17477279 17163349 16776097 16331016 16238009 15491327 14889672
5100 14889672 14622506 14347985 13926400 13702383 13756250 13699904 13259675 12991839 12812533 12489210
5090 12489210 11804808 11521110 11509050 11293317 11066543 10821178 10429941 9988930 9681873 9770052
5080 9770052 9878221 9615947 9238558 9055661 9024096 9015112 9287672 9386690 9124365 8926049
5070 8926049 8565399 8472533 8421250 8430803 8599266 8758789 8681208 8587446 8796061 8814447 8199919
5059 8199919 8005209 8241148 8328620 8324991 8087468 7992104 7690832 7860598 8311578 8646582
5049 8646582 8943366 9086608 8909371 9010623 8719416 8478876 8162781 7921929 8082771 8610597
5039 8610597 8905273 9111481 9337384 9323237 9683632 9298814 9517197 9998134 10115947 10055154
5029 10055154 9678068 9589070 9465625 9350095 9266603 9526946 9512572 9901738 10504512 10589351
5019 10589351 10506619 10356313 10359933 10482779 10670805 10406523 10414993 10900796 10802067 10889851 11503519
5008 11503519 12038701 12169919 12273326 12818794 13006595 13265820 13012555 12830013 12634470
4999 12634470 12509824 12991675 13321822 14040631 14568307 15280795 16033009 16280014 16637295
4990 16637295 16722573 16309652 15591552 14856392 15054752 15592698 15644175 15937015 16271771 16885904
4980 16885904 17177674 17195187 17247026 17135835 17055188 16907006 17027642 17271340 17281086 17372573
4970 17372573 17735236 17713886 18212473 18307635 18321817 18686697 18508750 18662575 18231988 18158058
4960 18158058 18231123 18148011 18994767 19325890 19703543 19910013 19719717 19635768 19641951 19997579
4950 19997579 19801541 19843865 20314889 20146376 19861912 19350293 19256357 19198998 19033719 18732513
4940 18732513 18624911 18586146 18310448 18287377 18045488 17712037 17620977 17957903 17792587 17664723
4930 17664723 17654009 17226890 17100542 16743557 16868817 17128025 17471825 17741172 17683062 18255800
4920 18255800 18131683 18004945 17668953 17357444 17154959 16789729 16916417 17176422 17412876
4911 17412876 18047722 18283048 18791338 19011724 18946391 19381375 19400589 19377891 19537183 20031703
4901 20031703 20047480 20067137 20127703 20608279 20646505 20785762 21132659 21085989 21021755 20916169
4891 20916169 20688947 20838351 21074487 21109816 21724177 22236684 22469743 23292263 23771591 24288644
4881 24288644 24648944 24910842 25711617 25724516 25973378 26210757 26483754 26848267 26663593 26343057
4871 26343057 25759411 25051373 24512244 24102665 23860557 23439566 23380142 22899213 22454913 22061080
4861 22061080 21514168 21126958 21225328 21160469 21078087 21355198 21546787 21850593 22167558 22618665
4851 22618665 23041784 23277083 23784685 23472999 23389395 23006195 22579998 22620755 22439367 22477895
4841 22477895 22480608 23081347 23590757 23901973 24122804 24298359 25165791 25951009 27197150 29132908
4831 29132908 31364707 34800115 40587136 48859218 58384517 65218815 63016094 55398180
4823 55398180 46891645 39646692 34665818 31573775 30075273 28961116 28105263 27055165
4815 27055165 26465983 26275021 25934528 25653923 24854956 24058174 23445711 22747684 22502568
4806 22502568 22241102 21958799 21322264 20721168 19996505 19350076 18708802 18042018 17452523
4797 17452523 16745932 16631641 16960176 16905057 16891981 17031378 16904743 16601131 15758975 15220713
4787 15220713 14843118 14112726 13818903 13910423 13740558 13846213 13582321 13665266 13331794 12956649
4777 12956649 12755387 12616181 12637745 12108201 11554599 11245147 11000533 10931507 10730276 11013663
4767 11013663 11337461 11420762 11895088 11725565 11185977 10694997 10217276 10280455 10578190 11172070
4757 11172070 11601765 11959653 12101136 12191952 12297640 12468743 12658761 12798684 13075119 13294960
4747 13294960 13738110 14210444 14555681 15306671 15870639 16586736 17213514 17727799 18095079
4738 18095079 18397211 19072769 19734851 20260409 20593224 21399676 22346311 23744703 24655672
4729 24655672 25640073 26260112 26952483 27490063 27968622 28290738 28972910 29610876 30302573
4720 30302573 31103637 32061305 32574542 32923184 33102463 33214357 33486094 33659487 34400941
4711 34400941 34818895 35222227 36234862 37282092 38182663 39245498 40467617 41726155 42840491
4702 42840491 44471628 45699678 47072180 48191802 48839308 49320276 49669045 50010559 50078052
4693 50078052 50041781 49452102 48689579 47391019 46590740 45254367 44176370 43104543 41449067
4684 41449067 40529336 39440103 38722851 37486792 36432512 35657214 34438057 34047288 33799961
4675 33799961 33493787 33206563 32716944 31971967 31063415 30391576 29288025 27926469 26964498
4666 26964498 25636382 24706243 23706104 22504682 21528562 20113457 19114371 18276305 17633038
4657 17633038 16771718 15494525 14548287 13834952 13017823 12486659 11809556 11576659 11309049
4648 11309049 10873263 10527932 9996715 9548941 9288456 8835257 8792926 8652585 8474375 8298029
4638 8298029 8136252 8588988 8346230 8763676 9064894 9104803 9371102 9866963 11438519 13224399
4628 13224399 15564629 17961353 18864960 17900536 16028538 13936850 11982174 10660906
4620 10660906 10092454 9331729 9193619 9590487 9747048 10075013 10619683 11477522 12938501
4611 12938501 14321328 15752384 16219524 16572655 17094558 17213298 18352197 19616699 21054915
4602 21054915 23759392 25862205 27366624 27477986 26937882 26354345 26189325 27520082 29105259
4593 29105259 31303595 32181912 31804677 30648505 28838341 27338340 26219000 25896616 26090822
4584 26090822 25528238 24660294 23104200 21097935 19142200 17523493 16685800 15900708 15491047
4575 15491047 14920097 13588501 12363778 10675434 9210610 8183164 6973566 6532138
4567 6532138 6051159 5877641 5719762 5301124 5145504 4586826 4251496 4253259 3826690 4099642
4557 4099642 4185626 4001540 3816102 3437791 3400328 3166536 3533335 3340102 3002803 2971180
4547 2971180 2633335 2850564 2940249 2933746 2905585 2876918 2973345 2830490 2589263 2236138 2174959
4536 2174959 1950671 2448598 2718961 2753060 2572476 2543270 2351747 2075137 2043395 1819162
4526 1819162 1855836 1708900 1527138 2046849 2196947 2527651 2525424 2903950 3092696 2440545
4516 2440545 2168314 1745887 1757157 1550329 1394978 1684655 1732063 2024853 2223139 2248494
4506 2248494 2388604 2201343 1845357 1410841 1126739 776449 857510 1062987 1364802 1645388
4496 1645388 1976666 2124992 2059046 2076614 1484495 1253798 820196 577606 788641 775481
4486 775481 1294800 1609377 1805736 1911811 2235479 2471128 2346646 1955604 1175369 683694
4476 683694 904670 1030821 1487676 1361735 1725943 2146854 2170059 2143720 2068183 1892012
4466 1892012 1066066 1063936 885430 575657 696846 1016159 1481050 1849998 2196560 2163672
4456 2163672 1859910 1498941 1041599 784095 670432 844804 748193 1390956 1322189 1422320
4446 1422320 1662768 1915282 2221733 1630650 1577255 1260090 698124 392709 369644 465992
4436 465992 787997 950310 1512406 1817125 2062119 1956037 2017025 1528450 1194380 918601
4426 918601 690924 580285 759523 920805 1544089 2035230 2052999 2159290 2132771 2054128
4416 2054128 1673472 1201051 1044632 633920 876962 905368 1120344 1469151 1541805 1957653
4406 1957653 2108972 2567712 2097670 1676265 1493945 880230 623414 563204 695971 1057123
4396 1057123 1331936 1830058 1956564 2319411 2217476 1833898 1497581 1436607 1338428 977043
4386 977043 799544 1019543 1363187 1643708 2141587 2150221 2533758 2476362 2412523 2455117 1792221
4375 1792221 1643036 1385466 1045500 1059174 1109514 1519655 2069441 2400149 2931742 2529128
4365 2529128 2478352 2088562 1854470 1756543 1859127 2199424 1786045 1791594 2013787 1988148
4355 1988148 2441443 2332959 2729063 2724794 2986800 2757641 2692763 2796515 2385158 2188779
4345 2188779 2301655 2579717 2723005 2940543 3392397 3905511 3854828 4039807 4201559 4036775
4335 4036775 4182727 4211688 4399045 4296643 4307793 4368486 4472409 4985878 5398911 5943756
4325 5943756 6253948 6430232 6763710 6888736 6949329 6977358 6925445 6894215 6690342 6994535
4315 6994535 7216707 7944605 8349656 8513173 8706276 8902044 8787709 8792089 8890043 8746700
4305 8746700 8444130 8362689 8359364 8531076 8761446 9504393 9646528 9481737 9351729 9203227
4295 9203227 9072325 9097673 8940960 8481392 8823317 9126986 9261215 9518826 9515274 9644233
4285 9644233 9597028 9888587 9637753 9441194 9257025 9436319 9524723 9882762 10494631 10993942
4275 10993942 11089088 11251978 11472774 11672862 11846074 11870828 12139036 12488474 12851152 12891109
4265 12891109 13431838 13774277 14137537 14593742 14827752 14868777 14740063 14761470 14468676 14450063
4255 14450063 14469456 14918550 15589321 16064810 16383977 16115384 16403784 16434420 16404067 16102124
4245 16102124 15640246 15558518 15350313 15479660 15657693 15541248 15782413 16198754 16674262 17053941
4235 17053941 17237013 17657658 18279437 19321251 22033403 26146289 31752441 37524887 37919664
4226 37919664 33686977 28460101 23521331 19728116 17181748 15675427 13959694 13572901
4218 13572901 13169547 12898157 13084045 12945380 12643661 12729755 12573800 12186918 11581445 11180357
4208 11180357 11092775 11438276 11477143 11630032 11903904 12120070 11758337 11569301 11638984 11427560
4198 11427560 11275768 11002786 11085084 11068010 10940041 10530574 10328892 10217550 10207866 10436156
4188 10436156 10198947 9978220 9849386 9604786 9403483 8976928 8621125 8535438 8378174 8130853
4178 8130853 8144352 8199497 7770526 7126787 7006935 7114472 7287325 7058065 7025719 7327428
4168 7327428 6941436 6111690 5954138 5635387 5697752 5697732 5868100 6366391 6541477 6746614
4158 6746614 6719360 6652880 6356341 5820900 5485030 5337756 5525649 5863404 5838546 5775340
4148 5775340 5790242 6108652 6797853 6848389 6911924 6459177 6048535 5742763 5667824 5705658
4138 5705658 5634661 6202252 6785734 7118776 7562388 7477268 7615748 7391830 7338202 7469553
4128 7469553 7212153 7129297 7261973 7603243 8244816 9144799 9459292 9644143 9957347 10070055
4118 10070055 10002785 10259831 10356665 10332681 10740788 11271855 11758280 12333112 12714885 13595206
4108 13595206 13783930 14022291 14377192 14618593 15168316 15192709 15623656 15830405 16445710 17331186
4098 17331186 17936184 18621432 19042564 19563466 20116361 20564097 20836382 21310787 21753381
4089 21753381 22504468 23238978 23724294 24097523 24778909 25431157 26093466 26541033 27091228
4080 27091228 27759711 28949800 29531823 30200902 30995837 31668961 32570728 33104709 33725019
4071 33725019 34167042 34875025 35538067 35984444 36428111 36504242 36714233 37248339 37696969 38169859
4061 38169859 38676291 39590432 40603070 41865440 43382270 45415313 47473539 48075247 47779601
4052 47779601 47038143 46213080 45611470 45554941 45913652 46627444 47742650 49183233 50443269
4043 50443269 51392149 52012698 52677266 53301813 53499109 53541766 53628740 53369242 53815593 54345382
4033 54345382 54788584 55136920 55092228 55471082 55863691 56155885 56245101 56483449 56792332 56818252
4023 56818252 56874495 57345176 57455501 57360332 57429904 57631902 57445551 57365800 57289847 56938184
4013 56938184 56882303 56506075 56159512 55970650 55745427 55753633 55892300 55677740 55585127 55555356
4003 55555356 55213916 55061555 54369279 54108959 53624591 53446260 52937690 52328808 51679613
3994 51679613 50708013 49550897 48906004 47962428 47319837 46601737 45901652 45203939 44435709
3985 44435709 43865464 43518316 42877495 42648244 42049414 41961811 41899596 41403864 41033655 40612507
3975 40612507 40255125 40109541 40152014 40154794 39631590 39639688 39599115 39250297 39058550 38224593
3965 38224593 38105089 37675384 37800423 37856339 37323535 36820626 36042029 35329816 34600329 33865460
3955 33865460 33643905 33362990 34319156 35636543 37108894 38159593 37703610 35987901 34094081
3946 34094081 32573204 31797337 30364753 29566120 28843876 28138182 27740602 27602339 27473276
3937 27473276 27276523 27084040 26711332 26507078 26099711 25777916 25399364 25327530 24917181 24919292
3927 24919292 24960491 25011931 25345030 24912478 25078175 25269032 25609059 26478594 26940315 26397270
3917 26397270 25030980 23984524 23109861 22091656 21332598 20478761 19823783 19595314 19213008
3908 19213008 19104746 19012579 18807690 19086175 18892924 19185646 19317169 19482076 19785812 19631531
3898 19631531 19515118 19568756 19253577 19149886 18628101 19064479 19167685 19423639 19902189 19970784
3888 19970784 20449429 20308607 19983488 19900864 19977086 20317610 20404957 20801935 21307438 22021896
3878 22021896 22831885 22932621 23513157 24013163 24753604 25622377 26487356 27350085 28703261
3869 28703261 29610872 31003746 32538140 33923043 35663580 36914997 38378016 39944718
3861 39944718 41148212 42151822 42243612 42755800 42979596 43472861 43896773 44046981 44336022
3852 44336022 44006590 44136455 43866831 43801365 43754540 43434304 43412031 42982113 43059646 43099225
3842 43099225 42787953 41959681 40962872 40066354 39203076 37995172 36934655 35626565 34853695
3833 34853695 33924693 33494264 32829837 31391520 30210685 29477710 28453520 27998019 27045676
3824 27045676 26683306 26157269 25008946 24527727 23784480 23378943 22531055 21881570 21712230
3815 21712230 20955785 20382528 19736285 19152034 18813578 18010507 18250774 18504310 18666747
3806 18666747 18322906 17898359 17769949 16853196 16422167 16193077 15624478 15561648 15535959 15719880
3796 15719880 15667952 15568468 15601915 15461978 14992869 15013422 15242952 15351900 15240890 14686577
3786 14686577 14870169 14738974 14542914 14438436 14476088 14747764 14515027 14942306 15236253 15469138
3776 15469138 15233989 14777054 15075593 14695923 14528795 14653024 14184410 14433192 14098946
3767 14098946 14382180 14598449 14595795 14790072 14856771 14872408 14715684 14698765 14538370 14067385
3757 14067385 13549583 13546537 13648510 13601579 13802699 14531990 14565383 14312396 14780170 14562120
3747 14562120 14226500 13590937 13193133 13570136 13470081 14042329 14629760 14692907 14986153 15106584
3737 15106584 15520381 15580134 15418435 15209050 15054321 15129822 14898623 14960760 14758723 14828563
3727 14828563 15303756 15529491 16252230 16201508 15914289 15626102 15427304 14842803 14501396 14585600
3717 14585600 14773493 14702443 14705234 15290133 15277831 15367434 14788428 14470378 14539160 14737360
3707 14737360 15026654 14849606 14490880 14442584 14231818 14370217 14219687 14350708 14052062 13615532
3697 13615532 13566249 13025939 12746593 12457688 12227530 12111409 11683256 11673772 11785838 11322187
3687 11322187 11007255 10581467 10359749 10343491 10433707 10222550 9867263 9852511 10081547 9724639
3677 9724639 9485508 9267413 9050887 8751171 8245459 8541346 8680766 8973743 8738979 8787517
3667 8787517 9027067 8883939 8743846 8301655 8080943 7708487 7495740 7686385 7626370 7678608
3657 7678608 8032044 8383764 8600573 8707638 8752167 8534005 8734737 8724052 8523488 8665011
3647 8665011 8745168 8969061 9174355 9418303 9934311 10580754 10813851 10923892 10859164 10780560
3637 10780560 10684878 10239418 10438008 10570732 11002714 11384702 11590254 11967757 11861933 11906910
3627 11906910 11832653 11814471 11970625 12221719 12585167 12269741 12058592 11992826 11792745 12356211
3617 12356211 12246173 12234695 11906143 11952170 12125465 11890353 12037909 11597050 11730370 11691928
3607 11691928 11593140 11852479 11608582 11626355 11844502 11809035 12193591 12524287 12837391 13170429
3597 13170429 13475806 13815897 14092694 14194680 14944654 14972168 15179122 15555894 16182474 17267204
3587 17267204 17583574 18221278 18613055 19023526 19257088 19171308 19311329 19186286 19220117 19225381
3577 19225381 19650035 20501183 20884060 21627548 22112410 22813116 23028185 23049921 23509748 23696231
3567 23696231 23719920 24154904 24488329 24769230 24898322 24757143 24405068 23945871 23574844 23562934
3557 23562934 23083755 22623512 22215784 21976356 21754620 21438063 21741191 21284043 21271144 20974642
3547 20974642 20755909 20859200 20335947 20005184 19511839 19637593 19731385 19419356 19447707 18780341
3537 18780341 18339928 18185717 17655072 17846082 17315636 16931055 16262803 16281918 16466801 16165441
3527 16165441 16526362 16178321 16233800 16275463 16312779 16020566 15689606 14864885 14345586 14505485
3517 14505485 14838500 15278606 15216027 15274088 15427998 15988580 16254996 16304142 16876940 16614093
3507 16614093 16602568 16593874 16615814 16826217 16523511 16521968 16404149 16030267 16077191 15525973 15121283
3496 15121283 14991582 14547844 14194456 13950742 13651386 12750924 12228583 12115669 11816120
3487 11816120 11283664 11378974 11735631 11638511 11492001 11498388 11301923 10690706 10382693 9487672
3477 9487672 8909875 8674060 8048563 8307784 7399742 6781164 6586724 6726574 6943306 6491770
3467 6491770 6820464 6194624 5725666 5527785 5264161 5232538 4599213 4376615 4334935 4460763
3457 4460763 4793921 4587726 4623912 4657739 4909646 5116634 5018668 4983294 4810494 4536743
3447 4536743 4557460 4572151 4523787 4364111 4164956 4289319 4340315 4716731 4842666 4800865
3437 4800865 4637513 4168547 4410216 4168770 3863918 4068133 4051207 4297517 4293422 4543956
3427 4543956 4949092 4705673 5049729 4723452 4698765 4660065 4691269 4872207 4293934 4239944
3417 4239944 4143839 4333513 4453015 4231944 4750523 5101283 5268360 5675902 5518790 5276649
3407 5276649 4983467 4961506 4992206 4536327 4753296 5357306 5254022 5657446 5696700 5835177
3397 5835177 6137872 6166270 6568097 6697148 6787844 6809633 7045000 7243203 7004918 7159724
3387 7159724 7098612 7624345 7881426 7822511 8120305 7569396 7573224 7172911 6686299 6777190
3377 6777190 6402285 6779538 7195542 7514080 7281702 7294660 7458331 7443454 7533346 7546698
3367 7546698 7541641 7409266 7551099 7769368 7943399 8155467 8039026 7879377 7420141 7710223
3357 7710223 7786891 7679181 7470306 6697903 6746959 6390819 6447838 6513973 6596236 7010626
3347 7010626 6754163 7186986 7214293 6869847 6716355 6306079 6017606 5891935 6041834 6165350
3337 6165350 6651655 6884620 7224701 7746200 7985632 7571299 7119527 7219906 6757875 6841398
3327 6841398 7073778 7090895 7288243 7048124 7859637 8324831 8547221 8981647 8896746 9378555
3317 9378555 8980187 9038999 9379304 9762902 10554117 10886801 12169022 13184809 14592359
3308 14592359 16058083 17135734 18120137 19367628 20900297 22441682 23337169 23850946 24105877
3299 24105877 24112814 24223374 24707974 25330900 26156494 26691188 27526562 27523300 26701716 25302809
3289 25302809 23458724 21911527 19777066 18597669 17531563 16727195 16401464 15497573 15493880
3280 15493880 15367222 15303452 15392802 15107220 15242628 15211641 15870720 16183694 16104364 16329053
3270 16329053 16667810 17418878 18161487 19331345 20809221 22163132 23734840 25456111 27056415
3261 27056415 28889699 31028969 33425010 37094831 41505904 46940631 53124234 60190837
3253 60190837 68019242 76436904 85041717 92860320 98520553 100009823 96586631 90565974
3245 90565974 82492312 73632568 65171616 57936635 51871260 46807001 43259962 40463181
3237 40463181 37904301 35736759 33785817 32041731 30755753 30030104 29669918 29890536 30366908
3228 30366908 31181008 32451145 33489084 34965360 36398103 38813663 41984173 46088253
3220 46088253 51186208 57243893 64379851 72339039 81849746 91778897 101132136 108618611
3212 108618611 112811991 113038559 109182049 102951417 95574956 88347070 81211424 74312265
3204 74312265 67817563 61473493 55589872 50166867 44881206 40116845 36061732 32607766
3196 32607766 29779562 27060815 24619150 23168245 21935591 20850703 20187193 19462654
3188 19462654 18799737 17719647 16775515 16179358 15431433 15080503 14403096 14186519 13918291
3179 13918291 13680875 13692964 13704076 14003416 13995334 14115218 14161965 13696649 13076172 12732429
3169 12732429 12516958 12262399 12436758 12896191 13277132 13477051 13796994 14222447 14345579
3160 14345579 14067860 13875690 13758780 13684952 13658114 13960784 14352181 14437229 14772476 15488818
3150 15488818 15908280 16458811 16799781 17044928 17596982 17379614 17337555 17572531 18066699 18435228
3140 18435228 18928979 20419122 21342419 22436673 23488053 24233100 25243175 26016686 27015036
3131 27015036 28158715 29594129 31137326 32930504 34931197 37217765 39884330 42463121
3123 42463121 45476045 49560630 54073895 59046658 64419812 71051648 78930008 88217488
3115 88217488 98519815 111317795 125719226 141122618 157281970 173220389 187037948
3108 187037948 196694660 201043294 200026370 194257823 185589862 176410245 168176318 162032395
3100 162032395 158204150 156949950 157536245 159112476 160030574 159554114 157081261 151851033
3092 151851033 144717804 137196828 130285538 124355083 119956128 117470804 117297747 118771822
3084 118771822 121872022 126288812 130601604 133633941 134172418 131497379 125207860 115591055
3076 115591055 104656929 93381595 82816735 73314369 65053713 58189912 52192158 47098420
3068 47098420 42720508 39051100 35978195 33295008 30743906 28443365 26043238 24287118
3060 24287118 22755594 21510416 20353501 19624241 18971610 17896329 17038395 15890029 14982545
3051 14982545 14197482 13005878 12625884 12562969 12264454 11842447 11392001 11145063 10528373
3042 10528373 9778457 9740978 8972451 8514428 8196701 7619278 7580914 7276480 7441830 7174237
3032 7174237 6992937 7072524 7319788 7180200 6473297 6222770 6013173 5824280 5746791 5583700
3022 5583700 5541676 5580407 5391871 5473584 5538843 5298380 4769102 4805284 4673901 4479410
3012 4479410 4397017 4180924 4159982 4178641 4079781 4062869 3856331 3906034 3732057 3854559 3692278
3001 3692278 3319676 3284735 3187983 3283051 3678267 3449206 3368207 3296283 3039083 3021628 2738165
2990 2738165 2563264 2473488 2539017 2475525 2717197 2733657 2662107 2928933 2431507 2301231
2980 2301231 2435687 2057832 1659144 1613442 1527743 1503571 1621253 2082738 2390508 2440319
2970 2440319 2599256 2431284 2394382 1893586 1447939 1335160 1234987 1088291 1042816 1224569
2960 1224569 1451721 1818093 2289064 2474759 2370765 1937546 1253742 1096518 680400 536595
2950 536595 845545 1120276 1298509 1492989 1825104 1726510 1538994 1219400 1386233 1201652
2940 1201652 881356 499740 728179 403177 706174 921907 1390162 1608681 1855539 1663828
2930 1663828 1653345 1614982 1413431 1230010 816241 556230 746399 1103493 1407783 1202807
2920 1202807 1000431 1092174 1245281 1149423 876004 1091248 888342 933506 723808 760378
2910 760378 893514 818419 503803 624921 583991 331677 523880 408600 325995 258937
2900 258937 354079 656164 720113 819320 640087 561133 242887 326656 344716 172268 122427
2889 122427 411469 985527 1013283 796568 814985 875552 698384 371845 366907 198321 -129529
2878 -129529 -116134 19729 339142 683456 907295 1216806 1009813 729343 339295 274337
2868 274337 24450 -204501 -152501 109611 196314 489668 675344 620017 783830 925773
2858 925773 1193579 995042 681313 530095 486270 562037 112778 365323 487187 477591
2848 477591 991372 1174972 802498 380158 316749 489671 393094 448918 481739 595140
2838 595140 401039 290337 144947 133838 518139 905926 1091098 956203 896133 946441
2828 946441 1118171 1095869 1014328 945556 807164 1051958 1075866 1131690 1048017 848201 910289
2817 910289 721297 1232427 1244704 1206444 935934 1076576 1077813 960495 763749 669182 523984
2806 523984 624217 832005 994125 1109056 947810 784646 970769 653892 761785 1033632
2796 1033632 955816 652044 445851 671450 649560 466297 527199 500219 596884 542508 592318
2785 592318 702975 417829 439179 216207 -141446 -582161 -518082 -345232 -424649 18513
2775 18513 496244 769822 698123 647271 420384 305430 29103 199861 187708 151862 80066
2764 80066 -198442 -51838 -109725 66893 544588 619544 795521 672725 753330 587585
2754 587585 -125536 -174713 -422291 175160 41417 -59431 61276 147794 274644 202108
2744 202108 153038 219641 106459 133942 47933 151109 -125993 -149215 -72354 -339724 -166009
2733 -166009 185017 118050 329187 166025 -19198 114729 -1125 226842 -299004 -138086
2723 -138086 140715 -435412 76073 -389697 -573598 -313987 -653306 -301426 -117470 56018
2713 56018 318844 232331 262166 59978 -130597 -621148 -853266 -607170 -685705 -652287 -191056
2702 -191056 98648 351546 93033 169220 339196 78508 277876 -111748 -153536 -441356
2692 -441356 -696563 -243667 -348991 -451615 -261447 525178 660875 257701 520825 -56874
2682 -56874 -647384 -857300 -794704 -239929 -51810 -80530 348879 308891 372775 102552 20704
2671 20704 -96708 -357316 -338316 -559209 -406991 -261943 -180119 44197 -188467 -114607
2661 -114607 74546 67466 100160 56627 -138793 -320120 -479062 -364341 -307255 11764 133287
2650 133287 -48811 82196 -196639 -102814 -276686 -604413 -420764 -503412 -35009 173131
2640 173131 204760 356575 170598 191427 -136367 -315658 -93302 -596894 -531415 -264242
2630 -264242 -81592 166051 165367 363446 482413 262129 350062 48863 93245 -355078 -446152
2619 -446152 -409188 -224521 22079 -63448 78272 433672 177263 194569 -92765 -143193
2609 -143193 -121203 -569502 -399719 -176529 -164122 -125617 302840 265083 80641 78150 69827
2598 69827 121142 395631 353853 663002 704949 776752 1173924 1267310 1364804 1287193 1362848
2587 1362848 1485587 878707 1021613 950207 865498 682366 263705 199025 34966 53258
2577 53258 522044 390122 498180 277467 386016 457175 354999 524444 146167 121757
2567 121757 349720 121259 52227 -476923 -622632 -323156 -147404 284849 925117 1134460
2557 1134460 1282169 598850 616677 326169 -50487 -324155 -510978 -42320 76458 206348
2547 206348 232141 210101 581398 492741 707472 461590 372464 148693 -573948 -562394 -550829
2536 -550829 -413111 351586 564111 986133 968405 986108 1064318 438923 706242 674613
2526 674613 325022 185169 94009 382725 347854 131168 614225 517284 986921 802445
2516 802445 766958 1066637 717735 399247 409387 393648 145394 -242675 -70814 2860
2506 2860 544536 902206 1043939 1289949 813118 827554 837297 580834 500307 630450 871767
2495 871767 571749 733279 877411 402851 454600 654595 1037096 973746 555495 707857
2485 707857 519962 676360 392882 404548 273986 411969 353019 806442 753190 765869
2475 765869 863603 795351 657812 489898 841196 1174106 1125245 990386 1031748 1483805
2465 1483805 1156296 828113 480745 369184 437018 521001 843755 1004571 1114565 1126823
2455 1126823 1031523 1079387 998927 958928 1162888 829573 573035 793076 882467 1250725
2445 1250725 1435458 1348074 1381192 1308098 1336458 717965 769550 579713 473770 617343
2435 617343 634491 617278 910329 1067439 1148864 972256 1136357 1357145 1162696 830847
2425 830847 898342 1424742 1205454 1302207 1725587 1711205 1932787 1590528 1744278 1578809
2415 1578809 1210056 993715 960761 1127331 1361216 1444960 1379707 1103817 777909 1258786
2405 1258786 1282292 1081149 804802 860701 1502276 1415433 1920010 2098942 2184252 2429886
2395 2429886 2524058 2622018 2102950 1719706 1901202 1614049 1841122 2300529 2833135 3208569
2385 3208569 3317653 3819840 4271869 4402862 4132304 3835222 3613149 3332821 3239565 3258113
2375 3258113 3616696 4437565 4783780 4788400 5060253 5284784 5416962 5073978 4754734 4412825
2365 4412825 4492332 4908086 4752368 5324725 5645762 5878674 6095154 5927164 6308853 6089838
2355 6089838 5709811 5843747 6069461 6845189 7606864 8178322 8974077 9498313 10199512 10613424
2345 10613424 11466257 12371734 13411306 14566871 16255033 18510078 20814988 23144074
2337 23144074 25158185 25081421 24811991 25977059 28398513 33036822 40238732 49415520 61729491
2328 61729491 76101982 96139115 125151822 170953959 227332781 289661739 318652568
2321 318652568 277599294 212421972 152756777 109946129 81216453 61839375 49437372
2314 49437372 42022304 36845532 33837834 31363275 29538301 27783511 26039707 24598569
2306 24598569 21639212 19024037 17389927 15915441 15004645 14558938 13725006 12716584 11207031
2297 11207031 10251562 9262979 8726761 8316575 7913425 8573793 8892175 9111420 9148945 8807166
2287 8807166 8393989 7348260 6832799 5989134 5319650 4810407 4591723 4665201 4650510 4710290
2277 4710290 5143689 4937388 4690359 4399587 3848491 3548102 3297070 3339674 3725351 3286929
2267 3286929 3080429 2468460 2264184 2476116 2084882 1917651 1851853 2125469 2483148 2516364
2257 2516364 3033214 2559583 2540988 2331924 2308564 2258463 1962909 1713386 1682863 1194003
2247 1194003 1275830 1496342 1884759 2172498 2189425 2580495 2696587 2766838 2520781 1835619
2237 1835619 1125435 741591 1038627 1159160 1334751 1623872 1287427 1443382 1503645 1127923
2227 1127923 1192072 649859 358842 449381 631134 825153 581142 610876 621598 875631
2217 875631 856157 829755 1004871 599901 669382 842100 674123 741802 535210 507790 728800
2206 728800 730456 810796 820794 493485 652179 735710 831586 542241 995728 1235512 981165
2195 981165 694767 619818 611046 332279 -417509 -403339 -586084 -173253 129596 485803
2185 485803 1006974 771299 788281 600600 223692 281445 -205514 -122640 -235556 -407716
2175 -407716 -83030 155194 402993 186400 278684 559842 619391 499172 406184 282263
2165 282263 140409 -55313 32976 65082 137318 321285 356232 372012 243568 118797 217039
2154 217039 66031 60505 263295 98602 -115375 -219823 -71937 -192369 -168730 113153
2144 113153 266680 378338 76321 270447 261764 -99730 -292803 -47025 305648 200144
2134 200144 -74494 -106041 56400 48476 -196236 115332 165037 94845 182262 479723 -46400
2123 -46400 -105002 82065 -120863 1471 -273350 -348750 -203884 -29219 293198 282420
2113 282420 483882 496601 394342 288499 112495 51780 -62086 -136357 -289859 -424691
2103 -424691 -28399 -29342 -16651 175517 286992 314568 526989 233829 167919 -174152 -398979
2092 -398979 -205607 -419027 -295301 -433352 -400111 -129372 -78166 26122 -266234 220885
2082 220885 251474 500235 389837 -143112 -144715 -499503 -458125 -508734 -666460 -771634 -127583
2071 -127583 242680 552032 705543 1035049 725555 179549 132839 -114353 -322710 -562902
2061 -562902 -656801 -201542 -26373 371052 845952 1085811 1736876 1900311 1891653 1441840
2051 1441840 890079 333041 -397506 -504585 -1074591 -409956 173515 554637 854767 863615
2041 863615 810790 446107 -75925 -158607 -487193 -544294 -738308 -411713 -494748 -163201
2031 -163201 396305 726836 1033176 842020 388388 177897 -233107 -356814 -386371 -352383
2021 -352383 -297590 -242595 -160170 114010 286706 248162 181403 251301 446875 447572 393559
2010 393559 154108 191418 -141491 -323327 -205729 -434732 -321628 -269098 -154739 151970
2000 151970 104401 136231 32124 320566 237416 218336 62544 -226992 -619659 -766445
1990 -766445 -625580 -485751 -368196 290222 342228 477161 444367 397112 179248 -191133
1980 -191133 -601870 -416298 -565748 -775296 -605337 -315564 173076 345491 362553 317518
1970 317518 -36698 13420 -328507 -548987 -626493 -524527 -237860 95525 543294 705664
1960 705664 646462 551823 274446 31984 -262439 -441117 -462683 -446049 -708352 -281316
1950 -281316 -248138 -112055 131734 -10036 -160893 -381716 -186750 -632451 -1111927 -889195
1940 -889195 -841931 -340508 73549 491196 582277 487395 537447 -150923 -487530 -729214
1930 -729214 -688329 -491354 -463726 -136149 -162189 -13356 11390 25284 -125077 -163362 96776
1919 96776 -218248 -276705 -429521 -763038 -494720 51184 268602 93263 226896 87120
1909 87120 -4662 731 -206720 -108394 -288225 30070 -374130 63796 -36792 -156549 -336797
1898 -336797 -670561 -299262 -573836 -564638 -427812 -584869 -187445 -517890 -442928 -274488
1888 -274488 15753 -121742 -313913 -351753 -129596 -166859 -310951 -416377 -61394 53190
1878 53190 162335 -1928 -390942 -458496 -420453 -625390 -406142 -270068 75891 180583
1868 180583 -84953 138861 -143960 -377829 -568959 -611540 -283748 -593259 -408638 -463145
1858 -463145 -481410 -208431 253838 655137 670795 384116 -53174 -456648 -764927 -913403
1848 -913403 -771409 -432638 -158514 672584 868736 715233 582187 228468 -29026 -70636
1838 -70636 -567684 -770707 -839224 -921992 -558470 -308999 -23240 620609 985915 920268
1828 920268 203226 -113815 -553039 -781588 -941015 -881658 -736451 -482621 -338582 -31053
1818 -31053 180222 259626 331131 203717 -237223 -131398 -335334 -431100 -874843 -854989 -488966
1807 -488966 -198216 -13293 184629 246171 27495 68183 -68411 -234977 -65356 -228561
1797 -228561 -143451 -99824 -77386 -304829 -164260 140835 150566 239107 421413 431817 152700
1786 152700 -193131 -250743 -269699 -130259 -247384 -202438 -199515 -125891 108450 213456 235001
1775 235001 228358 -26046 -168778 -79394 -127565 -533489 -415133 -222000 -299679 -573279 -140335
1764 -140335 357704 615216 673036 246514 276685 -191960 -535119 -845628 -765120 -559829
1754 -559829 -152015 222254 570840 512585 395135 196938 -94498 -108855 -24990 -663435
1744 -663435 -721666 -283336 -272177 -127355 304821 407945 299801 48476 244491 5235
1734 5235 -313280 -798511 -728632 -420597 -120299 98567 271219 206232 311095 159575
1724 159575 38569 -49816 -151292 -343144 -785858 -851209 -651811 -343739 296690 629915
1714 629915 682161 471651 250465 -24286 -472350 -624888 -834617 -899117 -330212 -83730
1704 -83730 160192 32384 63633 139266 282202 486820 184558 -334576 -675358 -742279
1694 -742279 -336411 -552279 -238345 446762 638380 896450 668587 497229 58967 -466982
1684 -466982 -835755 -641562 -766557 -478723 -207954 -85592 41713 357957 753358 558450
1674 558450 355937 228421 47802 -63711 -405324 -759821 -1053505 -798306 -453164 -122481
1664 -122481 588559 585517 355560 331872 67701 -25058 -398522 -355167 -481676 -528552 -577441
1653 -577441 -510057 -137978 135874 455456 927128 654628 856674 536694 39050 -75549
1643 -75549 -607726 -392916 -230470 -300157 -426596 -281181 165215 498098 670349 525770
1633 525770 413253 325702 193156 89163 -71501 -212029 -32293 -166129 -264815 188295
1623 188295 450403 393221 374396 -145871 -266265 -197197 -163090 -241309 -286276 -323298 -575933
1612 -575933 -323393 -336219 -392320 -297863 -40354 150683 256976 423731 401082 -260714
1602 -260714 -516260 -287129 -7485 92626 -181709 -66734 85474 21461 -199878 -139327
1592 -139327 -102895 -257687 -242146 46246 158565 -56182 -314359 -114387 -76412 36675
1582 36675 375347 60153 -223126 -91845 110576 -48023 -319819 -1617 -62281 -496118
1572 -496118 -451944 -272256 -16784 -56574 -186246 -123530 -179410 -403439 -98099 -400260
1562 -400260 -345835 -296928 -190904 26910 199450 268565 236205 27037 -354067 -495102
1552 -495102 -397968 -168724 -172501 -402540 -342979 -71210 303985 133604 -218432 -60508
1542 -60508 -74621 7877 -176039 -196599 -260520 -741519 -579015 -466881 -5041 416507 429858
1531 429858 426236 80690 -270691 -387907 -415514 -404263 -230333 149081 585434 310732
1521 310732 27690 -77289 -146873 -225708 214514 337813 380163 93407 -438716 -530266
1511 -530266 -438770 -484127 -154886 117207 96003 57841 -198181 -328742 -151598 -325226
1501 -325226 -249797 -425035 -258678 166638 -257854 -394255 -514601 -316302 16941 133668
1491 133668 329521 -36952 80874 126828 -391494 -478919 -493232 -188577 -268827 -569531
1481 -569531 -530360 -469108 -290657 -277890 -428115 46457 -35364 -261738 -325719 -558219 -677598
1470 -677598 -469261 -89315 -18567 -174053 -119013 -148860 -85997 -14968 -317287 -259231 -353314
1459 -353314 -255566 -91299 -77912 8161 -65386 -75314 -269181 -195850 272711 354829 173403
1448 173403 176704 -44577 -400511 -674131 -563226 -749542 -374379 -51804 93089 138281
1438 138281 -90557 -61295 -259474 -646024 -156998 -133782 -244161 -67009 -510218 -687912
1428 -687912 -891807 -907425 -172062 302024 597760 554803 515151 300544 -165298 -284694
1418 -284694 -650326 -628845 -457014 -534514 -38801 -244516 -218049 16982 -15243 395066
1408 395066 194885 136816 19787 -418795 -542249 -518425 -290813 -274431 -252105 168078
1398 168078 -27795 110902 174474 11321 -93252 -231122 -205262 -350405 -731812 -800800
1388 -800800 -876712 -508719 54874 477766 621330 301562 1473 -108736 -396303 -490970
1378 -490970 -642833 -524550 -387472 -399900 -458254 -458707 -332047 11462 377781 326899 363578
1367 363578 263513 -288192 -527968 -699245 -592139 -492115 6765 237532 124893 175570
1357 175570 69654 -196601 -50634 -267973 -539570 -562579 -495223 -290123 -85531 -107480
1347 -107480 -244260 -249074 -237964 -93724 208590 278598 73301 -317657 -748260 -785359 -710795
1336 -710795 -670227 -387430 21618 136261 28234 165435 104627 -113131 -262950 -277899
1326 -277899 -18183 -126013 -170037 -365367 -504934 -339068 -213071 -341844 -431143 -347853
1316 -347853 -120016 -4105 -51947 -18984 236149 -10536 -389105 -256346 -332114 -487377
1306 -487377 -645813 -623435 -225190 -211360 225769 478442 158911 34390 -68689 -292594
1296 -292594 -269613 -198812 -447019 -494760 -575112 -888113 -712626 -625228 60892 310809 148695
1285 148695 446880 98379 -175703 -795762 -1280264 -685939 -599521 -53220 193618 51671
1275 51671 67493 -40556 36379 -159138 -398256 -276966 -411273 136684 4567 46838
1265 46838 169803 -174331 -336853 5079 192887 383077 149721 15869 -253438 -508989
1255 -508989 -494293 -485440 -31758 -263487 -25815 371315 418360 425580 -79675 -402546 -257171
1244 -257171 -66353 -46331 123604 283632 318283 300988 146067 3185 100728 136842 -150082
1233 -150082 -155924 -461592 -192910 -206749 -397248 -302218 -237474 391674 676378 656050 400467
1222 400467 -87509 -219849 -505365 -177853 -246435 46810 5348 -139393 361800 576974
1212 576974 399402 510470 157969 93160 -229655 -592168 -602054 -358057 -340185 -5949
1202 -5949 452181 580205 617078 263724 5266 -115645 -345904 65487 171009 -25583
1192 -25583 -204374 -489766 -60177 316021 593618 464845 261909 354048 187532 -79236
1182 -79236 -420518 -368738 -106150 -5541 209715 558032 606611 599299 361159 -39450 -83971
1171 -83971 -272047 310887 281365 35730 211536 121217 37839 -300288 -30565 19980 -111380
1160 -111380 175336 21854 -10206 -250621 -652795 -370975 -270325 162986 342845 46017
1150 46017 362508 5166 -225782 -221267 -87704 -147748 -133145 145701 315944 394744 309971
1139 309971 363689 280904 55346 223317 78669 161458 99881 49814 220242 264674 282584
1128 282584 294307 -73872 -176294 -18974 -118713 -49586 -204243 -110323 18806 -11083 38915
1117 38915 -98634 -119397 -142467 6349 182476 234807 552739 411201 78347 -39281
1107 -39281 -426624 -482855 -50715 187926 168406 -58379 -109272 -269982 -282085 -171922 49028
1096 49028 530429 422649 430559 449200 28812 -492602 -657133 -198804 153548 194349 345707
1085 345707 423148 455194 235717 146027 152613 -120198 -486553 -383642 -465007 -430175 -385601
1074 -385601 -366460 25220 479388 767402 1133161 1049469 602087 308151 -219601 -518797
1064 -518797 -765788 -360850 -197058 115212 433074 449982 589965 478650 284850 57447
1054 57447 -635272 -453005 -406409 -686556 -730406 -662542 -397723 -118645 341726 577130
1044 577130 595138 423167 86176 101731 -86641 -357930 -338376 -189567 35681 33500 423668
1033 423668 644423 577920 583330 367277 -30406 -76851 -404305 -796042 -599833 -300251
1023 -300251 228507 319548 382438 633881 568185 272406 31832 92521 -399363 -653219
1013 -653219 -221483 91923 443690 497282 403847 17490 286190 495444 221795 301489
1003 301489 -32219 -217622 -490701 -448795 -322945 -445341 -200528 377436 671053 694269
993 694269 313138 -161324 -459283 -375550 -358413 -153938 24622 -103240 -307555 -255931
983 -255931 87178 161033 377968 245782 121574 176976 365930 37650 -77032 -28879
973 -28879 -414948 -298243 -142231 420484 548262 331489 329703 305415 109292 151559 242054
962 242054 86412 -434270 -467554 -632764 -619853 -466737 -350717 -14803 282075 740981
952 740981 621861 493222 297402 -213056 -385828 -624275 -731030 -706703 -572292 -83602
942 -83602 166401 340769 610387 620978 431952 497194 15701 -125315 -546780 -723154
932 -723154 -391026 -188838 188333 396786 696440 244052 188808 83033 -195493 -101160
922 -101160 -322344 -382952 -344064 -212832 39547 -26738 -115127 -13480 -127758 248823 102142
911 102142 98288 -259905 -314869 -253527 -230461 -118250 100416 413071 263766 -157666 -38365
900 -38365 -65132 -114051 -53274 124626 226932 144140 -131323 -229400 -168468 113467 133741
889 133741 197817 169744 177227 -112676 -432564 -591557 -433284 -43867 70944 397980 536854
878 536854 744996 347799 16878 132171 257815 -134368 173702 81938 -356435 -577497
868 -577497 -448665 -265786 -156743 219126 451495 592924 643758 344422 443271 177573
858 177573 -111617 8773 -168238 -30148 170809 146184 360683 615599 313147 605814
848 605814 691681 410785 56535 -434530 -694400 -647071 -261715 -298611 -167192 137051
838 137051 431495 669434 389423 226604 553604 119487 -2355 -309702 -414071 -709152
828 -709152 -517866 -600803 -220732 -74598 36729 436018 494414 80156 72456 62952 -92348
817 -92348 -430493 -193869 -148668 -319407 -87524 301507 371573 174215 254088 241238 442055
806 442055 421341 322385 38757 -410685 -701662 -645387 -614114 -542244 -147125 205371 8450
795 8450 376451 339661 329510 282376 321554 -145066 -428690 -559343 -642490 -669349 -542469
784 -542469 -324535 39030 212282 678092 631504 366338 71647 132536 -46163 -388296
774 -388296 -565140 -589215 -312236 -58080 121351 110672 -191607 -265441 -2256 445264
764 445264 164752 -47112 -346487 -377571 -93056 -542455 -397188 -95690 -144559 257294
754 257294 493990 572241 380519 343831 175203 -111483 -56127 -288259 -394139 -64083
744 -64083 -55391 31752 -19086 39490 366140 34117 22512 61672 64193 422069 386224 308377
732 308377 86061 -133395 -96866 -310494 -378105 -430995 -252986 24699 143971 333326
722 333326 400369 191792 474184 137436 199731 -50087 -163953 -164790 -39024 241019 336959
711 336959 505946 264956 397682 374247 346373 357081 118455 -37104 -398679 -597487
701 -597487 -523065 -276725 -12941 -24385 -11709 106156 -224653 -422395 -146377 -152032 189517
690 189517 217775 293835 303757 -128355 25318 -91079 -82536 24079 -10725 260889 88226
679 88226 -90987 -118419 -151364 65898 -152249 239884 182972 100373 132131 22417 -126929
668 -126929 -323823 -286603 -92408 -1560 338998 350504 307586 204350 -55876 -56102 -22432
657 -22432 -282102 -407578 -345989 -306921 -469357 -306156 167515 -221661 -284107 -285388 -297495
646 -297495 77530 367543 363254 238674 252641 -64142 -167321 -266929 -805667 -891344 -511014
635 -511014 -179776 136211 259143 338446 305594 231365 235821 -98648 -147186 -194258 -440495
624 -440495 -335586 -378008 -145971 -117911 105073 379897 488581 643498 369203 101027
614 101027 -363889 -734135 -930966 -1011096 -925570 -360509 -419172 -15827 357681 409349 232045
603 232045 -10299 33999 -61992 -299829 -255143 -436243 -444100 -594378 -437382 -265412 -38851
592 -38851 96944 96781 118153 196330 -67886 -54219 -373370 -919269 -886830 -506871 -159051
581 -159051 -35400 60217 98790 -286801 -97811 249659 408712 94462 -195800 13993
571 13993 -134409 -392332 -460471 -494956 -280029 -362538 249063 515278 227232 75273 -286288
560 -286288 -342168 -276206 -438643 -279209 -483558 -135449 512764 161054 483606 345837
550 345837 137551 -50815 -290961 -510736 -616525 -540961 -642078 -733438 93518 182095
540 182095 389449 687028 452007 253970 150057 -157 -60185 -602458 -558174 -860892
530 -860892 -409895 -250861 -26043 430860 331586 523312 407036 173058 141947 -392435
520 -392435 -470048 -520470 -411168 -186695 -272051 129008 147620 92010 130786 69133 420692
509 420692 -92787 -324316 -265197 -655105 -246301 -393747 -381985 -115204 -243146 436605
499 436605 457415 215963 184270 -162307 -216406 -561133 -501381 125251 -37871 170748 -29692
488 -29692 382064 181072 -429933 -164816 -296331 80777 -34457 -373122 -12118 -66514
478 -66514 52667 -56090 -140970 268930 -68896 177091 211812 -228540 387306 554311
468 554311 523410 128267 72027 402452 -352020 -306859 -624782 -560716 -240671 -457497 -68390
457 -68390 56302 24822 224167 12658 490660 254465 214944 203196 -197330 -372747 -405207
446 -405207 -311724 509653 138302 279452 63600 -33489 -123136 -428403 -326031 -354004 -310663
435 -310663 -315036 -323680 111311 -32225 117623 348818 222307 345563 155166 119381 243992
424 243992 -350211 -71896 114761 11211 377119 196244 217202 14834 -359007 -120739
414 -120739 -298039 -176831 -381115 247084 283269 -112567 307083 247418 306300 -22919
404 -22919 -68797 -282454 -714266 -565304 -294566 -232525 -185881 -381374 92945 -315376 -149089
393 -149089 44504 -61702 -148664 -172993 135664 257694 -72053 -27449 -371254 -107715
383 -107715 145234 -17702 76033 -41824 -20526 -132432 -609690 -214857 -255311 -159596 -138475
372 -138475 -534545 -475015 -463481 -118451 105323 -83506 367280 242225 81926 114040
362 114040 65040 362651 -17933 -363831 -147291 -223507 30287 -311352 19699 93710
352 93710 190953 602294 347550 70700 -60790 -188049 -135064 -433648 -339899 -396563 -379032
341 -379032 123882 287954 563915 342053 151914 116329 -176180 -227849 -257996 -603031
331 -603031 -570288 -446193 -104477 96994 688387 680779 272681 452910 -15144 -136880
321 -136880 -53481 -225261 137083 -1789 208356 42599 72220 249451 68420 203418
311 203418 43807 -91298 -222424 -280123 -221043 -282532 -217470 103758 153522 263825 317471
300 317471 -10006 -30781 -579930 -253870 -176112 -227639 -138600 -133976 492245 455043 476125
289 476125 304845 -498851 -218072 -252992 -104006 -133932 -410685 -115194 -24768 378401
279 378401 563310 356407 282669 -182926 -129041 -177657 -581922 -465044 -588513 -715146
269 -715146 -327449 51828 750588 983737 1138803 768443 170476 172258 -526160 -394406
259 -394406 -495310 -698160 17882 -66082 520120 455810 286881 799841 601367 608412 48569
248 48569 -380784 -453380 -837592 -414835 -262786 -42962 -121270 -338620 341854 398310 368061
237 368061 256084 243622 -68917 -205817 -64967 -65791 -512452 -534450 -322848 -504972 -209265
226 -209265 -242701 275733 400220 126584 74690 -74538 29323 -388615 -332348 -334191 -682056
215 -682056 -489917 -263013 230754 378495 47619 297777 339408 202801 -308785 -450735
205 -450735 -549771 -363723 -147538 254036 368834 150483 105407 170782 374951 257682
195 257682 60119 -36926 -428225 -289164 -153157 41253 -123688 -183390 -40162 -73672
185 -73672 358801 365259 301307 -177192 -603915 -441742 -157214 244507 412865 439068 491816
174 491816 429685 495989 205231 -198631 -421540 -692192 -734139 -445571 -182592 199046
164 199046 487770 350942 384067 359432 163358 -218449 -571455 -511992 -437413 -138767 -161006
153 -161006 157497 366762 216802 619173 556446 275084 -9266 -455910 -429533 -919513
143 -919513 -465358 -175389 -281354 -396629 158543 684801 698938 481425 -151806 -437659
133 -437659 -818417 -636262 -396841 -50411 -11811 29799 303607 418963 435269 126811
123 126811 -185761 45596 -353686 -103859 -79140 -31522 -144692 -363862 169175 99589
113 99589 230419 345796 925 -102627 -164251 -75544 -194882 -155608 -23270 64191 433061
102 433061 425385 252786 -95664 -321042 -608103 -331354 -64674 82188 202159 46700
92 46700 211340 124606 333312 -70119 -260407 -310206 -668790 -209436 88466 183539 -4535
81 -4535 -145588 -35159 -295043 -303323 -119445 -213607 -315541 -480421 -56560 37503 133825
70 133825 1498 -104729 110125 17858 -93507 -287395 -394667 -650716 -396277 -277588
60 -277588 -157074 157754 238690 341760 116092 128630 -138369 -524830 -912031 -795143
50 -795143 -674477 -586153 -144376 191774 413181 251800 -96974 16658 -269020 -617885
40 -617885 -965959 -943429 -518296 -408246 -210259 -41632 -13916 64734 124091 136661 97149
29 97149 -321006 -615950 -667211 -681899 -534930 -507061 -145243 94915 218596 380228 313543
18 313543 140598 -231728 -377132 -452155 -655967 -565066 -372212 -311731 -375156 -241267 92136
7 92136 89466 155579 48691 -297477 -512556 -409003 -277544
0 -277544
$$ Imaginary data points
##PAGE= N=2
##DATA TABLE= (X++(I..I)), XYDATA
16383 -1701717 -1643589 -1480438 -1381657 -1414345 -1260931 -1539415 -1817982 -1834724 -1522817 -1447542
16373 -1447542 -1658148 -1512142 -1250797 -1008507 -963512 -1052488 -1165605 -1228435 -1005779 -1147525
16363 -1147525 -942064 -994408 -1428232 -1379393 -1232995 -1055567 -1155040 -1073640 -970967 -1014339
16353 -1014339 -952328 -899791 -811456 -828817 -890173 -981125 -1011644 -1049319 -975095 -974312 -852566
16342 -852566 -713951 -584921 -227510 -184403 -317322 -596791 -624890 -465140 -564259 -646411
16332 -646411 -853295 -672954 -549591 -375278 -60145 -232236 -80079 -359451 -479959 -191454
16322 -191454 -163223 -342174 -412616 -397599 -224934 -62529 237421 379040 399128 329312
16312 329312 -112378 -116916 83580 61623 195925 38840 238491 206464 99333 219710
16302 219710 43746 118599 148396 161098 368094 43645 -43953 58976 251453 339404
16292 339404 622470 829697 689866 532772 593508 340748 250786 223747 391540 555266
16282 555266 643384 680665 754156 1201718 1225731 1108547 1023824 647151 809427 880112 887340
16271 887340 822310 865265 1206021 1062394 796417 946490 935757 828113 781750 482999
16261 482999 640488 471003 579734 771466 896397 1329361 1271773 1369149 1239424 1244447
16251 1244447 1409947 1175259 963870 692751 949558 1546971 1710076 1755688 1564159 1621622
16241 1621622 1675718 1318606 1058417 1318657 1383160 1189882 1117677 1256876 1466388 1444634
16231 1444634 1754492 1740138 1777717 1626127 1588824 1500052 1001984 1073505 1136211 1178601 1542477
16220 1542477 1775517 2295657 2279416 2370858 2260718 2096718 1522580 1144805 984633 966562
16210 966562 889379 1241842 1593056 2139552 2220339 2231040 2220616 2317688 2051326 1529547
16200 1529547 1189484 1680381 1729521 1717047 1845298 1690043 1997839 2204907 2288644 2549361
16190 2549361 2567810 2730772 2178661 2112109 1845706 1640016 1369183 1277719 1764218 2095676
16180 2095676 2538873 2572685 2619623 2589192 2056038 1975708 2015014 2130261 2026402 1795860
16170 1795860 1890855 1683865 1799124 2041751 2120989 1998948 2490088 2515882 2548590 2276372
16160 2276372 1979909 1856243 1612701 1953301 2018129 1877560 2417953 2296344 2144008 1922971
16150 1922971 1935089 1644235 1533592 1725130 1779709 1952109 2142492 2284054 2660719 2260843
16140 2260843 2337676 1870915 2174829 1916741 2082913 2178832 2160123 2007202 1978377 2043937
16130 2043937 2075985 1928293 2264661 2391770 2299171 2115975 2173866 1824516 1808330 1753290
16120 1753290 1895276 2196154 2501619 2971732 2886447 2940338 2851288 2386223 2029502 1770050
16110 1770050 2050004 2376116 2432241 2621743 2510743 2615055 2210732 2296230 2302653 2461008
16100 2461008 2476858 2315427 2496024 2333347 2204517 1936795 2091648 1926240 1880783 1968020
16090 1968020 1979508 2416870 1907515 2186700 2251622 2329705 2411717 2015476 2011574 2016258 1982760
16079 1982760 2118027 1968421 1892422 1743257 2214474 2261346 2620708 2788851 2774893 2520226
16069 2520226 2212447 2184405 1977966 1539051 1424457 1769182 1846507 2196113 2859912 2827523
16059 2827523 2844776 2324932 2168075 1834134 1748583 1681608 1777754 2070940 2215908 2285446
16049 2285446 2755375 2742822 2904872 2465880 2448708 2229691 1984576 1542110 1497148 1695121
16039 1695121 1622976 1783973 2166775 2616131 2836742 2966804 3070839 2984887 2126592 1418120
16029 1418120 1150504 1106465 1613352 2279992 2890751 3146923 3169271 2957999 2386004 1994529
16019 1994529 1953733 1875676 2093825 1802148 2060053 2204648 2109041 2092488 1921499 2542472
16009 2542472 2602622 2670102 2541833 2202004 1757892 1288118 1384243 1541001 1860376 2546666
15999 2546666 2835651 2812065 2582106 2573978 2200692 1815919 1538677 1782384 1695792 2009338
15989 2009338 2167416 2615121 2760065 2401382 2383208 2517862 2018772 1928390 1629152 1924587
15979 1924587 1659359 2064247 2157479 1948562 2083305 2157850 2337328 2438604 2035911 2073231
15969 2073231 1814509 1757922 1817629 2189028 2198467 2253630 2058485 2276596 2501267 2529836
15959 2529836 2375705 2041534 1870473 1716490 1948235 2289930 2541898 2721734 2788908 2887801
15949 2887801 2836984 2256089 1802899 1857693 2183844 1962836 2053993 2271445 2316397 2207374
15939 2207374 1902238 2027514 1931810 2000141 2094210 2033834 2201431 1995012 2362113 2323427
15929 2323427 2133827 2288242 2434200 2468415 2454218 2127243 1872103 1728663 1842902 1905924
15919 1905924 2121064 2291853 2654601 2638356 2579664 2245006 2108076 2115853 1910907 1726230
15909 1726230 1605051 2031390 2268608 2271274 2597115 2497839 2609084 2039624 2086378 1984065
15899 1984065 1674566 1628374 1589215 1975560 2065167 2475112 2821226 2519316 2529602 2458384
15889 2458384 2678706 2327677 1900326 1661394 1740267 1912816 2044645 2234696 2119707 2501897
15879 2501897 2511426 2437396 2610282 2112994 1940533 1511129 1354503 1409674 1878954 2286129
15869 2286129 2501575 2482529 2336499 2348679 2077638 2250203 2533781 2101267 2380788 2422024
15859 2422024 2522633 2133294 2185421 1868743 2083333 2527862 2420385 2662464 2663710 2626510
15849 2626510 2476154 2463942 2249807 2148875 2058222 2281315 2488407 2500491 2322208 2184514
15839 2184514 2212164 2299756 2606229 2944078 2798025 2448356 2150156 2200402 1850535 1790219
15829 1790219 1995496 2047231 2337250 2580505 2613251 3361938 2878354 2875909 2597418 2242032
15819 2242032 2193715 1788616 2067224 2138656 1948439 2323228 2651309 3554125 2957889 2964748
15809 2964748 2364694 1936653 2181402 2099774 1923466 1899737 2148985 2626521 2627416 2802491
15799 2802491 2950257 2925531 2872522 2896421 2997620 2473866 1597032 1866002 1816348 2082750
15789 2082750 2783110 2618919 2800843 2498028 2626219 2695165 1927699 1816337 1531397 2227462
15779 2227462 2529117 2444178 2875990 2709220 3185279 2853583 2397881 2085007 1970829 2049548
15769 2049548 1843731 1946856 2314009 2439203 2804022 3211406 3376666 3142261 2838493
15760 2838493 2653339 2297823 2088531 2407059 2243310 2547167 2470612 2838721 3193111 2880706
15750 2880706 2951483 2600183 2203439 2343921 1882654 2065853 1917153 2115330 2446586 2988368
15740 2988368 3070725 2642238 2781821 2807169 2232387 2163335 1725914 1998904 1837230 2025740
15730 2025740 2607666 3014364 2974512 2862877 2767120 2611444 2376211 2463431 2470472 2223536
15720 2223536 2103522 1966474 2000642 2442764 2389744 3076130 3101997 3101656 3003851 2356491 2348520
15709 2348520 1524433 1795413 2193423 2097566 2452835 2733308 2761294 2513316 2237437 2358464
15699 2358464 2250380 2434492 2242145 2152578 2442345 2536112 2409957 2486148 2415187 2387571
15689 2387571 2189639 2397354 2425948 2318048 2456637 2216414 2338071 2567738 2353128 2412193
15679 2412193 2202173 2183505 1789076 1957866 2083236 1897591 2214073 2590105 2831893 2797780
15669 2797780 2271586 2820991 2585062 2808785 2780167 2861881 2657671 2405718 2427423 2669999
15659 2669999 2432793 2613510 2786220 2784971 2728379 2673654 2359605 1890602 1464854 1761741
15649 1761741 2075577 2463868 2478277 2534641 2295904 2090758 2397928 2349803 2232683 2175487
15639 2175487 2410200 2779991 2585068 2084660 2025114 1881124 1915615 1492120 2371480 2560418
15629 2560418 2492338 2837656 2554048 2357261 2065033 2484393 2462229 2021335 2066172 1822710
15619 1822710 1824971 1655605 1860453 2283421 2387292 2621992 2829769 3049100 3064139 2532147
15609 2532147 2063479 1717624 1458130 1371647 1642409 1929546 2459204 2407552 3299852 3274914
15599 3274914 3013627 2490618 2173232 2102086 1936455 1790066 1917970 2061754 2576207 2865721
15589 2865721 3182497 2954074 3382892 2772621 2498767 2577411 2252980 2206290 1706203 1672463
15579 1672463 1808451 1645375 2160818 2282155 2576880 2808521 2854275 2805258 2499729 2234932
15569 2234932 1993768 1908956 1998341 2298767 2690767 2903706 2851142 2809569 2548959 2028907
15559 2028907 2228219 2391516 2585458 2644569 2278089 2408464 1935332 1852071 1846921 2117084
15549 2117084 2366275 2461398 2687887 2540133 2288473 2435731 2276438 2293655 1994069 2153822
15539 2153822 2299099 2378083 2723761 2677056 2392857 2286942 2077673 2363199 2663808 2612950
15529 2612950 2439241 2400614 2351348 2338249 2447736 2290364 2271421 2245943 1907392 2187542
15519 2187542 2253731 2092185 1992968 1694492 1688541 1904315 1899132 2015408 2040030 2402255 2189998
15508 2189998 2261685 2108107 2177128 2177016 2145815 2209185 2287761 2391945 2504227 2400035 2500495
15497 2500495 2491727 2598249 2377890 2353761 2588623 2561666 2416155 2259134 2156311 2231198
15487 2231198 2048678 1945750 2354410 2621308 2977673 2856963 2455339 2226707 1299289
15478 1299289 1350218 1454563 1644661 2260043 2260489 2159130 2314706 2369697 2371308 2030996 2048182
15467 2048182 2105391 2317308 2469478 2307911 2410608 2364839 2164775 2590033 2359227 2551903
15457 2551903 2726108 2504565 2691972 2346364 2472602 2280681 2253501 2124014 2130922 2461660
15447 2461660 2362637 2557773 2862568 2043866 1936080 1981999 2315142 2327422 2266768 2678669
15437 2678669 2408645 2379948 2699896 2476957 2520445 2108263 2271134 2426240 2702325 2946785
15427 2946785 2998675 2668190 2677559 2536843 2264603 2112460 2343858 2041188 2017093 2314886
15417 2314886 2252205 2218752 2180153 2113788 2560639 2474272 2640628 2625104 2553685 2729766 2346854
15406 2346854 1976932 1995472 2136356 2474585 2553311 2971595 2991847 3058377 2918527 2639626
15396 2639626 2534581 2137441 1944920 2219492 2300041 2696524 2715044 2706353 2319400 2286825
15386 2286825 2599004 2146284 2228180 2247327 2110420 2278843 2485558 2409648 2192923 2289226
15376 2289226 2806323 2870038 2804239 2542028 2355792 2451724 2097084 1877781 2048885 2169157
15366 2169157 2451890 2719686 3275062 2981226 2939040 2959257 2411817 1954067 1824237 1812228
15356 1812228 2091844 2085300 2631149 2514497 2561852 2579155 2762950 2652814 2525124 2539806
15346 2539806 2611422 2353136 1882994 1399411 1661085 1980714 2197201 2454669 2457924 2608587
15336 2608587 2693759 2806588 2851732 2371688 1806826 1738497 1754609 2112121 2390766 2525401
15326 2525401 3037623 2965112 2961000 2463084 2359383 2132167 2029676 2288000 2187748 2545652
15316 2545652 2349149 2125645 2336242 2021317 2313753 2702000 2833910 3086835 3003251 2847882
15306 2847882 2561751 2381683 2314569 2241917 2428187 2725712 2730660 3102741 2750897 2639527
15296 2639527 2603500 2596963 2501552 2660934 3208963 2870618 2599581 2587463 2430032 2213852
15286 2213852 2188517 2475248 2402513 1992891 2095446 2183504 2357868 2436529 2338536 2561291
15276 2561291 2575138 2760054 2750388 2466229 2581338 2629878 2582704 2406407 2362771 2656259
15266 2656259 2545871 2763815 3021516 3332269 3109780 2350207 2306588 2248231 2284437 2310386
15256 2310386 2458713 2559159 2413273 2810644 2841169 2661212 2544463 2349893 2578763 2543654
15246 2543654 2160355 2431828 2283725 2374507 2138446 2160192 2133171 2236274 2691660 2786899
15236 2786899 2940755 2823023 2633963 2582474 2483003 2359910 2461608 2142098 2327311 2767411
15226 2767411 2769291 2821217 2507938 2798251 2679559 2564458 2785646 2743682 2715213 2352730
15216 2352730 2370483 2368805 1885202 2026737 2076087 2522796 2513988 2799173 3106577 2656739
15206 2656739 2497568 2294510 2211531 2181708 2187423 2510156 2387560 2525138 2526365 2231350
15196 2231350 2651983 2445847 2357268 2530923 2370929 2277456 2315149 2485753 2445932 1959102
15186 1959102 2100153 1999559 2124878 2270286 2340816 2689795 2545901 2335901 2549766 2398732
15176 2398732 2471276 2202194 2363883 2510559 2590099 2687694 2254971 1908024 1986750 2047343
15166 2047343 2074017 2013663 2796457 2987817 3099390 3131942 2762250 2615769 2347832 2118828
15156 2118828 2079159 2084798 2141878 2651093 2877008 2968178 2862446 2889227 2762054 2767686 2803506
15145 2803506 2507328 2485850 2414270 2217679 2217742 2200801 2675689 2884617 3022560 3104339 2944773
15134 2944773 2807780 2668720 2720581 2361785 1926668 1988165 1937651 2102070 2397563 2548172
15124 2548172 2609615 2346642 2453747 2389822 2317222 2443621 2785478 2716522 2382470 2412064
15114 2412064 2374038 2176304 1815135 2112026 2483365 2966451 2800823 2929413 2735405 2657583
15104 2657583 2765211 2759467 2504740 2141723 2244676 2470482 2360612 2410222 2391616 2442190
15094 2442190 2543200 2394829 2727925 2761428 2586184 2740490 2683678 2387837 1986212 1842160
15084 1842160 1866693 1986865 2216731 2530532 3101036 3297083 3151574 3102358 2689327 2192098
15074 2192098 2313683 1991479 1865532 2141554 2285955 2577774 2593156 2739497 3078749 3067833
15064 3067833 2729130 2665182 2621251 2237575 2223542 1943140 1970545 2225192 2263248 2679130
15054 2679130 2653570 2594079 2705206 2414880 2095159 2008797 2159098 2143077 2152704 2226677 2613338
15043 2613338 2907975 3013231 2958803 2848256 2649708 2501490 2561040 2175711 2032760 2096922
15033 2096922 2317168 2329492 2393794 2847429 2825638 2840684 2754405 2576403 2420314 2088123
15023 2088123 2038862 2259368 2313948 2167660 2015726 2554650 2519862 2398746 2676958 2685358
15013 2685358 2729545 2474705 2046622 1757717 1687035 1960475 2273616 2599564 2789538 2902726
15003 2902726 2663832 2577659 2694972 3013421 2613862 2417900 2071083 2191773 2389736 2232856
14993 2232856 2206052 2331632 2556620 2823903 2569546 2607073 2341474 2209405 2233390 2169336
14983 2169336 2377411 2348738 2392625 2443226 2463958 2820224 2519681 2596658 2511240 2454196 2656830
14972 2656830 2652363 2960522 2683978 2370485 2018215 2057451 2428813 2360635 2362047 2468767
14962 2468767 2412448 2807363 2791660 2710453 2554215 2550757 2338984 2349378 2291430 2548758 2500808
14951 2500808 2548433 2420694 2559835 2711539 2495498 2545672 2716930 2352534 2546324 2570375
14941 2570375 2656983 2361007 2518267 2435291 2605323 2685750 2719829 2837826 2617673 2689859
14931 2689859 2649138 2025169 2320126 2286940 2333317 2477640 2607386 2947385 2713191 2182192
14921 2182192 2265822 2090871 2153388 2451976 2330405 2388303 2244452 2402582 2778989 2955427
14911 2955427 2921612 2539271 2337143 2343145 2416763 2522997 2467565 2460721 2291600 2431437 2513473
14900 2513473 2484700 2475190 2518597 2272699 2296669 2107297 2434179 2470418 2285420 2433329
14890 2433329 2629834 2917690 2859702 2920405 2507464 2345428 2415886 2578699 2707936 2478072
14880 2478072 2565978 2687850 2343785 2309997 2509144 2466887 2563755 2490473 2665169 2811376
14870 2811376 2775138 2434195 2365018 2279673 2178204 2610849 2864664 2684517 2705599 2294246
14860 2294246 2279131 2279736 2537647 2422222 2298302 2362596 2575196 2327777 2380479 2356370 2543658
14849 2543658 2470669 2447601 2595572 2966483 2933169 2630744 2554715 2561346 2300676 2750795
14839 2750795 2527382 2454501 2476861 2664135 2956472 3011957 2821548 2610837 2272752 2391100
14829 2391100 2422552 2421603 2473165 2824241 2738411 2771966 2954563 2949828 2640880 2422310 2464049
14818 2464049 2389489 2673255 2380412 2408039 2171549 2302126 2482079 2558766 2725927 2540213
14808 2540213 2572140 2856000 2644459 2918479 2646452 2798116 2529351 2268737 2532053 2695201
14798 2695201 2773644 2386580 2401616 2785697 2561626 2910866 2953353 2947581 2681641 2570625
14788 2570625 2503726 2395234 2620177 2706589 2482545 2788267 2784946 2964290 2975974 2954596
14778 2954596 2887476 2468865 2329002 2442523 2069299 2392906 2244556 2123623 2519676 2691587
14768 2691587 2973447 2679732 2725678 2690312 2454499 2792714 2213131 2197597 2194262 2204607
14758 2204607 2624704 2612240 2890207 2760462 2698812 2785501 2416762 2536586 2320544 2433777
14748 2433777 2813474 2645547 2643988 2834906 2909967 2945429 2416096 2668175 2523161 2520949
14738 2520949 3081278 2478454 2971420 2940978 3040328 3141419 2605179 2946866 2287600 2145550
14728 2145550 2430816 2197919 2604879 2302254 2823891 2977579 2936743 3180001 2675323 2495362
14718 2495362 2667688 2520046 2399629 1999668 2289505 2391964 2398152 2746671 2921825 2994957
14708 2994957 2916724 2745947 2732530 2297441 2416255 2567624 2423093 2565883 2553454 3036320
14698 3036320 3280566 3122980 3311495 2553084 2508103 2549611 2450801 2579515 2246762 2638126
14688 2638126 2590984 2910903 3066328 2622394 2800661 2728830 2955344 2658768 2407656 2865529
14678 2865529 2557969 2578470 2957658 2765351 3186761 3216869 2954164 2639815 2076875 2056062
14668 2056062 2076377 2228769 2489176 2305602 2604974 2926978 3238958 3344144 2776841 2949552
14658 2949552 2765281 2655528 2523127 2182517 2573019 2314948 2526613 2873068 2964185 3134064
14648 3134064 2789585 2990114 2797751 2464473 2649406 2047613 2097029 2022644 2225442 2630523
14638 2630523 2545416 3006936 3024977 2982306 2833537 2853394 2997175 2663088 2042141 2413593
14628 2413593 2315770 2499439 2658099 2579064 3041152 2887179 2775413 2772844 2578864 2952228
14618 2952228 3048491 3244087 2686246 2293142 2492017 2306340 2348151 1960342 2535670 2581244
14608 2581244 2367106 2864709 3024885 3142007 2837032 2667608 2558268 2359605 2481651
14599 2481651 2089954 2033560 2346318 2178034 2606378 2703156 2966807 3408039 3306106 3288613
14589 3288613 2962647 2484065 2503380 2297481 2280999 2084006 2167933 2666882 2599102 3005515
14579 3005515 3128576 3068527 2865980 2612119 3062383 2576298 2651786 2499692 1984879 2281587
14569 2281587 2102789 2567997 2974416 2879501 3171201 2713430 2847727 2788685 2436013 2515022
14559 2515022 1942634 2211608 2323555 2353108 2647581 2665760 2827619 2830028 2347132 2624731
14549 2624731 2751578 2946409 2806908 2517960 2899840 2696125 2599964 2755888 2580299 2727149
14539 2727149 2346308 2409795 2483842 2472805 2551020 2282077 2708741 2739017 2650455 3107878
14529 3107878 2899535 3268140 2849153 2753597 2800465 2346501 2199036 2146715 2377982 2710492
14519 2710492 2916497 3116657 2924777 2666989 2512979 2292427 2558268 2685222 2985493
14510 2985493 2788428 2548862 2663379 2541789 2491549 2710267 2642666 2794371 2759078 3099155
14500 3099155 2887808 2616876 2718221 2202067 2238602 2479482 2213808 2516912 2644793 3238048
14490 3238048 3407609 3225171 3086597 2827720 2461676 2058705 2431033 2270901 2009580
14481 2009580 2388043 2582150 2963052 3239203 3330498 3490424 3305410 2825405 2651104 2071668
14471 2071668 1769642 1671719 1735534 2460734 2902591 3193926 3440342 3386863 3210001 2554861
14461 2554861 2994500 2651972 2146291 2185996 2033767 2412230 2477768 3110404 3463995 3484689
14451 3484689 3627943 3278904 3226270 2558060 1830806 1941960 1794844 1724011 2428865 2871244
14441 2871244 3259983 3423908 3352984 3766223 3411754 2989264 2636394 2173858 2065436 1857245
14431 1857245 2043055 2504789 2563972 3087779 3224676 3340257 3043366 2881960 2834782 2547232
14421 2547232 2584823 2302656 2315073 2390165 2757686 2893173 2424201 2636781 2763717 2923522
14411 2923522 2774931 2570452 2338131 2316138 2592693 2256888 2089343 2321551 2409871 2707321
14401 2707321 2917028 2969966 2707023 2658807 2264696 2209259 2588909 3065444 3101487 3150076
14391 3150076 2848139 2574041 2427386 2354337 2388823 2356319 2500756 2825150 2719642 2999227
14381 2999227 3127023 2832998 2623366 2599143 3101987 2656723 2489454 2533052 2386398 2783189
14371 2783189 2496668 2534251 2770159 2757202 2787324 2833016 2417265 2256290 2191738 2258500
14361 2258500 2486988 2723613 3340083 3101742 2891012 2899212 2748418 2821148 2299445 2551808
14351 2551808 2776092 2396587 2621082 2867754 3180779 2776890 3023263 2811609 2642936
14342 2642936 2541118 1972266 2060004 2124264 2282809 2551030 2718346 3054871 3258069 3134597
14332 3134597 2767844 2775613 2485157 2362612 2137439 1730401 1979226 2495358 2574039 2751804
14322 2751804 3403908 3862840 3528184 3350582 2995705 2543385 1994777 2264699 2375904
14313 2375904 2354832 2798957 2774760 3032464 2966117 2693606 3014191 2586085 2485424 2561557
14303 2561557 2544869 2407606 2483483 2407489 2517803 2664833 2923338 2837120 2760381 3184963
14293 3184963 3260614 3004232 2890371 2656291 2576036 2348711 2363828 2516083 2476537 2728291
14283 2728291 2873415 3168776 2657727 2584728 2470805 2528205 2844262 2592440 2576530 2464290
14273 2464290 2368732 2511683 2553317 2774587 2551667 2843604 3274932 3312384 3360043 3436001
14263 3436001 2960555 2580182 2156550 2275796 2351738 2411200 2789590 3155204 3057619 3143155
14253 3143155 3349592 3273293 3137178 2497102 2261427 1949190 1902454 2004982 2043028 1903034
14243 1903034 2050844 2805102 3002009 3028380 3030306 3042650 3018363 2513169 2437104 2211911
14233 2211911 2179400 2308038 2597683 2977291 2934863 3013345 3124432 2860542 2578353 2606890
14223 2606890 2504145 2858691 2731318 2838028 2744828 2412732 2455579 2449967 2476671 2814909
14213 2814909 2690878 2942271 2910902 2910630 2830889 2489656 2822362 2664696 2280108 2367887
14203 2367887 2579893 2758088 2589879 2652915 2868799 2818403 2961254 3064280 3255314 2905328
14193 2905328 2679578 2839454 2725620 2380555 2155046 2152585 2477750 2825135 2776792 3293707
14183 3293707 3334391 3118245 2991618 2882116 2739560 2600825 2651805 2407382 2542261 2703214
14173 2703214 2844905 3027441 2799218 3046613 3234239 2980100 2794142 2903935 2728832
14164 2728832 2297089 2472506 2625815 2774328 2978448 3092224 3305889 3354324 3193864 2960960
14154 2960960 2797773 2768721 2455340 2746290 3159274 3180034 3053482 3360856 3103605 2996108
14144 2996108 2778097 2528259 2365073 2330557 2619843 2617656 2827923 3106853 3217661 3354472
14134 3354472 3030065 3129594 2960304 2708393 2849704 2826264 2893932 2734842 2629364 2744885
14124 2744885 2774873 3191331 3350831 3463321 3406424 3221093 2914933 2539565 2398502 2475976
14114 2475976 2621802 2847632 3114606 2945057 3266937 3135668 2983947 3013065 2846070 2684404
14104 2684404 2752386 3118371 2984783 3055836 3491530 3235091 3168926 3002432 3187354 3250145
14094 3250145 2866859 3117314 3226728 3185276 2989288 2755076 2904326 3142721 3252617 3316509
14084 3316509 3314445 2934810 2669113 2629422 2602595 2468179 2677337 2876419 2942319 3259222
14074 3259222 3375178 3015422 3032735 2726255 2819184 2712814 2685630 2791328 3040417 3101805
14064 3101805 3183409 3399117 3175777 3430632 3380352 3250441 3074694 2788728 2849576 2894142
14054 2894142 2799515 2897663 2945641 3143070 2835711 3093499 2923366 2811053 2869241 2761617
14044 2761617 2784292 2620516 2433750 2680643 2820717 3559276 3656108 3311797 3093788 2900568
14034 2900568 2486258 2600614 2838388 2701962 2571856 2621478 3305040 3307180 3441101 3174720
14024 3174720 3043358 2892282 2280653 2508856 2694823 2571544 2504049 2494616 2798728 2947865
14014 2947865 3496282 3391892 3293121 2829869 2687808 2810838 2553194 2445645 2437146 2544432
14004 2544432 2689413 2987872 3267862 3420832 3108882 2962248 3261078 3064913 2908332
13995 2908332 2903009 3144144 2778123 2448236 2772295 2855240 2859296 2537869 2488457 2979276
13985 2979276 2906929 2782880 2904247 3001735 2795885 2831208 3015607 2792796 2524743 2273728
13975 2273728 2617286 2601300 2245156 2541289 2888803 3125443 3091595 3383849 3330605 2697726
13965 2697726 2633810 2477397 2545138 2370597 2413047 2731660 2890689 3015459 3390454 3370872
13955 3370872 3127398 2959615 2359988 2168692 2159051 2188560 2494794 2653041 2848732 3192037
13945 3192037 3540026 3392877 2658229 2512725 2354832 2034068 2213822 2522246 3081107
13936 3081107 2993873 2924901 3165695 3504500 3488161 3196051 2940956 2455735 2141163 2106423
13926 2106423 2425084 2670300 2881374 2853762 3069211 3532304 3068178 3107597 2813549 2240390
13916 2240390 1900127 1647121 2441222 2350742 2560859 3079329 3558036 3497136 3246079 3333133
13906 3333133 2487340 2015168 1781161 1884566 2263480 2223509 2589915 2819737 3016432 3437271
13896 3437271 3439798 3263776 2977529 2643855 2344114 2031917 1755661 2255037 2735205 2981922
13886 2981922 3266421 3673826 3932613 3526282 3265863 2882968 2873689 2651177 2240542 2531968
13876 2531968 2575880 2820170 2828702 2813983 3035945 2832374 2677118 2631621 3040075 2962754
13866 2962754 2716242 2812049 2869389 3028395 3017154 3357464 3326240 2856982 2788451 2425088
13856 2425088 2344227 2491827 2677694 2895149 2506825 2361757 2590411 2827428 2906765 2902243
13846 2902243 2694423 2776982 2510760 2211374 2304697 2664440 2912328 2956601 3420845 3273470
13836 3273470 2859609 2855475 2481976 2671660 2606301 2856136 2985608 2967258 3090834 3028047
13826 3028047 3383231 3061119 3108355 3313533 2882299 2507147 2798262 2912130 2903785 2640316
13816 2640316 2788776 3077003 3008110 2789555 2819301 2562743 2655000 2764601 2662589 2897854
13806 2897854 2898628 3329099 3321311 3044398 2795820 2772942 3034434 2659402 2514857 2703787
13796 2703787 3083861 3175045 3171810 3152770 3022812 3291377 3001905 2716202 2755903 2571705
13786 2571705 2618161 2494890 2532544 2494698 3118327 3426137 3335556 3358526 3066919 2994923
13776 2994923 2652924 2289564 2285130 2638765 2818356 3049370 3284387 3426117 3070050 2798027
13766 2798027 3014308 3225747 2835274 2663738 2627376 2876511 2617334 2723760 3138505 3283207
13756 3283207 3439250 3487553 3705526 3398112 3143445 3224574 2813235 2581995 2474636 2726128
13746 2726128 3016971 2718114 2911998 3251809 3303010 3176936 3296111 3422415 3046835 2928490
13736 2928490 2840822 2617688 2787032 2732207 3100515 3727589 3222101 3336384 3342348 2941942
13726 2941942 3052581 2992469 3112858 3073322 2728007 2711401 2482631 2838596 2926871 2809966
13716 2809966 3123354 2690443 3119711 3000289 2798885 2714095 2844463 3177757 3012637 3033385
13706 3033385 3241388 3003528 3118495 2872881 2974619 3185993 3061706 3012777 3261706 3788435
13696 3788435 3588439 3194054 3141970 3050077 2896372 2852937 3016999 3331548 3104383 3208278
13686 3208278 3416776 3020149 3221780 3247342 3702000 3146247 2759954 3116719 3056936 3219176
13676 3219176 2967824 3168437 3313434 3099968 3529907 3401991 3458322 3221726 2992427 3148900
13666 3148900 2866263 3020069 2985877 3076796 2823414 2603316 2944760 3132243 3032136 3063613
13656 3063613 2949044 3115400 2989936 2844966 3285249 3093323 3065733 3232318 3084668 3523180
13646 3523180 3321395 3465221 3393057 3007558 3106747 3250519 3155290 3017606 2783601 3202632
13636 3202632 3038893 3372154 3379353 3468223 3897014 3213856 3223753 3100699 2951200 2838368
13626 2838368 2708488 3058341 3184632 3336502 3408605 3301871 3079755 3140952 2980194 2989917
13616 2989917 2938493 2890176 3005280 2992274 2869382 2878633 3316503 3414643 3412771 3434917 3225609
13605 3225609 3374604 2998446 2897712 2987147 2630575 2614003 2864770 2883725 2768876 2907336
13595 2907336 3177979 3132099 3142815 2988772 2709398 2981630 3120410 3112701 3149620 3144117 2939402
13584 2939402 2786555 3023748 3392381 3202220 3320082 3458288 3259032 3082233 2949507
13575 2949507 3038229 2902048 3207340 3539058 3366554 3553196 3281675 3383787 2831756 2820716
13565 2820716 3485140 3691744 3828127 3219237 3205212 3254750 2607371 2561789 2405582 2728021
13555 2728021 3006925 3065807 3325738 3195321 2757386 2957894 2947545 3069363 2797881 2933900
$$ [...]
##END NTUPLES=NMR SPECTRUM
##END=
