##TITLE=1H_DE-80H_X3
 200.13MHz, d2o
 8 sc
 
 19ns.26.2.2025
##JCAMPDX= 6.0         $$ Bruker NMR JCAMP-DX V2.0
##DATA TYPE= NMR SPECTRUM
##DATA CLASS= NTUPLES
##ORIGIN= UXNMR, Bruker Analytische Messtechnik GmbH
##OWNER= pz
$$ XWIN-NMR		Version 3.5
$$ Thu Mar 26 10:27:42 2026 Russian Standard Time (UT+4h)  Yarkov@DPX200
##.OBSERVE FREQUENCY= 200.1313
##.OBSERVE NUCLEUS= ^1H
##.ACQUISITION MODE= SIMULTANEOUS
##.ACQUISITION SCHEME= undefined
##.AVERAGES= 8
##.DIGITISER RES= 18
##SPECTROMETER/DATA SYSTEM= spect
##.PULSE SEQUENCE= zg30
##.SOLVENT NAME= DMSO
##.SHIFT REFERENCE= (INTERNAL, DMSO, 0, 15.4803)
##AUDIT TRAIL= $$ (NUMBER, WHEN, WHO, WHERE, WHAT)
$$ ##TITLE= Audit trail, XWIN-NMR		Version 3.5
$$ ##JCAMPDX= 5.01
$$ ##ORIGIN= Bruker BioSpin GmbH
$$ ##OWNER= Yarkov
$$ C:/Bruker/XWIN-NMR/data/yarkov2/nmr/H-C/1/pdata/1/auditp.txt
$$ ##AUDIT TRAIL=  $$ (NUMBER, WHEN, WHO, WHERE, WHAT)
(   1,<2026-03-26 10:26:44.26 +0400>,<Yarkov>,<DPX200>,
      <created by zg, POWCHK disabled, PULCHK disabled
       configuration hash MD5:
       00 E9 B6 7A A2 85 ED C7 34 08 36 98 17 FE 4E 26
       data hash MD5: 16K
       30 97 6F F9 50 A6 15 5D 44 18 EE 71 6D 3D 98 AD>)
(   2,<2026-03-26 10:27:00.35 +0400>,<Yarkov>,<DPX200>,
      <Start of raw data processing
       efp BC_mod = 2 LB = 0.25 FT_mod = 6 PKNL = 1 PHC0 = -5299.148 PHC1 = 6.821927 SI = 16K 
       data hash MD5: 16K
       16 FA 1A AC 01 56 61 F1 5F 34 16 B6 E0 29 42 68>)
$$ ##END=
$$ 
$$ hash MD5
$$ D9 66 B1 65 98 9C AD 33 23 29 70 B4 69 E8 EF 18
##$RELAX= 
##$RELAX= 
##$RELAX= 
##$RELAX= 
##$RELAX= 
##$RELAX= 
$$ Bruker specific parameters
$$ --------------------------
##$DU= <C:/Bruker/XWIN-NMR>
##$EXPNO= 1
##$NAME= <H-C>
##$PROCNO= 1
##$TYPE= <nmr>
##$USER= <yarkov2>
##$AMP= (0..31)
100 100 100 100 100 100 100 100 100 100 100 100 100 100 100 100 100 100 
100 100 100 100 100 100 100 100 100 100 100 100 100 100 
##$AQSEQ= 0
##$AQ_mod= 1
##$AUNM= <au_zg>
##$AUTOPOS= <>
##$BF1= 200.13
##$BF2= 200.13
##$BF3= 200.13
##$BF4= 200.13
##$BF5= 200.13
##$BF6= 200.13
##$BF7= 200.13
##$BF8= 200.13
##$BYTORDA= 1
##$CFDGTYP= 0
##$CFRGTYP= 5
##$CHEMSTR= <none>
##$CNST= (0..31)
1 1 145 1 1 1 1 1 1 1 1 1 1 1 1 1 1 1 1 1 1 1 1 1 1 1 1 1 1 1 1 1 
##$CPDPRG= <>
##$CPDPRG1= <>
##$CPDPRG2= <>
##$CPDPRG3= <>
##$CPDPRG4= <mlev>
##$CPDPRG5= <mlev>
##$CPDPRG6= <mlev>
##$CPDPRG7= <mlev>
##$CPDPRG8= <mlev>
##$CPDPRGB= <>
##$CPDPRGT= <>
##$D= (0..31)
0 0.7 0 0 0 0 0 0 0 0 0 0.03 0 0 0 0 0 0 0 0 0 0 0 0 0 0 0 0 0 0 0 0 
##$DATE= 1774506403
##$DBL= (0..7)
120 120 120 120 120 120 120 120 
##$DBP= (0..7)
150 150 150 150 150 150 150 150 
##$DBP07= 0
##$DBPNAM0= <>
##$DBPNAM1= <>
##$DBPNAM2= <>
##$DBPNAM3= <>
##$DBPNAM4= <>
##$DBPNAM5= <>
##$DBPNAM6= <>
##$DBPNAM7= <>
##$DBPOAL= (0..7)
0.5 0.5 0.5 0.5 0.5 0.5 0.5 0.5 
##$DBPOFFS= (0..7)
0 0 0 0 0 0 0 0 
##$DE= 6
##$DECBNUC= <off>
##$DECIM= 32
##$DECNUC= <off>
##$DECSTAT= 4
##$DIGMOD= 1
##$DIGTYP= 9
##$DL= (0..7)
0 120 120 120 120 120 120 120 
##$DP= (0..7)
$$ [...]
##$SUBNAM2= <"">
##$SUBNAM3= <"">
##$SUBNAM4= <"">
##$SUBNAM5= <"">
##$SUBNAM6= <"">
##$SUBNAM7= <"">
##$SUBNAM8= <"">
##$SUBNAM9= <"">
##$SW= 18.0517328524113
##$SWIBOX= (0..15)
0 0 2 0 0 0 0 0 0 0 0 0 0 0 0 0 
##$SW_h= 3612.71676300578
##$TD= 16384
##$TD0= 1
##$TE= 0
##$TE2= 300
##$TE3= 300
##$TEG= 300
##$TL= (0..7)
0 120 120 120 120 120 120 120 
##$TP= (0..7)
150 150 150 150 150 150 150 150 
##$TP07= 0
##$TPNAME0= <>
##$TPNAME1= <>
##$TPNAME2= <>
##$TPNAME3= <>
##$TPNAME4= <>
##$TPNAME5= <>
##$TPNAME6= <>
##$TPNAME7= <>
##$TPOAL= (0..7)
0.5 0.5 0.5 0.5 0.5 0.5 0.5 0.5 
##$TPOFFS= (0..7)
0 0 0 0 0 0 0 0 
##$TUNHIN= 0
##$TUNHOUT= 0
##$TUNXOUT= 0
##$USERA1= <user>
##$USERA2= <user>
##$USERA3= <user>
##$USERA4= <user>
##$USERA5= <user>
##$V9= 5
##$VALIST= <valist>
##$VCLIST= <CCCCCCCCCCCCCCC>
##$VD= 0
##$VDLIST= <DDDDDDDDDDDDDDD>
##$VPLIST= <PPPPPPPPPPPPPPP>
##$VTLIST= <TTTTTTTTTTTTTTT>
##$WBST= 1024
##$WBSW= 4
##$XGAIN= (0..3)
0 0 0 0 
##$XL= 0
##$YL= 0
##$YMAX_a= 80647
##$YMIN_a= -78191
##$ZGOPTNS= <>
##$ZL1= 120
##$ZL2= 120
##$ZL3= 120
##$ZL4= 120
##$ABSF1= 0
##$ABSF2= 0
##$ABSG= 0
##$ABSL= 0
##$ALPHA= 0
##$AQORDER= 0
##$ASSFAC= 0
##$ASSFACI= 0
##$ASSFACX= 0
##$ASSWID= 0
##$AUNMP= <proc_1d>
##$AZFE= 0.1
##$AZFW= 0.1
##$BCFW= 0
##$BC_mod= 2
##$BYTORDP= 0
##$COROFFS= 0
##$CY= -3
##$DATMOD= 1
##$DC= 0
##$DFILT= <>
##$DTYPP= 0
##$F1P= 0
##$F2P= 0
##$FCOR= 1
##$FTSIZE= 16384
##$FT_mod= 6
##$GAMMA= 0
##$GB= 0
##$INTBC= 1
##$INTSCL= 3.241238e-09
##$ISEN= 128
##$LB= 0.25
##$LEV0= 0
##$LPBIN= 0
##$MAXI= 10000
##$MC2= 0
##$MEAN= 0
##$ME_mod= 0
##$MI= 1.114404
##$NCOEF= 0
##$NC_proc= -8
##$NLEV= 6
##$NOISF1= 3.799351
##$NOISF2= 2.8
##$NSP= 0
##$NTH_PI= 0
##$NZP= 0
##$OFFSET= 15.48025
##$PC= 1
##$PHC0= -5299.148
##$PHC1= 6.821927
##$PH_mod= 1
##$PKNL= yes
##$PPARMOD= 0
##$PSCAL= 0
##$PSIGN= 0
##$REVERSE= no
##$SF= 200.130008295661
##$SI= 16384
##$SIGF1= 3
##$SIGF2= 2
##$SINO= 0.751879
##$SIOLD= 32768
##$SREGLST= <19F.Aceton>
##$SSB= 0
##$STSI= 16384
##$STSR= 0
##$SW_p= 3612.71676300578
##$SYMM= 0
##$S_DEV= 0
##$TDeff= 16384
##$TDoff= 0
##$TI= <>
##$TILT= no
##$TM1= 0
##$TM2= 0
##$TOPLEV= 0
##$USERP1= <user>
##$USERP2= <user>
##$USERP3= <user>
##$USERP4= <user>
##$USERP5= <user>
##$WDW= 1
##$XDIM= 16384
##$YMAX_p= 359093115
##$YMIN_p= -2110129
$$ End of Bruker specific parameters
$$ ---------------------------------
##NTUPLES= NMR SPECTRUM
##VAR_NAME=  FREQUENCY,     SPECTRUM/REAL,   SPECTRUM/IMAG
##SYMBOL=    X,             R,               I
##VAR_TYPE=  INDEPENDENT,   DEPENDENT,       DEPENDENT
##VAR_FORM=  AFFN,          ASDF,            ASDF
##VAR_DIM=   16384,         16384,           16384
##UNITS=     HZ,            ARBITRARY UNITS, ARBITRARY UNITS
##FACTOR=    0.220516191357247, 1,           1
##FIRST=     3098.06263268183, 0,            0
##LAST=      -514.654130323946, 0,           0
##MIN=       -514.654130323946, -2110129,    0
##MAX=       3098.06263268183, 359093115,    0
$$ Real data points
##PAGE= N=1
##DATA TABLE= (X++(R..R)), XYDATA
$$ [...]
5168G715598k23432J22895Q0029k36519m4632M20316L77643J53153j47018j54908
5158H063125j49312J62236n0711n8072k0551P4787K61348J37949L18770N8868
5148H798437p5231n5217k2117j63069J65683L34570K06970Q3291k29890Q5153
5138I128580N4874l106Q9545K99160q6753J32387J33370m5898o8091J71674J18627
5127I924369J0117L8375J45043M00236K53785K45570J99637j93024L3333J92142
5117A1249583K44024J1776J49567J73801k2346k8587J34780L22069k01247M89490
5107A2522910J84169J0978J70186q6761K08148M24449j23281j9796Q0459J0475
5097A3381936K13956l3483J66266L21466p8348k26014R8799L45795M5579j53227
$$ y = [7715598, 7492166, 7615061, 7695090, 7458571, 7413939, 7834255, 8211898, 8365051, 8218033, 8063125, 7913813, 8076049, 8025338, 7967266, 7946715, 8021502, 8282850, 8420799, 8739569, 8798437, 8723206, 8667989, 8645872, 8482803, 8648486, 8983056, 9190026, 9273317, 9043427, 9128580, 9183454, 9180348, 9269893, 9569053, 9482300, 9614687, 9748057, 9702159, 9634068, 9805742, 9924369, 9934486, 9972861, 10117904, 10518140, 10771925, 11017495, 11217132, 11024108, 11057441, 11249583, 11493607, 11505383, 11654950, 11828751, 11806405, 11777818, 11912598, 12234667, 12033420, 12522910, 12707079, 12718057, 12888243, 12801482, 13009630, 13434079, 13310798, 13291002, 13371461, 13381936, 13595892, 13562409, 13728675, 14050141, 13971793, 13745779, 13844578, 14190373, 14235952, 14082725]
5087A4082725K13417j29733n3188J41111j44345j89753P1477O9336J54673r399
5077A4206321j54941Q6076o5534j05585q4765n8199O5339N8550j26600K68671
5067A4089333k4026k14222r0628M3298p5497J1863M01991r569N2627K60765k3928
5056A4422007Q907j77116K9789K2829J13433j71661j53655L53923R0160r2527
5046A4446089r1444K05525k9252k07727L60871R1149n83188q7359j7652j9955
5036A4067057Q8791j77926j5779J13495J1386J5375P9640J51357N766j31712n2618
5025A4154832L00266L4944K32486N2305q5364L3227k2990J66895l7067k77598
5015A4551936p0859N772R8578m2176J20936j5938l7625n0100J13225k57519j66511
$$ y = [14082725, 14296142, 14166409, 14113221, 14254332, 14109987, 13920234, 13991711, 14061047, 14215720, 14206321, 14051380, 14137456, 14071922, 13966337, 13881572, 13823373, 13888712, 13947262, 13820662, 14089333, 14065307, 13851085, 13760457, 13803755, 13728258, 13740121, 14142112, 14132543, 14185170, 14445935, 14422007, 14430914, 14253798, 14283587, 14306416, 14419849, 14248188, 14094533, 14448456, 14538616, 14446089, 14354645, 14560170, 14530918, 14323191, 14684062, 14775211, 14192023, 14104664, 14087012, 14067057, 14155848, 13977922, 13962143, 14075638, 14087024, 14102399, 14182039, 14333396, 14339162, 14207450, 14154832, 14455098, 14490042, 14722528, 14774833, 14689469, 14722696, 14699706, 14866601, 14829534, 14551936, 14481077, 14486849, 14585427, 14543251, 14664187, 14648249, 14610624, 14560524, 14673749, 14416230, 14249719]
5004A4249719K34116L1105j39813j92558k09162J07096L95129R4667J57728J3005
4994A4741032l42315J01928L12578M40489J19606o0392K75696R6551K79104N2918
4984A6017195J13856J26029J57350K27931Q3785n4469J70032j70014J27230j20644
4974A6678281k0291r4256J37626j48753j94939l6581j28161l8990l66580k21087
4964A5566269l8836l75617j64925k2173p5874j77494o6061J20870j90992k69759
4954A4305408j58951j70546k38589J99035m15986K87426J04956m31895M0217j49853
4944A3371222l51951J68401K3500P7511n2747k09303P9722p5569k8875K684O1175
4933A3065770j35077k56642n4168K35099L8916K15215j40661j58275j05504j61577
$$ y = [14249719, 14483835, 14514940, 14375127, 14182569, 13973407, 14080503, 14475632, 14570299, 14728027, 14741032, 14398717, 14500645, 14813223, 15253712, 15373318, 15312926, 15588622, 15685173, 15964277, 16017195, 16131051, 16257080, 16414430, 16642361, 16726146, 16671677, 16841709, 16671695, 16798925, 16678281, 16657990, 16563734, 16701360, 16552607, 16357668, 16321087, 16192926, 16153936, 15787356, 15566269, 15527433, 15151816, 14986891, 14964718, 14888844, 14711350, 14645289, 14766159, 14575167, 14305408, 14146457, 13975911, 13737322, 13936357, 13520371, 13807797, 13912753, 13480858, 13521075, 13371222, 13019271, 13187672, 13211172, 13288683, 13235936, 13026633, 13106355, 13030786, 13001911, 13004595, 13065770, 12930693, 12674051, 12619883, 12854982, 12893898, 13109113, 12968452, 12810177, 12704673, 12543096]
4923A2543096N5920K9160k63103l7153j77302l37236O4305O3730j38225r7790
4913A1705402l09222n8505K20581l38087j31955J98059R312O7600l69878j69276
4903A0824031K18789k4592J70716n1383M3576L53934M12023R5837J07900J55253
4893A2306084O4900J34978l1693L84753q9915k2621J05944j09226k15569n2180
4883A2475455K69881K2721J63626M3387k29580N4706J72921J56786N7006L09646
4873A3496555L8980L27562J64884o4395J01559J27192J36117L5918J35879p5348
4863A4424903p5722J14844M74899j34551J29366l23227K03667N874n5776K10032
4853A4974309p2219k1706p166K99184K20026N6975K01978J35450K00754L89951
$$ y = [12543096, 12599016, 12628176, 12365073, 12327920, 12150618, 11813382, 11877687, 11941417, 11803192, 11705402, 11396180, 11337675, 11558256, 11220169, 11088214, 11286273, 11295585, 11363185, 10993307, 10824031, 11042820, 11018228, 11188944, 11137561, 11181137, 11535071, 11947094, 12042931, 12150831, 12306084, 12370984, 12505962, 12474269, 12859022, 12769107, 12746486, 12852430, 12743204, 12527635, 12475455, 12745336, 12768057, 12931683, 12975070, 12745490, 12800196, 12973117, 13129903, 13186909, 13496555, 13535535, 13863097, 14027981, 13963586, 14065145, 14192337, 14328454, 14364372, 14500251, 14424903, 14349181, 14464025, 14938924, 14804373, 14933739, 14610512, 14814179, 14820053, 14764277, 14974309, 14902090, 14880384, 14873218, 15172402, 15392428, 15449403, 15651381, 15786831, 15987585, 16377536]
4843A6377536P2512L60351J38941J9933L98443l0090K11012M58072j3602j28706
4833A7864402O22242M17933J03341J09399L20745N4711M58680N74261L22535K55497
4823B1103746m3696K971J42885J48767L36198J66912J56881Q3822l00272J3941
4813B1812155k33096p2951n6016m12769k90299l8482K6450k92000L1758K29119
4803B0703869J64738K31393M9652J84550M8504P6587K29336K93308J71268M00587
4793B2553792N24085n2048K26959K18082J8069K49831k67808l7970j93436l45178
4783B2894378m11573l50490j99146n02183k38572o6246n49655n66676l93934J40275
4773A9756178r4800j82801j25896l93439k53169j32768k83691j42163l6011k5987
$$ y = [16377536, 16450048, 16810399, 16949340, 16969273, 17367716, 17337626, 17548638, 18006710, 17993108, 17864402, 18486644, 18904577, 19007918, 19117317, 19438062, 19492773, 19951453, 20525714, 20848249, 21103746, 21060050, 21063021, 21205906, 21354673, 21690871, 21857783, 22014664, 22098486, 21798214, 21812155, 21579059, 21506108, 21450092, 21037323, 20747024, 20708542, 20734992, 20442992, 20474750, 20703869, 20868607, 21100000, 21149652, 21334202, 21382706, 21459293, 21688629, 21981937, 22153205, 22553792, 23077877, 23025829, 23252788, 23470870, 23488939, 23738770, 23470962, 23432992, 23239556, 22894378, 22482805, 22132315, 21933169, 21430986, 21192414, 21126168, 20576513, 20009837, 19615903, 19756178, 19661378, 19478577, 19352681, 18959242, 18706073, 18573305, 18289614, 18147451, 18111440, 18085453]
4763A8085453k77822l12530p5176p5994j75286k08746j15293j41233j00276j61119
4753A6441978J82851j29306j0246n3292k51785J37746J95797J03942n0715J88807
4743A6755777K03399Q271P2751L46245K13570O9764k4308O05493K67892M12140
4733A8930994L28501K80834L82997L11959P41080K35232L44037M23863M69168
4724B2448665N17470P83924O43209N01834P53412O55639J029779J024170J186773
4715B9544875Q69204J187154J298480Q41239J088261J165146J083805R41158O98881
4706C8718203O00103P86312N07144O34009N60962O22886O75522O92573O07026
4697D4404740O42035J086350O69371N64465R61157N80656R39982J313041O44051
$$ y = [18085453, 17807631, 17495101, 17419925, 17343931, 17168645, 16959899, 16844606, 16703373, 16603097, 16441978, 16624829, 16495523, 16485277, 16431985, 16180200, 16317946, 16513743, 16617685, 16566970, 16755777, 16959176, 16967447, 17040198, 17386443, 17600013, 17669777, 17645469, 18250962, 18518854, 18930994, 19259495, 19540329, 19923326, 20235285, 20976365, 21211597, 21555634, 21979497, 22448665, 22966135, 23750059, 24393268, 24895102, 25648514, 26304153, 27333932, 28358102, 29544875, 30414079, 31601233, 32899713, 33740952, 34829213, 35994359, 37078164, 38019322, 38718203, 39318306, 40104618, 40611762, 41245771, 41806733, 42429619, 43105141, 43797714, 44404740, 45046775, 46133125, 46802496, 47366961, 48328118, 48908774, 49848756, 51161797, 51805848]
4688E1805848Q74008Q46482O02969R61111R62010Q76834Q28338O77855K47679
4679E8683134L47867r2662k2865k64679l46458k40519j9402m05973j69572l35497
4669E7133374k95595j39358o49662m43139n95552p03086q78377j081115j308604
4660E1038886j199122j093894j107461j424795j324118j221711j165856j466374
4652D1035555j123688q98953j385095j002349r04055j120921j057546j179684
4644C2363264p36825j038806r67443j068099p86648n80789q20925q20278j063911
4635B4479540q97105p07847r31462q99646q58042n70375n55857r24934o23619
4626A7510653m18357p08816o21009j61729k94992p62900l74637j80909l87210
$$ y = [51805848, 52679856, 53526338, 54129307, 55090418, 56052428, 56929262, 57757600, 58435455, 58683134, 59031001, 58938339, 58915474, 58650795, 58304337, 58063818, 58044416, 57638443, 57468871, 57133374, 56837779, 56698421, 56048759, 55605620, 55010068, 54306982, 53428605, 52347490, 51038886, 49839764, 48745870, 47638409, 46213614, 44889496, 43667785, 42501929, 41035555, 39911867, 39012914, 37627819, 36625470, 35721415, 34600494, 33542948, 32363264, 31626439, 30587633, 29620190, 28552091, 27765443, 27184654, 26363729, 25543451, 24479540, 23582435, 22874588, 21943126, 21043480, 20185438, 19615063, 19059206, 18134272, 17510653, 17092296, 16383480, 15762471, 15600742, 15305750, 14542850, 14168213, 13987304, 13600094]
4617A3600094k54233l88585k02159m19009j72009k55521k88015k58280l35376
4608A1026907k73282m89859k99881l89737j18665j88060j55046m13500k91892
4599H406985l24053l20648M509L84190j16115n70306o6955o8677n7216m67274
4589F804440k50552l56228k20680j7972l79888l02040O1671r6650p8577k93446
4579D870078j69638j91557j43182m59345q5352q4919J73890l96262R173j37324
4569C385562j60028o3479j961k6338j22385K1846j08004j4419k86151k33438p6588
4558B314617K33014m998q0195j96799O7084J1506o4034K435J04331j8409P030
4547B375582n7116p1932k87k46571p8503K425k46215P1084J54727l28977J79362
$$ y = [13600094, 13345861, 12957276, 12755117, 12336108, 12164099, 11908578, 11620563, 11362283, 11026907, 10753625, 10263766, 9963885, 9574148, 9455483, 9267423, 9112377, 8698877, 8406985, 8082932, 7762284, 7766793, 8150983, 8034868, 7464562, 7397607, 7328930, 7271714, 6804440, 6553888, 6197660, 5976980, 5959008, 5579120, 5277080, 5338751, 5242101, 5163524, 4870078, 4700440, 4508883, 4365701, 3906356, 3821004, 3736085, 3909975, 3513713, 3522886, 3385562, 3225534, 3162055, 3160094, 3133756, 3011371, 3033217, 2925213, 2910794, 2624643, 2391205, 2314617, 2547631, 2542633, 2462438, 2265639, 2332723, 2344229, 2280195, 2282630, 2386961, 2368552, 2375582, 2318466, 2246534, 2246247, 1999676, 1921173, 1923598, 1677383, 1748467, 1903194, 1574217, 1753579]
4536A753579j5697j36663J41954j35795r327P7399M972j99278K06598r6887J1174
4525A602029m21517K55134L48057k99637q7143N9478j67211n9193M61802J1299
4515A703098j84287j37443k85454K97957o9703k55375r385K66992m615L481J16675
4504A441941J06929j13587q0844J12303o0125k06836J04630o8963j65800J60860
4494A230508o3942Q1320j40283o4887j222R985k965q8160R4282l17410O1717O3701
4482H62644M8126J09863J96877m0686q5361K98805k23284j12209r2186O3854J03
4471A026546P6712p0622j13679J32063o4768o3018R1670R7113j15236j00949Q8135
4460I83967k2240l5494J37375j73777K67375j16785L2095J37197Q1002O6690k26025
$$ y = [1753579, 1737882, 1601219, 1743173, 1607378, 1598051, 1675450, 1680422, 1481144, 1687742, 1590855, 1602029, 1180512, 1435646, 1783703, 1484066, 1396923, 1456401, 1289190, 1229997, 1691799, 1703098, 1518811, 1381368, 1095914, 1393871, 1324168, 1068793, 1059408, 1326400, 1321785, 1325266, 1441941, 1548870, 1435283, 1354439, 1466742, 1406617, 1199781, 1304411, 1235448, 1069648, 1230508, 1166566, 1247886, 1107603, 1042716, 1041494, 1051479, 1048514, 960354, 1054636, 737226, 798943, 862644, 910770, 1020633, 1217510, 1176824, 1091463, 1390268, 1166984, 1054775, 962589, 1026443, 1026546, 1103258, 1032636, 918957, 1051020, 986252, 923234, 1014904, 1112017, 996781, 895832, 983967, 961727, 926233, 1063608, 889831, 1157206, 1040421, 1072516, 1209713, 1290715, 1357405, 1131380]
4449A131380j1501j10834K37093q3500l9984l712k9440j44278K59094J33199l26979
4438A010538P2240k71428P0200J77759j78134q4772j06337P5864J22011J40462
4428A028403L5874K2528m0846O0940l40054L59698L9414q8777r5217P3971K56309
4417A312243r141q3359k18481M7851K92185R5487q6476K0170j15770N8562j9090
4406A294181M411J01974j57494j74289k89520O9859K68227R7836k8296J52140
4396A339029l1543q2830J08468p314N0984j23725K21076j58430J05776j93519
4386A227972R2487K09469j35244q216p3783J20758L0780L13555j82940j54778
4376A440060J09029L0559K879J29280r6953J8195N206J29246K237k79161j18614
$$ y = [1131380, 1119879, 1009045, 1246138, 1162638, 1122654, 1118942, 1089502, 945224, 1204318, 1337517, 1010538, 1082778, 811350, 881550, 1059309, 881175, 796403, 690066, 765930, 887941, 1028403, 1064277, 1086805, 1045959, 1106899, 766845, 1126543, 1165957, 1077180, 981963, 1055934, 1312243, 1303102, 1219743, 1001262, 1049113, 1341298, 1436785, 1350309, 1370479, 1254709, 1313271, 1294181, 1298592, 1400566, 1243072, 1068783, 779263, 849122, 1117349, 1215185, 1186889, 1339029, 1307486, 1224656, 1333124, 1325810, 1376794, 1253069, 1474145, 1315715, 1421491, 1227972, 1320459, 1529928, 1394684, 1386468, 1312685, 1433443, 1464223, 1777778, 1594838, 1440060, 1549089, 1579648, 1582527, 1711807, 1614854, 1633049, 1638255, 1767501, 1769738, 1490577, 1371963]
4365A371963M9656P2343O9556K72688l8968j77169J30498q3619j12531r6651K03531
4354A661297j23763k6546J27239J03720l0740M5279R2445l2744Q0723k65379K37294
4343A868825J43629j43017J57287K16956k64469j39894K05336K10202n23j04932
4333B149400J12083J2244R3719K98421j21354l07338L00635K96577J24093K24646
4323C183126P8357K29977K57223K18179L9789J27589L36982K32052M92652O84133
4313E880059Q42509J946876L070388M672308O458202O631598J701878l769177
4305B7434641n205871m006839l809014l173946j637985j288236r63738m71050
4297F877962m28849k57239k26205m06315j43268K4661J9853k20731K5408K07610
$$ y = [1371963, 1421619, 1493962, 1563518, 1836206, 1797238, 1620069, 1750567, 1666948, 1554417, 1457766, 1661297, 1537534, 1510988, 1638227, 1741947, 1711207, 1756486, 1848931, 1816187, 1896910, 1631531, 1868825, 2012454, 1869437, 2026724, 2243680, 1979211, 1839317, 2044653, 2254855, 2254332, 2149400, 2261483, 2273727, 2367446, 2665867, 2544513, 2237175, 2537810, 2834387, 2958480, 3183126, 3261483, 3491460, 3748683, 3966862, 4006651, 4134240, 4471222, 4703274, 5195926, 5880059, 6722568, 8669444, 11739832, 16412140, 22870342, 29501940, 31203818, 27434641, 22228770, 18221931, 14412917, 11238971, 9600986, 8312750, 7349012, 6877962, 6449113, 6191874, 5965669, 5559354, 5416086, 5440747, 5460600, 5239869, 5265277, 5472887]
4287E472887K9890K49860J55194n9800j35545R6769J55236J92346j28351k2158
4277F006328K17607N607J09696J95716m3235k8562P1991J40866K25013j00379
4267F800648l8638J72989L895k28270J56906p8166J9752J64134J96202j85475
4257F983977l60131j28678J48157o1576m09571J27406J61191J03082j8846J10705
4247F655716n6244j00641o0645K03390J62937K77372M26972R9495J31569M435
4237G744356P2838R7329J22452k5040L66119N24917O2811K92603M04220K82430
4227I945035K89663K86540P2558M33390M86162K15457J45215J39107J89575K07277
4217A2409979M05414K74527M4911j55866J11967j3199Q8899L1116k51483L3281
$$ y = [5472887, 5502777, 5752637, 5907831, 5848031, 5712486, 5809255, 5964491, 6156837, 6028486, 6006328, 6223935, 6229542, 6339238, 6534954, 6491719, 6463157, 6535148, 6676014, 6901027, 6800648, 6762010, 6934999, 6938894, 6710624, 6867530, 6789364, 6809116, 6973250, 7169452, 6983977, 6623846, 6495168, 6643325, 6581749, 6172178, 6299584, 6460775, 6563857, 6545011, 6655716, 6599472, 6498831, 6438186, 6641576, 6804513, 7081885, 7508857, 7608352, 7739921, 7744356, 7817194, 7914523, 8036975, 8011935, 8378054, 8902971, 8965782, 9258385, 9662605, 9945035, 10234698, 10521238, 10593796, 11027186, 11513348, 11728805, 11874020, 12013127, 12202702, 12409979, 12815393, 13089920, 13134831, 12978965, 13090932, 13077733, 13166632, 13197748, 12946265, 12979546]
4207A2979546J24852k75580l67749j78336j0988m8221k68013k08161O9467O4711
4197A1881528k10606k91420r5o7951k14676m7630k90290l54825k91794k29683
4187I882558n602P4784j64085P6462k3502p0756J4595l872K41275K77210n9555
4176A0239512M1931J13024p30Q0184k9633K33217K76013N22826J42983k243J35582
4165A1752666Q3777M9301K39974p7297p5323J33350j23172m9421J69262K8526
4155A2131643R5550P5500j5976j29820J71901J85429J30205j87182J1878l03253
4145A2165875k68308m83394j12529m39101j55345p4997k60957k06255O02k14808
4135I950783l96866j66483l02781o2695k1927r7792p8942l29001l08627M64296
$$ y = [12979546, 13104398, 12828818, 12461069, 12282733, 12271745, 12223524, 11955511, 11747350, 11816817, 11881528, 11670922, 11379502, 11379407, 11311456, 11096780, 11049150, 10758860, 10404035, 10112241, 9882558, 9876956, 9951740, 9787655, 9864117, 9840615, 9769859, 9784454, 9780582, 10021857, 10299067, 10239512, 10281443, 10394467, 10393737, 10473921, 10444288, 10677505, 10953518, 11476344, 11619327, 11617084, 11752666, 11836443, 11885744, 12125718, 12048421, 11973098, 12106448, 11983276, 11933855, 12103117, 12131643, 12227193, 12302693, 12286717, 12156897, 12328798, 12514227, 12644432, 12457250, 12469128, 12165875, 11897567, 11414173, 11301644, 10862543, 10707198, 10632201, 10371244, 10164989, 10165591, 9950783, 9553917, 9387434, 9084653, 9021958, 9000031, 8902239, 8823297, 8494296, 8185669, 8649965]
4125H649965J18130J74692n13216J38064J47213j55256p8956j04312j11043N0397
4115H315678J58996K54908q6390K19047j03156J43800K37905N2272J81508j92476
4105I182092J63613N0484J24651M71181L74045M2766j78790L91314K71812J00264
4095A0993432K20432J5430l0134j08381K12094J51545L95037K13625K13865M20392
4085A2697337J56045K92512K80308Q8980K52900N17068J13160K13916J43426J65264
4075A4920916J59578M12040M48366L58813N57724L15635M63813M07481N36583
4066A8580949P97979J13733J99501O89769N09910K73027P91426L77690J86726
4057B2520710N68050Q79338N60784M87000N38579M84516M62348N40547O44468
$$ y = [8649965, 8768095, 8942787, 8429571, 8567635, 8714848, 8559592, 8480636, 8376324, 8265281, 8315678, 8474674, 8729582, 8643192, 8862239, 8759083, 8902883, 9140788, 9193060, 9374568, 9182092, 9345705, 9396189, 9520840, 9992021, 10366066, 10408832, 10230042, 10621356, 10893168, 10993432, 11213864, 11229294, 11199160, 11090779, 11302873, 11454418, 11849455, 12063080, 12276945, 12697337, 12853382, 13145894, 13426202, 13515182, 13768082, 14285150, 14398310, 14612226, 14755652, 14920916, 15080494, 15492534, 15940900, 16299713, 16857437, 17173072, 17636885, 18044366, 18580949, 19378928, 19492661, 19692162, 20381931, 20891841, 21164868, 21956294, 22333984, 22520710, 23088760, 23968098, 24528882, 25015882, 25554461, 26038977, 26501325, 27041872, 27686340]
4048B7686340Q72105Q14346O43231P53643P50997P44227R70903N42922N31741
4039C4310455N28507N48535M72708N66328N21969L70073O53728O09390N80297
4030C9161990O59987Q51370O33460M10740M41441Q27651Q42348Q97288Q55905
4021D5582180P55172Q12010J112252Q25423P55042J199114J611503J334787J594096
4012E5581579J007765J539451J516922R99981J147440J015317J141699Q97249
4004F4847403N91451K3539J02519n2079j81652j98124j77273l2225o7369j70385
3994F4685805j04128j48020k22987m41j37473L60242J70492K66091L42091M44985
3984F5656657Q6722M33114M33639J79358J81920K52033j60584o45314p16802o04059
$$ y = [27686340, 28558445, 29372791, 30016022, 30769665, 31520662, 32264889, 33235792, 33778714, 34310455, 34838962, 35387497, 35860205, 36426533, 36948502, 37318575, 37972303, 38581693, 39161990, 39821977, 40673347, 41306807, 41717547, 42158988, 42986639, 43828987, 44726275, 45582180, 46337352, 47149362, 48261614, 49087037, 49842079, 51041193, 52652696, 53987483, 55581579, 56589344, 58128795, 59645717, 60645698, 61793138, 62808455, 63950154, 64847403, 65438854, 65462393, 65564912, 65512833, 65331181, 65133057, 64955784, 64923559, 64856190, 64685805, 64581677, 64433657, 64210670, 64210229, 64072756, 64432998, 64603490, 64869581, 65211672, 65656657, 65743379, 66176493, 66610132, 66789490, 66971410, 67223443, 67062859, 66417545, 65700743, 65096684]
3974F5096684j189822r83853r89073j035332r04676r04504r21954j208047p28572
3965E6230851m20093p00339o04338o94394p19459m77475m93972o55241k79371
3956E1186169o61637m78806m82539p3653j46062m65382k72580m00520J66240j2528
3946D8358702j86522n12676J17033k01984k89550l39278l76554n77663n36313
3937D5455195n95749l81852q6006k51272k44463K13164J02550L17294O05145J019960
3927D6153966J071110J373532K180495K488330K762812L347461M231901N293607
3919F8903214N723421N934518N451881M373546K531664N88098j878775l495830
3911H8131737m874867o040600o002920n786080n239240m747058l952121l511305
$$ y = [65096684, 63906862, 62923009, 61933936, 60898604, 59993928, 59089424, 58167470, 56959423, 56230851, 55810758, 55110419, 54506081, 53811687, 53092228, 52614753, 52120781, 51465540, 51186169, 50524532, 50045726, 49563187, 49489534, 49343472, 48878090, 48605510, 48204990, 48371230, 48358702, 48172180, 47659504, 47776537, 47574553, 47285003, 46945725, 46569171, 45991508, 45455195, 44859446, 44477594, 44391588, 44140316, 43895853, 44109017, 44211567, 44528861, 45134006, 46153966, 47225076, 48598608, 50779103, 53267433, 56030245, 59377706, 63609607, 68903214, 74626635, 80561153, 86013034, 90386580, 92918244, 93506342, 91627567, 88131737, 83256870, 77216270, 71213350, 65427270, 60188030, 55440972, 51488851, 47977546]
3903D7977546l488907k566496k404925k481982k039516j975438j781924j258790
3895B9979568j459775o68356j138250j192985o69923n87712n11074m62792p37999
3886B2550702q29858l78858m14703j24830k47422q9281p2584l51106k08482o4454
3876A9769124k33522l5671k27179k15710l74976k7176k38280l35370j18703p4035
3866A7888502M932k14600P4459L52808J42020K74222K91050M08247L08555N08847
3856B0039042N91698N67894O71162N30504O54524Q63175N63832Q85390J008240
3847B6375461O84233Q17272J325912R36302Q89928J053301Q21867Q98207J172829
3838C4975312M63574M72426J123855Q91184O31566M55749O97713M96816L17442
$$ y = [47977546, 44488639, 41922143, 39517218, 37035236, 34995720, 33020282, 31238358, 29979568, 28519793, 27851437, 26713187, 25520202, 24850279, 24262567, 23751493, 23288701, 22550702, 21720844, 21341986, 20927283, 20802453, 20555031, 20465750, 20393166, 20042060, 19833578, 19769124, 19535602, 19499931, 19272752, 19057042, 18682066, 18654890, 18416610, 18081240, 17962537, 17888502, 17893434, 17678834, 17753293, 18106101, 18248121, 18522343, 18813393, 19221640, 19530195, 20039042, 20630740, 21198634, 21869796, 22400300, 23054824, 23917999, 24481831, 25367221, 26375461, 27059694, 27876966, 29202878, 30139180, 31029108, 32082409, 32904276, 33802483, 34975312, 35438886, 35911312, 37035167, 37926351, 38557917, 39013666, 39711379, 40208195, 40525637]
3829D0525637K80719o3471L23506J81033k03167K32804J54711J45671L43434r3247
3819D1827630j48677k14933k11734k80303n31987q35404j083503r52818j168658
3810C6399613j277244j165466r06711j021338r15156r46860r32070m31693n04884
3801B8298191n60932m16260n05136n33873p84619p64514q08761o15230q57187
3792B2451679o68338p46560o29502n96744o47642n36815o40639k68862l15433
3783A7401144l24783m53925l07553k07432M6097j61433k06749m28580n6947k83425
3773A5016414l70998j95970j959r0049o1861k96840q8591j25257o4820J47528
3763A3867597J6166L09526l95405k32928L07817o9895j01657K42299l4199L69579
$$ y = [40525637, 40806356, 40742885, 41066391, 41247424, 41044257, 41277061, 41431772, 41577443, 41920877, 41827630, 41678953, 41464020, 41252286, 40971983, 40439996, 39604592, 38521089, 37568271, 36399613, 35122369, 33956903, 33050192, 32028854, 31113698, 30166838, 29234768, 28803075, 28298191, 27737259, 27320999, 26815863, 26281990, 25497371, 24732857, 23924096, 23308866, 22451679, 21783341, 21036781, 20407279, 19810535, 19162893, 18626078, 17985439, 17716577, 17401144, 17076361, 16622436, 16314883, 16107451, 16153548, 15992115, 15785366, 15356786, 15299839, 15016414, 14645416, 14449446, 14447487, 14357438, 14295577, 13998737, 13910146, 13784889, 13720069, 13867597, 13883763, 14193289, 13797884, 13564956, 13872773, 13802878, 13701221, 13943520, 13909321, 14278900]
3753A4278900O3143J02917M7740m2162N0005J12119K5891K37185J61104K77176
3743A5314018J30071L64192L31428K88109K01166J82165J69986K52865L57413
3734A7591413K11566M26139K51204O69358N55692M89323J70141J14587L14235
3725B0793658K50537O4916M6290J26075l849K0317m62694m2813p3731p1554l92498
3714B0254654j43097J27374q5184N0312p6130j36000J32625l9022p0715J96151
3704B0210968O5283J38494J74772O9826P2545L47293J48718L28791k2792J74135
3694B1708033k16903o9942J7037J87830J14641l19668J05231k82979n38847k97008
3684B0407425j20296k82244l28396l38637j60865p07046m26394k98168j46551
$$ y = [14278900, 14342043, 14444960, 14492700, 14450538, 14500543, 14612662, 14638553, 14875738, 15036842, 15314018, 15444089, 15808281, 16139709, 16427818, 16628984, 16811149, 16981135, 17234000, 17591413, 17802979, 18229118, 18480322, 19149680, 19705372, 20194695, 20364836, 20479423, 20793658, 21044195, 21109111, 21155401, 21281476, 21277627, 21297944, 20835250, 20792437, 20718706, 20647152, 20254654, 20111557, 20238931, 20153747, 20204059, 20127929, 19991929, 20124554, 20085532, 20014817, 20210968, 20276251, 20414745, 20589517, 20659343, 20731888, 21079181, 21227899, 21556690, 21533898, 21708033, 21491130, 21421188, 21438225, 21626055, 21740696, 21421028, 21526259, 21243280, 20704433, 20407425, 20287129, 20004885, 19676489, 19337852, 19176987, 18469941, 18043547, 17745379, 17598828]
3675A7598828n6252l55872j80510k58324k59073k16755K46321k11710k33213r546
3665A6063894j37633j81984k52964L04366k10851p1977P8466p113J37277o2915
3655A5658566l98176l37483j87101K07680K14366k41086P8514j06885K64596M38396
3645A5591387R5919L92465M31574k61392j25547j41703n2173l38690k41350l59275
3635A4991215R1805r640l34005Q9204O2867m04784j24668M12530M57378M02097
3625A5633999m2047J46071P4701k13968k94924l00244n95640p24928k73462l79701
3615A3029857l98512j84333k66944m99427k93643l04210Q9018j02344r0834J35692
3605A1114320L31883K66050J03214k35712K69552J59225k13023m097j00538l59763
$$ y = [17598828, 17542576, 17186704, 17006194, 16747870, 16488797, 16272042, 16518363, 16306653, 16073440, 16063894, 15926261, 15744277, 15491313, 15795679, 15584828, 15512851, 15591317, 15584204, 15721481, 15658566, 15260390, 14922907, 14735806, 14943486, 15157852, 14916766, 14995280, 14888395, 15152991, 15591387, 15687306, 16079771, 16511345, 16249953, 16124406, 15982703, 15930530, 15591840, 15350490, 14991215, 15083020, 15073380, 14739375, 14828579, 14891446, 14486662, 14361994, 14774524, 15231902, 15633999, 15591952, 15738023, 15812724, 15598756, 15303832, 15003588, 14407948, 13683020, 13409558, 13029857, 12631345, 12447012, 12180068, 11680641, 11386998, 11082788, 11171806, 11069462, 10978628, 11114320, 11446203, 11712253, 11815467, 11579755, 11849307, 12008532, 11795509, 11791412, 11690874, 11331111]
3595A1331111k31823j27682o1548R6560L086K92623K51619L05178O8151K58288
3585A2185563M33666N44597L90586L9063J49899K24539M8862L13206k78128j11298
3575A3940555j90573m16420j67035m2089j73112K09943n8860K24612M42232P8404
3565A3847657J28747M11942j7587j13964j13199j81990l27169k34153n33922p26481
3555A2139881m74667k82612o64784m50313l91815l94622m01746l41088k35200
3546H503034k66369k45484j98108R6114n88148m05591k63114m66030k87842j69989
3536E708473m2253l3435j70525m7677j92499j35159K56560r2140j19133k16128
3526D916084L2518j23206k60726p6940L7999N5098p9333o01k71878J68856J8236
$$ y = [11331111, 11099288, 10971606, 10910058, 11006618, 11009704, 11302327, 11553946, 11859124, 11927275, 12185563, 12619229, 13163826, 13554412, 13593475, 13743374, 13967913, 14016775, 14329981, 14051853, 13940555, 13749982, 13333562, 13166527, 13124438, 12951326, 13161269, 13102409, 13327021, 13769253, 13847657, 13976404, 14388346, 14370759, 14256795, 14143596, 13961606, 13634437, 13400284, 12866362, 12139881, 11665214, 11382602, 10717818, 10267505, 9875690, 9481068, 9079322, 8738234, 8503034, 8236665, 7991181, 7793073, 7889187, 7301039, 6895448, 6632334, 6166304, 5878462, 5708473, 5666220, 5632785, 5462260, 5414583, 5222084, 5086925, 5343485, 5251345, 5132212, 4916084, 4948602, 4825396, 4564670, 4487730, 4525729, 4580827, 4501494, 4500893, 4229015, 4397871, 4416107]
3515D416107q8069J26431R6770k13552O0760J73459J88416N1842j5858k61814
3505D534492J79521J09603m4926k18519j51557j15520N2567j79652j7376k91358
3495C857275m46313j11076l72145l2628K21191j90312l16784N0323P4023N7635
3485B791189k22737m1754l1715k1781j3326M99116k64756k9128L37691l09774
3475B693025k00282K44066J05966J22705J48467M4918J7697L1343L1064o3759
3465C175210j61816l46961k86401m7343j0588J40844r3202n4304J38500k76641
3455B177298Q8394J36425k37700J78230j34508J16549K38213l10826j75815j07524
3445A968736J6777K60814k4493m3077N032j93647K14217J93802K1430j04660L66564
$$ y = [4416107, 4328038, 4454469, 4551239, 4337687, 4398447, 4571906, 4760322, 4812164, 4796306, 4534492, 4714013, 4823616, 4778690, 4560171, 4408614, 4293094, 4345661, 4166009, 4148633, 3857275, 3410962, 3299886, 2927741, 2895113, 3116304, 2925992, 2609208, 2659531, 2733554, 2791189, 2568452, 2526698, 2494983, 2473202, 2459876, 2958992, 2694236, 2665108, 3002799, 2693025, 2492743, 2736809, 2842775, 2965480, 3113947, 3158865, 3176562, 3207905, 3238969, 3175210, 3013394, 2666433, 2380032, 2332689, 2322101, 2462945, 2369743, 2315439, 2453939, 2177298, 2265692, 2402117, 2164417, 2342647, 2208139, 2324688, 2562901, 2252075, 2076260, 1968736, 1985513, 2246327, 2221834, 2178757, 2183789, 1990142, 2204359, 2398161, 2419591, 2314931, 2681495]
3434B681495J77671J26465p7064Q4830k16414L4846J78888n003j0079J06211J73159
3423C255005O2060k9457J81797J1069K93669J5414K5866M5949j12329K82716R9604
3412D131363k56285Q3152K19059M32669K29956K93086K73307M57357K75672M22970
3402F562306M19722O65120L27170L10188L86806K14174O32949J22336K39182p8280
3392I801673m3720k20917K4316n5246j55979j67791K2319l07787J57741L14759
3382I369368L98331O4800j09609j48040J80363K37760j30898k60510j67615k98469
3372I135481j74543k58199n30469n22200l20222j04430k50788j15503j50063r7956
3362F611108j77103M7587M0756J75551J56631r7741m0239j96956N00696K20272
$$ y = [2681495, 2859166, 2985631, 2908567, 2993397, 2776983, 2811829, 2990717, 2985714, 2975635, 3081846, 3255005, 3317065, 3287608, 3469405, 3480474, 3774143, 3789557, 3815423, 3861372, 3749043, 4031759, 4131363, 3875078, 3958230, 4177289, 4609958, 4839914, 5133000, 5406307, 5863664, 6139336, 6562306, 6982028, 7647148, 7974318, 8284506, 8671312, 8885486, 9518435, 9640771, 9879953, 9801673, 9757953, 9537036, 9561352, 9506106, 9350127, 9182336, 9204655, 8896868, 9054609, 9369368, 9767699, 9832499, 9722890, 9574850, 9755213, 9992973, 9862075, 9601565, 9433950, 9135481, 8960938, 8702739, 8172270, 7650070, 7329848, 7225418, 6974630, 6859127, 6709064, 6611108, 6434005, 6481592, 6522348, 6697899, 6854530, 6756789, 6716550, 6519594, 7020290, 7240562]
3352G240562k07438l20419M98486J74557m8887M31381N13382K77372N20609P68932
3342I848537K64969N00868N75845O72486Q10602N91431N30965L98885P07416M64796
3332A5366800L34064K27111q151J72304M47285K40727J11471J77186O4079M53005
3322A7585881J87090J83025J91280M14062J83868K41256N6576r4345o1499j83885
3312A8703309j72643l77030n33909l71685n19740n65482m18010j80832j34035
3303A5429943l16611l04570m37541j68572m0857j19816n5692k38459k49677p0766
3293A3427382m9994j1345k8897K2832j12643q5546Q3419L57045K83372J77294
3283A4062919K11987J89959L83744J03434O1419L92178K87458M76181L71919K04381
$$ y = [7240562, 7033124, 6712705, 7211191, 7385748, 7336861, 7768242, 8281624, 8558996, 9079605, 9848537, 10113506, 10614374, 11190219, 11862705, 12673307, 13264738, 13795703, 14194588, 14902004, 15366800, 15700864, 15927975, 15919824, 16092128, 16539413, 16780140, 16891611, 17068797, 17132876, 17585881, 17772971, 17955996, 18147276, 18561338, 18745206, 18986462, 19043038, 18948693, 18887194, 18703309, 18530666, 18153636, 17619727, 17248042, 16728302, 16162820, 15744810, 15563978, 15429943, 15113332, 14808762, 14371221, 14202649, 14161792, 14041976, 13986284, 13747825, 13498148, 13427382, 13377388, 13366043, 13337146, 13359978, 13247335, 13161789, 13245208, 13602253, 13885625, 14062919, 14274906, 14464865, 14848609, 14952043, 15013462, 15405640, 15693098, 16169279, 16541198, 16745579]
3273A6745579O08097K31094K06374L85263j7866K21374P37926J50586R5456o4221
3263A9299662P2293K4904J3544O7178J43816l93554j56734K51144M3517m679j38644
3252A9222447L51572K34598J61862M82497n4100J23400M59085M25943M23751N07629
3242B2338684K03536L56341M36757o6660K79986k94663o02104n42195q68442o91236
3232B0550004m73316p60621o77073n79205k32889l95252k44462n86491m40972
3223A6159723l4338k06658o6353q6868k58118q3930q4808j36701K08341K13458
3213A5623748j21802m18289Q2750j6564n1791j6748k4406k71234k7621J69681
3203A4927724K47251L010K2681L99246O0282J74519J00765K39874M91899R6641
$$ y = [16745579, 17353676, 17584770, 17791144, 18176407, 18158541, 18379915, 19117841, 19268427, 19363883, 19299662, 19371955, 19396859, 19410403, 19477581, 19621397, 19227843, 19071109, 19322253, 19365770, 19361091, 19222447, 19574019, 19808617, 19970479, 20452976, 20398876, 20522276, 20981361, 21407304, 21831055, 22338684, 22542220, 22898561, 23335318, 23268658, 23548644, 23253981, 22651877, 22109682, 21241240, 20550004, 20076688, 19316067, 18638994, 18059789, 17826900, 17431648, 17187186, 16600695, 16159723, 16125385, 15918727, 15852374, 15765506, 15507388, 15423458, 15338650, 15201949, 15410290, 15623748, 15501946, 15083657, 15166407, 15149843, 15098052, 15081304, 15056898, 14785664, 14758043, 14927724, 15174975, 15177985, 15200666, 15599912, 15660194, 15834713, 15935478, 16175352, 16667251, 16763892]
3193A6763892j22549O9860Q5118N8692K52135O5517P4359M838M34513K26322K21685
3182A8134382N31035N18823L99484M19803R56153R70847J079663J047017J644013
3173B5701220J872238K176248K387438K321423K385310J696356J061093O96074
3165D0297400P7663K11040L71808P62292J417012K099503K874264L660422M640653
3156E6412057O001668P662111R413531J1568750J3135586J4069644J2915145J0143945
3148A41322437O039630J602368r67642j545562o41994O74259J332687R72282p95976
3139A47992489l924784p120130r696908j0691889j1643025j0875884j0088561
3132H3951308r158519p824101p069660n829862m711256m118364l744546l079563
$$ y = [16763892, 16641343, 16711203, 16796321, 16855013, 17107148, 17172665, 17247024, 17251862, 17686375, 17912697, 18134382, 18665417, 19184240, 19583724, 20003527, 20959680, 21930527, 23010190, 24057207, 25701220, 27573458, 29749706, 32137144, 34458567, 36843877, 38540233, 39601326, 40297400, 40375063, 40586103, 40957911, 41720203, 43137215, 45236718, 48110982, 51771404, 56412057, 62413725, 70075836, 79489367, 91058117, 104193703, 118263347, 131178492, 141322437, 147362067, 148964435, 147996793, 146451231, 145809237, 146483496, 147816183, 148788465, 147992489, 144067705, 136947575, 127250667, 116558778, 104915753, 94039869, 83951308, 74792789, 66968688, 59899028, 54069166, 49357910, 45239546, 41495000, 38415437]
3124C8415437k326155k129269j331760q33757j155337j202459j442174j111231
3116B6883295j152167j221608j112456j209595r14426r86138n66984m33823o91607
3107A8594491p45505m72549l7148m18960l07874k93990l70425j89411K89881R6506
3097A6145016r5277l7245K584j25544K6247l45009N3908J22502J37818K88278
3087A6173278J84221J93695j00548J31084K22586O8581M8487J23189N13857R72703
3077A8531133L46358L67334L90645N62004P45948Q28552R05769J265819J090646
3068B5034208J296633J812768K080758K132059K333359K228046K180648K113683
3060D1212162J951091J204523J252025J398641J332574J789854K391083L177351
$$ y = [38415437, 36089282, 33960013, 32628253, 31794496, 30639159, 29436700, 27994526, 26883295, 25731128, 24509520, 23397064, 22187469, 21273043, 20286905, 19719921, 19286098, 18594491, 17848986, 17376437, 17339289, 16920329, 16612455, 16318465, 15948040, 15758629, 16048510, 16145016, 16049739, 16012494, 16015078, 15889534, 15915781, 15570772, 15624680, 15747182, 15885000, 16173278, 16357499, 16551194, 16450646, 16581730, 16804316, 16872897, 16921384, 17044573, 17558430, 18531133, 18877491, 19244825, 19635470, 20197474, 20943422, 21771974, 22677743, 23943562, 25034208, 26330841, 28143609, 30224367, 32356426, 34689785, 36917831, 39098479, 41212162, 43163253, 44367776, 45619801, 47018442, 48351016, 50140870, 52531953, 55709304]
3052E5709304M277078N763781P504645R140120J1008632J3427792J4556098J4244776
3044A35632226J2140933Q926062N264541K974748K156966L016009N491581Q682215
3036A84285281J1707548J4755271J4880971J2030911O387266j818340r599427
3029B32629481j5879093j9171607k0225248j9385597j7844213j6041464j3919102
3022A10163157j2407596j0951175r400962q057588o935282n739391m637810l750899
3014D8282454k979268k144068j834572j710610j624557j467367j390858j278090
3006C3853064j296477j140525j005597m36823m85893m21498N2928K28254P17611
2997C0065044Q66634Q96183J324135J749843K313113K715747L806543M678522
$$ y = [55709304, 59986382, 65750163, 73254808, 82394928, 93403560, 106831352, 121387450, 135632226, 147773159, 156699221, 161963762, 164938510, 167095476, 170111485, 175603066, 184285281, 195992829, 210748100, 225629071, 237659982, 244047248, 242228908, 232629481, 216750388, 197578781, 177353533, 157967936, 140123723, 124082259, 110163157, 97755561, 86804386, 77403424, 69345836, 62410554, 56671163, 52033353, 48282454, 45303186, 43159118, 41324546, 39613936, 37989379, 36522012, 35131154, 33853064, 32556587, 31416062, 30410465, 29973642, 29487749, 29066251, 29119179, 29347433, 30065044, 30931678, 31827861, 33151996, 34901839, 37214952, 39930699, 43737242, 48415764]
2989D8415764N514722O973953Q872612J0296449J1155662J1215330R877032P189660
2981A19511184K317635k443595o188974r270352j0310382j0695990j0304659r135483
2973F3479384p870433o947697n893824m851426l914114l025665k961570k240459
2965B5774196j586096j404426j178428j207881j157690j055614r13446r81014
2957A6289601r86951p46150j011964r90416m36600o93247o47448j10191m87778
2948A0178856l67226n92173O6757r9448m38925m03439k30901l32060L8028p3347
2938G746122m85845k60243M787l31392o04004k99589m05705j08699k31542q568
2928E015322j30100N0379k90274K5031j85801k14267p9143l64571m0470k37638
$$ y = [48415764, 53930486, 60904439, 69777051, 80073500, 91229162, 102444492, 112321524, 119511184, 121828819, 119385224, 113196250, 103925898, 93615516, 82919526, 72614867, 63479384, 55608951, 48661254, 42767430, 37916004, 34001890, 30976225, 28014655, 25774196, 24188100, 22783674, 21605246, 20397365, 19239675, 18184061, 17270615, 16289601, 15302650, 14556500, 13544536, 12554120, 12117520, 11424273, 10776825, 10666634, 10178856, 9811630, 9219457, 9286214, 9186766, 8747841, 8344402, 8113501, 7781441, 7819469, 7746122, 7260277, 7000034, 7004821, 6673429, 6069425, 5769836, 5364131, 5255432, 5023890, 5015322, 4885222, 4935601, 4645327, 4670358, 4484557, 4270290, 4191147, 3826576, 3786106, 3548468]
2918C548468M4684j14759p1123l17244J59409L7087P0896r3281P2118l42896m74490
2907B518869k1977J05315K0510j74064J3471j27695N3018j92259P4821k33994
2897B036015J86564N780j56531j93072j19756k1446L19782O8306k44715j08467
2887A772460k90124L52511r9533q5038J04834l27707J33245K60645J35886K16977
2877B174156j15961m97817l04970J18201K78838J42293r0189k06052R2178J41804
2867A732481j62282J35885l0606J1806K03849P1199k5483M360k81474l97385q82
2856A261468m4807r1678K34203J36816j55138p4716Q1269l26904J20383P3802
2846A214698j4320k16618k62450k3186o374P0231m1224m7368j65558j17110j01878
$$ y = [3548468, 3593152, 3478393, 3407270, 3090026, 3249435, 3286522, 3357418, 3264137, 3336255, 2993359, 2518869, 2496892, 2602207, 2622717, 2448653, 2462124, 2334429, 2387447, 2195188, 2270009, 2036015, 2222579, 2228359, 2071828, 1878756, 1759000, 1737554, 2057336, 2125642, 1880927, 1772460, 1482336, 1834847, 1735314, 1650276, 1755110, 1427403, 1560648, 1821293, 1957179, 2174156, 2058195, 1560378, 1255408, 1373609, 1652447, 1794740, 1704551, 1498499, 1590677, 1732481, 1570199, 1706084, 1675478, 1687284, 1891133, 1962332, 1936849, 1941209, 1659735, 1262350, 1261468, 1216661, 1124983, 1359186, 1496002, 1340864, 1266148, 1347417, 1020513, 1140896, 1214698, 1200378, 983760, 721310, 698124, 691750, 761981, 720757, 673389, 507831, 390721, 288843]
2835B88843j27825j3674m2202L84423N6817k22911O5972J59582M8626m509O8703
2824F61845J41962j57938j36151P9458J46026r837k89668k17248p5544J08033
2814B50938l4633K02790j0586K31708q0308j68948p5225o1756n94Q010l7834o6847
2802A56715k2238J27842J05318n3582J17564j83372r5868j08709M3959J93267
2792B80896r0328N6323j40246J24800j77146R9361J68000o8780j44674R4514K7403
2781B30123k9844K22315P3460l61265L1583L1850l7956Q5487Q1031K11549k43427
2770B94906k91966m7091R3595L17937N00951R0412k76463j03339J4018j06840
2760D86120M22212J90029j77208p7273l3617J6589J48515n5737J51415K13596
$$ y = [288843, 161018, 147344, 105142, 489565, 546382, 323471, 389443, 549025, 597651, 593142, 661845, 803807, 645869, 509718, 589176, 735202, 725365, 435697, 218449, 142905, 250938, 216305, 419095, 408509, 640217, 559909, 390961, 315736, 253980, 253386, 261396, 223562, 156715, 134477, 262319, 367637, 314055, 431619, 248247, 152379, 43670, 87629, 280896, 190568, 246891, 106645, 231445, 54299, 153660, 321660, 252880, 108206, 202720, 230123, 200279, 422594, 496054, 134789, 166372, 198222, 160266, 245753, 326784, 538333, 294906, 2940, -44151, 49444, 367381, 868332, 958744, 682281, 578942, 592960, 486120, 908332, 1098361, 921153, 843880, 810263, 826852, 975367, 919630, 1071045, 1284641]
2750A284641R371k9895K319r0450L8516J09528j22620n0420q4907k87862O9493
2739H47714j32873J01622j01567j23044P9406j23227L4919l20996J85193O464
2729D53611j47161j19756J28523o0422L7161j22838N6128M4906l31511J61766
2719A00407K24124j92124J5595P8715k72329n0862J54573M4855K0170J09274k53303
2708b0905R7997K68260L7533j6297N4129j01407l6510O7840p2309J70321O8883
2697E17535j38325l3658M94837k7084r3647j12068j50700k17609j37627K56760
2687C58414M5270j86642O2478J47977q6382l08297k3165k486j51756J74601p8134
2676d8122l02M6276Q2406M5438J15827j35501o2713j12361l4912o6326l3869o878
$$ y = [1284641, 1294012, 1264117, 1266436, 1175986, 1214502, 1324030, 1201410, 1150990, 1066083, 778221, 847714, 714841, 816463, 714896, 591852, 671258, 548031, 582950, 261954, 447147, 453611, 306450, 186694, 315217, 254795, 291956, 169118, 225246, 270152, -61359, 100407, 324531, 132407, 148002, 226717, -45612, -96474, 58099, 102954, 123124, 232398, -20905, 77092, 345352, 382885, 366588, 420717, 319310, 282800, 350640, 278331, 448652, 517535, 379210, 345552, 840389, 813305, 719658, 607590, 456890, 239281, 101654, 358414, 403684, 217042, 279520, 427497, 341115, 32818, 9653, 7167, -144589, 30012, -48122, -48424, -2148, 80258, 125696, 241523, 106022, 43309, -69052, -103964, -170290, -204159, -211037]
2664b11037K27962j35208k5795J33587L72619j31507k07475m8363r5511L63403
2654B42675l1836p1555K3243m59734K45296R1450j18428N1834K03393K4238J7814
2643B18390K12930J648l15338J5177Q3802j94250J7427O5596P2037l3776l24601
2632a80958K13300k10202r1578J39085q5768K3183M2478J00271k46237K36850
2622e9576j7521J13209r6363k8284q4104N8313O7660J77129K23945L0633J7128
2611D02169J41149l4691O9896j06968j26432q7883J76298K62425J97787N196L12646
2600A211592N08031J93937k28150j77927j63800k72809j62440j91350j19006q421
2590E89657j75503m16249R515K52462j29831O3376Q5529L5552K7139j20196J84089
$$ y = [-211037, 16925, -118283, -144078, -10491, 362128, 230621, 23146, -25217, -120728, 242675, 210839, 139284, 162527, -297207, -51911, 39539, -78889, -27055, 176338, 200576, 218390, 431320, 432968, 117630, 132807, 216609, 22359, 39786, 105382, 177419, 143643, -180958, 32342, -177860, -269438, -130353, -216121, -192938, -150460, -50189, -296426, -59576, -77097, 36112, -60251, -88535, -172639, -114326, -46666, 130463, 354408, 385041, 402169, 543318, 508627, 578523, 471555, 345123, 257240, 433538, 695963, 893750, 898946, 1211592, 1719623, 1913560, 1685410, 1507483, 1343683, 1070874, 908434, 717084, 598078, 589657, 414154, -2095, 7420, 259882, 130051, 193427, 278956, 314508, 341647, 221451, 405540]
2579D05540j36136j2530J09382k39667L19105j52015k67734J40794L32013K24044
2569G22796m92866j95008P0812K54774o4946j15835j31216j06039O1264m9713
2559d5977l38028J28863K29102K40478k03750j05504L33083q2433k55263J43399
2549D3970j03984k086q715j60623J691K96136J14207p9894k30233R6961p6278
2538a08848J15563J97547r8181o3612n0818j1116J73192O0592N830J25717j92396
2527A53470K93981j70067k9713J31452Q5850r8617J17576j06961p0009j75280
2517A31682J05251k8183P0386L5540m8215k51544J99325L05963N595M5862j42906
2506D28756q0377p3081j56303o114J42773k2704q6443O9124o864j00940N4684
$$ y = [405540, 269404, 256874, 366256, 126589, 445694, 293679, 25945, 166739, 498752, 722796, 229930, 34922, 105734, 360508, 295562, 179727, 48511, -57528, 3736, -45977, -384005, -255142, -26040, 214438, 10688, -94816, 238267, 155834, -99429, 43970, -60014, -62100, -70815, -231438, -229747, 66389, 180596, 100702, -129531, -32570, -108848, 6715, 204262, 106081, 42469, -8349, -19465, 153727, 214319, 220149, 345866, 153470, 447451, 277384, 247671, 379123, 464973, 366356, 483932, 376971, 306962, 131682, 236933, 208750, 279136, 314676, 266461, 14917, 214242, 520205, 525800, 571662, 428756, 348379, 275298, 118995, 112881, 255654, 232950, 146507, 215631, 208767, 107827, 162511]
2495A62511o8248q5164K26777k08352K19316J96986q8678k50301K81114J57529
2485E43490n744O1824j9122J52837Q0268o7807K6672K3371j47130P0774l7247
2474F82186j07628j43980K34689p9892n6938L0260Q3506P5543J31684j17100j80437
2463E51893k09756K23631K73483l72456L0711J51310p9272Q4357K15799L07667
2453A177367j15328l01778k1374p3136P5872J92752J55901K1583j25694K40937
2443A227102m0209K7778L7468n3229m134K4207j99623N3771j01752J64674K95232
2432A431285o8229j85532J78899r7152J2918q2312r8215Q1614K1966j36590j07742
2421I50910K78772j17904O102J41858k0448R8134K13292k2576j16850K68016K5375
$$ y = [162511, 94263, 9099, 235876, 27524, 246840, 443826, 355148, 104847, 385961, 543490, 537746, 599570, 580448, 733285, 813553, 745746, 772418, 795789, 648659, 719433, 682186, 574558, 430578, 665267, 585375, 528437, 558697, 642203, 717746, 849430, 732330, 551893, 342137, 565768, 839251, 466795, 497506, 648816, 569544, 653901, 869700, 1177367, 1062039, 760261, 738887, 665751, 741623, 934375, 1090276, 1111859, 986165, 1227102, 1186893, 1214671, 1252139, 1198910, 1194776, 1218983, 1019360, 1073131, 971379, 1136053, 1431285, 1363056, 1177524, 1356423, 1259271, 1272189, 1189877, 1091662, 1173276, 1195242, 1058652, 950910, 1229682, 1111778, 1117880, 1259738, 1239290, 1337424, 1550716, 1528140, 1411290, 1679306, 1704681]
2410A704681o0295k3364l4715j25513K27859J15008K00310J97492o8781j1473
2400B121209j04671Q1665M5862K76646j16306q9854j10745L3729K02449O7016
2390B407000K27560j9466L21882J0302K44834P8837R5986M9343K49898l222L35045
2379C997999j9530L68708P5559O337k1896O3186m4942P0751O8566M13853K15659
2368E194250K65731K09533L77660O2093K95925N04535N2389M41200M98230N9554
2358G961100J24566Q29789L18088K73597Q19528J169401J576155K260761K988907
2349A8321892L326643L280081J970879L38016P40561J163112J468664K333499
2341C2943347M528692O404244R873565J4458135K4257175M0947779O1250300P9427176
$$ y = [1704681, 1644386, 1621022, 1586307, 1460794, 1688653, 1803661, 2003971, 2201463, 2132682, 2121209, 2016538, 2098203, 2144065, 2420711, 2304405, 2214551, 2103806, 2137535, 2339984, 2407000, 2634560, 2615094, 2936976, 2947278, 3192112, 3270949, 3366935, 3416278, 3666176, 3662954, 3997999, 3978469, 4347177, 4422736, 4429073, 4407177, 4470363, 4425421, 4496172, 4564738, 4978591, 5194250, 5459981, 5669514, 6047174, 6109267, 6405192, 6909727, 6962116, 7403316, 7901546, 7961100, 8085666, 8915455, 9233543, 9507140, 10326668, 11496069, 13072224, 15332985, 18321892, 21648535, 24928616, 26899495, 27237511, 27978072, 29141184, 30609848, 32943347, 37472039, 43876283, 53749848, 68207983, 92465158, 133412937, 194663237, 274090413]
2333B74090413P7783444P219258n3550408n9064884n0298366m5453837l6773234
2326A13952386k5432179j9070283j3417431j0804898p005576m862229k679851
2319C0679939j494534p22978k381530k984342k978529j819376j297764j379061
2311A5621825j384322r50625j117567j099506o22596m83477p68818k97249o23944
2302H273721k88836n20648j68713k41015n85071J8183l92454l42399K36703j08011
2292E881460j59718k03647K1909j49896j52755m29176l20912k28698k11086l16049
2282C731432K46930p1986l04126j05514R4622J7735L02204k23535m2466j2808
2272C632488l36320j79519j12287m79113k80494J96808K13434J81066o2457N6898
$$ y = [274090413, 351873857, 359093115, 305542707, 246477823, 196179457, 150725620, 113952386, 88520207, 69449924, 56032493, 45227595, 38222019, 33359790, 30679939, 29185405, 28462427, 26080897, 23096555, 20118026, 18298650, 17000886, 15621825, 14237503, 13286878, 12169311, 11069805, 10447209, 9963732, 9194914, 8897665, 8273721, 7984885, 7464237, 7295524, 7054509, 6469438, 6487621, 6095167, 5752768, 5989471, 5881460, 5721742, 5518095, 5540004, 5390108, 5237353, 4808177, 4487265, 4258567, 4047481, 3731432, 3978362, 3906376, 3602250, 3496736, 3591358, 3609093, 3911297, 3687762, 3645296, 3632488, 3296168, 3116649, 3004362, 2525249, 2244755, 2441563, 2654997, 2836063, 2773606, 2830504]
2262B830504m46869m84120K0015J33513L0525r9770j79096l02125J70987J39930
2252A813494P8811m63378j41479M05986k84444r1418K77826m3046l9621k46327
2242A266404p0617j7579J50353q9363J01056k09344l34464m6785P3749P2310q6517
2231H09203J11960j42222o2612L21834O3367R9911k55930j87726j27615J1361
2221F41531j51138r311r1472J00554j58470j567K44157l15628J76420r8673j91188
2210A45215J14174O605J77601K3462j24286K18166k47096L10045l5901R1239j91863
2199D87361j03293j34259q9081K25025k87136K73177J04129j68731L7673j09484
2189B35381K6770j98306L407L31256K622j12639j76344l082p0077J77921K42072
$$ y = [2830504, 2383635, 1899515, 1919530, 2053043, 2083568, 1983798, 1804702, 1502577, 1673564, 1813494, 1892305, 1428927, 1287448, 1693434, 1408990, 1317572, 1595398, 1552352, 1512731, 1266404, 1195787, 1178208, 1328561, 1239198, 1340254, 1130910, 796446, 749661, 823410, 895720, 809203, 921163, 778941, 716329, 1038163, 1101530, 1201441, 945511, 757785, 630170, 641531, 490393, 481082, 389610, 490164, 331694, 330127, 574284, 258656, 435076, 336403, 145215, 259389, 265994, 443595, 467057, 342771, 560937, 313841, 623886, 587985, 679224, 487361, 384068, 249809, 160728, 385753, 98617, 371794, 475923, 307192, 344865, 235381, 262151, 63845, 67252, 398508, 401130, 288491, 112147, 109065, 38988, 216909, 458981]
2178D58981j79356O8234J99078k13419j21166M5181j22342K55277J49029J2483
2168E51980k49724k9826N8932J04806R7758J11353n88109P658J38145k0151Q229
2157A91051k64980J88580L4222N8726J65965j63418k51020J10197K34196l39795
2147c6276j78155K50143p4696l64630m8172P6122K4228K14740K44320p6145n6597
2136b5118j07104J472J42384L3355j41162K02849k30282j7630M5304j02997L9528
2125a59401P3158J55399r8127j52142N6877o5068J16001m5144R0956j58386J76935
2114h942L44272n35426j19696l1298J8893L22035L66939j19160J4819j54365k17799
2103a19728N1360L47652j69660m77901j45644N2108K17833L59382j31840j54199
$$ y = [458981, 279625, 347859, 546937, 333518, 212352, 257533, 135191, 390468, 539497, 551980, 302256, 272430, 331362, 436168, 533926, 645279, 57170, 64828, 202973, 182822, 191051, -73929, 114651, 148873, 207599, 373564, 210146, -40874, 69323, 303519, -36276, -214431, 35712, -38984, -403614, -451786, -375664, -351436, -136696, 107624, 31479, -25118, -132222, -130750, 11634, 44989, -96173, 106676, -123606, -141236, -95932, -198929, -159401, -86243, 69156, -28971, -181113, -124236, -189304, -73303, -118447, -27491, -185877, -8942, 335330, -200096, -319792, -351090, -332197, -10162, 356777, 237617, 252436, 98071, -119728, -68368, 279284, 109624, -368277, -513921, -461813, -243980, 115402, -16438, -170637]
2093a70637j35213j78465J74169q3753J6492P9550J044m3265J47892L36402m56940
2082c12724l77525J16207J71926J42764J68139j16820k14150J93005K86790L04534
2072C62146k3188k74721j03457M0751R5404K96189N0452M37336M26075l291O3352
2061A367048k00499j59240l69780k21170j79030k45184J68013j71059j47635J43363
2051a5173R2492k91902L55164K4018j45281J7686J2339L00726j82893o55073J45624
2040c42273K28755m01612J53958k545J02925J76788R0176j40609k9448k68191
2030d32076J55340K17331j947j95113R7768m84613j19786K03524n432j6128R0897
2019d90235J18873J1640j31059K68460K7229K9049p0973j19997L5658J84305j58480
$$ y = [-170637, -305850, -484315, -310146, -393899, -377407, -297857, -296813, -340078, -192186, 144216, -312724, -690249, -574042, -402116, -259352, -91213, -208033, -422183, -229178, 57612, 362146, 338958, 64237, -39220, 1531, 96935, 393124, 443576, 880912, 1306987, 1303696, 1367048, 1166549, 1007309, 637529, 416359, 237329, -7855, 160158, -10901, -158536, -15173, 77319, -214583, 140581, 164599, 19318, 37004, 49343, 350069, 167176, -487897, -342273, -113518, -515130, -361172, -363717, -260792, -84004, 6172, -134437, -163885, -432076, -276736, -59405, -61352, -256465, -158697, -643310, -763096, -559572, -565004, -581132, -490235, -371362, -359722, -490781, -222321, -195092, -166043, -237016, -357013, -321355, -137050, -295530]
2008b95530N0964K13610j63835R1054M1492L756m2718k94589M0164J5735K04312
1997a35585J42287j13173j64438P4677J56827m4630k18915Q4979Q2335j99878
1987c35514K2976P9231K00342O5193j05731j13046K9270L6699Q7805J26841l0930
1976F3136q9525j59280L6250R5696k16932n7574J04987J53570j49944J67485m1953
1965i4084m1636l6491k30626j62008O1458R7264L58412j55535J09550l66374K68587
1954a91483P624o1932o3866j25451r6436L95107J0281k65413j00767l2585O6385
1943d58536J36277J81739n3426r803K4870j85889K1974K98902k6043L02449J58092
1932C90606m47787j6605L113k91825K45365K00850r3990r5905q6376M5891J78864
$$ y = [-295530, -244566, -30956, -194791, -103737, -62245, -58489, -101207, -395796, -355632, -339897, -135585, 6702, -106471, -270909, -196232, -39405, -84035, -302950, -217971, -135636, -335514, -312538, -233307, -32965, 32228, -73503, -186549, -157279, -120580, -32775, 94066, 63136, -26389, -185669, -149419, -53723, -270655, -328229, -223242, -69672, -219616, -52131, -94084, -135720, -172211, -402837, -564845, -503387, -406123, -47711, -203246, -93696, -460070, -191483, -183859, -245791, -309657, -435108, -531544, -136437, -126156, -391569, -492336, -524921, -458536, -322259, -140520, -193946, -203749, -178879, -364768, -342794, -43892, -69935, 232514, 390606, -57181, -73786, -70673, -362498, -117133, 83717, -10273, -106178, -192554, -146663, 32201]
1921C2201j57222o9731L322j46043j18822J45736J41067k7410r0851r9209Q5597
1910c01365L8833j11549J60141N7149O7711L023j46978p9035K5039J81913R3005
1899a2113k40903k41477R1615P732Q8587K9114m685J49711l16364r3386O3228
1888d78941J27350L4849P5708K0722R0631r912j3001J0773L5351j59766k06172
1877d72408J52278K30219j4066J6579J03608j81131j02911o6097K19145P0667
1867d4117o9782J06460j64618l4875Q8394q5424k26334j8301L39360Q7752j19730
1856a41215o445j41621Q1136o9953L30115Q1187l97019m5378o2839J05255K74004
1845G227j45278n2247j05364o3833J78434k3570k5768j37744O7703J0675J6956
$$ y = [32201, -125021, -194752, -191430, -337473, -456295, -310559, -169492, -196902, -287753, -386962, -301365, -262532, -374081, -213940, -156791, -89080, -86057, -233035, -312070, -287031, -105118, -12113, -253016, -494493, -402878, -395146, -306559, -277445, -282130, -132419, -448783, -542169, -478941, -351591, -316742, -241034, -220312, -129681, -139593, -152594, -141821, -106470, -266236, -472408, -320130, -89911, -103977, -87398, 16210, -164921, -267832, -333929, -114784, -44117, -113899, -7439, -172057, -206932, -118538, -203962, -430296, -448597, -109237, -21485, -141215, -147660, -289281, -208145, -278098, 52017, 133204, -263815, -309193, -372032, -266777, 7227, -138051, -190298, -295662, -359495, -181061, -204631, -230399, -368143, -300440, -289765, -272809]
1834b72809J05817k37275J53998l27898M4034K24537r2916p4101J14861K09053
1824a52699O6985L8092k97140K45425k97556k79996L57391j75158K02407K22002
1814g0247m45145J10175K94125p4687j88791K49632k1534k69369J9047K36963
1804a59831q9589J56436j7451r9073J69897J9821P8863Q5460k03154k02399J32978
1793a28042L75912j5845j72616n3549j25998j45577m3935J94511O876K42337r2604
1782D1470k44282J37469p5633k7400K40j00787J09599q3372K42606Q8295p0692
1771A7513j81343l95853N2597K99768q3627J55715J1918j61658k86177j09344
1761f80491K13039M8036P7129p3O3691J01739P9009J7691k4809n4962l1889j08656
$$ y = [-272809, -166992, -404267, -250269, -578167, -534133, -309596, -402512, -476613, -361752, -152699, -85714, -47622, -344762, -99337, -396893, -676889, -319498, -494656, -292249, -70247, -515392, -405217, -111092, -185779, -374570, -124938, -146472, -415841, -396794, -159831, -249420, -92984, -110435, -209508, -39611, -19790, 59073, 144533, -58621, -261020, -128042, 247870, 232025, 59409, 5860, -120138, -265715, -309650, -115139, -108263, 134074, 41470, -202812, -65343, -140976, -168376, -168136, -268923, -159324, -242696, -90, 88205, 17513, -163830, -559683, -507086, -207318, -290945, -135230, -123312, -284970, -571147, -680491, -467452, -419416, -342287, -342360, -278669, -176930, -97921, -80230, -105039, -160001, -191890, -300546]
1749c00546j9784J21241J1940m6419j64039J06122K94201j06037j55029o6370
1739c24720P5006O5116j57216l6125J50419J82529o8813j1862p1755J18003K66753
1728A87335k39837J88360j37930k64708J75242j11218Q7533J35181k30488K31258
1718B0728J08034k99227q2402J70705k36223J76217l2221j07136j32441O1858
1708c52108R6605j15101K67100j26809K1713j86248K8318j06464M5206q0494J79565
1697c28717K59042j51607K4634r1486K29084n7680j92880M9872K14067j01544
1687a47215j17079Q8020r444k4603r5401l4736m70P472P6717q9697N8674K89430
1675A668L6435j88178j16009o9501J84029K20327m5531j87095Q8896J231j45986
$$ y = [-300546, -320330, -199089, -187149, -233568, -397607, -291485, 2716, -103321, -258350, -324720, -249714, -184598, -341814, -377939, -227520, -44991, -113804, -125666, -197421, -79418, 187335, -52502, 135858, -2072, -266780, -91538, -202756, -115223, 19958, -210530, 20728, 128762, -170465, -252867, -82162, -318385, -142168, -174389, -281525, -413966, -352108, -255503, -370604, -103504, -230313, -208600, -394848, -366530, -472994, -427788, -508282, -328717, -69675, -221282, -196648, -288134, -59050, -116730, -309610, -259738, -45671, -147215, -264294, -176274, -185718, -210321, -305722, -340458, -340928, -333456, -256739, -346436, -287762, 1668, 38103, -150075, -266084, -335585, -151556, 68771, 23240, -163855, -74959, -73728, -219714]
1664b19714L143l6672o1436J35168Q4559N8383l5137n6136O272o1643O6951j57279
1652b73541r5119p8201L5213K33897j30967J78470l484Q4015o4157J18216J30125
1641A34467j7533j38379L7285J34859j63047J5710k07370j10038l825K9347m4172
1630c32696m2733j61250Q6045K42439K50213k19514l77095N6774K87194P0948
1620a39675j25683L65869J35122j41985j08315j04855q8684J15527J66214J2186
1610H5721Q8585l51140K3865k11448n8974P1111l6733K14820k55480o7346L44527
1599a52492j98615L6174l66316K08650L14117J62628j81570q513k8055J46209
1589f7783j7649k31898Q4621J33727R3450k50581O5117r2111K57136M2915N1563
$$ y = [-219714, -216571, -253243, -314679, -179511, -94952, -36569, -71706, -127842, -121570, -183213, -116262, -273541, -368660, -446861, -411648, -177751, -308718, -130248, -133732, -49717, -113874, 4342, 134467, 116934, -21445, 15840, 150699, -12348, 3362, -204008, -314046, -317871, -288524, -332696, -375429, -536679, -450634, -208195, 42018, -177496, -554591, -497817, -210623, -139675, -265358, 100511, 235633, 93648, -14667, -119522, -208206, -92679, 73535, 85721, 174306, -176834, -152969, -364417, -423391, -352280, -389013, -174193, -429673, -497019, -152492, -351107, -314933, -681249, -472599, -158482, 4146, -177424, -185937, -213992, -67783, -85432, -317330, -232709, -98982, -5532, -256113, -190996, -283107, -25971, 16944, 68507]
1578F8507n366m6581j85702l57017J44373M8627J20544k65942j40550M7915j4784
1567e85976K78372L00898o7071l476o1061j93452N4528k96293J23955j66996K88615
1556c27957L17552q0930k30486j31983K36419L36343J3407l06888j17656O9890
1546b22289q5070J97800J29854N0048l9093k27741O6772K165N4385j4202k17145
1535c04516K27762K3799P7669q1786M407p4176k96360J54786Q0355M4638K4865
1524a18557j27678J5044J92895J10154j26444m4101O0492j13261k39500J28659
1514b62297L00434j14671j04283j10042L75171j3720n6141K05725k85282j04804
1504a69910P5273j37093R9680j40819n2120O5484l3063J11316l9599j3853q6506
$$ y = [68507, 63141, 16560, -169142, -526159, -381786, -333159, -212615, -478557, -619107, -571192, -585976, -307604, -6706, -73777, -77253, -138314, -331766, -277238, -573531, -449576, -616572, -327957, -10405, -91335, -321821, -453804, -217385, 118958, 132365, -174523, -292179, -222289, -307359, -109559, 20295, 70343, 31250, -196491, -129719, -127554, -73169, -87371, -304516, -76754, -52955, 24714, -57072, -52665, -126841, -423201, -268415, -188060, -143422, -118557, -246235, -231191, -38296, 71858, -54586, -98687, -38195, -151456, -390956, -262297, 38137, -76534, -180817, -290859, 84312, 70592, 14451, 220176, -65106, -169910, -94637, -231730, -132050, -272869, -324989, -259505, -292568, -181252, -220851, -234704, -321210]
1493c21210l063k0574K7591O3930o9357O1861J79997j76119K6311K59159p9417
1482e0891j08714O4450o3247J90164j22026j10113j18657L6564K95047m4199k38625
1471b70247k25304K16301m9242J12341J08860J5867N2397n8371j30333j51621
1461c79352p410K25129n3920k55207k0703J76767P0910j52110J93206J01726m7554
1450a48518j0377q7191J05788r836m3966J10083j51512j61513N8950O889Q0534
1439b50669K00131J0394j45155j34717o8793K71761m8161k32931M2273K12711
1429a43156J85767k78689q3995J47167L36110k04502p2980N7015o9108P6338l31271
1418c81304J01751j0291N7305N9056J25074M0115O276j49258k98491K40001J61664
$$ y = [-321210, -324273, -344847, -317256, -253326, -322683, -260822, -80825, -256944, -230633, 28526, -50891, -159605, -95155, -158402, 31762, -90264, -200377, -319034, -282470, 12577, -31622, -270247, -495551, -279250, -328492, -216151, -107291, -91424, -39027, -97398, -227731, -379352, -386762, -161633, -215553, -470760, -491463, -314696, -243786, -395896, -202690, -100964, -148518, -158895, -246086, -140298, -150134, -194100, -84017, -235529, -397042, -338092, -331203, -250669, -50538, -40144, -185299, -320016, -388809, -117048, -165209, -398140, -355867, -143156, 42611, -236078, -320073, -172906, 163204, -41298, -114278, -57263, -126371, -50033, -381304, -279553, -289844, -232539, -173483, -48409, -8294, -2018, -151276, -449767, -209766, -48102]
1407d8102m3258k167k65911J3158L49826n5106N7949j09203j81904m3129O3183
1396b64664m709o8081p9220J88885L06275m4663m40686J40242J83264l04773K37588
1385a50542J75051P9099r1356j39972j75287N330j06177P0745J50269j6396O9605
1374a29631k43696l3850L5155m0161K06994K75355j02139k10707o5166J94104
1364a13742Q068k04648J27708J39868M9755j97859j73815L87599j6214k10468
1354b03748p4523j66994l7914j406J73749j03426K23242K53844j50539o7577k4142
1343a79434M69979k87800q5801K03299k43535o9305Q3579J99825k5007j56330
1333i0530n2907j17348j25027K91116M0442j41409K2963n0976l06619M57227p213
$$ y = [-48102, -91360, -93527, -359438, -346280, 3546, -51560, 6389, -102814, -284718, -327847, -264664, -269373, -337454, -416674, -227789, 78486, 33823, -406863, -266621, -83357, -388130, -150542, 24509, 103608, 12252, -127720, -303007, -297677, -403854, -333109, -182840, -199236, -129631, -373327, -407177, -372022, -412183, -205189, 70166, -31973, -242680, -307846, -113742, -105674, -310322, -182614, -42746, 7009, -190850, -364665, 22934, 6720, -203748, -278271, -445265, -483179, -484585, -310836, -414262, -191020, 62824, -87715, -155292, -179434, 290545, 2745, -83056, 120243, -123292, -192597, -109018, 90807, 65800, -90530, -143437, -260785, -385812, -94696, -54254, -195663, -172700, -223676, -530295, -73068, -80281]
1322h0281M3993Q3677n3514p7155k45320J09138r9933M9441q7039N9452J48608
1311a48933J76961O7697l36443o4164J74810q9645p0305J99455N3029J60182q9505
1300C3139K25640Q6975j70693l08253j4817J61843m1049Q8244j96031j02184J78997
1289e8189K5175q6017k29172j63041K14250K5819o5620m2965j40458j73955L47227
1278c46946q3926L03422P3358k60311J43837O7928Q769n6398K38825K21032j06501
1267B03089r5228j93482j407J20309k71865j79299Q3952m44832R525L13944K63888
1256a91406Q7919r3029p9412J1229j04913J86467m2265J44508j7151K87941J60963
1245C50851j74824o615k55352j57016j92426K27226J28701m8534N5352J0708j64735
$$ y = [-80281, -36288, 47389, -6125, -83280, -328600, -219462, -319395, -269954, -356993, -297541, -148933, 28028, 95725, -240718, -304882, -130072, -219717, -290022, -90567, -37538, 122644, 33139, 258779, 345754, 175061, -133192, -148009, 13834, -27215, 61029, -135002, -237186, -58189, -33014, -119031, -348203, -511244, -296994, -271175, -336795, -379760, -520218, -694173, -346946, -430872, -127450, -54092, -314403, -170566, -102638, -93869, -150267, 88558, 309590, 203089, 107861, -85621, -87028, 33281, -238584, -417883, -333931, -778763, -769238, -455294, -191406, -103487, -196516, -275928, -264699, -369612, -183145, -225410, -80902, -98053, 189888, 350851, 176027, 169412, -85940, -242956, -435382, -208156, -79455, -127989, -72637, -61929, -226664]
1234b26664p4963j38096P1031J28466J35313j93138k38957J16487K93360n683
1224a32844j31891m7850K02474j87783k0501P1355j03423j44970P4586N3509K01930
1213a65408k88010r5394L76548M1947k46082j50915K19228j91984J56026N5541
1203b88503L52786j8163K8858j0420k63509j36033r7593K78708L7970J41857k95693
1192b69735j87387J2633K86850k62769q0943K85529K36161O4917j84791j01524
1182b01059r5603l03550K20701M74284j05100j33902J56546J56377k15641l1487
1172g8434j68564j19292N2192Q0187N6624R3331k74781l3788q1436J98076K31063
1161d4822R9412q2392o1708o3856j86569L41592j44155j99530J3017J76678p091
$$ y = [-226664, -301627, -439723, -368692, -240226, -104913, -298051, -537008, -420521, -127161, -132844, -264735, -312585, -110111, -297894, -318395, -247040, -350463, -495433, -420847, -367338, -165408, -453418, -548812, -172264, -130317, -376399, -527314, -308086, -500070, -344044, -288503, 64283, 46120, 74978, 64558, -198951, -334984, -432577, -153869, -115899, 25958, -269735, -457122, -444489, -157639, -420408, -501351, -215822, 20339, 85256, -99535, -201059, -296662, -600212, -379511, 94773, -10327, -144229, 12317, 168694, -46947, -78434, -246998, -366290, -314098, -233911, -177287, -83956, -358737, -392525, -473961, -275885, -44822, 54590, -27802, -89510, -153366, -339935, 1657, -142498, -342028, -329011, -152333, -159424]
1150a59424j71J19311p8791k8060O7742k10248q2526J72083J64965O9482l7015
1139b652k06853j17211R7306K00073k00399j24679K17168r8047M7778K89660k0494
1128H1650l05084K28048J40275J08047j55336q624j98142P6741p810k91736P8
1117c31893J14686o3841N3556K26033j22146r9193J63973R8707M089J80286j15151
1106A09106r7202J36427j02869q4836k30518O6141K77913k17676j13058N5926
1096b00646J24065k67417o4687K98050R6163Q3973j68266M2596J07525k81377
1086b30021P5534J51675m8012j06323J52539j8508K54877M8375k91223K2683j99086
1075a87490J28204J02586k69839j00032K34787K8128j80665j53573J75818L22240
$$ y = [-159424, -159595, -40284, -119075, -147135, -79393, -289641, -372167, -200084, -35119, 34363, -2652, -209505, -326716, -229410, -29337, -229736, -354415, -137247, -235294, -187516, 102144, 81650, -223434, 4614, 144889, 252936, 97600, 88976, -109166, -32425, -40235, -331971, -331893, -217207, -281048, -227492, -1459, -123605, -222798, -58825, 39882, 43971, 224257, 109106, 11904, 148331, 45462, -39374, -269892, -203751, 74162, -143514, -256572, -200646, -76581, -343998, -408685, -110635, -14472, 69501, -98765, -56169, 51356, -230021, -154487, -2812, -50824, -157147, -4608, -23116, 231761, 280136, -11087, 11596, -187490, -59286, 43300, -226539, -326571, -91784, -63656, -244321, -397894, -222076, 100164]
1065A00164J55270l26385m19581K79325Q0661R5790j50938n8923O1992q5449K5039
1054b43035J22871M5931R0560r6801r0839M664R181j83731k30711J73773q82j24607
1042e23626k1425m6434M1456J27035N5665R062M987R6481P4646M4598M1417M2489
1030e3649q8015k5852M3571j59895q6722L07665J62450k31M6879k33790J30866
1019D3277m6782j86349J82436j0869j92438j94446m5808K46900O0997l1857k7660
1008b02599N5665j44424j31978J61803L24877m4020l39784N9593j0037j022j33458
997d05384K23340j43906K17412K21631j87449J02369j36058L9365J69004j35367
987c5043l4087p5385J29376j36346n954n5172J38551o6336j05146j30213m6324
$$ y = [100164, 255434, -70951, -490532, -211207, -130546, -34756, -185694, -244617, -182625, -268074, -243035, -120164, -74233, 16327, -80474, -171313, -166649, -157468, -341199, -571910, -398137, -399019, -523626, -545051, -591485, -550029, -422994, -367329, -358267, -353280, -256799, -182153, -137555, -96138, -53649, -141664, -167516, -123945, -283840, -370562, -62897, 99553, 99322, 146201, -87589, 43277, -3505, -189854, -7418, -18287, -210725, -405171, -450979, -204079, -143082, -174939, -202599, -146934, -291358, -423336, -261533, 63344, 19324, -320460, -260867, -270904, -271926, -405384, -182044, -325950, -108538, 113093, -74356, 28013, -108045, -68680, 100324, -35043, -69130, -144515, -15139, -151485, -157439, -212611, -74060, -140396, -245542, -375755, -422079]
976d22079J99348j47327J13210K15857Q4188K8646q2286q9357J07068J16417Q7484
965B11169j9035k17928k01542m6924j31231k00785q8148L15528K88998k4413J26187
954A1876J25759j49802k45695j02689K74941p7281q7037N9610Q0091r7945q4171
943b92343J7222J69450J52772o236j26423O8377j06497O63K76590k53089k31137
932c30651j16118o9521J58076J09921k3484R4703K07719m9287n6669l60672j07831
921e43814J68625Q4574k8068M3423J74060J17504q4995O0251J13923j28984m6134
910f9635j36223J0517J89790K48928p6152p6745k19174k05177l2602R1479j5589
899b90583J17280j3245k48202K92409K27089K46874J59365l28848j81974j85906
$$ y = [-422079, -222731, -370058, -256848, -40991, 43197, 71843, -10443, -99800, 7268, 123685, 211169, 192134, -25794, -227336, -274260, -405491, -606276, -694424, -378896, -89898, -114311, 11876, 137635, -12167, -257862, -360551, -85610, -162891, -249928, -190318, -110227, -208172, -292343, -275121, -105671, 47101, 40865, -85558, -17181, -123678, -123015, 153575, -99514, -330651, -446769, -516290, -358214, -248293, -271777, -177074, 30645, -18642, -75311, -435983, -543814, -375189, -290615, -318683, -275260, -101200, 16304, -68691, -8440, 105483, -23501, -69635, -205858, -195341, -5551, 243377, 167225, 90480, -128694, -333871, -366473, -274994, -290583, -173303, -186548, -434750, -142341, 84748, 331622, 490987, 162139, -19835, -205741]
889b05741P2083R9416q8541o5558o4195K47447k33401J70062J20264j13744o6190
878a28098l10323K29927J70086r8358r5582l3286K01028N4072J36761o6562j00249
867d0584j13465j99320m7404L50O973J970m6992r977j38323P0120M06613j5166
855a25205l07578l9197p1223M68439m8526k9805o2489l37117J3875J45326N9775
844c33725k7794J55793J20846L4928j62945k0132j49575K62705j63700J9872j56853
833d20580p8925J5269J29311R5151j24365J73038L54686j1370j31095K6453k21257
822a93684J32211J1296l77285L9007R0661K21955J42413l15807L2402Q6359k70879
811d01351K02822j77061Q0258K69876k7132q4043j4253p152k73036K78048J62948
$$ y = [-205741, -133658, -34242, -122783, -188341, -252536, -5089, -238490, -68428, 51836, -61908, -128098, -438421, -208494, -38408, -136766, -232348, -265634, -64606, -10534, 126227, 59665, -40584, -154049, -353369, -400773, -400423, -393450, -391480, -438472, -448449, -586772, -516652, -110039, -125205, -432783, -471980, -543203, -74764, -123290, -153095, -215584, -552701, -538826, -393500, -333725, -361519, -205726, -84880, -49952, -212897, -233029, -382604, -119899, -283599, -263727, -420580, -499505, -484236, -354925, -259774, -384139, -211101, 143585, 132215, 1120, 27573, -193684, -61473, -50177, -427462, -388455, -297794, -75839, 66574, -249233, -216831, -130472, -401351, -198529, -375590, -295332, -25456, -52588, -136631, -150884, -158036, -431072, -153024, 9924]
800I924o3307j19801k43591L08380O5242j19777K80978m9620k80277K45215K32340
789B65706j17996l37606N0396l8022j2757L7560L6206q5217J27745J77989k28784
778a24780j82182J6340J38888J95032J49508j32994n9436O1572K1356j44969k3826
767h5491j84851J02650J1270k3369q3512R2495l36l02660J69915L67575k34313
756a70627o9421J74691J05724j63087j77149L591Q9241K990j4461J5281l8017
745b41244L04725M121k04326K7438j75604J99563O8560j94057J63656L529j66332
734b09971j31248P1267m0409J3212K01177j23971q0501K11237J32792k00622R6715
723f0322p2300N1114j33526L6074O2664J9312R660k01162J2778J21881p57k8412
$$ y = [9924, -53383, -173184, -416775, -108395, -43153, -162930, 118048, 68428, -211849, 33366, 265706, 147710, -189896, -139500, -177522, -190279, -152719, -116513, -201730, -73985, 104004, -124780, -306962, -290622, -151734, 43298, 192806, 59812, 376, 61948, 83304, -61665, -85491, -270342, -167692, -156422, -179791, -263303, -170808, -171144, -473804, -303889, 63686, -170627, -240048, -65357, 40367, -122720, -299869, -296278, -207037, -204047, -218508, -203227, -241244, 63481, 67602, -136724, -109286, -284890, -85327, -16767, -210824, -47168, -43639, -209971, -341219, -269952, -310361, -297149, -95972, -219943, -300444, -89207, 43585, -157037, -60322, -132622, -81508, -215034, -178960, -116296, -96984, -87324, -288486, -275708, -153827, -154584, -182996]
711a82996m6988J08873Q9248J7463L1779k1711j56969J95700p9990j21054J59157
700g488k69428K49345j63621J81733l30382K2368K49401j65081j9558K2470J47881
689h2360k11448K22826J0887J71613K5728k34414j41659K21441k28834j69861
679d16081K86400J84325Q4496k02542k68969J48183j01350K47802J96700r4745
669F4219r2002j61948K02741k05504q6377j80922J06569O0962J83882K18070P0162
658A79852k09530k33162N8321J45752q7312o8030J80836P6104n6032k663J31994
647A16130j18645J5839P6179Q6266q1511k36222M4501k06612r8442K43162J19551
636c9804n4751L5939q2224l8801K81793K5938j13959K20515k65131k24277j29787
$$ y = [-182996, -229984, -121111, -31863, -14400, 17379, -4332, -161301, 34399, -45591, -166645, -7488, -276916, -27571, -191192, -9459, -339841, -317473, -68072, -233153, -252711, -230241, -82360, -293808, -70982, -60095, 111518, 137246, -97168, -238827, -17386, -246220, -416081, -129681, 54644, 139140, -63402, -332371, -184188, -285538, -37736, 158964, 64219, -27783, -189731, 13010, -192494, -278871, -459793, -353224, -292262, -108380, 109690, 179852, -29678, -262840, -204519, -58767, -146079, -214109, -33273, 42831, -13201, -15864, 116130, -2515, 13324, 89503, 175769, 94258, -141964, -97463, -304075, -402517, -159355, -39804, -94555, -58616, -140840, -179641, 102152, 128090, 14131, 234646, -30485, -254762, -384549]
625c84549K05441J47425L8512m3503j88273k907J53356p2534L3645J24808p2450
614f1029Q2291o9192R7818m5025q8765L5135j68774K09100k47891n4715N9698
603b51349k9236J93133K81152R2456J33476k54232k28077O0662J11790q5764M5737
592F9748k66217K01281O0584j94782M5705M0790j13343k37052K26780N2184N7959
581e6363k26830j29657J17579J15883p532J22759l4691j6518j72155K18606j7870
570h6789P8456m7869q8387j19090j7088L39418K30967N2972l69900j85084L45400
559A33006r9779L7877J12777j39392j2264k96603Q235J05330k84349J49987O1094
548b24081k3208M604L34783j97934r4238L8449J50291j60392k43626l0842J33909
$$ y = [-384549, -179108, -31683, 6829, -36674, -224947, -227854, -74498, -147032, -113387, 11421, -61029, 21262, -47930, 49888, 4863, -83902, -48767, -217541, -8441, -256332, -311047, -251349, -280585, -87452, 193700, 286156, 419632, 165400, -62677, -2015, 109775, 24011, 69748, -196469, 4812, 65396, -129386, -83681, -42891, -156234, -393286, -166506, -114322, -56363, -283193, -412850, -295271, -179388, -186920, -64161, -98852, -115370, -287525, -68919, -86789, -8333, -56202, -144589, -263679, -280767, 58651, 289618, 342590, -27310, -212394, 133006, 33227, 71104, 183881, 44489, 32225, -264378, -256143, -150813, -435162, -285175, -224081, -247289, -242685, 92098, -105836, -200074, -161625, -11334, -171726, -415352, -446194, -312285]
537c12285l8098J23855J54231j19299P0373p2457J74865J39548J09411Q0268j77102
526A33310n0394k08380j48354R7732L6228k47861k8588k6586J5739M4865j06008
515d88297P5416K90759J10614k5211j17481l14968J60443J29936L86848K05076
505D13135k92734k88779l4723l9522j4421J30008N8929j20796N3963l0223M7448
494a17715j61118k10021K20964j01401J54788J60531M3469k00078n7503J00538
484a67546j25876K46097J3169j30984J57622j9371k01903M3081k1923R3582K5606
473h8446N135n9498N6867n0472l0349o6461L2497j38806J57882K51856j15190
462d4985k86642k5257J89829r3452K95212R9342n6794k49574j70689J9257J42402
$$ y = [-312285, -350383, -226528, -72297, -191596, -121223, -193680, -18815, 120733, 230144, 310412, 133310, 82916, -125464, -273818, -176086, -139858, -387719, -416307, -442893, -427154, -382289, -488297, -412881, -122122, -11508, -36719, -154200, -469168, -308725, -178789, 208059, 413135, 120401, -168378, -203101, -242623, -257044, -127036, -68107, -188903, -134940, -165163, -117715, -278833, -488854, -267890, -369291, -214503, -53972, -10503, -210581, -268084, -167546, -293422, -47325, -34156, -165140, -7518, -26889, -228792, -185711, -207634, -114052, -88446, -83311, -142809, -85942, -136414, -166763, -233224, -200727, -339533, -181651, 70205, -44985, -331627, -356884, -167055, -260507, 34705, 134047, 77253, -172321, -343010, -323753, -181351]
451a81351k6867p7154M8349l24464K76791K55272J7787j8809P329j42930O1906
440a04141k2204L3693j81288L60673j66722j18471P7007r2447K0436N0894O5930
429g6640P8707J01232m7571k57128K14140L3445k07954J33520J1865J992k76143
418b90535m5974Q1576J47533n4720l4134r977R1525J87709J06499k80330k15374
407c16202J54211L86939j57512k39481l8703J21606J36140o9960n9389K5347P5240
396A8236J69127k57053j64981J54207p7925o6156j32442q1302J83190J48261l9511
385a46349J70500j06355j01541R5752j94124J83851j86799J34002J47275q1494
375h5282L0679k3513J14427k99210J28811J22065k34212j04960J77969L86919
$$ y = [-181351, -208218, -285372, -237023, -561487, -284696, -29424, -11637, -30446, -23117, -166047, -104141, -126345, -92652, -273940, 86733, -79989, -198460, -121453, -213900, -193464, -142570, -76640, 2067, 103299, 55728, -201400, 12740, 46185, -161769, -28249, -16384, -14392, -290535, -336509, -254933, -107400, -162120, -196254, -206231, -114706, 73003, 179502, -100828, -316202, -161991, 224948, 67436, -172045, -210748, -89142, 46998, -22962, -82351, -57004, 18236, 187363, -69690, -234671, -80464, -158389, -224545, -356987, -438289, -255099, -106838, -146349, 24151, -82204, -183745, -87993, -282117, -98266, -285065, -151063, -3788, -85282, -54603, -78116, 36311, -262899, -134088, -12023, -246235, -351195, -173226, 213693]
365B13693j04969j61245J3458j13501j91128K86907K9723j01638J40367L6306
355D7973n3762M6191j75507j48200j29103O1480M8707K12026J74700r095m85206
344d09796L6930N4920J92573J88159m0661J0210J62568j76837k40885K80325j34969
333g7463L07657j07362j38010O6198m6088L3070N1078M9023l36035j18288L13045
322c175J0539l57435K84644p808j21722K18012l31036K58231k15920Q2869J76534
311f267J13491k6623j78280P9709j10698j63850j06639J6713K26979M6631P8656
300c0178l7756J40604k29060k08078J29269J80481j07220M4183p6222k22064K07065
289b08976J42455J54590k35461j3565j1770J22970r476j22486l4253N2847o3543
$$ y = [213693, 108724, -52521, -39063, -152564, -343692, -56785, -27062, -128700, 11667, 47973, -5789, 40402, -135105, -283305, -412408, -350928, -302221, -90195, 84505, 75410, -409796, -372866, -317946, -125373, 62786, 22125, 32335, 194903, 18066, -222819, 57506, -77463, 230194, 122832, -15178, 51020, 4932, 38002, 89080, 138103, -197932, -316220, -3175, 7364, -350071, -65427, -73235, -194957, 23055, -307981, -49750, -265670, -182801, -6267, 107224, 80601, -97679, -17970, -128668, -292518, -399157, -382444, -155465, -108834, -30178, -67934, 72670, -156390, -364468, -235199, -54718, -161938, -117755, -193977, -416041, -208976, -66521, 88069, -147392, -160957, -172727, -49757, -59233, -181719, -215972, -163125, -226668]
278b26668j09051K9287J64794j39817J56480j6395J11779j5245o4494k7921O246
267a31005J02177N3032J7142k29073o841j60885J35307j25735n7115n2746k117
256d57859L81519J56435k25585j11222k00236K32252L3873l6643K42873l3521
246a8114P8239o8910o6497J88051j75000J49868m0482j45335L2604O2919K6543
235B3886O7107j23179l3817M9455J11117J06214j17319k64106K9441j44368J55099
224a40470J63395k25761L2213n2618P0086J18294L1998j61760j43242J04890Q7512
213a15463j70377O3287k5032J90549k76885l5473K24242J80418j4172J03451j25327
202g82J09462k42673J2121j9238j54845j6626J72023l47550M6357L34595O917
$$ y = [-226668, -335719, -306432, -141638, -281455, -124975, -141370, -29591, -44836, -109330, -137251, -131005, -28828, 24204, 41346, -187727, -194568, -355453, -220146, -345881, -402996, -455742, -457859, -76340, 80095, -145490, -256712, -456948, -224696, -190823, -227466, 15407, -18114, 60125, -8785, -75282, 112769, -62231, 87637, 47155, -98180, -65576, -2657, 23886, 90993, -32186, -66003, -16548, 94569, 200783, 83464, -180642, -151201, -295569, -140470, 22925, -202836, -170623, -223241, -153155, -34861, -2863, -164623, -307865, -202975, -115463, -285840, -222553, -247585, -57036, -333921, -369394, -145152, 35266, 21094, 124545, -782, 108680, -133993, -121872, -141110, -295955, -312581, -140558, -488108, -441751, -107156, -100239]
191a00239l1241J28239N9963p7292J46864j83106P1061J12938k78045l6120J06145
180h0833j86809J84338J10129j41480K02575j73801l55413K69888j30535j6356
170c18297j41462J52725J43058J6983P3662R5650n5630m695r1050j13566R9074
159a43548m8490l5352o3985m819J73550k68250k9816Q2540j2264j13937P7514
148c86857o1363K12786J03751K01850J15261N8044k1031o4565l11934j06077L15077
137E4942N6256J78667k40985k16927Q9143r5215J43801j22150o0851K07549l0841
126c6611J80020k70783K8301N8490k4417K1235m3889k52228j05539L3148j0230
115d22503K52918l6516J42787n0266r4458K7506j33203J08605L0076j8004l0680
$$ y = [-100239, -131480, -3241, 56722, -20570, 126294, -56812, 14249, 127187, -150858, -186978, -80833, -267642, -83304, 26825, -114655, 87920, -85881, -441294, -171406, -301941, -318297, -459759, -307034, -163976, -146993, -73331, 22319, -33311, -38006, -129056, -242622, -143548, -192038, -227390, -291375, -296194, -122644, -390894, -420710, -338170, -350434, -464371, -386857, -448220, -235434, -131683, 70167, 185428, 243472, 222441, 157876, -154058, -260135, 54942, 111198, 289865, 48880, -168047, -78904, -174119, -30318, -152468, -213319, -5770, -36611, 143409, -127374, -99073, -40583, -65000, -43765, -87654, -339882, -445421, -412273, -422503, -169585, -206101, -63314, -113580, -208038, -180532, -313735, -205130, -175054, -193058, -223738]
104b23738K09142k6265J5776K1771j25524j52181N5956J56072K8559j41166j54564
93c36162N8995J65696l9608k49585J17061K46500J0716l77736R1837J95694l37355
82d53947J34507J62292j70703m2303j9098o328L32689j64229p578O8356K7772
71a38570l0798k82115j61299L33292J33717J16049r1264p5052R4229j57965j60060
60d19836O2342n3553K7941J92570J39730l8593o2803j07594q9104N8794J27881
49a62225J43531l0171j8994j26287o3240P3433N830o459J0961j82627Q5525L9292
37b31431M922J38212k2358k81163K18315J58855j16096o9174l6850K392P6556
26a57820p7124j45924R77O0621j1255J04817k0213k05608o2025J90362o1312K0333
$$ y = [-223738, -14596, -40861, -25085, -3314, -128838, -281019, -225063, -68991, -40432, -181598, -336162, -277167, -111471, -151079, -400664, -283603, -37103, -26387, -404123, -312286, -116592, -453947, -319440, -157148, -327851, -370154, -389252, -395580, -62891, -227120, -234698, -166342, -138570, -169368, -451483, -612782, -279490, -145773, -29724, -120988, -196040, -101811, -259776, -419836, -357494, -411047, -383106, -190536, -50806, -89399, -152202, -259796, -348900, -290106, -162225, -18694, -48865, -67859, -194146, -257386, -183953, -178123, -184582, -173621, -356248, -270723, -231431, -226509, -88297, -110655, -391818, -173503, -14648, -130744, -199918, -236768, -234376, -157820, -234944, -380868, -379891, -319270, -330525, -225708, -245921, -451529, -513554, -323192, -384504, -364171]
14c64171K41097o7434k72351k01377J85266K19308Q5759j85987m5014l992j2318
3d21214J15552J5163J39506
0a50993
$$ y = [-364171, -123074, -190508, -462859, -664236, -478970, -259662, -173903, -359890, -404904, -408896, -421214, -305662, -290499, -150993]
$$ Imaginary data points
##PAGE= N=2
##DATA TABLE= (X++(I..I)), XYDATA
16383a692047J0822j2204O4984j24048R7988J28701j596J0569Q654j03963L39336
16372a272804j91773p003R7197J5635K01646J68772P0024j23609O2534j42035
16362a121416Q6929K9691L9476k7926j42906p2495J53911P4750K24705j76171
16352i31452k7870N4607r6904p1558k7857J11938J66423J74965O6424P6433J15404
16341c89447j16582m23762K46097L61688l24844k64607O3370J15586J70551j11092
16331f73042N5532K64906j35686J28943N5374m9310J69564k5210r7513j91148
16321d97590J19569j27923Q0309Q2997K2424K01517n5980K281K20828p6744r1789
16310a20101Q0205j48011J12749Q5131j10218J37392P8998K05246P7056j86017
$$ y = [-1692047, -1681225, -1693429, -1628445, -1752493, -1654505, -1525804, -1527400, -1516831, -1508177, -1612140, -1272804, -1464577, -1471580, -1374383, -1358748, -1157102, -988330, -918306, -1041915, -979381, -1121416, -1034487, -1004796, -965320, -993246, -1136152, -1208647, -1054736, -979986, -755281, -931452, -959322, -904715, -1001619, -1073177, -1101034, -989096, -822673, -647708, -581284, -504851, -389447, -506029, -929791, -683694, -322006, -646850, -911457, -848087, -732501, -561950, -673042, -617510, -352604, -488290, -359347, -303973, -353283, -183719, -208929, -306442, -497590, -378021, -505944, -425635, -342638, -320214, -118697, -174677, -172396, 48432, -28312, -120101, -39896, -187907, -75158, 9973, -100245, 37147, 116145, 321391, 398447, 212430]
16300B12430m5951K30147K6303k5264k50234n0094N1838K4292J28645K49397k34050
16289C17459P9143j58088k8150J46333r5317J50629j00267J44918J3790J0735
16279D81185P2205L7990j30795M354K6536Q3889K98248q8871m0937J79428j88255
16268G34977r5046J69390k85741J94382J5630J3644J14519q622j14540N5448J31237
16257I25278j28932j01317L7894K68151j5452J51952j3023k7676j30723o1202
16247I04950j59425K02944J26552k22424N8454K24881m220j38638J34098r5325
16237A031847j54218K94581P6873k7927j34794J52848Q0699j08074J5954P3004
16227A300793P4411K5866J06468j1880r6622j67714k19300P9692j8686K73885
$$ y = [212430, 166479, 396626, 422929, 397665, 147431, 97337, 149175, 173467, 302112, 551509, 317459, 396602, 238514, 210364, 356697, 261380, 412009, 311742, 456660, 470450, 481185, 553390, 591380, 460585, 464939, 491475, 575364, 873612, 784741, 743804, 923232, 734977, 639931, 809321, 523580, 717962, 733592, 747236, 861755, 853133, 738593, 794041, 925278, 796346, 695029, 732923, 1001074, 985622, 1137574, 1124551, 1096875, 966152, 904950, 745525, 948469, 1075021, 852597, 911051, 1135932, 1131712, 993074, 1127172, 1031847, 877629, 1172210, 1249083, 1221156, 1086362, 1239210, 1319909, 1211835, 1227789, 1300793, 1375204, 1401070, 1507538, 1495658, 1399036, 1231322, 1012022, 1091714, 1073028, 1346913]
16217A346913K86341j51539M0067J35926l3671M7490M7214k13001K36461r3382
16207A648819L4494j97734l83411L35632M3801N7695K59465M4489k65672r045
16197A568533J23658j46150p4881K22000L10519j19773k61609k80411n718K04881
16187A541049q7804L39468n0738j05578K01802j90726q6112l9563l4328j52423
16177A335047R5942K57037J11066K9412k26329k13245q5136M01182O282j15576
16167A595682J77583O8483q2664J81876l39883j77183L23498K68009m4158O8570
16157B039813p6664o0586j88232J6360N0035k00843J40506L8815J80308l0768
16147A908744j15992R718J06464k4594J66204J45567J078j47026j23298j3786
$$ y = [1346913, 1633254, 1481715, 1521782, 1657708, 1624037, 1671527, 1718741, 1505740, 1742201, 1648819, 1683313, 1485579, 1102168, 1437800, 1481601, 1539296, 1798761, 1843250, 1577578, 1568533, 1692191, 1546041, 1471160, 1693160, 2003679, 1883906, 1622297, 1341886, 1336168, 1541049, 1453245, 1792713, 1741975, 1636397, 1838199, 1647473, 1561361, 1521798, 1487470, 1335047, 1430989, 1688026, 1799092, 1828504, 1602175, 1388930, 1303794, 1704976, 1711258, 1595682, 1773265, 1841748, 1759084, 1940960, 1601077, 1423894, 1747392, 2015401, 1971243, 2039813, 1963149, 1902563, 1714331, 1730691, 1780726, 1579883, 1720389, 1759204, 1939512, 1908744, 1792752, 1802470, 1908934, 1884340, 2050544, 2196111, 2197189, 2050163, 1926865, 1913079]
16137A913079J61131k9498R5506R2119k96221K5670j13594j19298J34030J26316
16127A989240J80715K12718P1526l54545J13805n7683j02662q4943k24570J53792
16117A897393J85770n4610p7414L814n9196R1459m9574N9292J2769m4338J66827
16106B132192Q3974r7405j91667n5255l0767J59685j09906Q6285l8542J67692
16096B106286J752l2848o5179N2602l935k57113n576J98982L63637q9393k57928
16085B011287j80051N8045P9821R7499j20236j01201J3989J53740J53198k20139
16075A945952j16057L54277p7224M9365J03497k4054O3406k13058J54730K9154
16065B269988k37281k20393J91080J07227p1398q5209l3369k2263J14530O2943
$$ y = [1913079, 2074210, 2044712, 2140218, 2232337, 1936116, 1961786, 1848192, 1728894, 1862924, 1989240, 2169955, 2382673, 2454199, 2099654, 2213459, 2155776, 2053114, 1968171, 1743601, 1897393, 2083163, 2028553, 1951139, 1954953, 1895757, 1987216, 1937642, 1996934, 2009703, 1965365, 2132192, 2216166, 2118761, 1927094, 1871839, 1841072, 2000757, 1890851, 1977136, 1938594, 2106286, 2108038, 2075190, 2010011, 2062613, 2058678, 1801565, 1795989, 1994971, 2358608, 2269215, 2011287, 1831236, 1889281, 1969102, 2066601, 1946365, 1845164, 1859153, 2012893, 2166091, 1945952, 1829895, 2184172, 2106948, 2156313, 2259810, 2235756, 2299162, 2086104, 2240834, 2269988, 2032707, 1812314, 2003394, 2110621, 2039223, 1954014, 1920645, 1898382, 2012912, 2075855]
16055B075855O7448j2243j60149o9579L26000M8290k21980J9408J24843K3395
16045B221288m4186j49732j53156J16035m3076n0270K18983K6126j23R9337j70169
16034B071057k68750J14700k833L2980J50981J82280m6978j51308k09675j80867
16024A691587K47876k21189K46842J45682J2968p3445j17042O8198K07643J9043
16014B228163r3548j72544M5996N1174q9382j60929J14204K45802m6838J49309
16004B271407j25296p033j78763J96591K7070o7668j01148J45905n1479j98752
15994A910834q9437r5117K17130p5273R5743r5483K92458K6677l22335J20273
15984A985470n6472J96157N9087k26849j46345k4523K61213J48459j15845p4140
$$ y = [2075855, 2143303, 2131060, 1970911, 1901332, 2227332, 2275622, 2053642, 2073050, 2197893, 2221288, 2177102, 2027370, 1874214, 1990249, 1947173, 1896903, 2115886, 2142012, 2141889, 2241226, 2071057, 1802307, 1917007, 1914174, 1947154, 2098135, 2280415, 2233437, 2082129, 1872454, 1691587, 1939463, 1718274, 1965116, 2110798, 2123766, 2050321, 1933279, 2001477, 2209120, 2228163, 2134615, 1962071, 2008067, 2059241, 1969859, 1808930, 1923134, 2168936, 2122098, 2271407, 2146111, 2139078, 1960315, 2156906, 2183976, 2116308, 2015160, 2161065, 2109586, 1910834, 1821397, 1726280, 1943410, 1868137, 1963880, 1868397, 2160855, 2187532, 1865197, 1985470, 1928998, 2125155, 2184242, 1957393, 1811048, 1786525, 2047738, 2196197, 2080352, 2006212]
15974B006212K35482q0364J4759j38824K13039L12325M6027k28183k41635j04714
15964B034124l956q2759p2204o3324L18630N1650n3266K42211M4355j50044o8379
15953B197038k65110k31490J63827K32948j80706k1294L31721n3888j22109r6595
15943A954342J02085k6099k30208J16578J68393J71521j50736J41610N1003j16878
15933B181611j92772O0891o9264N6153k32203j72733M60899J13077l12479M2480
15923A935660L20445l93112O6457k7919Q7148L13836M7310n89l61322l9587m7439
15912A900888j14502J31997J73442J9914K2121k00062l1723P9615j742j8116l8843
15901A922989K04262j50824Q7924R0137j07370K2669N06L51822K31962m01866
$$ y = [2006212, 2241694, 2161330, 2176089, 2037265, 2250304, 2562629, 2608656, 2380473, 2138838, 2034124, 2030168, 1947409, 1875205, 1811881, 2130511, 2182161, 2128895, 2371106, 2415461, 2265417, 2197038, 1931928, 1700438, 1864265, 2097213, 1916507, 1895213, 2226934, 2173046, 2050937, 1954342, 2056427, 2030328, 1800120, 1916698, 2085091, 2256612, 2105876, 2247486, 2298489, 2181611, 1988839, 2049730, 1980466, 2036619, 1804416, 1631683, 2092582, 2205659, 1893180, 1935660, 2256105, 1862993, 1929450, 1901531, 1988679, 2302515, 2349825, 2349236, 1987914, 1948327, 1900888, 1786386, 1918383, 2091825, 2111739, 2133860, 1933798, 1902075, 1981690, 1979948, 1961832, 1922989, 2127251, 1976427, 2064351, 2154488, 2047118, 2069787, 2070293, 2422115, 2654077, 2252211]
15891B252211j80901l00762J94376K51553J36092m55121L83541P1258L0536j63480
15881B219303l17233J68798n464K2507p8326K11024O2085r9937K2240p4485J76001
15870B306513k16926j60680o2947J70131J99733Q3038r2138J39315K174K5319
15860B393532r6539k27789q7298k0162J48726K07753l19039j16356L00503J7467
15850B200798j76241p4995m3940O0260L6424k7459J69184p0901p2105J59067q3877
15839B076215k36474p4598j22337J17219L51557l4855j69429P0880m6461J8760
15829A950477o5680L8198R3882K12392j80610Q0886k35211l7693J41080L52276
15819B349997M6486m5546l05770k10002K56298N2046l7242m4273L0046O4420m9038
$$ y = [2252211, 2071310, 1770548, 1964924, 2216477, 2352569, 1897448, 2280989, 2352247, 2382783, 2219303, 1902070, 2070868, 2065404, 2087911, 2009585, 2220609, 2282694, 2182757, 2204997, 2130512, 2306513, 2089587, 1928907, 1865960, 2036091, 2235824, 2318862, 2226724, 2366039, 2368213, 2393532, 2296993, 2069204, 1981906, 1961744, 2110470, 2318223, 1999184, 1882828, 2183331, 2200798, 2024557, 1949562, 1905622, 1965882, 2002306, 1974847, 2144031, 2073130, 2001025, 2160092, 2076215, 1839741, 1765143, 1642806, 1760025, 2111582, 2076727, 1907298, 1978178, 1931717, 1950477, 1884797, 1922995, 2016877, 2229269, 2048659, 2129545, 1894334, 1856641, 1997721, 2349997, 2396483, 2350937, 2045167, 1835165, 2091463, 2143509, 2106267, 2061994, 2092040, 2156460, 2107422]
15808B107422J1596N935K1628J86272P5856r3744n0164r7099K16318K10232k25735
15797B368517j82250R1879r3624j94977M5590K28260l06710K2387k6676j40360
15787A812036L54230L55146J7352j99201l1774M7128l6475n6572j12513Q3247
15777B232604o5891j91913j33509L39708O644l9045K6159k12683K69048q7235
15767B143887j7888J59541q4503k89238K15989o0025M4356j83693j942J16002
15757B042486p1391k7073J82672K77953k27848J46090P1019j95134k30507J09833
15747B078100J03592J98877j41820k83187J3126K3950j67075J42567J12972j7419
15737B063683K7704k9626J22701m0591n8800M0866L1904r0768L36933j11031l41132
$$ y = [2107422, 2119018, 2124953, 2146581, 2332853, 2408709, 2314965, 2264801, 2167702, 2384020, 2594252, 2368517, 2186267, 2278146, 2184522, 1989545, 2035135, 2263395, 1956685, 1979072, 1952396, 1812036, 2166266, 2521412, 2538764, 2339563, 2307789, 2354917, 2318442, 2261870, 2149357, 2232604, 2166713, 1974800, 1841291, 2180999, 2187643, 2148598, 2174757, 1962074, 2231122, 2143887, 2125999, 2285540, 2201037, 1911799, 2127788, 2067763, 2112119, 1928426, 1926484, 2042486, 1971095, 1944022, 2126694, 2404647, 2176799, 2322889, 2393908, 2198774, 1968267, 2078100, 2181692, 2380569, 2238749, 1955562, 1968688, 1992638, 1825563, 1968130, 2081102, 2063683, 2091387, 2061761, 2184462, 2143871, 2085071, 2125937, 2157841, 2067073, 2404006, 2292975, 1951843]
15726A951843o6581J33255J38177J74617K0462k4630j74285q7111K87541n3117
15716B300171r8850K00441J93642j20249j19605j85512p8618P7381K07265j35374
15706B240692K0499k0776k91234K84544K19250l18674j50861j15483M0244J18793
$$ y = [1951843, 1885262, 2018517, 2156694, 2331311, 2351773, 2327143, 2152858, 2065747, 2353288, 2300171, 2201321, 2401762, 2595404, 2475155, 2355550, 2170038, 2091420, 2168801, 2376066, 2240692, 2261191, 2240415, 1949181, 2233725, 2452975, 2134301, 1983440, 1867957, 1908201, 2026994]
$$ [...]
##END NTUPLES=NMR SPECTRUM
##END=
