##TITLE=1H_DE-80H_X3
 200.13MHz, d2o
 8 sc
 
 19ns.26.2.2025
##JCAMPDX= 6.0         $$ Bruker NMR JCAMP-DX V2.0
##DATA TYPE= NMR SPECTRUM
##DATA CLASS= NTUPLES
##ORIGIN= UXNMR, Bruker Analytische Messtechnik GmbH
##OWNER= pz
$$ XWIN-NMR		Version 3.5
$$ Tue Mar 24 13:46:15 2026 Russian Standard Time (UT+4h)  Yarkov@DPX200
##.OBSERVE FREQUENCY= 200.1313
##.OBSERVE NUCLEUS= ^1H
##.ACQUISITION MODE= SIMULTANEOUS
##.ACQUISITION SCHEME= undefined
##.AVERAGES= 8
##.DIGITISER RES= 18
##SPECTROMETER/DATA SYSTEM= spect
##.PULSE SEQUENCE= zg30
##.SOLVENT NAME= CDCl3
##.SHIFT REFERENCE= (INTERNAL, CDCl3, 0, 15.4461)
##AUDIT TRAIL= $$ (NUMBER, WHEN, WHO, WHERE, WHAT)
$$ ##TITLE= Audit trail, XWIN-NMR		Version 3.5
$$ ##JCAMPDX= 5.01
$$ ##ORIGIN= Bruker BioSpin GmbH
$$ ##OWNER= Yarkov
$$ C:/Bruker/XWIN-NMR/data/yarkov2/nmr/H-C/1/pdata/1/auditp.txt
$$ ##AUDIT TRAIL=  $$ (NUMBER, WHEN, WHO, WHERE, WHAT)
(   1,<2026-03-24 13:45:27.46 +0400>,<Yarkov>,<DPX200>,
      <created by zg, POWCHK disabled, PULCHK disabled
       configuration hash MD5:
       00 E9 B6 7A A2 85 ED C7 34 08 36 98 17 FE 4E 26
       data hash MD5: 16K
       E9 FE BD 2D 01 F0 3E 4D 9A 7E 7C F3 3D 36 80 FE>)
(   2,<2026-03-24 13:45:32.98 +0400>,<Yarkov>,<DPX200>,
      <Start of raw data processing
       efp BC_mod = 2 LB = 0.25 FT_mod = 6 PKNL = 1 PHC0 = -5299.148 PHC1 = 6.821927 SI = 16K 
       data hash MD5: 16K
       E7 FB 0C F8 D8 56 02 66 E3 2D E9 BA 5E 73 F8 6D>)
(   3,<2026-03-24 13:45:38.29 +0400>,<Yarkov>,<DPX200>,
      <abs ABSG = 5 
       data hash MD5: 16K
       51 CC DD A6 99 8D 67 79 AC 23 05 F3 2C 4A 59 90>)
$$ ##END=
$$ 
$$ hash MD5
$$ C7 3B 40 6A 02 55 14 94 EF 35 70 58 0A ED DC 92
##$RELAX= 
##$RELAX= 
##$RELAX= 
##$RELAX= 
##$RELAX= 
##$RELAX= 
$$ Bruker specific parameters
$$ --------------------------
##$DU= <C:/Bruker/XWIN-NMR>
##$EXPNO= 1
##$NAME= <H-C>
##$PROCNO= 1
##$TYPE= <nmr>
##$USER= <yarkov2>
##$AMP= (0..31)
100 100 100 100 100 100 100 100 100 100 100 100 100 100 100 100 100 100 
100 100 100 100 100 100 100 100 100 100 100 100 100 100 
##$AQSEQ= 0
##$AQ_mod= 1
##$AUNM= <au_zg>
##$AUTOPOS= <>
##$BF1= 200.13
##$BF2= 200.13
##$BF3= 200.13
##$BF4= 200.13
##$BF5= 200.13
##$BF6= 200.13
##$BF7= 200.13
##$BF8= 200.13
##$BYTORDA= 1
##$CFDGTYP= 0
##$CFRGTYP= 5
##$CHEMSTR= <none>
##$CNST= (0..31)
1 1 145 1 1 1 1 1 1 1 1 1 1 1 1 1 1 1 1 1 1 1 1 1 1 1 1 1 1 1 1 1 
##$CPDPRG= <>
##$CPDPRG1= <>
##$CPDPRG2= <>
##$CPDPRG3= <>
##$CPDPRG4= <mlev>
##$CPDPRG5= <mlev>
##$CPDPRG6= <mlev>
##$CPDPRG7= <mlev>
##$CPDPRG8= <mlev>
##$CPDPRGB= <>
##$CPDPRGT= <>
##$D= (0..31)
0 0.7 0 0 0 0 0 0 0 0 0 0.03 0 0 0 0 0 0 0 0 0 0 0 0 0 0 0 0 0 0 0 0 
##$DATE= 1774345527
##$DBL= (0..7)
120 120 120 120 120 120 120 120 
##$DBP= (0..7)
150 150 150 150 150 150 150 150 
##$DBP07= 0
##$DBPNAM0= <>
##$DBPNAM1= <>
##$DBPNAM2= <>
##$DBPNAM3= <>
##$DBPNAM4= <>
##$DBPNAM5= <>
##$DBPNAM6= <>
##$DBPNAM7= <>
##$DBPOAL= (0..7)
0.5 0.5 0.5 0.5 0.5 0.5 0.5 0.5 
##$DBPOFFS= (0..7)
0 0 0 0 0 0 0 0 
##$DE= 6
$$ [...]
##$SUBNAM3= <"">
##$SUBNAM4= <"">
##$SUBNAM5= <"">
##$SUBNAM6= <"">
##$SUBNAM7= <"">
##$SUBNAM8= <"">
##$SUBNAM9= <"">
##$SW= 18.0517328524113
##$SWIBOX= (0..15)
0 0 2 0 0 0 0 0 0 0 0 0 0 0 0 0 
##$SW_h= 3612.71676300578
##$TD= 16384
##$TD0= 1
##$TE= 0
##$TE2= 300
##$TE3= 300
##$TEG= 300
##$TL= (0..7)
0 120 120 120 120 120 120 120 
##$TP= (0..7)
150 150 150 150 150 150 150 150 
##$TP07= 0
##$TPNAME0= <>
##$TPNAME1= <>
##$TPNAME2= <>
##$TPNAME3= <>
##$TPNAME4= <>
##$TPNAME5= <>
##$TPNAME6= <>
##$TPNAME7= <>
##$TPOAL= (0..7)
0.5 0.5 0.5 0.5 0.5 0.5 0.5 0.5 
##$TPOFFS= (0..7)
0 0 0 0 0 0 0 0 
##$TUNHIN= 0
##$TUNHOUT= 0
##$TUNXOUT= 0
##$USERA1= <user>
##$USERA2= <user>
##$USERA3= <user>
##$USERA4= <user>
##$USERA5= <user>
##$V9= 5
##$VALIST= <valist>
##$VCLIST= <CCCCCCCCCCCCCCC>
##$VD= 0
##$VDLIST= <DDDDDDDDDDDDDDD>
##$VPLIST= <PPPPPPPPPPPPPPP>
##$VTLIST= <TTTTTTTTTTTTTTT>
##$WBST= 1024
##$WBSW= 4
##$XGAIN= (0..3)
0 0 0 0 
##$XL= 0
##$YL= 0
##$YMAX_a= 503967
##$YMIN_a= -461444
##$ZGOPTNS= <>
##$ZL1= 120
##$ZL2= 120
##$ZL3= 120
##$ZL4= 120
##$ABSF1= 15.4461
##$ABSF2= -2.605749
##$ABSG= 5
##$ABSL= 3
##$ALPHA= 0
##$AQORDER= 0
##$ASSFAC= 0
##$ASSFACI= 0
##$ASSFACX= 0
##$ASSWID= 0
##$AUNMP= <proc_1d>
##$AZFE= 0.1
##$AZFW= 0.1
##$BCFW= 0
##$BC_mod= 2
##$BYTORDP= 0
##$COROFFS= 0
##$CY= -3
##$DATMOD= 1
##$DC= 0
##$DFILT= <>
##$DTYPP= 0
##$F1P= 0
##$F2P= 0
##$FCOR= 1
##$FTSIZE= 16384
##$FT_mod= 6
##$GAMMA= 0
##$GB= 0
##$INTBC= 1
##$INTSCL= 3.241238e-09
##$ISEN= 128
##$LB= 0.25
##$LEV0= 0
##$LPBIN= 0
##$MAXI= 10000
##$MC2= 0
##$MEAN= 0
##$ME_mod= 0
##$MI= 1.114404
##$NCOEF= 0
##$NC_proc= -6
##$NLEV= 6
##$NOISF1= 3.799351
##$NOISF2= 2.8
##$NSP= 0
##$NTH_PI= 0
##$NZP= 0
##$OFFSET= 15.4461
##$PC= 1
##$PHC0= -5299.148
##$PHC1= 6.821927
##$PH_mod= 1
##$PKNL= yes
##$PPARMOD= 0
##$PSCAL= 0
##$PSIGN= 0
##$REVERSE= no
##$SF= 200.130015131028
##$SI= 16384
##$SIGF1= 3
##$SIGF2= 2
##$SINO= 0.751879
##$SIOLD= 32768
##$SREGLST= <19F.Aceton>
##$SSB= 0
##$STSI= 16384
##$STSR= 0
##$SW_p= 3612.71676300578
##$SYMM= 0
##$S_DEV= 0
##$TDeff= 16384
##$TDoff= 0
##$TI= <>
##$TILT= no
##$TM1= 0
##$TM2= 0
##$TOPLEV= 0
##$USERP1= <user>
##$USERP2= <user>
##$USERP3= <user>
##$USERP4= <user>
##$USERP5= <user>
##$WDW= 1
##$XDIM= 16384
##$YMAX_p= 429916996
##$YMIN_p= -272758
$$ End of Bruker specific parameters
$$ ---------------------------------
##NTUPLES= NMR SPECTRUM
##VAR_NAME=  FREQUENCY,     SPECTRUM/REAL,   SPECTRUM/IMAG
##SYMBOL=    X,             R,               I
##VAR_TYPE=  INDEPENDENT,   DEPENDENT,       DEPENDENT
##VAR_FORM=  AFFN,          ASDF,            ASDF
##VAR_DIM=   16384,         16384,           16384
##UNITS=     HZ,            ARBITRARY UNITS, ARBITRARY UNITS
##FACTOR=    0.220516191357247, 1,           1
##FIRST=     3091.22827374299, 0,            0
##LAST=      -521.488489262787, 0,           0
##MIN=       -521.488489262787, -272758,     0
##MAX=       3091.22827374299, 429916996,    0
$$ Real data points
##PAGE= N=1
##DATA TABLE= (X++(R..R)), XYDATA
$$ [...]
8278 563377 500235 476889 515990 556767 535002 507267 533119 511577 496354 456193 444747 537623
8266 537623 537705 527216 507729 489577 571546 535065 424882 379312 459913 499387 493395 474711
8254 474711 424810 488986 538237 579519 581512 618752 551217 484764 430402 461577 470588 489084
8242 489084 485170 521573 528054 486377 491476 450647 439535 482482 542612 546600 513989 422975
8230 422975 412140 382347 412037 433513 490999 445660 446530 429737 332302 340496 428805 428240 400159
8217 400159 407209 400732 372470 390580 399014 383751 393911 430762 414065 369085 366579 439426
8205 439426 467798 444024 436341 424626 455138 476910 456534 451947 467446 434328 456822 503037
8193 503037 346421 140882 298208 394691 378781 407567 414521 365884 397145 337701 336035
8182 336035 357652 351137 355033 283691 338249 266718 198699 214236 266424 282788 267407 237398
8170 237398 239357 297750 316364 336382 334450 356074 318421 322625 307457 310503 329115 341990
8158 341990 359289 325928 294402 299174 354924 323357 248718 210206 238760 258424 204193 276999
8146 276999 237460 219053 241456 247335 270502 266168 248491 208359 247076 276773 230708 213146
8134 213146 225529 173895 197951 185437 198054 154693 146487 143461 185170 221561 153167 94357
8122 94357 112005 104730 148898 162654 127842 109534 129917 153655 199116 214037 145841 190061
8110 190061 220070 224245 172371 176194 132386 144092 183525 122036 130017 103218 131992 102518
8098 102518 119162 126306 133027 190188 120518 88962 152650 211743 168654 149011 173718 189221
8086 189221 159273 159403 137961 154199 114979 134983 156807 147644 152989 154319 115351 120301 142584
8073 142584 119693 117288 161421 175766 193224 165908 127429 172388 178018 124926 128400 160691
8061 160691 105325 117680 146608 186724 193333 154272 211440 197857 191489 184438 139481 177789
8049 177789 221563 217053 179039 116441 190691 237345 193857 154772 105754 104737 136614 161719
8037 161719 153232 175126 159595 169330 78688 115561 85481 78452 168716 224648 258066 163636
8025 163636 136723 86489 117310 163153 144451 157026 141032 124586 112372 117649 123953 124933
8013 124933 55845 78123 121250 112344 89188 92534 102649 102239 146231 194037 145963 82289
8001 82289 79015 99713 49422 19409 64841 101709 71869 74778 128132 142846 122387 142980
7989 142980 165809 158364 164164 126912 90550 72128 80806 112842 84948 99837 148388 118230
7977 118230 63470 92577 90620 85988 111300 65366 58545 6125 79496 111863 115992 91057
7965 91057 60070 39438 46133 25775 38558 84902 97256 151164 142293 131058 62838 49501
7953 49501 20071 49048 110122 27883 34581 114350 62758 40785 35225 108042 91150 6885
7941 6885 5767 42369 24363 56771 45745 33475 118004 74308 60628 37131 32524 132309
7929 132309 49779 63557 137944 86956 80411 80311 84028 -20123 -965 66460 162026 215008
7917 215008 126877 48256 17767 30076 51651 99287 137488 93998 78666 85437 98945 66390
7905 66390 112536 136778 141482 139577 147306 147564 171269 163010 152370 129778 49693 112331 127215
7892 127215 118257 153620 155801 185965 158819 182929 188859 178559 113544 199508 204548 92777
7880 92777 108819 186297 203745 164338 103199 44302 73766 119712 134544 121295 160212 136759
7868 136759 161162 125828 127397 150711 160247 162554 91259 51649 117758 123914 73338 109478
7856 109478 125858 127789 158647 77388 61237 28643 44707 118026 122909 2580 13636 62140
7844 62140 76549 54379 82762 113201 50621 84887 86388 37404 38535 105283 35748 37460
7832 37460 21843 -19909 -43622 -28954 -6557 15253 14375 13667 -23576 -41390 -51030 51497 160490
7819 160490 90646 92482 -11963 -20649 68594 60119 52618 12834 58093 101985 434581 333254
7807 333254 31728 50336 23440 36766 35652 60938 58720 83614 25546 -15043 -6666 40650
7795 40650 -17604 -64862 -50078 -38013 -3884 17823 -25636 19675 -38204 -63562 -86787 -69855
7783 -69855 -29597 -29559 -296 17609 8567 35547 35605 -10401 -21429 36009 51600 -10585 40673
7770 40673 30374 -16 -70862 -74839 -63249 -30890 45265 43408 -38713 -80957 5729 37142
7758 37142 37721 45994 41478 2632 -29593 38327 -4314 -25869 -32220 -69024 -2019 8629 80326
7745 80326 93316 9331 12347 52543 32186 98415 109277 51467 10830 9666 -40916 9760
7733 9760 20282 -17486 24468 71326 42716 -26688 -15393 -19752 8770 15234 48433 29038
7721 29038 38729 -7639 39371 76405 61065 36076 8201 31729 48270 52398 31602 35575
7709 35575 19916 25847 25206 6483 44002 63736 43984 -1871 35407 49479 -917 16421
7697 16421 -4244 -22423 -11357 -18390 -59 60112 15682 -14931 28670 -33578 -21094 -13034
7685 -13034 -30241 -41149 -30510 -23558 -55519 -44499 6880 14255 -45193 25977 14565 -57585
7673 -57585 -15227 -26687 -19286 0 57341 44794 44869 24709 83124 65208 16208 -21947 4572
7660 4572 23016 6957 -41592 -76000 -28484 -1802 -12069 41847 83195 28840 -48745 -59474
7648 -59474 -17348 -264 57738 56725 -29114 -29914 -20175 -83897 -68549 -30419 -36410 -17571 -64353
7635 -64353 -52896 -18919 -47194 13857 46623 -9207 -4525 -8255 -15729 20381 -32688 2150
7623 2150 -77565 -83260 -120352 -68441 -20809 -5624 -7940 13615 19460 -10854 -49479 -74348 -32017
7610 -32017 -40613 -55671 32055 59845 38539 -50909 -15475 -38279 -28562 -8392 -16296 5192
7598 5192 -60038 -99952 -91958 -80512 -56396 14206 -6661 -50785 -99760 -121312 -114890 -26910
7586 -26910 39692 12181 -47516 -74085 -57697 -77087 -28357 92307 81779 76652 49071 4891
7574 4891 -24473 37276 54394 23116 68543 101222 87510 31388 91832 68433 -17182 -50850
7562 -50850 5892 68934 128490 163660 141932 139566 99225 47684 43408 73270 31272 17080
7550 17080 37324 75809 50414 39436 -9549 -9584 35070 21062 -8763 33456 13902 -57692
7538 -57692 -51769 -31116 -616 52522 -19306 18232 -62995 -140328 -146142 -102523 -104967 -105819 -64547
7525 -64547 -18368 -1508 -16410 -31765 11753 46381 37540 34147 12628 -38260 -73371 -16281
7513 -16281 -94106 -182072 -131307 -96098 -61076 -12662 -27715 25985 11921 -36810 -64457 -10150
7501 -10150 -19738 46697 5457 -52274 -69344 -74386 -126872 -85137 -59491 -118803 -105538 -105252 -98036
7488 -98036 -17069 41584 24830 2134 -35827 -73527 -56878 -102248 -85689 -26863 -25836 -71201
7476 -71201 -25162 6492 13221 10774 36213 -44917 -59691 -10078 -14777 -27305 -47041 -18935
7464 -18935 11285 -19990 -78892 7850 -33526 10269 -4838 -13739 -14630 12534 -11920 -33357
7452 -33357 -26507 -70980 -44503 -59503 -46380 48305 36237 62764 23636 20298 34568 -26047
7440 -26047 -25372 10476 -45591 -71283 -45740 -87503 -4865 27112 42488 52955 41773 44989
7428 44989 -10382 55973 67121 56764 54132 19558 41547 77751 28424 11592 41975 31880
7416 31880 -16372 -86890 -77944 -68658 -84254 -69021 -29635 -22565 36973 57989 67488 25587 33089
7403 33089 -28129 -18607 32837 -15302 -11097 -97911 -49371 -1102 -50075 -31873 44788 34186
7391 34186 -17050 2542 42977 4031 -67581 -77428 -99863 -110839 -82830 -78697 -47060 -29543
7379 -29543 -30287 -22722 -35697 -36787 -89550 -130055 -116321 -55013 -97363 -68293 -3566 33144 -1704
7366 -1704 -27837 -14720 -76681 -91057 -78954 -91344 -54473 -28166 -97085 -112981 -64080 -32953
7354 -32953 -38166 -11533 13973 394 -53013 12953 -1393 -44952 -107417 -140861 -107286 -136942
7342 -136942 -131085 -166290 -158561 -126260 -105867 -98810 -198928 -170157 -80290 -77849 -129041 -97037
7330 -97037 -70519 -72848 -21680 -23066 -75489 -73468 -36280 -34252 17654 7603 -94176 -125512
7318 -125512 -99252 -87363 -97298 -143565 -111364 -76223 -88295 -71890 -49104 -108845 -103352 -76935
7306 -76935 -50561 -93834 -54046 -33621 22311 -39881 -72927 -63685 -70753 -73427 -169584 -126065
7294 -126065 -62933 -64120 -94118 -74570 -18963 -25854 -52914 -99701 -108565 -61354 -80394 -49274
7282 -49274 -17300 -55524 -83336 -116487 -42021 -73762 -54590 -94486 -68761 -76310 -122219 -97199
7270 -97199 -106087 -97177 -136281 -148470 -126988 -80682 -75645 -61549 -48759 -13947 -74420 -110200
7258 -110200 -128131 -62821 -87521 -73160 -121136 -65143 -93682 -103160 -53424 -53508 -105613 -103487 -28346
7245 -28346 -54767 -105730 -125802 -111158 -114324 -121173 -92362 -33541 -6233 -92595 -98780 -71437
7233 -71437 -81963 -155035 -119948 -80643 -118846 -127822 -100370 -93358 -129152 -155999 -168455 -63070
7221 -63070 -74431 -73523 -143049 -128543 -76799 -881 27777 -28236 -97978 -113284 -94922 -82714
7209 -82714 -60662 -91006 -167520 -112692 -90039 -119170 -124736 -128168 -125737 -153892 -147134 -125504 -113497
7196 -113497 -118313 -43000 -92006 -90537 -39013 -43265 -77889 -90384 -55126 -60404 -98613 -109266
7184 -109266 -109473 -112799 -54943 -78607 -115792 -103871 -149333 -151762 -77354 -53679 -89688 -131697
7172 -131697 -157172 -115864 -101169 -143996 -144905 -121899 -133825 -173374 -187054 -108463 -127131 -92087
7160 -92087 -95460 -140460 -108320 -95670 -97116 -87666 -105054 -97690 -103912 -168120 -169499 -165143 -135854
7147 -135854 -119503 -76536 -116551 -133594 -126199 -94533 -79947 -86315 -137662 -87056 -87151 -74821 -71289
7134 -71289 -111445 -138953 -103804 -94050 -95077 -89288 -114443 -7004 17137 -115100 -58366 -13471
7122 -13471 -36333 -16625 -36860 41225 59515 4293 -18865 -4071 -25609 -35045 866 38885
7110 38885 30887 -24915 -76761 17759 5861 -17101 -71557 -25723 9292 -12465 46067 849
7098 849 10697 38011 53716 8709 -26573 -8833 17032 12314 15139 53269 43127 66266 24477
7085 24477 30467 36202 59503 37657 -26192 -25976 -1372 43909 9623 40638 52436 72421 51146
7072 51146 -21177 8342 -34826 -7544 -18627 3153 44007 -38283 -33693 -54228 -32178 -40070
7060 -40070 -55122 -34998 -73618 -53605 -37330 7194 23735 -40757 11758 -8214 -72783 -105834
7048 -105834 -42874 -56349 -52685 -1757 -57681 -13448 -43276 -90689 -114311 -146913 -131259 -98758
7036 -98758 -95599 -104144 -71923 -88452 -93422 -95550 -106158 -112511 -68660 -55145 -7222 34890 -13312
7023 -13312 -43745 -40412 -11269 61358 89229 42750 39115 27422 56914 72780 33325 2396
7011 2396 -26270 -45396 -104069 -50862 23437 16585 -74626 -139434 -69094 22257 38790 -12543
6999 -12543 -12266 -14524 -48195 -26716 -17707 26956 14533 -573 -19032 8702 61643 2950 -32618
6986 -32618 33565 26206 -14224 -27276 -48501 10590 5281 -14393 -37579 -2260 -25765 7105
6974 7105 23887 -8203 -36714 -25122 -19254 -5735 -14210 -19617 -11503 -3284 -54690 4681 -71989
6961 -71989 -99181 -117429 -134526 -132558 -84260 -118556 -116963 -46123 -96238 -109588 -151704 -38003
6949 -38003 -89964 -77972 -106845 -75505 -4386 -25191 -24029 35130 17929 24460 -18551 18794
6937 18794 47536 3450 -82491 -47849 38054 -3336 83771 32946 21046 26874 -21880 28790
6925 28790 81685 12670 46869 63741 55223 83937 109063 116532 97786 175038 256035 263995
6913 263995 195289 178815 154070 89871 66752 72726 122593 105983 132848 134834 147015 163007
6901 163007 118203 78083 102069 163932 156005 144912 144940 129067 104289 41212 82152 149473
6889 149473 121462 53517 69164 82881 106937 87017 130960 182550 172896 189616 158848 187797
6877 187797 205670 168469 70870 73536 39696 60317 99489 96726 96450 67596 46932 56151 36940
6864 36940 104082 133774 126672 84645 67370 31351 -28822 19548 13418 36392 47961 62158
6852 62158 92482 44623 60634 53059 66022 40679 57377 87463 58530 83097 58770 2763
6840 2763 74320 53476 52717 40055 -34 -14127 33092 61010 54638 42103 -9968 -23819 14362
6827 14362 35539 4805 -30977 -1142 -23308 16517 24590 -65214 18914 114261 65624 10865
6815 10865 2398 53549 58801 -49504 -101528 -45015 52303 52843 130165 64622 73235 15021 -30264
6802 -30264 41889 108572 55807 -25477 -32141 -22615 2706 -36848 -48678 -66956 -13711 39292
6790 39292 13148 15640 19421 73623 73890 122376 130656 92623 70867 76847 108774 77928 97693
6777 97693 138287 97300 132452 191946 177969 169252 182738 214513 248739 298290 244177 243683
6765 243683 279921 240981 325639 381940 367533 400899 415915 491906 555834 621566 666299 625670
6753 625670 655337 679953 788340 850834 849328 864901 848146 876967 972013 912131 922590 937554
6741 937554 907312 926773 987297 997496 967886 1013897 992804 932273 860390 920047 901855 873378
6729 873378 886235 904365 861446 804136 689655 688969 681593 655392 637571 578252 556372 563043
6717 563043 567470 448094 370588 273333 323473 323855 290131 238039 264764 232492 179340 146406
6705 146406 165936 129498 41836 71633 131466 39125 -2969 123122 125136 92276 118981 180354
6693 180354 108292 47556 33839 46643 75475 124347 132284 148966 87409 70200 50381 105294
6681 105294 127408 73829 32619 70054 35783 76174 130094 64276 48621 93297 129787 119435
6669 119435 114948 87795 92720 55828 64410 68384 111455 125704 169722 216522 141037 209622
6657 209622 162569 184202 242362 209624 161342 169440 164207 138833 163131 139821 102155 158580
6645 158580 168945 148088 140904 176524 140863 139569 116201 150605 189642 197007 225326 214280
6633 214280 230715 165436 141205 142768 168868 184827 132039 98084 194461 236529 199433 198387
6621 198387 190534 247686 264556 185784 207697 185460 234863 272686 253095 258991 284787 358408
6609 358408 386206 371271 368219 287654 321933 357169 393272 450764 422437 382866 470644 398558
6597 398558 436871 462573 427251 463937 522309 620428 615344 576379 559373 595769 565387 544929
6585 544929 543818 565912 528396 513031 542752 516668 499027 514540 452890 381247 429305 493698
6573 493698 489244 395013 389832 410568 351411 301488 300067 364355 319612 315850 274957 277939 285894
6560 285894 285276 268413 274812 206972 240418 249301 196455 136361 99445 176291 212785 275624
6548 275624 164386 169609 119075 106010 113986 125800 123675 91567 48303 29813 24001 29154
6536 29154 44735 28127 -29997 32518 60745 16486 45332 59987 66099 50724 62145 74794
6524 74794 93352 97480 85102 88918 78406 113680 92795 113377 128226 105386 90017 84837
6512 84837 84881 100624 99452 100175 110134 86851 86782 77056 150610 175101 143326 152509 140260 69316
6498 69316 67412 136997 73420 76065 83401 47440 100038 63564 33013 61093 41722 56865
6486 56865 83716 31291 -11981 -29301 69458 113538 144014 107781 84358 62542 49734 39578
6474 39578 88600 100346 151864 120468 62477 87215 101033 102983 121907 96642 106970 155893
6462 155893 149888 118159 114016 59264 73816 135528 153585 192952 190381 118064 64543 58830
6450 58830 103161 147937 209100 137975 130446 153100 144140 181511 162591 161707 165112 163616 172454
6437 172454 179236 141750 184677 235387 282051 229569 203905 187100 124732 171019 222799 224154
6425 224154 241640 230934 221194 249182 239611 221277 171666 166814 225758 145084 162259 210460
6413 210460 188305 216930 214394 152017 156513 119012 150206 211321 251804 287535 292767 276599
6401 276599 253930 229606 265775 223363 224399 278651 270720 261376 349991 302975 257675 379649
6389 379649 337919 261654 236899 344639 402896 357182 362183 389985 413083 496051 487934 467515
6377 467515 480415 441134 390760 407678 525822 523814 555285 577929 583039 519710 480643 595967
6365 595967 545327 544710 554319 560289 658879 575118 509155 543115 575062 575479 640859 627239 626085
6352 626085 649482 608518 624424 651743 646679 646071 644029 673714 730269 702889 699107 742088 718665
6339 718665 776743 798321 698783 804763 805111 736354 714779 714822 787534 869406 891775 883109 949170
6326 949170 970451 979168 985866 998944 1040557 1012172 1016885 1009971 925050 996324 1034673 1072806
6314 1072806 1149070 1161778 1212774 1253546 1312234 1354841 1393368 1410812 1462450 1528823 1635911
6303 1635911 1702995 1774790 1894920 1972463 2109469 2210071 2298867 2438663 2650178 2765714
6293 2765714 2917274 3076225 3125084 3164799 3197786 3163180 3207383 3243362 3181145 3127354 2969840
6282 2969840 2933727 2903157 2831987 2785318 2707206 2685225 2685538 2722422 2819166 2841798 2852853 2836904
6270 2836904 3016934 3135718 3195769 3247593 3366439 3448896 3469917 3497794 3412154 3339739 3364602
6259 3364602 3269401 3066114 2912778 2740315 2601069 2420253 2258770 2096436 1905547 1788352
6249 1788352 1691094 1564793 1470472 1433538 1451458 1329921 1280383 1266469 1217364 1168038 1070472
6238 1070472 1060195 1126507 1187022 1132986 1120289 1144842 1108280 1166629 1175467 1171891 1198618 1181084
6226 1181084 1144639 1122923 1142400 1164580 1225099 1240832 1226450 1178769 1207612 1200245 1144509 1155225
6214 1155225 1220306 1248884 1191573 1159982 1215883 1267769 1250231 1243692 1250497 1282797 1242838 1283033
6202 1283033 1253323 1247872 1252730 1260223 1340181 1350219 1297622 1246697 1263563 1276033 1311521 1299400
6190 1299400 1308993 1284037 1291198 1284269 1272677 1245329 1292446 1324615 1336360 1319860 1277150 1265985
6178 1265985 1336605 1304564 1319207 1332316 1308358 1352021 1328075 1344454 1378750 1421825 1366179
6167 1366179 1363098 1294058 1335587 1351617 1471434 1454642 1383947 1354630 1402950 1329742 1389982
6156 1389982 1378425 1322221 1330134 1349072 1344524 1361284 1402324 1467698 1473605 1428192 1414696 1434738
6144 1434738 1545861 1449667 1453672 1532891 1575010 1651566 1699746 1675653 1603617 1619018 1786981
6133 1786981 1769031 1747903 1752239 1820150 1769573 1793704 1816696 1777828 1851913 1864579 1854844 1842101
6121 1842101 1804350 1879646 1904814 1906802 2017940 2009792 1986264 2052937 2069081 2090637 2116745 2184716
6109 2184716 2245122 2286748 2304727 2344531 2367315 2463468 2554770 2598446 2662298 2658424 2731530 2760492
6097 2760492 2822023 2936084 2954577 2997515 3015139 3126901 3152517 3156177 3192930 3189041 3246690
6086 3246690 3297580 3358608 3323878 3260815 3369594 3407678 3453821 3520086 3553297 3604512 3737354
6075 3737354 3783367 3873160 3923585 3984264 4138566 4236208 4320093 4380249 4513912 4676229 4724326
6064 4724326 4808146 4947306 5049999 5177881 5222656 5330392 5494806 5657210 5773537 5930315
6054 5930315 6123370 6277622 6426631 6561387 6777837 7029657 7341187 7604846 7915919 8277300
6044 8277300 8694872 9228549 9746190 10383423 11083474 11993880 13004675 14226254 15564689
6035 15564689 17120177 18838943 20775531 23021209 25542156 28261976 31141137 34322612
6027 34322612 37750982 41208771 44777744 48290976 51578847 54774512 57794735 60276839
6019 60276839 62352202 64028311 65129762 65701990 65860966 65575033 64973535 64189868 63342321
6010 63342321 62571611 61909039 61397486 61290006 61716838 62670265 64172724 66273970 69004284
6001 69004284 72238403 75903747 79705824 83638265 87479084 90836537 93506397 95396757
5993 95396757 96338862 96316320 95384383 93502643 90877890 87456767 83267097 78414081 73103155
5984 73103155 67502518 61873817 56387137 51138063 46277994 41757669 37712137 34010127
5976 34010127 30620369 27564431 24822537 22459176 20508998 18896574 17476750 16205726
5968 16205726 15147146 14299936 13631841 13009293 12453531 11947225 11599469 11217721 10984234
5959 10984234 10833766 10675107 10576003 10508219 10459380 10585293 10682054 10799924 10891364 11011598
5949 11011598 11264659 11546683 11763869 11975674 12280695 12554744 12960968 13268413 13577274
5940 13577274 13976784 14384596 14688486 15037187 15486615 15891139 16281268 16673670 17107389
5931 17107389 17534794 17887204 18395179 18831825 19181245 19579885 19914285 20258352 20532727
5922 20532727 20805094 21132233 21449615 21719122 21935816 22145199 22334231 22704266 23018702
5913 23018702 23243070 23558212 23963456 24302534 24601705 24929766 25230609 25506003 25722377
5904 25722377 25908211 26111861 26364967 26500130 26643469 26727594 26861427 27019702 27137448 27309512
5894 27309512 27465645 27622679 27733441 27786179 27809372 27794695 27744771 27748692 27778711 27638957 27471862
5883 27471862 27282657 27060121 26869242 26704793 26455928 26251574 25981643 25649233 25400226
5874 25400226 25151246 24898421 24632186 24338584 24146926 23916936 23638155 23395908 23111530
5865 23111530 22780242 22427218 22031924 21590789 21165371 20706501 20210282 19740617 19194744
5856 19194744 18676538 18220370 17649978 17068196 16567286 16090515 15549769 15044920 14602360
5847 14602360 14159051 13729796 13253656 12745628 12361479 11989599 11633181 11256968 10909954
5838 10909954 10545642 10151711 9812852 9484315 9161949 8857290 8472958 8249613 7927818
5829 7927818 7659717 7387893 7185702 6934885 6603633 6397561 6173232 5979355 5799470 5583371
5819 5583371 5393855 5140571 4957750 4774418 4576677 4428004 4338947 4234513 4104020 3965839
5809 3965839 3827035 3696580 3608011 3486301 3391396 3357209 3354612 3304566 3167140 3150011 3060544
5798 3060544 3026837 3047068 3052450 2943462 2876900 2841419 2838123 2814930 2787040 2765932 2767387 2722709
5786 2722709 2688523 2732244 2731741 2678719 2650923 2611386 2613189 2594343 2549866 2541400 2553894 2522089
5774 2522089 2479222 2448783 2497347 2540778 2514320 2472717 2500399 2475931 2423471 2452042 2414211
5763 2414211 2368454 2403983 2374834 2379627 2373251 2354179 2323072 2297618 2322754 2302781 2295091 2259361
5751 2259361 2302361 2294701 2281493 2258666 2239742 2304462 2295648 2294545 2227993 2240255 2317893 2317838 2243215
5738 2243215 2267830 2243702 2221409 2255605 2244307 2275985 2262345 2219684 2213196 2176928 2222202 2289717
5726 2289717 2295229 2308779 2342568 2370785 2351444 2395826 2361866 2397250 2476531 2572532 2587944 2666283
5714 2666283 2770580 2776969 2842960 2911919 2895850 2962093 2989164 2922233 2947374 3014136 2927242
5703 2927242 2865445 2843575 2834550 2827374 2819728 2854141 2795695 2800714 2761500 2838317 2919970 2916210
5691 2916210 2959565 3047360 3029340 3114519 3263286 3369662 3445982 3572361 3753078 3835375 3915337
5680 3915337 4011234 4059233 4031451 4033390 3971846 3942227 3852246 3757490 3629596 3532797 3358640
5669 3358640 3245226 3082744 2989664 2964063 2802841 2764649 2787234 2767003 2826304 2824807 2904835
5658 2904835 2989217 3063477 3216512 3276068 3335639 3410952 3585868 3709549 3833620 3942922
5648 3942922 3934533 3946200 3977355 3854490 3754086 3722156 3710124 3605805 3503461 3307494 3136852
5637 3136852 3024600 2906401 2831289 2702922 2603579 2584264 2536204 2462592 2419753 2445389 2459527
5626 2459527 2516715 2548488 2523365 2538515 2620520 2649026 2639907 2679861 2666232 2664589 2648725 2678732
5614 2678732 2671753 2594845 2469098 2406058 2447871 2428104 2408196 2314715 2241958 2146979 2115048
5603 2115048 2135038 2059773 2043082 2027081 2000349 2012875 2014260 1993018 2041451 1972828 2007403 2007452
5591 2007452 1989078 1966451 1954852 1925084 1900928 1880326 1873267 1866948 1898702 1980868 1972427 1938294
5579 1938294 1893849 1832621 1770342 1785079 1760136 1851867 1898701 1884330 1865470 1877862 1920404
5568 1920404 1876436 1903153 1871337 1804120 1823416 1841098 1822158 1799250 1842968 1863220 1846979
5557 1846979 1770303 1787945 1829708 1819136 1830327 1813913 1793772 1764493 1779958 1812906 1842140
5546 1842140 1807823 1722645 1652128 1662886 1710597 1659205 1712428 1711579 1726831 1763576 1789197 1833484
5534 1833484 1798018 1775126 1749765 1705624 1706184 1730943 1656966 1655459 1632050 1631289 1719333 1673627
5522 1673627 1632688 1672801 1657923 1718847 1694692 1716407 1685529 1655228 1625441 1585561 1587467 1590433
5510 1590433 1595656 1547350 1635136 1639544 1639195 1644180 1594405 1596164 1579439 1588309 1558284 1593712 1615601
5497 1615601 1540480 1622495 1650397 1704226 1649461 1595392 1504591 1529453 1574833 1505313 1545400
5486 1545400 1583454 1566699 1564226 1540614 1499625 1478231 1507954 1486236 1534751 1528109 1490091 1541485
5474 1541485 1538249 1521531 1587122 1627794 1614714 1599437 1578760 1597887 1603759 1607867 1553171 1542469
5462 1542469 1578146 1586335 1570170 1601605 1569238 1582583 1552752 1535247 1546059 1488624 1486182 1490976
5450 1490976 1461098 1526040 1546137 1478872 1521579 1590372 1530582 1551781 1517096 1534384 1550139
5439 1550139 1583243 1581942 1584166 1630808 1614858 1595072 1596362 1526063 1486333 1528915 1510687 1522670
5427 1522670 1517288 1520034 1514958 1446061 1507519 1548396 1532197 1505304 1562402 1558302 1451069 1426401
5415 1426401 1428941 1428495 1427386 1432741 1385417 1483831 1478514 1472239 1493545 1531880 1496343 1440031 1389625
5402 1389625 1435595 1491649 1491661 1504598 1475946 1451195 1498864 1527447 1467630 1498368 1517599 1439086
5390 1439086 1415748 1459273 1548210 1548681 1469373 1471119 1492765 1433172 1440098 1410000 1352919 1388648
5378 1388648 1383182 1356389 1343035 1375019 1335340 1321995 1333906 1399098 1423514 1409891 1394793 1395016
5366 1395016 1364471 1467175 1422174 1378931 1428160 1455483 1504336 1484079 1473759 1393730 1455122
5355 1455122 1478686 1431134 1434759 1451379 1464942 1464917 1485623 1494750 1460391 1490910 1489117 1490728 1515786
5342 1515786 1518649 1535919 1528186 1522050 1546144 1549220 1588010 1622012 1584173 1524819 1462631 1484117
5330 1484117 1541597 1603005 1597801 1558035 1495853 1543766 1570275 1552607 1547515 1617224 1602638 1580803
5318 1580803 1584390 1539261 1538462 1564195 1549219 1552539 1611055 1513358 1535452 1545417 1538316 1549989 1590809
5305 1590809 1594255 1607557 1605546 1590232 1577375 1596413 1575131 1590972 1608001 1623572 1585582 1512942
5293 1512942 1463272 1535284 1534729 1476082 1463257 1481395 1458944 1456495 1489259 1529829 1494922 1444720
5281 1444720 1458094 1500424 1518493 1494854 1526000 1540506 1539840 1521394 1543929 1504803 1535620 1515750
5269 1515750 1459042 1414236 1414106 1523363 1527297 1471182 1502996 1490450 1472473 1415388 1411364 1431245
5257 1431245 1461741 1466341 1515276 1502581 1463636 1463669 1452196 1432428 1445135 1450495 1410745 1445469
5245 1445469 1487971 1486639 1503714 1432555 1370350 1389701 1462603 1450091 1436030 1445699 1439178 1423904
5233 1423904 1420963 1439488 1502738 1509541 1494705 1556632 1571518 1572427 1598329 1483854 1417251 1483267
5221 1483267 1453405 1440235 1463853 1522486 1559350 1529004 1506204 1529862 1522946 1557798 1545522 1517428
5209 1517428 1539770 1526650 1530176 1535277 1533819 1560138 1614798 1626606 1622509 1586857 1568809 1581831
5197 1581831 1603343 1650610 1640040 1618007 1606936 1577181 1586843 1575126 1634678 1544326 1514133 1576728
5185 1576728 1566231 1591511 1662972 1632621 1627326 1607383 1593010 1620861 1614482 1679403 1687660 1754329
5173 1754329 1733525 1727116 1775579 1742872 1755366 1817429 1796054 1766153 1821324 1824289 1788925 1814997
5161 1814997 1802137 1842576 1852353 1917778 1874438 1868403 1971080 1994977 1985073 2043713 2023516 2056433
5149 2056433 2039167 2119455 2155958 2137425 2159564 2132257 2129995 2141987 2188829 2212840 2156877 2156785
5137 2156785 2200925 2198971 2222693 2223790 2168698 2187011 2183634 2266146 2255395 2253059 2344777 2353132
5125 2353132 2422786 2351512 2261191 2267409 2263165 2242677 2205677 2255514 2280740 2253118 2227356 2188475
5113 2188475 2234197 2298389 2273716 2213404 2197630 2158913 2192113 2186712 2208172 2250974 2244787 2216603
5101 2216603 2198983 2164836 2166924 2148411 2149122 2194872 2223876 2268370 2241122 2186021 2217578 2202543
5089 2202543 2203587 2203258 2241286 2294561 2261425 2264412 2318051 2299026 2324973 2353623 2415952 2511324
5077 2511324 2462832 2415834 2463334 2510037 2595694 2564151 2552610 2561416 2615351 2635640 2678384 2725103
5065 2725103 2772118 2871966 2854990 2853732 2913778 2942522 3033465 3037563 3089586 3092063 3104907 3163308
5053 3163308 3126693 3188212 3230460 3261079 3317859 3296541 3325816 3364103 3372690 3430252 3416987 3372396
5041 3372396 3430216 3491919 3449768 3477680 3510695 3523098 3514006 3558405 3662245 3701378 3712607
5030 3712607 3735752 3719886 3734558 3708622 3650861 3711153 3754942 3687992 3655881 3583292 3598933
5019 3598933 3639813 3578919 3564558 3545787 3520577 3554482 3504948 3493365 3526583 3562380 3574077
5008 3574077 3526742 3510213 3546824 3617650 3616445 3593207 3655952 3643071 3655868 3721991 3737895 3767249
4996 3767249 3730982 3752038 3761598 3786475 3797279 3863692 3872676 3832588 3875938 3954478 3994614 3982372
4984 3982372 4011100 4024611 4073349 4082728 4115013 4120774 4119256 4132094 4141587 4130444 4067878 4087414
4972 4087414 4064901 4147142 4189135 4167352 4189181 4155668 4260016 4259045 4264110 4291964 4403249 4416577
4960 4416577 4446515 4508848 4573816 4712783 4768832 4834547 4984689 5130077 5207000 5282831 5446946
4949 5446946 5549797 5702937 5725066 5829390 5994504 6094378 6263062 6361593 6506119 6660450
4939 6660450 6866078 6996141 6997680 7152089 7267531 7402967 7613497 7718043 7836815 8030227
4929 8030227 8188881 8315678 8451961 8685483 8875644 9110265 9364509 9581327 9779103 10056754
4919 10056754 10398537 10771482 11200642 11629163 12105721 12625827 13245612 13881391 14566683
4910 14566683 15289471 16090449 16855108 17631274 18423078 19218963 19896067 20491938 20939760
4901 20939760 21360983 21665281 22066344 22275739 22415127 22593889 22752271 22875744 23035759
4892 23035759 23202589 23446605 23796218 24050783 24400909 24808042 25149946 25403219 25579156
4883 25579156 25799570 25918394 26057397 26265380 26394638 26593520 26873152 27146812 27551327
4874 27551327 28004273 28588154 29255222 30156450 31114796 32079926 33319006 34635527 35859411
4865 35859411 37254381 38794444 40381336 42066103 43852511 45870935 47814011 49871372
4857 49871372 52075194 54437752 56960657 59566370 62317872 65138556 68053472 71014560
4849 71014560 73970355 76848492 79711124 82584553 85253056 87852571 90410715 92878917
4841 92878917 95101149 97224692 99187374 100909149 102558525 104099208 105420598 106547995
4833 106547995 107416168 108050387 108479694 108666405 108491746 108041782 107318005 106384834 105317184
4824 105317184 104096061 102644093 101036164 99351450 97634794 95901271 94147523 92468263
4816 92468263 90869895 89333812 87792242 86454635 85236070 84206165 83375201 82682385
4808 82682385 82122571 81618434 81257456 80991045 80787379 80738982 80835480 80915654 81093569 81372245
4798 81372245 81638910 81798127 81998834 82381774 82779016 83087218 83352291 83627422 83763346
4789 83763346 83825432 83928704 83938115 83950291 83937984 84004720 84069913 84176858 84272583 84543066 84970273
4778 84970273 85517623 86340018 87421741 88627310 90063450 91668472 93388615 95228055
4770 95228055 97083514 98925335 100735848 102404632 103781023 105054783 106091000 106703711
4762 106703711 106998514 106923728 106406313 105509902 104283069 102789371 101091566 99179997 97004554
4753 97004554 94701560 92265049 89665648 87009803 84452134 81994052 79573994 77170024
4745 77170024 74963846 72834429 70788271 68883627 67026893 65268752 63577900 61855781
4737 61855781 60212857 58519335 56749348 54951362 53114998 51208755 49205990 47175168
4729 47175168 45160545 43085295 41063412 39015904 36956863 35058753 33137437 31318242
4721 31318242 29609106 28023784 26600060 25200494 23936403 22757768 21640852 20568886
4713 20568886 19688265 18930260 18190438 17602460 17127332 16620161 16158900 15745893 15461663
4704 15461663 15266033 14973804 14714068 14578929 14445019 14330974 14336970 14251679 14191467 14218181
4694 14218181 14280049 14395637 14512788 14689884 14869260 15074403 15393148 15718524 16060980 16506719
4684 16506719 16972975 17443303 18001514 18626021 19248640 19851320 20485556 21161522 21776370
4675 21776370 22273410 22690004 23005681 23134851 23205728 23217140 23190111 23094533 22892403 22584968
4665 22584968 22214293 21793797 21386617 20955167 20565029 20223469 20006739 19865997 19765649
4656 19765649 19752850 19813876 19988750 20300082 20836087 21436833 22208328 23052412 24005963 25113859
4646 25113859 26316204 27647252 29035093 30308106 31567730 32657030 33619593 34399968
4638 34399968 34930248 35199842 35231614 35098916 34620515 33942630 33106810 32151589 31016354
4629 31016354 29816024 28691844 27514423 26327559 25281622 24415444 23730161 23125109 22587915
4620 22587915 22256429 21985647 21837447 21716252 21660784 21812636 22039781 22356271 22803674 23237015
4610 23237015 23670069 24200672 24764752 25243983 25577921 25862087 26106078 26213853 26225706 26177457
4600 26177457 25973175 25668123 25471903 25228296 24930432 24577974 24274670 24130407 24039890 24065367
4590 24065367 24113628 24225154 24481412 24628358 24699868 24705463 24644785 24560886 24283436 23851794
4580 23851794 23364197 22755659 22043924 21194912 20329009 19387251 18356046 17365440 16454252
4571 16454252 15682438 14853771 14152725 13491180 12950560 12517174 12187277 11951273 11850456
4562 11850456 11764791 11753022 11868278 12023181 12395821 12818570 13181718 13693377 14202262 14643387
4552 14643387 14991043 15273628 15443441 15510786 15538730 15442291 15260724 15038161 14770109 14403897
4542 14403897 13946111 13414417 12911833 12458940 11906329 11419765 11069361 10714256 10408240
4533 10408240 10020522 9749776 9464261 9260255 9088580 8891215 8716758 8523769 8390229
4524 8390229 8220836 8070143 7985492 7827609 7601505 7499674 7394750 7274667 7060434 6895457
4514 6895457 6713492 6521655 6437584 6300076 6206228 6100317 5966561 5781797 5627077 5512008
4504 5512008 5396723 5243546 5086189 4940559 4850920 4770794 4767070 4669579 4647588 4640108 4519939
4493 4519939 4495815 4448163 4466255 4404026 4422024 4442882 4426164 4301925 4255985 4237935 4159576
4482 4159576 4245166 4293246 4285028 4268784 4266236 4206658 4281611 4313628 4226390 4246958 4272079 4266202
4470 4266202 4229215 4246310 4166343 4099661 4132664 4120546 4110796 4101234 4108876 4009879 3982544 3899686
4458 3899686 3857315 3899594 3856842 3919382 3872351 3767352 3756489 3713938 3704036 3689256 3625992
4447 3625992 3525459 3467275 3415506 3419403 3462479 3482023 3356987 3364399 3361349 3289478 3362257 3324275
4435 3324275 3347517 3358973 3283291 3354046 3352624 3338460 3426688 3388377 3363577 3333032 3351605 3362720
4423 3362720 3380934 3360851 3318962 3402094 3414013 3450962 3420864 3478827 3547984 3578015 3743610
4412 3743610 3840258 3908291 3917433 4037099 4059531 4119963 4213926 4273874 4277334 4369794 4347011 4378703
4400 4378703 4403188 4437017 4482796 4419917 4409955 4448206 4429410 4419287 4403485 4383980 4350017 4395918
4388 4395918 4489654 4513646 4504345 4575324 4676407 4673734 4762890 4801257 4837837 4829686 4824828 4852682
4376 4852682 4979625 5052288 5065888 5096177 5127473 5147390 5202979 5255699 5292152 5377484 5453455
4365 5453455 5486729 5576678 5572457 5650065 5746903 5767646 5815302 5925131 6011942 6095494 6186084
4354 6186084 6322957 6445017 6474002 6613991 6739377 6826475 7001786 7187393 7294942 7470473
4344 7470473 7514075 7683576 7902932 8044731 8303381 8526651 8682417 8970949 9286001 9562695
4334 9562695 9937505 10285654 10764106 11166584 11562695 11971089 12431685 12875309 13367805 13715173
4324 13715173 14114467 14594368 14972968 15312982 15652221 15943143 16221220 16613831 16964789
4315 16964789 17284046 17650230 17942124 18204277 18516916 18781492 19117230 19396980 19582343
4306 19582343 19829888 20002075 20083417 20196639 20219370 20175044 20192098 20177505 20052994 19992931
4296 19992931 19979530 19887076 19865514 19825846 19751790 19663117 19691467 19720415 19717427 19719689 19736290 19903283
4284 19903283 19951296 19906520 19954197 20063436 20063754 20164840 20209263 20332153 20512101 20727839 21007992
4273 21007992 21346638 21754898 22072593 22443381 22967902 23440249 23834691 24283607 24755986
4264 24755986 25078945 25500297 25853580 26227990 26604608 26874971 27059936 27282796 27507321
4255 27507321 27563595 27718272 27813098 27911749 27949439 28032165 28049354 27959089 27866841 27729316 27477935
4244 27477935 27184358 26885671 26521550 26150121 25747412 25311527 24889763 24476773 24021350
4235 24021350 23553049 23101226 22709032 22306438 21972189 21676187 21373392 21053930 20788448
4226 20788448 20524625 20286089 20065222 19774314 19477874 19223206 18922856 18728680 18611660
4217 18611660 18489718 18372420 18198474 18165504 18125797 18058230 18035381 18091732 18144601 18157721 18273421
4206 18273421 18369742 18308942 18304862 18237956 18198836 18055732 17995229 17874662 17677409 17506937 17238982
4195 17238982 16997747 16762167 16527588 16201210 15984274 15692389 15429181 15218597 14983118
4186 14983118 14709386 14457160 14110169 13758225 13384372 13108036 12787435 12414957 12074964
4177 12074964 11749520 11364258 11071748 10798374 10449884 10335702 10193241 10020125 9882522
4168 9882522 9826432 9843024 9828432 9895026 9980125 10128031 10395521 10660027 10942714 11235654
4158 11235654 11564608 11956854 12349662 12757077 13182166 13640114 14170720 14641375 15118961
4149 15118961 15617326 16034427 16478936 17050173 17498502 17958971 18470112 19041483 19531209
4140 19531209 20123576 20740997 21321093 21919737 22437953 22921857 23455554 24011172 24624201
4131 24624201 25173269 25766675 26348091 26908880 27481330 28049838 28656547 29266124 29932299
4122 29932299 30576423 31282295 32056989 32848226 33653441 34447972 35278384 36156950 37005364
4113 37005364 37956219 38899413 39871346 40847288 41767676 42648624 43437642 44235347 45024499
4104 45024499 45787241 46484029 47090681 47684188 48238655 48787884 49375298 49889499 50399771
4095 50399771 51010160 51553580 52246875 52987597 53647581 54495960 55515095 56539282 57622604
4086 57622604 58884612 60270578 61742897 63399877 65045167 66645218 68333219 69991015
4078 69991015 71612344 73234248 74774138 76109411 77453010 78685789 79773701 80624743
4070 80624743 81394564 82012555 82493501 82981973 83333223 83540212 83630610 83712837 83699084 83680875
4060 83680875 83649738 83602122 83465477 83349882 83292769 83173400 83091666 83091319 83041345 83015393 83037359
4049 83037359 83059519 83018352 82934759 82858589 82671980 82433646 82145340 81731369 81201897 80494923
4039 80494923 79705629 78698516 77611577 76369542 74971731 73498963 71914941 70275780
4031 70275780 68683155 66998285 65406532 63888693 62459537 61177161 59872328 58671706
4023 58671706 57574135 56606548 55824772 55029001 54348421 53762577 53232514 52708709 52135068
4014 52135068 51632540 51182627 50658328 50179408 49764470 49192828 48585909 47958978 47311273
4005 47311273 46512583 45804822 44983005 44174800 43268249 42297255 41374737 40381278 39357545
3996 39357545 38432700 37555168 36602310 35688596 34853235 34049448 33233365 32490875 31855351
3987 31855351 31155099 30365131 29693195 29047335 28396240 27809604 27206990 26614654 26075712
3978 26075712 25463521 24867151 24358791 23768451 23188114 22629394 22093674 21570934 21067421
3969 21067421 20567452 20124278 19719923 19289632 18886670 18437592 18078901 17744839 17482954
3960 17482954 17259942 17021363 16754172 16483656 16275287 16123903 15885714 15702217 15585005
3951 15585005 15475555 15430611 15340653 15235297 15280448 15364744 15357523 15410649 15500452 15591462 15704768
3940 15704768 15822234 15850734 15941897 16117407 16181035 16276660 16317355 16345691 16447147 16572954
3930 16572954 16575452 16647855 16770481 16803131 16961412 17048489 17158531 17253875 17364801 17413746 17498587
3919 17498587 17546031 17635914 17708065 17724181 17705456 17740648 17779734 17764252 17958637 18096162 18224862
3908 18224862 18417944 18574702 18681756 18814726 19052753 19227277 19418946 19612498 19846623
3899 19846623 20092474 20284743 20522975 20835083 21182122 21629288 22089038 22559529 23042483
3890 23042483 23476931 24065683 24540196 25009443 25514967 25956472 26330308 26633870 26923847
3881 26923847 27104655 27379942 27646007 27869764 28089173 28387087 28707292 28969457 29348579
3872 29348579 29686503 29966915 30291481 30550598 30783726 30968008 31049577 31073297 30985882 30925699
3862 30925699 30784549 30607879 30413400 30296873 30139389 29993375 29807784 29705683 29622112 29490320
3852 29490320 29525177 29573986 29638522 29699002 29777982 29975292 30123459 30268116 30473114 30727341
3842 30727341 30911731 31246481 31616984 31928837 32352863 32808815 33324924 33885920 34481695
3833 34481695 35054311 35651247 36229465 36809255 37362354 38053783 38748574 39513808 40317196
3824 40317196 41260062 42336131 43492476 44823255 46335283 47969479 49818394 51815059
3816 51815059 53758571 55867355 57915223 59826786 61623649 63208945 64565209 65824966
3808 65824966 66852644 67586940 68107079 68408909 68639153 68694812 68615549 68537246 68643197 68784041
3798 68784041 69023115 69385291 69863812 70507221 71098325 71733487 72318074 72703780 72995077
3789 72995077 73073874 72865870 72281077 71417835 70341299 68981721 67435898 65761499 63882443
3780 63882443 61892278 59899178 58006775 56157116 54491244 52965835 51484426 50228136
3772 50228136 48988500 47856330 46787004 45679256 44544256 43379127 42273859 41160659
3764 41160659 39925646 38743142 37599506 36512032 35443292 34496290 33531122 32718853 31991157
3755 31991157 31358569 30845237 30332968 29941015 29592575 29231890 29007030 28786262 28510003
3746 28510003 28248299 27946116 27606880 27208979 26811740 26398984 26014834 25700589 25296393
3737 25296393 24796847 24410245 23933693 23497822 23097209 22735266 22369756 22062445 21758677
3728 21758677 21386844 21042151 20625351 20258979 19895572 19598938 19239126 18842396 18538387
3719 18538387 18195014 17845804 17544550 17247226 17000883 16794242 16492135 16215120 15903848
3710 15903848 15556807 15268949 14987309 14677508 14425554 14104018 13846059 13563241 13274477
3701 13274477 13079854 12931399 12816844 12641645 12420771 12314355 12120314 11874170 11762019
3692 11762019 11512298 11318635 11010513 10759858 10471817 10091981 9722192 9385381 9163347
3683 9163347 8794091 8513220 8160057 7905581 7681433 7461736 7314128 7063378 6893646 6778643
3673 6778643 6663867 6535283 6371337 6259204 6169955 6180204 6135274 6081849 6074029 6060752 5986194
3662 5986194 5916652 5884725 5819629 5721477 5694405 5713808 5691365 5736788 5668336 5544767 5571007
3651 5571007 5556603 5493263 5521308 5557526 5528323 5442664 5475262 5476586 5437449 5400284 5421541 5469958
3639 5469958 5557264 5544433 5509129 5514999 5494875 5527334 5514691 5515263 5504423 5448718 5424123 5340350
3627 5340350 5318183 5323672 5323125 5404710 5447225 5416826 5444770 5430064 5369285 5394732 5381480 5363121
3615 5363121 5339190 5374235 5427728 5580783 5638669 5633168 5650897 5650436 5677391 5679414 5792886 5795361
3603 5795361 5749534 5755579 5815880 5888051 5960266 5954017 5963459 6047417 6129469 6140102 6137199 6179518
3591 6179518 6223135 6312325 6375432 6351107 6401561 6452054 6538997 6628775 6742145 6786343 6841741
3580 6841741 6949971 7041317 7036265 7071962 7221268 7346278 7467291 7550870 7622066 7715307 7849088
3569 7849088 8065204 8186948 8308310 8472212 8724939 8931645 9121494 9334292 9553593 9822920
3559 9822920 10169125 10499741 10709114 11049042 11379747 11651670 12022286 12356891 12697431 13083453
3549 13083453 13385625 13658046 13988529 14389457 14800093 15137573 15470295 15850416 16161745
3540 16161745 16662370 17026426 17500602 17910804 18351104 18843912 19298037 19765545 20245859
3531 20245859 20747636 21262165 21711770 22177091 22511214 22899719 23243498 23610931 23905191
3522 23905191 24040844 24138147 24222341 24300045 24328402 24294475 24240586 24130795 24064769 23958195 23823327
3511 23823327 23654037 23513877 23357182 23220976 23138483 23052822 23013821 23005863 23059785 23077023 23223575
3500 23223575 23359296 23514531 23652705 23793443 23924319 24047352 24221044 24408185 24585929
3491 24585929 24810818 24993265 25209771 25360304 25581588 25714136 25978330 26267344 26560752
3482 26560752 26904661 27274132 27635173 27993218 28354873 28800407 29304861 29760921 30116238
3473 30116238 30528717 30936076 31260229 31419810 31596872 31673463 31618089 31489681 31263920 31038382
3463 31038382 30776215 30375590 29856035 29261261 28640193 27986621 27266299 26587586 25865845
3454 25865845 25115559 24439718 23720132 22972554 22264393 21510279 20820369 20316412 19783692
3445 19783692 19182361 18784405 18407577 18074931 17830363 17613230 17507507 17446196 17293234 17089632
3435 17089632 16947384 16767748 16524768 16429100 16394261 16248776 16066489 15894423 15823636 15709968
3425 15709968 15631269 15606324 15655370 15795380 15884352 16066290 16249725 16418347 16631968 16863158
3415 16863158 17082374 17365365 17613269 17929643 18189349 18455520 18751365 19035356 19335533
3406 19335533 19575919 19723587 19898184 20082927 20335795 20650387 20922796 21247919 21552981
3397 21552981 21846446 22227888 22539416 22923900 23256822 23664495 23919556 24097473 24170258 24181327
3387 24181327 24143950 23967273 23786400 23517952 23203620 22790262 22405237 22018017 21644967 21371371
3377 21371371 20993265 20672067 20453782 20349115 20316438 20292016 20295459 20268778 20336213 20477219
3367 20477219 20522757 20570734 20697835 20763647 20864403 20893242 20960994 21050400 21136021 21234406 21270356
3356 21270356 21428028 21650023 21818968 21977194 22204376 22431734 22674813 22822724 22988622
3347 22988622 23254041 23373638 23543091 23738272 23984954 24110706 24315293 24480983 24539490 24628477
3337 24628477 24704293 24750633 24821536 24839181 24885059 24980545 25048850 25137440 25161826 25204058 25312160
3326 25312160 25404860 25561992 25675267 25731459 25697222 25669244 25626629 25602542 25459835 25202654
3316 25202654 24955035 24753737 24480078 24148393 23795157 23483490 23122882 22739200 22291219
3307 22291219 21948517 21714234 21457655 21287461 21102984 20974675 20897467 20804295 20712968 20644401
3297 20644401 20583083 20497080 20397674 20209612 19998362 19793751 19495211 19211593 18762905 18335092
3287 18335092 17920731 17522535 17082298 16564533 16037203 15673121 15363793 15017290 14733609
3278 14733609 14406329 14212659 14007184 13864877 13848157 13721196 13642183 13465532 13399944 13273534
3268 13273534 13069423 12902968 12722754 12587088 12400166 12226513 11991784 11805344 11630440
3259 11630440 11436586 11219742 11028098 10906040 10818162 10679574 10530987 10486238 10346791 10215503
3249 10215503 10090988 9952315 9849659 9803300 9646514 9451236 9346944 9231876 9092337 9009284
3239 9009284 8877679 8799569 8663317 8580994 8544446 8550312 8555363 8611405 8691895 8747303 8790276
3228 8790276 8847221 8877213 8986157 9025603 9068553 9145235 9201296 9256389 9296176 9289691 9343247
3217 9343247 9338220 9317856 9347597 9356666 9385426 9489372 9637872 9708342 9848585 9924969 10090629
3206 10090629 10157399 10217675 10284838 10410222 10408077 10487672 10529253 10524766 10588235 10582699 10593201 10618598
3194 10618598 10655571 10741279 10747841 10768937 10825553 10839349 10978548 11158956 11299801 11444994 11552103
3183 11552103 11727251 11912933 12150112 12451349 12662366 12900122 13224725 13519802 13865157
3174 13865157 14296594 14739326 15130868 15540582 16018046 16524331 17071162 17669763 18236854
3165 18236854 18895655 19565308 20201582 20895453 21684625 22334411 22985365 23710293 24374757
3156 24374757 24966046 25647695 26306118 26919975 27599666 28347678 29148720 29901362 30680593
3147 30680593 31508926 32342463 33444240 34623500 35848393 37230395 38651382 40143331
3139 40143331 41829586 43712186 45792938 47997968 50298371 53048407 56059196 59534974
3131 59534974 63433768 67784251 72729260 78301110 84570828 91822667 100075885 109369302
3123 109369302 120030838 132275351 146083439 161541999 178802228 197823224 218526920
3116 218526920 240856136 264404764 288899484 313623524 337787688 360638319 381145926
3109 381145926 398529708 412348540 422190175 428035090 429916996 427919457 422388539 413592580
3101 413592580 402113479 388453662 373261540 357364051 341597426 326548945 312677560
3094 312677560 300225648 289438154 280233993 272385039 265784815 260232543 255885259 252765694
3086 252765694 251007275 250420384 250762834 251700897 252675955 253266155 252861314 250797110 246926760
3077 246926760 241704292 235530918 228704603 221204929 212843755 203411368 192990868 181733488
3069 181733488 170439532 159951025 150807788 143354202 137449399 133119312 130409335 129129322
3061 129129322 129015292 129885195 131316979 133052479 134727515 135763865 135860533 135241859 133910557
3052 133910557 132027682 129537253 126431134 122521339 117545711 111616297 105009304 98270464
3044 98270464 91715231 85617280 80006328 74834020 70130731 65713764 61554300 57687777
3036 57687777 54049388 50733128 47895114 45531140 43637233 42145401 40795685 39641366
3028 39641366 38686690 37772009 36886121 36004655 35024311 34036834 33050538 32010014 30931291
3019 30931291 29802127 28611478 27461934 26329828 25169461 24111752 23125009 22214733
3011 22214733 21308563 20575977 20074128 19640445 19267539 19079150 19031556 19072817 19290857 19669147
3001 19669147 20141794 20639478 21328187 22223942 23275943 24315116 25395347 26493761 27636879
2992 27636879 28807056 29862575 30758800 31603385 32231412 32790439 33063632 33215246 33279346
2983 33279346 33124313 32997706 32814867 32491541 32182490 31892341 31583702 31350146 31255140 31140891
2973 31140891 31078480 31039342 30922350 30736669 30461259 30039473 29511220 28849812 28063614 27139683
2963 27139683 26018796 24875767 23658367 22383082 21028077 19811772 18620780 17423551
2955 17423551 16289801 15384821 14456039 13666845 12955195 12304823 11859062 11430505 11070515
2946 11070515 10891291 10718001 10688609 10704222 10761038 10869129 11141110 11537112 11777325 12136708
2936 12136708 12530540 12866721 13144644 13450322 13734720 13881542 14011483 14073933 14094825 14024031
2926 14024031 13911960 13849930 13764196 13670065 13592908 13499643 13377326 13409575 13370309 13444944 13377895
2915 13377895 13249880 13172348 13029484 12807933 12500941 12143844 11738645 11311192 10803341 10276099
2905 10276099 9725096 9187188 8659311 8160286 7646551 7161095 6791698 6339281 5969171
2896 5969171 5676728 5408284 5171731 4954845 4757727 4567046 4387771 4239234 4156252 3997723
2886 3997723 3909762 3852099 3744700 3709481 3630776 3566757 3523117 3445507 3418400 3351938 3316514
2875 3316514 3315146 3235171 3195948 3226984 3183650 3130954 3120786 3079535 2983521 2998324 3002586 2978126
2863 2978126 2987841 2858821 2856489 2890698 2836022 2836446 2895170 2928904 2781736 2786989 2810655 2790363
2851 2790363 2747929 2769223 2758699 2733508 2766348 2733366 2671094 2731075 2736478 2759730 2830527 2910209
2839 2910209 2867059 2939622 3034170 3132748 3236155 3294618 3318110 3455352 3662450 3771587 3847849
2828 3847849 3981074 4092753 4096581 4131728 4227539 4263804 4217561 4245818 4300485 4273238 4155140
2817 4155140 4027360 3935602 3948402 3844332 3778638 3673574 3604061 3507975 3426661 3323575 3304600
2806 3304600 3283852 3299042 3304870 3256487 3184582 3158820 3115789 3078432 3082028 3051530 3144455 3142004
2794 3142004 3065707 3028004 2941261 2885872 2787523 2773780 2745730 2628426 2588617 2565009 2460332
2783 2460332 2391588 2368025 2336091 2276300 2313250 2284234 2243872 2216874 2203726 2258307 2242649
2772 2242649 2234500 2120148 2158385 2131472 2108210 2084124 2055682 2013013 1997303 1974896 1914434
2761 1914434 1881482 1788858 1759433 1738687 1703936 1712061 1721818 1697679 1661370 1622693 1613697 1594151
2749 1594151 1543208 1469884 1459693 1484375 1495944 1512163 1516274 1509657 1533755 1572619 1495683 1408022
2737 1408022 1414703 1371255 1384704 1438861 1364869 1397111 1377275 1333659 1285181 1272235 1288255 1315588
2725 1315588 1371904 1407814 1408179 1327190 1301560 1266569 1277140 1285341 1301157 1258324 1332668 1290656
2713 1290656 1280561 1237808 1202428 1181632 1119399 1191052 1226430 1199464 1258763 1252745 1279412 1252962
2701 1252962 1213162 1168377 1243312 1273632 1245215 1218934 1152238 1147423 1106463 1213577 1249997
2690 1249997 1175230 1150714 1201721 1208961 1167621 1204687 1136952 1107142 1127819 1132317 1176702 1091673
2678 1091673 1118560 1181774 1155602 1167112 1143493 1063450 1033455 1001890 1073338 1143888 1128252
2667 1128252 1109601 1132233 1136404 1106699 1045054 1002360 977959 1011083 1001353 1010623 958049 991069
2655 991069 975906 1026243 1039607 1021690 1010706 1026758 991006 984637 1025260 969223 953117 1000487
2643 1000487 935135 976119 1032945 1033340 1000776 1061334 1014821 1038658 1006568 999828 1085317 1107819
2631 1107819 1158925 1105726 1122107 1160529 1206077 1162713 1174810 1208101 1202005 1177514 1146012 1155023
2619 1155023 1137227 1133153 1123683 1034076 1023616 1011019 980663 975222 942701 959436 932160 914467
2607 914467 880172 863288 890570 897003 897177 888459 920932 859286 816643 784646 794963 806509
2595 806509 804495 822481 871687 798064 746541 779563 799360 722926 711715 731534 765102 748338
2583 748338 756949 763247 732171 681179 730082 734345 801054 885262 835817 746929 769210 795690
2571 795690 837446 831483 799622 761635 705751 710073 779138 762015 701822 706156 763908 721081
2559 721081 688704 694987 670173 727489 786003 776265 682464 717874 701237 669865 702243 718647
2547 718647 754425 739470 709400 719887 686000 718213 752931 732081 750038 770135 791353 768488
2535 768488 728655 764932 829433 815338 728140 721199 754263 721232 739368 790052 767080 737209
2523 737209 748010 688276 708424 760297 718772 671725 628756 604555 656984 677026 672284 653548
2511 653548 693383 699401 667143 646853 640829 700028 654747 656706 633991 654163 651566 685414
2499 685414 684298 667680 663292 689043 716517 689624 732763 714056 710537 686857 691559 679424
2487 679424 617701 654661 637718 655316 673006 676884 620457 616771 615245 693997 706762 707361 676509
2474 676509 630614 742947 775921 751081 728514 678918 707526 778097 754958 720807 700469
2463 700469 767604 823633 766335 756679 756530 774042 725181 748378 723732 713837 777373 815000
2451 815000 767728 748402 801083 818803 858575 790080 785067 757565 801027 827754 800291 789183
2439 789183 745138 765846 747566 818836 859656 870011 784870 805435 768465 763930 844351 859630
2427 859630 818022 842216 828491 919827 914316 898293 991846 947136 965853 992113 1036552 1077276
2415 1077276 1121558 1130395 1121124 1129967 1149970 1200162 1247753 1173575 1191263 1228420 1231610 1220421
2403 1220421 1291829 1249872 1289484 1295022 1363636 1385899 1428652 1461676 1517447 1586566 1674016 1723904
2391 1723904 1772004 1817551 1938529 2011687 2142018 2284158 2394543 2605402 2822792 3114001
2381 3114001 3510199 3956822 4429331 4989612 5633678 6347689 7066470 8016895 9352771
2372 9352771 10999195 12767287 14702920 16834915 19190282 22009899 25172359 28493526
2364 28493526 31992264 35466295 38801331 41849758 43482795 43717976 43593164 43272698 42587319
2355 42587319 41482954 40035064 38132742 35398256 31834479 28054772 24530460 21499850
2347 21499850 18895396 16627359 14625398 12771424 11151786 9739870 8268088 6989788
2339 6989788 5940087 5129238 4544159 4136561 3753654 3400972 3122430 2903676 2689113
2330 2689113 2503859 2401861 2266479 2146973 2060572 1952598 1815388 1721737 1746473 1700838
2320 1700838 1672606 1578489 1491603 1433373 1341464 1347336 1326619 1303870 1291299 1196792 1197179 1203529
2308 1203529 1135299 1108162 1097015 1053247 1062823 1019896 1003199 925256 965056 936658 929535 953316
2296 953316 918363 925338 915296 901452 833187 811750 790818 839830 801313 744199 737375 798083
2284 798083 784204 793125 737164 813869 745040 755043 739981 705338 718359 703596 726273 631764
2272 631764 655973 595692 551727 571198 521287 511196 529280 538172 549481 601842 598808 597941
2260 597941 613269 583463 561800 569240 581537 592771 564652 535530 553909 513637 524529 520215
2248 520215 475612 484154 460717 519153 611946 585795 506935 446785 492963 531508 571344 463416
2236 463416 478153 450662 480869 481836 458356 447585 389620 465850 511708 450433 439111 459644
2224 459644 445906 438170 407544 385384 428569 473003 387569 339538 345439 400434 375319 385379
2212 385379 394558 432055 418427 396007 428609 405945 328062 309209 378222 401810 439860 444046
2200 444046 406011 346542 410916 390843 410941 472869 434694 411097 410240 375151 384994 373763
2188 373763 330219 378404 355274 333854 325856 319798 386457 364233 317770 383398 374979 321713
2176 321713 355409 403526 329421 333510 320436 301230 282988 299941 320989 352315 323496 242200
2164 242200 224480 232931 257311 325203 323692 242262 259471 277791 230964 204322 211500 250457
2152 250457 281964 237795 232219 284633 340210 351493 355645 362679 326694 333600 275186 241944
2140 241944 319563 334797 336452 320724 348552 299854 263002 266948 259862 263302 299631 358241
2128 358241 293926 275873 271668 290874 236039 228612 240145 279475 282704 240962 311871 289725
2116 289725 258178 215571 226324 244385 228214 299834 296619 339405 305974 318862 283314 311155
2104 311155 319457 294038 362440 312664 342860 356187 364713 376781 366783 385294 381083 436658
2092 436658 445978 376152 394448 414168 447837 390553 379355 435696 461564 424424 424928 321475
2080 321475 304638 329422 317431 314745 394761 298865 304917 307076 265867 287316 289799 298745 289748
2067 289748 255965 168353 199407 196740 217459 196927 216134 256625 252210 285865 342353 244596
2055 244596 176729 236751 182030 149615 188499 142766 203686 278839 243569 199106 178805 190907
2043 190907 178529 189037 210845 181972 153303 195566 250783 190818 185006 198885 273685 238126
2031 238126 243146 206578 164185 189955 200147 214938 211001 243033 246293 189124 160603 162443
2019 162443 92945 135228 141244 195470 215737 144334 201610 199134 139952 161283 180489 161447
2007 161447 108047 129809 205106 213673 170144 248773 256588 173452 118934 139019 167458 184087
1995 184087 159238 134250 167538 151969 151205 144172 224216 239917 193507 174617 198016 192960
1983 192960 191190 211193 223894 200647 157876 177027 143566 117973 60324 35114 57385 67302
1971 67302 104396 109774 107642 87887 144426 173023 199973 207211 166248 140104 68142 34426
1959 34426 109815 116674 62186 91040 141304 105653 129340 129872 172763 156857 73601 126983
1947 126983 112722 101148 134903 166626 97462 124895 107464 131507 138469 185802 202928 174301
1935 174301 119094 116532 172422 162361 169209 155150 145428 149551 105269 155027 174089 142536
1923 142536 158849 160480 131162 93289 100155 158497 198069 119767 126566 194647 173672 133992
1911 133992 113057 109938 129014 119497 99228 126016 115440 14604 86158 111676 62272 62187
1899 62187 104171 101957 87660 71381 95498 125601 137522 151575 188442 191939 172743 91303
1887 91303 94258 107112 96019 108838 139533 153465 140539 160818 149014 156332 107893 106011
1875 106011 48542 43446 87853 50480 66231 111807 132052 140221 77948 82328 150483 84292
1863 84292 145331 163757 164517 107309 100462 139697 137541 106053 123019 149814 94936 94044 80006
1850 80006 97503 64696 64309 106180 124206 163330 172527 207261 158084 35608 52101 22731
1838 22731 87630 32954 80857 28787 -12945 70751 81832 64630 43464 112869 144066 120495
1826 120495 132602 127981 59293 12283 30574 63382 74908 62861 106269 134070 100002 78973
1814 78973 111032 117348 130953 198412 153311 151318 79968 43236 60911 125376 134306 226433
1802 226433 167901 138715 153455 187636 105871 53064 109898 67722 48105 101463 99669 60647
1790 60647 11372 1077 934 10741 21424 23631 83849 75129 117953 103068 50658 56187 134676
1777 134676 96897 129145 73426 70280 62568 59001 61479 55429 66645 60569 26204 47150 63552
1764 63552 -7815 72384 134673 99588 68474 66551 99380 43481 33967 115721 97662 34220
1752 34220 44065 27832 21506 51084 52186 39836 69996 85199 100068 56788 81262 83688 13909
1739 13909 51764 126002 117240 120733 50743 -14155 -11409 -24329 -14791 -20257 -13066 44050 26467
1726 26467 15280 13979 38120 77355 53843 62555 103991 104414 98683 53308 -34327 33647 104302
1713 104302 63123 78332 110288 66423 10666 7233 53801 35119 49652 57340 69961 53281
1701 53281 52262 -25438 -72739 -71732 11865 2752 28403 38891 -8248 30461 30865 53356 71791
1688 71791 97538 89639 15222 75994 60405 84415 77506 45285 42842 24855 96261 113559
1676 113559 66364 63164 108758 54593 16402 41051 11496 82131 129279 127247 57560 10380
1664 10380 16616 92144 100648 42989 73709 63321 79966 86754 95134 81969 58839 52049 122056
1651 122056 150485 139670 59470 59760 96089 54179 76162 120699 47265 22122 63886 28734
1639 28734 71881 67504 -489 91390 103520 15594 -13288 -4959 35742 -32117 -91299 -33674
1627 -33674 7489 29756 37748 -6204 3014 29387 42831 26802 -18227 -7833 1531 -25779
1615 -25779 -55042 15221 58417 43344 -4817 23901 12724 1059 -13149 -38391 -26365 4109
1603 4109 -2957 25251 11945 5324 82827 10400 18153 66783 77329 60952 1803 9462 2954
1590 2954 7099 62858 59608 62433 41099 9584 3916 8822 -35112 -23740 -32685 -23984 -77081
1577 -77081 -52953 -8092 9727 26259 -22531 -16835 6155 52151 -8495 -14779 20425 -6793
1565 -6793 250 8420 21533 51237 17466 111569 84140 54561 7153 26910 40226 -977
1553 -977 50058 12958 -44633 -70500 -59805 -65192 -59749 -23251 -81050 -70646 -75089 -72097 -44064
1540 -44064 -19445 -6379 -13015 -31467 -65037 -4070 -29175 -74729 16972 12423 -7811 2986
1528 2986 3403 64707 117417 53316 -22729 7481 28168 37598 -20395 -39047 -38081 -68024 -102810
1515 -102810 -112930 -90875 -40600 -54141 -66115 -32717 -808 -6398 23662 -18640 -43098 45104
1503 45104 40843 -17686 -53226 -56387 27224 36155 37573 42748 13689 33265 36114 46831 52569
1490 52569 28626 76700 94960 -13028 -46847 15741 60338 58816 -12862 29303 98330 69411
1478 69411 18690 25063 -15020 -15252 2014 -16205 -55952 -5134 6056 -18131 -79112 -125270
1466 -125270 -44986 -31545 10007 -32182 -60155 -13946 -16530 -17675 21581 -4794 -40645 -44692
1454 -44692 -41283 8745 7055 25988 48484 17991 -27326 32673 17172 -22156 21686 -1981
1442 -1981 78572 58955 28361 12050 -30016 934 -18181 -32032 29161 -11553 1148 -299
1430 -299 33808 71758 20110 29548 26320 -52491 -99410 -33848 -22641 -10147 -16868 -78336 -27244
1417 -27244 37133 70200 46019 -47753 -18054 23390 29665 14365 -11194 4753 6615 5792 33676
1404 33676 18995 -58781 -33509 -8910 -35832 -94362 -46232 24602 -47643 -47744 -44686 -15673
1392 -15673 -14281 28206 15710 3046 -21696 -50901 -10655 -2069 3749 -56040 -18009 33825
1380 33825 -12387 13265 12325 7719 -33134 13627 42825 64462 100322 84370 79576 65605 79361
1367 79361 74722 63895 65827 31603 13651 -28605 -48560 4721 -26282 -46891 -2378 8123
1355 8123 -93189 -5392 56412 33596 34405 -11396 -46852 2534 -24593 -1370 30930 32907
1343 32907 27015 -31897 7634 20821 25414 17099 48602 54187 -5825 -45446 8685 46304 -44467
1330 -44467 -26825 15834 18474 39817 50010 -62607 -58680 -44284 -63472 -19420 -27029 -93198
1318 -93198 -79696 -23224 9996 -11558 -49448 -52146 -67962 -70048 -35215 -32144 -21621 -79871
1306 -79871 -63720 -16935 30700 2035 -12696 -51319 -85752 -102754 -155774 -70510 29767 41482
1294 41482 22258 23991 59487 40655 -298 48214 13957 -1933 -8470 -90586 -37342 -29978
1282 -29978 -14855 44719 -47117 21457 -8622 -42719 23068 44806 -27614 -36616 -42840 -8176
1270 -8176 -75213 1203 -10801 -46737 -72916 -44604 36228 -47907 -61064 29449 -16463 -20468
1258 -20468 -40819 245 -12107 10310 25568 -12004 29556 6897 -64170 -20810 41414 24819
1246 24819 -7417 -28135 -39969 -75635 12732 50242 -8403 -100037 -69273 -3170 -16706 -21187
1234 -21187 34785 34356 -7400 -41298 -4164 -30134 -53839 -89119 -46468 -18333 -66708 -8671
1222 -8671 -46976 -82617 -56873 -15183 15043 -65075 -9090 -39671 4013 6198 -4007 -15965
1210 -15965 -18106 13528 -8736 30407 99122 110334 20677 -33930 -27677 -48177 -43034 -42677 -27798
1197 -27798 -28800 85120 66873 13256 -19222 -44549 -5521 -21877 -41769 -35615 -66856 -31413
1185 -31413 12510 50258 38694 7102 -7118 -23549 -29434 -40276 -3432 -67415 2009 -55972
1173 -55972 -42359 -21642 -30882 -17895 -1269 -42863 -55325 -91495 -98072 -68366 43128 31905
1161 31905 -14639 30308 5370 22398 -55075 -1732 -6353 -47159 -33276 -274 11387 10763
1149 10763 -10651 -29651 -83685 -49450 -38233 -69796 -13162 -14613 10922 -78162 -105795 -124808
1137 -124808 -74650 -71747 -105641 -101361 -63036 -14709 -29720 -10186 -32102 -57649 -134216 -83901
1125 -83901 6456 35321 40580 -20520 -34999 -25237 12006 60056 32171 2829 -49298 -16589
1113 -16589 -10457 -24036 -33945 -56787 -83730 -6300 61391 35710 -12410 -76721 -6218 7614
1101 7614 -15122 -49826 -4602 35758 -35399 3422 35784 39147 -9939 -8790 -38230 -22260
1089 -22260 11028 -25885 -67546 -45891 61754 14705 -55365 5631 -1707 -42605 -61356 -100884
1077 -100884 -67474 -90064 -82092 -116607 -128489 -94800 25045 38752 -11854 37156 5415 -81424
1065 -81424 -61178 -29172 -41620 -58579 -29426 -9496 -19328 -63976 -68227 -49940 -22866 76487
1053 76487 101116 41855 23350 26465 3011 12262 -5165 -32668 -103789 -87566 -21892 -94646
1041 -94646 3416 -5742 -41914 13290 5955 -13866 3380 15568 -27565 68575 -16540 -106590
1029 -106590 -61177 6840 -18757 3796 -63245 -50933 -45380 -18436 -62899 -84370 -45025 -76895
1017 -76895 -44418 -5109 23029 20823 45916 5230 -39305 -40905 54818 7450 -1179 -15834
1005 -15834 -38148 8030 58526 -4658 -35500 -54859 -136097 -107010 -66451 -43539 -40981 17586
993 17586 15424 42297 -43325 -40747 -34215 -50287 -73416 -118938 -54367 -21109 -31168 -28583 -33598
980 -33598 -45700 18331 15943 38831 64625 -780 -86029 -90351 -26385 -86939 -119478 -54296
968 -54296 -95409 -89110 -73680 -40289 -42918 9384 -8120 -19972 4517 -48590 -38091 -32025 23084
955 23084 60200 -3783 -20357 -77438 -143620 -68458 13213 24211 9296 20079 26160 -9202
943 -9202 -1290 46867 -27786 -37293 -60047 -71703 -18579 15607 16036 -19719 -37750 -56535 -22310
930 -22310 -20312 -22700 -3211 42297 -49795 -66632 -22035 -39299 -8431 -10551 -63682 30668 -55502
917 -55502 -107475 -104538 -75880 -43150 -33202 17474 26507 45913 -31457 -42988 -21782 -10498 -17512
904 -17512 10776 52266 37043 51161 26572 -62017 -54810 -53798 -108223 -49245 -5337 -10557 5237
891 5237 7516 36209 53074 7143 -51466 -81867 -79849 2776 -64927 -77036 -51881 -3659 -46661
878 -46661 -81884 -68257 -18704 -18869 -65779 -87138 -44078 32387 1846 -81088 -61921 -71115 -39409
865 -39409 14346 -24860 21731 12663 -25796 -37794 -25861 -7670 -19305 5499 -33557 -127341
853 -127341 -125619 -62740 -10224 63143 10404 -922 7466 2343 47900 13670 31853 38850 52766
840 52766 88226 33211 34220 36453 -21770 -72884 -109740 -71009 -18693 -2397 -35642 -37150 -73025
827 -73025 -67659 28415 20255 -24085 2758 27185 30236 -40885 -55833 -52991 -66125 -48581 -29211
814 -29211 -35158 -63068 -18362 29052 -9544 -25132 -44561 -3059 22375 22381 28486 55296 48604
801 48604 -38029 -36393 43648 52566 -25653 -70258 -99589 -74061 -48025 -16537 25667 50909
789 50909 -31092 24649 952 3465 -20798 -70459 28982 20590 -3351 -8517 46141 83614 40454
776 40454 17181 -1198 1319 43709 -10853 -30951 -48864 -102733 -86907 -15958 -103081 -84546
764 -84546 -23628 44108 -18408 -69102 3976 -250 -44094 -3050 -16446 -74384 -22996 -3474
752 -3474 -40742 59603 -18536 -31381 -18903 -62372 -23305 -56803 -86073 -144231 -78163 -40422
740 -40422 -25271 -12762 -36677 -65123 -81805 -43182 -25063 -60170 -76890 -58060 -47570 -36466
728 -36466 20417 -9028 -20944 11752 35281 53047 29937 6383 1249 -5326 -4030 -34327 -37820
715 -37820 36122 19937 -7846 -28248 -20770 42604 16693 54728 67107 50599 8501 -13107
703 -13107 15299 41818 16728 25649 18640 15712 33818 -13523 6774 37041 66641 61607 16433
690 16433 46107 5148 -74216 -24083 42637 57932 11442 67837 104254 45088 55920 -2808
678 -2808 -5208 66101 -14517 20657 -18906 1319 -1212 -30815 -13661 -41634 5139 -28491 -51857
665 -51857 -91105 -39938 -56850 -87318 -41655 48268 38465 -26302 -62925 -40472 -56509 -6991
653 -6991 4482 17858 -36334 -30049 51381 150328 130565 76078 87266 41932 48763 35300 -2002
640 -2002 -16273 1361 27244 24666 28501 -6277 -8567 65562 68633 40324 38879 46393 36665 -6192
626 -6192 9922 -18499 -22653 20047 -42794 -63727 -44596 8823 -28989 53515 44861 5171 -30188
613 -30188 -15206 -28444 -47498 -25068 2342 7113 -18529 -44341 27170 81524 52720 34719
601 34719 15626 50785 37049 61158 52880 23274 21359 -12126 22789 -108 -8779 358 -49041
588 -49041 -58040 -80116 -58354 -34202 -11801 -3471 40677 57359 63006 27473 39676 -25650 -35138
575 -35138 3699 -2764 -20537 -35981 2283 -17096 55426 16277 -67918 -71829 -50982 -328
563 -328 -23863 -33285 -26436 -48820 61965 38854 -52928 -7297 1139 9144 -18285 7255 -6926
550 -6926 -535 22568 -28403 -14021 -48734 -9507 5966 92116 34364 54277 60344 11672 15370
537 15370 30714 23812 4590 44512 85786 56710 14468 55003 17927 11889 9833 46875 22309
524 22309 30833 16247 19349 119872 117593 12689 24516 6087 -16426 -18964 -7921 26910
512 26910 -14489 -11790 23232 60368 81877 81125 -4697 -53449 -75724 -2319 11288 25327 12615
499 12615 5442 4552 -25458 -52772 -33979 -7154 -29087 -43888 4225 79273 15696 59773 121158
486 121158 81201 73970 57325 8173 53744 127807 98831 -33219 15095 -9295 -43840 -7289
474 -7289 -8881 35444 92596 107354 39632 -38115 17670 131750 80852 15268 -10223 -38948
462 -38948 63205 50309 47687 68318 48111 74485 47055 47124 12157 -26888 14997 661 7306
449 7306 -30102 19502 -26515 -13027 69407 87353 -10290 55281 60345 8062 -8672 372 31145
436 31145 36145 47379 25015 75917 78457 68801 70062 56520 -47864 648 22389 35031 55396
423 55396 39035 65414 -29521 6724 24354 -55937 -1235 19206 123358 83727 63963 27580
411 27580 44891 68398 84717 94667 59919 68316 114527 49180 88016 120513 39182 50114
399 50114 17107 37949 49272 28681 35067 29293 10039 39813 31142 -4944 -13443 6627 64494
386 64494 40005 85469 56854 63203 81644 49619 49165 10275 37785 23811 47451 56571 29579
373 29579 63058 81236 74940 179623 163821 112051 111885 84789 72526 7376 -10509 78131
361 78131 79126 27002 75908 35659 122343 64180 8356 80091 167815 159675 162144 192928 152121
348 152121 160064 155856 91851 97676 93654 30334 114251 88478 101080 110055 143119 96767 25325
335 25325 50927 107264 110748 12259 -17639 18882 6884 29912 72657 24305 45883 53560
323 53560 10075 -5911 -16404 37366 31054 39298 82170 85511 44808 9377 70821 49245 30024
310 30024 62451 46022 59452 71948 114069 40660 5804 45850 79940 97527 57373 45808
298 45808 14148 103698 149852 130134 141620 133976 96515 87099 79968 35271 91980 34158 -546
285 -546 -1365 3338 61013 65401 76389 47445 53352 74145 51387 -22919 70497 195242 174080
272 174080 162898 114878 79972 111302 174409 151732 136351 85926 90898 76830 93022 90949
260 90949 104992 95513 51567 30532 4894 61234 33911 -5933 72291 93676 42085 66347
248 66347 38316 -15256 52141 142681 101367 69957 62568 46720 80588 57633 9064 23622
236 23622 41712 51406 69171 20420 48060 38954 50459 118136 136235 102416 89745 111537
224 111537 137927 159751 109498 89855 56424 69629 80005 57339 22071 110984 101567 161058
212 161058 121365 65190 26680 19609 20023 73332 95936 108372 125031 77977 39363 46123 119734
199 119734 162165 64759 59162 87067 152689 135244 41906 56878 53978 41079 4715 30919
187 30919 66686 121438 171493 170221 141585 126429 98629 79936 68202 26880 94918 116448
175 116448 84570 139626 128739 132325 62952 68467 -8191 42751 69544 74659 45923 22766
163 22766 37798 58585 88898 119426 146082 158415 93954 33742 8733 2308 46323 78120
151 78120 56948 52543 83771 107394 149076 149942 116650 120158 160440 207485 193513 129403 88378
138 88378 104179 104530 150142 103227 79140 83454 88420 118782 119046 43904 82044 42045 -18535
125 -18535 47794 74064 80426 89456 77149 110668 122056 125453 161164 97325 59365 56947 105676
112 105676 53443 110337 156892 134779 96159 81878 74816 62706 57556 102206 122659 68531
100 68531 89363 111177 79136 123040 138843 128347 79195 82833 100650 60184 63751 98920
88 98920 73877 94158 118445 141271 112210 115593 100807 91762 53320 51935 98813 175169 140802
75 140802 79891 101240 113321 104736 104421 28363 20593 64675 61095 96153 98228 75735 45741
62 45741 24682 66538 70642 64083 76721 132498 129814 97496 69279 40922 49159 61505 77799
49 77799 135871 157492 124228 90206 78720 84926 93786 136125 111505 87344 59997 72633 75095
36 75095 94114 132655 147200 127538 112998 49024 125805 169811 139420 146933 148034 101986 112085
23 112085 127535 105572 106771 99008 135542 108564 85751 88626 62221 57829 69677 75417 121693
10 121693 129671 108343 117549 129780 110438 117595 127654 87003 91142 73740
0 73740
$$ Imaginary data points
##PAGE= N=2
##DATA TABLE= (X++(I..I)), XYDATA
16383 -2290458 -2289932 -2234793 -2172474 -2147830 -2114416 -2070395 -2024814 -1987279 -2008876 -1987700 -1955799 -1970578
16371 -1970578 -1881800 -1823031 -1785819 -1770067 -1733404 -1665974 -1670291 -1614920 -1561252 -1551378 -1520019 -1510653
16359 -1510653 -1515130 -1495520 -1445533 -1394746 -1395557 -1331677 -1328119 -1293251 -1230465 -1211336 -1227748 -1158240
16347 -1158240 -1099075 -1100038 -1074485 -1033090 -1060087 -1014739 -982315 -977194 -929226 -864595 -842535 -829785
16335 -829785 -819799 -771985 -756022 -690594 -652705 -642831 -594106 -580249 -535949 -545123 -514030 -459735
16323 -459735 -420416 -409210 -394380 -360185 -325236 -269897 -235632 -213255 -204813 -236417 -182416 -139075
16311 -139075 -130285 -122031 -86689 1810 9977 37179 51301 70604 89100 151548 159453 214886
16299 214886 258528 315044 286210 277709 285694 287695 367412 443429 427704 471367 493394 538710
16287 538710 533526 500890 557042 638407 636583 595326 636292 651953 663686 698564 738241 776177
16275 776177 731956 781288 832920 856869 893549 915426 934607 972862 997536 1031142 1090883
16264 1090883 1062818 1129073 1135934 1171755 1164204 1131341 1147616 1120579 1143289 1221711 1259525 1222969
16252 1222969 1259885 1256354 1278513 1356116 1356061 1309064 1311634 1354900 1404161 1492685 1420761 1476997
16240 1476997 1482857 1511744 1489935 1510548 1507517 1549668 1563167 1603767 1636879 1673866 1699197 1680791
16228 1680791 1651819 1680006 1693567 1692988 1677247 1765482 1836771 1843772 1802041 1811264 1835015 1882010
16216 1882010 1854408 1862842 1841294 1879074 1952729 1922097 1914651 1980050 2010910 1966421 1966365 1944642
16204 1944642 1946787 1948409 1989894 1995509 2022516 2115946 2094565 2093031 2110244 2068320 2085270 2100512
16192 2100512 2148482 2139240 2162505 2110835 2198857 2164607 2149087 2158379 2188997 2206115 2179811 2199480
16180 2199480 2215795 2245914 2289479 2303165 2275737 2247668 2245333 2224963 2161611 2253609 2375115
16169 2375115 2355575 2346160 2352117 2359656 2344058 2384965 2414824 2425452 2447472 2429224 2460127 2439511
16157 2439511 2413504 2413964 2381621 2392573 2430519 2474985 2534011 2514825 2535933 2499907 2503040 2546946
16145 2546946 2488864 2473369 2435408 2541123 2567519 2596864 2553100 2546758 2547233 2529412 2544227 2523501
16133 2523501 2585951 2586721 2566354 2607012 2636801 2584413 2610126 2548856 2517301 2557291 2542553 2664073
16121 2664073 2670721 2548435 2614448 2633037 2570941 2629120 2630462 2636900 2643911 2611867 2684673 2699581
16109 2699581 2636452 2659697 2598908 2566346 2623408 2675223 2682958 2709898 2666992 2657195 2693581 2675568
16097 2675568 2608903 2589763 2631451 2664066 2677919 2671533 2661366 2689978 2740798 2717118 2705038
16086 2705038 2675707 2711940 2744642 2676808 2661129 2728985 2730545 2757904 2774639 2730391 2722842 2696227
16074 2696227 2690644 2697536 2691610 2675449 2628860 2666125 2673875 2675692 2684926 2697909 2755709 2806336
16062 2806336 2750420 2758954 2795630 2735551 2690336 2702869 2752968 2693540 2706882 2733168 2690635
16051 2690635 2747059 2756979 2770897 2764880 2727405 2664281 2694481 2690213 2665542 2680817 2665927 2643861
16039 2643861 2701849 2782966 2735070 2765726 2776385 2782058 2793508 2678387 2724675 2757131 2741187
16028 2741187 2736584 2772343 2812885 2753275 2758390 2737979 2739398 2705555 2730631 2753274 2770539 2802944
16016 2802944 2722720 2767044 2804811 2777263 2796080 2801618 2761056 2821089 2816969 2779325 2804670 2740670
16004 2740670 2775508 2770585 2762070 2806161 2767456 2747519 2729724 2783541 2820563 2768478 2748334 2764824
15992 2764824 2792103 2753576 2760031 2747323 2728692 2706074 2689554 2729787 2754800 2798783 2824966
15981 2824966 2872480 2816125 2790150 2823202 2871629 2843554 2864589 2827393 2736986 2762714 2818702
15970 2818702 2856280 2925689 2898854 2876758 2791140 2708767 2815916 2802835 2770533 2791291 2828615
15959 2828615 2807740 2760886 2744581 2738241 2772144 2841669 2843619 2859158 2834859 2785731 2741214 2810534
15947 2810534 2849198 2880242 2898055 2877305 2861810 2820273 2799972 2886701 2971815 2888363 2860050
15936 2860050 2782290 2764519 2779507 2738161 2735004 2749274 2725781 2767342 2790885 2792282 2795559 2735644
15924 2735644 2740492 2772686 2787438 2753332 2768116 2726051 2714759 2762589 2813837 2818708 2835917 2819913
15912 2819913 2858196 2843746 2836165 2815708 2798399 2805879 2804249 2838604 2801165 2821078 2800625 2786458
15900 2786458 2800317 2898768 2899842 2839526 2787126 2777620 2845840 2765669 2768054 2716677 2755022 2814161
15888 2814161 2833733 2755666 2744245 2775135 2763579 2806040 2826592 2847095 2812513 2768217 2802196
15877 2802196 2848265 2790196 2785476 2830762 2864948 2906686 2913802 2857948 2857688 2820512 2869784 2843749
15865 2843749 2846667 2871568 2898845 2871984 2878267 2862471 2823998 2841082 2819102 2803472 2802857 2827526
15853 2827526 2791360 2807266 2751678 2812280 2861428 2899679 2886842 2874058 2821384 2762289 2779185
15842 2779185 2766968 2764992 2792977 2793578 2797896 2831486 2825110 2775009 2792452 2834777 2814394 2807205
15830 2807205 2834768 2866755 2855584 2861707 2840806 2802228 2829937 2897497 2846736 2861104 2829078
15819 2829078 2868093 2909875 2864560 2808772 2783161 2752724 2755036 2725584 2715431 2745702 2730242
15808 2730242 2767124 2824971 2799868 2823878 2853487 2797307 2745857 2779864 2822465 2857639 2882876
15797 2882876 2843300 2854687 2910457 2896786 2838121 2759849 2750300 2785575 2805026 2818701 2750241
15786 2750241 2797712 2890059 2876601 2869811 2899054 2876850 2825203 2757623 2783418 2803530 2833681
15775 2833681 2775428 2815778 2886432 2849936 2848985 2837233 2877446 2862394 2853897 2886897 2899895 2808101
15763 2808101 2871987 2851709 2890473 2998864 2965449 2885797 2811088 2816247 2894409 2839347 2824818
15752 2824818 2820133 2756189 2724958 2761761 2826026 2863917 2800997 2842630 2834788 2806803 2860995 2854427
15740 2854427 2831229 2843532 2877260 2818220 2832195 2853430 2846202 2740246 2779555 2794710 2857869
15729 2857869 2810827 2765861 2828276 2941526 2951416 2938264 2927052 2945869 2909247 2883636 2887028
15718 2887028 2826075 2845732 2878604 2872739 2899395 2873100 2878531 2844529 2831680 2885287 2876587 2852599
15706 2852599 2846816 2884030 2899486 2860954 2842415 2848218 2862691 2865713 2803014 2791326 2786479 2791214
15694 2791214 2802072 2868255 2886931 2859822 2847791 2970493 2967183 2898657 2888413 2874887 2935250
15683 2935250 2972699 2937330 2972014 2963841 2927512 2919360 2932391 2923601 2955140 2931060 2931894 2941545
15671 2941545 2857128 2881299 2836528 2936880 2948895 2865360 2959468 2909039 2867524 2841029 2786689
15660 2786689 2844038 2855876 2843679 2817620 2898444 2915904 2863738 2864432 2859941 2884466 2961218 2896130
15648 2896130 2854096 2834425 2874449 2869742 2843754 2792244 2806549 2843141 2850879 2843788 2843245 2863933
15636 2863933 2933262 2968108 2907187 2889725 2846363 2831744 2878406 2841410 2806523 2805973 2765678 2801079
15624 2801079 2840808 2871961 2882754 2845610 2840402 2945177 2897966 2899684 2892008 2915415 2899712 2933707
15612 2933707 2920389 2886387 2922611 2897856 2871372 2936249 2955249 2898130 2811693 2856127 2901320
15601 2901320 2845145 2846168 2887687 2864596 2916644 2872764 2833704 2879343 2877647 2908365 2898641 2924660
15589 2924660 2870316 2895530 2890686 2863328 2889319 2870321 2851468 2892427 2915930 2960755 2920600
15578 2920600 2858414 2928525 3013085 2996184 2947014 2904378 2964103 2934385 2873451 2879408 2841082
15567 2841082 2922954 2968606 2872793 2843611 2913414 2829690 2889453 2920405 2944885 2919054 2969885
15556 2969885 2995345 2953508 2943345 2958163 2949333 2917053 2885618 2907726 2945375 2937063 2911642 2869495
15544 2869495 2950171 3034341 2990717 2928156 2958572 2961415 2919545 2916535 2994980 2985743 2976309 2959680
15532 2959680 2950589 2916111 2901454 2929769 2924131 2887067 2897686 2895485 2871722 2849175 2923631 2951250
15520 2951250 2885618 2896426 2916751 2871928 2910465 2930765 2926445 2904254 2894855 2885886 2924529 2867733
15508 2867733 2882031 2886138 2927966 2925851 2921676 2912267 2892069 2880666 2985899 2968940 2876130 2938119
15496 2938119 2894505 2911745 2930984 2964510 2927123 2911175 2954821 2943030 2920779 2912736 2874308
15485 2874308 2883336 2912565 2919208 2895331 2888045 2863131 2863683 2814956 2793919 2839773 2930202 2900157
15473 2900157 2893365 2828316 2857386 2929786 2948804 2892517 2915639 2939889 2885482 2902254 2925224
15462 2925224 2947983 2914394 2915766 2970358 2929850 2980616 3033298 2996670 2994634 2989781 2929945 2907520
15450 2907520 3014510 2968543 2932206 2908188 2944653 2903577 2941325 2949261 3004411 2961381 2966376
15439 2966376 2937614 2902821 2973154 2969323 2972566 2920942 2949910 2934096 2958862 2961509 2961704 2948893
15427 2948893 2951476 2959916 2964780 2971373 2967411 2960400 2980616 2988905 3018324 3044465 2974986 2956462 3018334
15414 3018334 2963982 2934441 2949824 2958166 2954421 2965444 3023842 2990528 3005638 3052450 3042020 2995384
15402 2995384 2986986 3009319 3018855 2994380 2968825 2935830 2950863 3033209 3007310 2991413 2972486 2917700
15390 2917700 2916461 2898429 2908593 2902601 2928451 2895504 2917428 2889758 2915423 2972034 2941328 2930800
15378 2930800 2898570 2968981 3039552 3029749 3013761 2947304 2931920 3016901 2969688 2951212 3049788
15367 3049788 3050599 2966390 2896909 2906495 2985237 2976898 3017435 2966182 2960980 2948992 2964325 3084271
15355 3084271 3092029 2975518 2990962 3012204 3029665 2990389 2945698 2974435 2905792 2948578 2905465
15344 2905465 2892896 2896885 2927368 2923284 2921634 2948850 2977848 2972727 3008676 2976546 2933829 2948889
15332 2948889 2882867 2961319 2984440 2972937 2979100 2937879 2951947 3018975 2976659 2927460 2935676 2939243
15320 2939243 2869100 2965183 2955548 2939485 2938606 2872787 2930403 2902114 2913299 2981231 2977568 3041448
15308 3041448 3014674 3014141 3055131 2987446 3002011 3030820 3005374 3014643 3075637 3050834 2954996 2984147
15296 2984147 3052028 3052449 3008415 2925092 2969378 2951653 2976157 3010825 2954984 2938348 2944889 2957408
15284 2957408 2983282 3016256 3038507 2991452 2938867 2939268 2962129 2959341 2981120 2979315 3028570 3006407
15272 3006407 2960869 2940768 2968206 3005942 2985644 2954229 2945393 2967690 2953506 3017787 3011011 3010815
15260 3010815 3035897 3042763 3006798 2937518 2966818 3012849 3003349 3026625 3021290 3014872 2995570 3028232
15248 3028232 3036841 2991969 3045332 3022730 2977336 3004445 3017561 3028572 3034385 3022771 2999385 2971639
15236 2971639 2965895 3055927 3071663 2994444 3013669 2991668 2960784 2967175 2935739 2993777 3060975 3036662
15224 3036662 3038447 3041767 3031803 2952400 2973501 2939151 2922324 2966731 3004703 2996787 3054457 3049819
15212 3049819 2995450 2985441 3044013 3118064 3068988 3067549 3103230 3056276 3001179 2982879 3062763
15201 3062763 3119647 3084934 3052860 2993333 3001567 3032248 3000025 3023212 3109229 3070670 3096015
15190 3096015 3092005 3060258 3060629 3054226 3011293 3017486 3037512 3001247 3013738 3055966 2981161 2993559
15178 2993559 3081870 3045454 3044877 3062997 3007883 2952092 2948818 2937206 2953891 2994135 3035210 3090842
15166 3090842 3061755 3021961 3041578 3029825 3099601 3064331 2976564 2943636 3005438 3052880 3056728
15155 3056728 3071594 3048858 3029085 3054137 3041478 3065582 3087571 3026568 3002057 3035689 3043255
15144 3043255 3078767 3049520 3006627 3012421 3038587 3108572 3056120 3025762 3021504 3066440 3043366 3072046
15132 3072046 3083980 3052892 3007079 3038157 3086931 3011255 3078908 3098845 3060336 3089305 3003694
15121 3003694 2971074 3003942 3073870 3020921 3083314 2996070 2991360 3021037 3062045 3075864 3093946
15110 3093946 3092739 3039255 3056409 3081728 3136375 3127122 3156680 3074590 3075270 3080020 3073632 3069223 3123942
15097 3123942 3119564 3099794 3067777 3021472 3009509 2964623 2981841 3004342 2992732 3048596 3102675
15086 3102675 3083664 3054250 3027980 3111964 3090522 3070072 3092755 3052150 3065590 3100928 3087405
15075 3087405 3112179 3154373 3075496 3054606 3058791 3040789 3032480 3106451 3080451 3028339 3045057 3031217
15063 3031217 3101262 3125125 3123751 3097952 3041115 3033459 3083182 3109003 3190165 3177483 3070724
15052 3070724 3015038 2981776 3084923 3055701 3072127 3102494 3159776 3091826 3072138 3060853 3092224
15041 3092224 3122927 3051564 3091120 3102535 3092875 3078846 3078713 3037496 3088791 3115745 3092767 3153174
15029 3153174 3084811 3050216 3126630 3144680 3014228 2991685 3071002 3047164 3052287 3121952 3143873
15018 3143873 3087081 2966007 2981325 3044407 3103365 3065278 3078614 3043731 3057916 3132258 3159950
15007 3159950 3162366 3083592 3078435 3109025 3174650 3093804 3063265 3052532 3089587 3121276 3086833 3091733
14995 3091733 3100692 3096900 3053738 3053204 3095712 3100382 3127330 3071009 3101621 3131028 3100489 3034327
14983 3034327 3028134 3076933 3130381 3103790 3106976 3123002 3140259 3131704 3092408 3066723 3023186 3087211
14971 3087211 3053803 3056814 3114695 3080642 3007046 3068583 3119995 3104443 3091479 3128393 3123181 3043560
14959 3043560 3013143 3023676 3088177 3128846 3097302 3125824 3127866 3108893 3112100 3091938 3082597 3031546
14947 3031546 2995885 3037300 3096030 3110344 3030123 3028991 3040368 3100526 3134389 3081594 3087501 3043320
14935 3043320 3065935 3084077 3119664 3082603 3117336 3125071 3068815 3056273 2993136 3021871 3097247
14924 3097247 3160538 3148006 3119668 3118034 3059525 3100625 3098195 3084195 3132662 3148700 3047806
14913 3047806 3022661 3075363 3095592 3092358 3037655 3002277 3045495 3099188 3074786 3080445 3168262 3139486
14901 3139486 3144312 3099734 3062749 3081727 3110730 3104686 3050401 3089116 3097934 3136780 3083694 3119088
14889 3119088 3148452 3185482 3158437 3136858 3152305 3139898 3191892 3131137 3154553 3156082 3149228 3170112
14877 3170112 3129292 3092330 3124343 3137660 3133322 3115205 3089592 3099240 3107382 3127487 3111368 3105351
14865 3105351 3112464 3108731 3070029 3122495 3136702 3090931 3089238 3109733 3216073 3187888 3203287 3170625
14853 3170625 3158064 3171002 3145112 3179083 3164415 3105440 3098342 3080824 3070349 3100941 3158452
14842 3158452 3157147 3110955 3146730 3081958 3085890 3057076 3063736 3146523 3132825 3058281 3107008 3145548
14830 3145548 3147052 3128599 3095996 3122708 3080282 3081151 3127469 3163015 3186315 3123537 3076405 3081403
14818 3081403 3106509 3064567 3111731 3089687 3121002 3087877 3056098 3044283 3048029 3057170 3094351 3070036
14806 3070036 3093877 3103032 3110195 3068053 3091107 3133770 3209913 3175115 3074966 3109272 3113680 3163376
14794 3163376 3131973 3125335 3100387 3118739 3160824 3159131 3139933 3196315 3207634 3192473 3170634 3178706
14782 3178706 3200419 3156788 3147167 3151533 3155610 3176530 3192751 3165237 3181032 3235146 3151287 3109258
14770 3109258 3100784 3120507 3128588 3202622 3171519 3178342 3196379 3191622 3164352 3150751 3133929 3143777
14758 3143777 3104284 3081191 3067253 3122645 3147397 3133928 3172107 3197509 3230082 3218885 3163365
14747 3163365 3213718 3182201 3206332 3208316 3193066 3238664 3248976 3278340 3230994 3195655 3204022 3167158
14735 3167158 3137202 3182877 3186512 3144558 3107178 3129347 3090373 3115904 3148518 3160867 3164595 3201008
14723 3201008 3247698 3210603 3226929 3219386 3133029 3142189 3192873 3212484 3197330 3179938 3238249 3289711
14711 3289711 3295258 3231828 3198687 3209056 3167176 3199254 3206854 3197448 3188226 3228760 3181668 3162627
14699 3162627 3187718 3157335 3136657 3203371 3161623 3180983 3158715 3138811 3130406 3159156 3193376
14688 3193376 3191272 3209086 3214325 3186774 3174786 3144381 3130910 3186884 3279725 3320171 3236370 3179686
14676 3179686 3184230 3228023 3181282 3198561 3230377 3171998 3108350 3169389 3210417 3204608 3200718 3282210
14664 3282210 3247101 3160268 3172400 3198002 3188865 3228427 3260364 3167899 3116907 3174414 3194809
14653 3194809 3211971 3179526 3143592 3183546 3267269 3230109 3176207 3193964 3204901 3172857 3188975
14642 3188975 3191234 3123803 3133250 3210663 3237025 3194876 3155727 3213784 3255390 3250175 3197439 3186029
14630 3186029 3203079 3174018 3248521 3308416 3291114 3189983 3168261 3178355 3180694 3202720 3223629
14619 3223629 3196739 3234862 3248458 3143772 3178184 3314687 3268806 3250381 3285369 3299484 3264220
14608 3264220 3214117 3183920 3203625 3216381 3247649 3197735 3181697 3150799 3083465 3114451 3089353
14597 3089353 3161025 3130692 3226788 3252443 3182872 3166181 3198222 3203903 3260589 3206599 3149182
14586 3149182 3253178 3255269 3263808 3265494 3270522 3185121 3144749 3165495 3217957 3227599 3198129 3240961
14574 3240961 3209502 3198749 3223183 3183766 3264833 3234210 3203920 3166305 3186904 3268346 3284887
14563 3284887 3339431 3297050 3248911 3187272 3175658 3227700 3267625 3275596 3290306 3245763 3230941
14552 3230941 3203929 3125863 3133698 3153992 3122581 3193976 3198743 3199144 3211567 3176165 3234471 3263274
14540 3263274 3213898 3225612 3274146 3176697 3238588 3243593 3254178 3301027 3232946 3240104 3184037 3203985
14528 3203985 3202807 3138389 3190773 3220976 3278349 3238246 3259731 3253983 3290867 3291441 3245124 3201291
14516 3201291 3203446 3204591 3181935 3239148 3247316 3207943 3251992 3269625 3190597 3174970 3155661 3169498
14504 3169498 3195401 3201616 3238770 3317615 3293811 3278764 3248243 3284534 3299098 3216704 3229777
14493 3229777 3248200 3224378 3234931 3206157 3160583 3192465 3232243 3209342 3234175 3269835 3308446
14482 3308446 3275077 3266167 3251407 3233448 3272813 3262755 3287863 3238936 3270915 3253709 3221404
14471 3221404 3243931 3187379 3227481 3271270 3313855 3273789 3189072 3141950 3130394 3115814 3195608
14460 3195608 3247060 3284978 3339261 3322506 3242398 3249389 3247950 3198454 3240201 3328485 3287951 3272307
14448 3272307 3280967 3274252 3249993 3271862 3295028 3272204 3292694 3314321 3308327 3293040 3270272 3261516
14436 3261516 3249140 3260000 3334236 3299256 3324345 3296530 3325009 3385953 3385612 3362335 3353122 3399974
14424 3399974 3411780 3293646 3296725 3265118 3274950 3345793 3314082 3348495 3343558 3294701 3321105 3279821
14412 3279821 3239444 3291659 3314226 3331260 3355917 3343597 3328071 3258379 3163264 3228205 3257276
14401 3257276 3260984 3231876 3210985 3182915 3212827 3329983 3335989 3358412 3248820 3206740 3262879
14390 3262879 3276909 3303672 3295952 3286116 3235335 3224093 3257533 3294945 3358853 3285290 3254063 3314672
14378 3314672 3277478 3298541 3279334 3270618 3298250 3310832 3314708 3358565 3373270 3378340 3373265 3307381
14366 3307381 3277277 3253779 3269633 3320331 3309459 3317594 3321680 3295494 3332870 3353557 3320816 3312411
14354 3312411 3280429 3318387 3347561 3334980 3280030 3255023 3332025 3303597 3308491 3291745 3294691 3376725
14342 3376725 3339238 3302423 3291382 3288488 3316223 3311425 3295763 3301967 3333607 3318689 3326926 3313567
14330 3313567 3370508 3399624 3343903 3343139 3277655 3225864 3265063 3270926 3219732 3259460 3303136 3263181
14318 3263181 3269956 3274301 3261032 3294348 3381680 3384267 3327816 3391149 3379203 3344259 3319545 3307239
14306 3307239 3338240 3385437 3341598 3300067 3298790 3297070 3339335 3333557 3288580 3305427 3287684 3331277
14294 3331277 3361417 3339501 3370329 3328239 3324862 3260819 3237151 3258627 3368898 3337178 3319742
14283 3319742 3319215 3377478 3412217 3339846 3332401 3358898 3333284 3314659 3314246 3320082 3330534 3314065
14271 3314065 3316247 3336782 3360176 3325968 3307001 3346016 3403400 3432731 3376140 3291318 3311331
14260 3311331 3366832 3366187 3310108 3297126 3360941 3315310 3306727 3378994 3340880 3351605 3391994 3367189
14248 3367189 3265035 3289830 3247076 3327374 3315790 3332746 3346882 3313735 3345608 3416279 3396020
14237 3396020 3279892 3255737 3298737 3291578 3309823 3354419 3352336 3384879 3353121 3379689 3420052
14226 3420052 3456805 3333921 3348811 3382756 3417968 3458896 3415016 3366903 3273601 3359299 3406717
14215 3406717 3422494 3441216 3366280 3330810 3346493 3345812 3327661 3411147 3374241 3392905 3367275 3341466
14203 3341466 3346553 3341358 3361038 3415451 3410280 3321886 3238524 3304593 3373119 3385091 3372600 3312943
14191 3312943 3330224 3290718 3355823 3391274 3399180 3376654 3312232 3309368 3338504 3380973 3438050 3407262
14179 3407262 3289041 3269961 3352470 3393036 3389022 3341435 3409515 3386784 3389072 3432612 3391738
14168 3391738 3328178 3374893 3399079 3433933 3455634 3406791 3437496 3441439 3409879 3402592 3389447 3460244
14156 3460244 3516249 3495711 3385374 3437793 3471477 3473274 3449417 3365489 3401778 3422348 3362066
14145 3362066 3345522 3352139 3358822 3351895 3367743 3437887 3407893 3327214 3295910 3351153 3392033 3431401
14133 3431401 3425393 3425062 3414301 3383952 3402834 3439608 3418585 3492927 3487919 3420588 3391725 3390920
14121 3390920 3433169 3463769 3473454 3500696 3426360 3392222 3390837 3419652 3396068 3422150 3426585 3430030
14109 3430030 3437580 3389794 3379078 3432860 3408862 3424024 3408050 3375022 3352190 3351567 3390684 3439582
14097 3439582 3428307 3351126 3394805 3457093 3506824 3481321 3463912 3471411 3484773 3394909 3392242 3415273
14085 3415273 3466740 3456524 3467658 3495687 3472081 3423614 3453153 3465259 3458930 3474873 3427194
14074 3427194 3412877 3417355 3483135 3445996 3368103 3421500 3507730 3488475 3414554 3423981 3417045 3374244
14062 3374244 3383427 3419636 3446629 3380225 3402814 3412105 3356593 3354095 3418184 3405424 3388015 3399009
14050 3399009 3431617 3392074 3441393 3468653 3432991 3387895 3404148 3405891 3375018 3384096 3454435 3521623
14038 3521623 3511630 3483196 3414837 3393436 3438569 3363272 3372876 3322590 3308004 3368057 3422294 3456256
14026 3456256 3419467 3383013 3375819 3451010 3412060 3411485 3416444 3500608 3474180 3417113 3398474 3464955
14014 3464955 3543276 3499087 3458888 3388333 3372355 3402592 3374731 3382644 3378071 3455167 3465122 3455169
14002 3455169 3378672 3376419 3414772 3423242 3404378 3351307 3413586 3458946 3465082 3409782 3372270 3434671
13990 3434671 3385585 3424279 3369164 3358604 3398995 3415136 3432712 3450836 3472545 3421678 3435101
13979 3435101 3450856 3448242 3489475 3475276 3477946 3469282 3497208 3472865 3500561 3515772 3442724 3438126
13967 3438126 3409818 3481698 3567806 3502757 3439044 3490599 3484554 3490655 3602955 3535582 3404308
13956 3404308 3430618 3430274 3417582 3458072 3520452 3548035 3503374 3443082 3484891 3473096 3417249 3460351
13944 3460351 3518144 3463351 3430075 3455015 3452827 3431232 3447509 3435115 3469196 3500286 3483145
13933 3483145 3477273 3487010 3492235 3424470 3448923 3478559 3529357 3503624 3484333 3475455 3437468 3465442
13921 3465442 3428583 3473249 3488628 3501249 3544488 3562382 3530708 3423411 3468539 3463396 3490318
$$ [...]
##END NTUPLES=NMR SPECTRUM
##END=
