##TITLE=1H_DE-80H_X3
 200.13MHz, d2o
 8 sc
 
 19ns.26.2.2025
##JCAMPDX= 6.0         $$ Bruker NMR JCAMP-DX V2.0
##DATA TYPE= NMR SPECTRUM
##DATA CLASS= NTUPLES
##ORIGIN= UXNMR, Bruker Analytische Messtechnik GmbH
##OWNER= pz
$$ XWIN-NMR		Version 3.5
$$ Tue Mar 24 13:40:57 2026 Russian Standard Time (UT+4h)  Yarkov@DPX200
##.OBSERVE FREQUENCY= 200.1313
##.OBSERVE NUCLEUS= ^1H
##.ACQUISITION MODE= SIMULTANEOUS
##.ACQUISITION SCHEME= undefined
##.AVERAGES= 8
##.DIGITISER RES= 18
##SPECTROMETER/DATA SYSTEM= spect
##.PULSE SEQUENCE= zg30
##.SOLVENT NAME= CDCl3
##.SHIFT REFERENCE= (INTERNAL, CDCl3, 0, 15.4461)
##AUDIT TRAIL= $$ (NUMBER, WHEN, WHO, WHERE, WHAT)
$$ ##TITLE= Audit trail, XWIN-NMR		Version 3.5
$$ ##JCAMPDX= 5.01
$$ ##ORIGIN= Bruker BioSpin GmbH
$$ ##OWNER= Yarkov
$$ C:/Bruker/XWIN-NMR/data/yarkov2/nmr/H-C/1/pdata/1/auditp.txt
$$ ##AUDIT TRAIL=  $$ (NUMBER, WHEN, WHO, WHERE, WHAT)
(   1,<2026-03-24 13:40:05.60 +0400>,<Yarkov>,<DPX200>,
      <created by zg, POWCHK disabled, PULCHK disabled
       configuration hash MD5:
       00 E9 B6 7A A2 85 ED C7 34 08 36 98 17 FE 4E 26
       data hash MD5: 16K
       B9 18 F6 F9 4C 6E F8 B3 30 38 DC 24 1D 38 90 96>)
(   2,<2026-03-24 13:40:09.23 +0400>,<Yarkov>,<DPX200>,
      <Start of raw data processing
       efp BC_mod = 2 LB = 0.25 FT_mod = 6 PKNL = 1 PHC0 = -5299.148 PHC1 = 6.821927 SI = 16K 
       data hash MD5: 16K
       2A 1F 85 E3 F9 1A B9 B9 5B E9 51 2A B2 24 28 4C>)
(   3,<2026-03-24 13:40:13.51 +0400>,<Yarkov>,<DPX200>,
      <abs ABSG = 5 
       data hash MD5: 16K
       B2 F6 FF 97 20 DC B8 26 7B 55 95 51 73 D7 EA 8C>)
$$ ##END=
$$ 
$$ hash MD5
$$ B4 8D 7A 74 F1 04 BE 1E 6C B0 23 8C 1A FA BA 8C
##$RELAX= 
##$RELAX= 
##$RELAX= 
##$RELAX= 
##$RELAX= 
##$RELAX= 
$$ Bruker specific parameters
$$ --------------------------
##$DU= <C:/Bruker/XWIN-NMR>
##$EXPNO= 1
##$NAME= <H-C>
##$PROCNO= 1
##$TYPE= <nmr>
##$USER= <yarkov2>
##$AMP= (0..31)
100 100 100 100 100 100 100 100 100 100 100 100 100 100 100 100 100 100 
100 100 100 100 100 100 100 100 100 100 100 100 100 100 
##$AQSEQ= 0
##$AQ_mod= 1
##$AUNM= <au_zg>
##$AUTOPOS= <>
##$BF1= 200.13
##$BF2= 200.13
##$BF3= 200.13
##$BF4= 200.13
##$BF5= 200.13
##$BF6= 200.13
##$BF7= 200.13
##$BF8= 200.13
##$BYTORDA= 1
##$CFDGTYP= 0
##$CFRGTYP= 5
##$CHEMSTR= <none>
##$CNST= (0..31)
1 1 145 1 1 1 1 1 1 1 1 1 1 1 1 1 1 1 1 1 1 1 1 1 1 1 1 1 1 1 1 1 
##$CPDPRG= <>
##$CPDPRG1= <>
##$CPDPRG2= <>
##$CPDPRG3= <>
##$CPDPRG4= <mlev>
##$CPDPRG5= <mlev>
##$CPDPRG6= <mlev>
##$CPDPRG7= <mlev>
##$CPDPRG8= <mlev>
##$CPDPRGB= <>
##$CPDPRGT= <>
##$D= (0..31)
0 0.7 0 0 0 0 0 0 0 0 0 0.03 0 0 0 0 0 0 0 0 0 0 0 0 0 0 0 0 0 0 0 0 
##$DATE= 1774345205
##$DBL= (0..7)
120 120 120 120 120 120 120 120 
##$DBP= (0..7)
150 150 150 150 150 150 150 150 
##$DBP07= 0
##$DBPNAM0= <>
##$DBPNAM1= <>
##$DBPNAM2= <>
##$DBPNAM3= <>
##$DBPNAM4= <>
##$DBPNAM5= <>
##$DBPNAM6= <>
##$DBPNAM7= <>
##$DBPOAL= (0..7)
0.5 0.5 0.5 0.5 0.5 0.5 0.5 0.5 
##$DBPOFFS= (0..7)
0 0 0 0 0 0 0 0 
##$DE= 6
$$ [...]
##$SUBNAM3= <"">
##$SUBNAM4= <"">
##$SUBNAM5= <"">
##$SUBNAM6= <"">
##$SUBNAM7= <"">
##$SUBNAM8= <"">
##$SUBNAM9= <"">
##$SW= 18.0517328524113
##$SWIBOX= (0..15)
0 0 2 0 0 0 0 0 0 0 0 0 0 0 0 0 
##$SW_h= 3612.71676300578
##$TD= 16384
##$TD0= 1
##$TE= 0
##$TE2= 300
##$TE3= 300
##$TEG= 300
##$TL= (0..7)
0 120 120 120 120 120 120 120 
##$TP= (0..7)
150 150 150 150 150 150 150 150 
##$TP07= 0
##$TPNAME0= <>
##$TPNAME1= <>
##$TPNAME2= <>
##$TPNAME3= <>
##$TPNAME4= <>
##$TPNAME5= <>
##$TPNAME6= <>
##$TPNAME7= <>
##$TPOAL= (0..7)
0.5 0.5 0.5 0.5 0.5 0.5 0.5 0.5 
##$TPOFFS= (0..7)
0 0 0 0 0 0 0 0 
##$TUNHIN= 0
##$TUNHOUT= 0
##$TUNXOUT= 0
##$USERA1= <user>
##$USERA2= <user>
##$USERA3= <user>
##$USERA4= <user>
##$USERA5= <user>
##$V9= 5
##$VALIST= <valist>
##$VCLIST= <CCCCCCCCCCCCCCC>
##$VD= 0
##$VDLIST= <DDDDDDDDDDDDDDD>
##$VPLIST= <PPPPPPPPPPPPPPP>
##$VTLIST= <TTTTTTTTTTTTTTT>
##$WBST= 1024
##$WBSW= 4
##$XGAIN= (0..3)
0 0 0 0 
##$XL= 0
##$YL= 0
##$YMAX_a= 494994
##$YMIN_a= -454404
##$ZGOPTNS= <>
##$ZL1= 120
##$ZL2= 120
##$ZL3= 120
##$ZL4= 120
##$ABSF1= 15.4461
##$ABSF2= -2.605749
##$ABSG= 5
##$ABSL= 3
##$ALPHA= 0
##$AQORDER= 0
##$ASSFAC= 0
##$ASSFACI= 0
##$ASSFACX= 0
##$ASSWID= 0
##$AUNMP= <proc_1d>
##$AZFE= 0.1
##$AZFW= 0.1
##$BCFW= 0
##$BC_mod= 2
##$BYTORDP= 0
##$COROFFS= 0
##$CY= -3
##$DATMOD= 1
##$DC= 0
##$DFILT= <>
##$DTYPP= 0
##$F1P= 0
##$F2P= 0
##$FCOR= 1
##$FTSIZE= 16384
##$FT_mod= 6
##$GAMMA= 0
##$GB= 0
##$INTBC= 1
##$INTSCL= 3.241238e-09
##$ISEN= 128
##$LB= 0.25
##$LEV0= 0
##$LPBIN= 0
##$MAXI= 10000
##$MC2= 0
##$MEAN= 0
##$ME_mod= 0
##$MI= 1.114404
##$NCOEF= 0
##$NC_proc= -6
##$NLEV= 6
##$NOISF1= 3.799351
##$NOISF2= 2.8
##$NSP= 0
##$NTH_PI= 0
##$NZP= 0
##$OFFSET= 15.4461
##$PC= 1
##$PHC0= -5299.148
##$PHC1= 6.821927
##$PH_mod= 1
##$PKNL= yes
##$PPARMOD= 0
##$PSCAL= 0
##$PSIGN= 0
##$REVERSE= no
##$SF= 200.130015131073
##$SI= 16384
##$SIGF1= 3
##$SIGF2= 2
##$SINO= 0.751879
##$SIOLD= 32768
##$SREGLST= <19F.Aceton>
##$SSB= 0
##$STSI= 16384
##$STSR= 0
##$SW_p= 3612.71676300578
##$SYMM= 0
##$S_DEV= 0
##$TDeff= 16384
##$TDoff= 0
##$TI= <>
##$TILT= no
##$TM1= 0
##$TM2= 0
##$TOPLEV= 0
##$USERP1= <user>
##$USERP2= <user>
##$USERP3= <user>
##$USERP4= <user>
##$USERP5= <user>
##$WDW= 1
##$XDIM= 16384
##$YMAX_p= 431591796
##$YMIN_p= -218579
$$ End of Bruker specific parameters
$$ ---------------------------------
##NTUPLES= NMR SPECTRUM
##VAR_NAME=  FREQUENCY,     SPECTRUM/REAL,   SPECTRUM/IMAG
##SYMBOL=    X,             R,               I
##VAR_TYPE=  INDEPENDENT,   DEPENDENT,       DEPENDENT
##VAR_FORM=  AFFN,          ASDF,            ASDF
##VAR_DIM=   16384,         16384,           16384
##UNITS=     HZ,            ARBITRARY UNITS, ARBITRARY UNITS
##FACTOR=    0.220516191357247, 1,           1
##FIRST=     3091.22827374369, 0,            0
##LAST=      -521.488489262091, 0,           0
##MIN=       -521.488489262091, -218579,     0
##MAX=       3091.22827374369, 431591796,    0
$$ Real data points
##PAGE= N=1
##DATA TABLE= (X++(R..R)), XYDATA
$$ [...]
$$ plain form
5995 63249727 57222351 51578296 46331008 41522984 37110779 33243457 29715238 26497270
5987 26497270 23736689 21420742 19409827 17662612 16188290 14926544 13885245 12976076
5979 12976076 12293350 11628103 11076262 10608872 10226363 9873351 9558043 9302849 9128825
5970 9128825 8907077 8777721 8694839 8613390 8549434 8618146 8685102 8691665 8820489 8940435 9027526
5959 9027526 9108099 9388234 9641369 9855214 10099390 10414671 10735454 11041370 11306891 11668009
5949 11668009 12047342 12366863 12744692 13156480 13605014 14064837 14549752 15048629 15561770
5940 15561770 16011987 16472864 16867792 17314799 17762090 18102081 18538480 18907987 19239093
5931 19239093 19509129 19825271 20172897 20486393 20853207 21237432 21615358 22020479 22501245
$$ packed form
5995F3249727o027376n644055n247288m808024m412205l867322l528219l217968
5987B6497270k760581k315947k010915j747215j474322j261746j041299r09169
5979A2976076o82726o65247n51841m67390l82509l53012l15308k55194j74024
5970I128825k21748j29356q2882q1449o3956O8712O6956O563J28824J19946Q7091
5959I027526Q0573K80135K53135K13845K44176L15281L20783L05916K65521L61118
5949A1668009L79333L19521L77829M11788M48534M59823M84915M98877N13141
5940A5561770M50217M60877L94928M47007M47291L39991M36399L69507L31106
5931A9239093K70036L16142L47626L13496L66814L84225L77926M05121M80766
$$ plain form
5922 22501245 23045471 23486016 23921112 24401481 24745310 25185502 25607785 25948157 26214946
5913 26214946 26447967 26711663 26855836 27077370 27282497 27513782 27766714 28087565 28340523
5904 28340523 28552406 28792687 29003905 29208798 29382575 29436651 29574724 29689173 29757196 29769381
5894 29769381 29742356 29669355 29490889 29299609 29109099 28874898 28691520 28526139 28342296 28124363
5884 28124363 27916625 27657123 27484089 27393268 27226396 27038118 26826041 26532960 26234567 25986107
5874 25986107 25630372 25256304 24816024 24394990 23891228 23411844 22860119 22358160 21939884
5865 21939884 21382849 20773923 20213784 19634371 19179371 18642151 18124832 17659763 17163635
5856 17163635 16686551 16232913 15754315 15278086 14762078 14334333 13791686 13240382 12730155
$$ packed form
5922B2501245N44226M40545M35096M80369L43829M40192M22283L40372K66789
5913B6214946K33021K63696J44173K21534K05127K31285K52932L20851K52958
5904B8340523K11883K40281K11218K04893J73777N4076J38073J14449O8023J2185
5894B9769381k7025p3001j78466j91280j90510k34201j83378j65381j83843k17933
5884B8124363k07738k59502j73034r0821j66872j88278k12077k93081k98393k48460
5874B5986107l55735l74068m40280m21034n03762m79384n51725n01959m18276
5865B1939884n57035o08926n60139n79413m55000n37220n17319m65069m96128
5856A7163635m77084m53638m78598m76229n16008m27745n42647n51304n10227
$$ plain form
5847 12730155 12193786 11773716 11324337 10844959 10394210 10008029 9520690 9057629 8665862
5838 8665862 8429606 8165150 7866673 7527943 7301911 7001617 6771154 6515302 6198247 5967027
5828 5967027 5685425 5509756 5254264 4976478 4771956 4583951 4300207 4104810 3916544 3733857
5818 3733857 3621904 3524277 3380812 3243572 3113581 2979803 2986482 2934564 2889565 2731660
5808 2731660 2635989 2621158 2539972 2535843 2465226 2483304 2494920 2440066 2412661 2397021 2377577 2318829
5796 2318829 2294944 2325274 2309074 2265674 2275451 2310813 2253457 2177807 2199212 2148541 2184141 2237984
5784 2237984 2216606 2214118 2183274 2190979 2171136 2163858 2124147 2119914 2167516 2215951 2168548 2099858
5772 2099858 2046823 2022183 2078476 2056395 2064372 1999493 1990680 2053945 2057158 2030497 1993851 2014955
$$ packed form
5847A2730155n36369m20070m49379m79378m50749l86181m87339m63061l91767
5838H665862k36256k64456k98477l38730k26032l00294k30463k55852l17055k31220
5828E967027k81602j75669k55492k77786k04522j88005k83744j95397j88266j82687
5818C733857j11953r7627j43465j37240j29991j33778O679n1918m4999j57905
5808B731660r5671j4831q1186m129p0617J8078J1616n4854k7405j5640j9444n8748
5796B318829k3885L0330j6200m3400R777L5362n7356p5650K1405n0671L5600N3843
5784B237984k1378k488l0844P705j9843p278l9711m233M7602M8435m7403o8690
5772B099858n3035k4640N6293k2081P977o4879q813O3265L213k6661l6646K1104
$$ plain form
5760 2014955 2032327 2032113 2031375 2017632 2066782 2079257 2047787 2077870 2063460 2067059 2041641 2041071 1949379
5747 1949379 1951742 1994941 2009594 2049011 2056959 2087916 2089419 2042266 2030032 2165309 2196053 2158151
5735 2158151 2156031 2230058 2211323 2242142 2268160 2292241 2363279 2354652 2393456 2423711 2405565 2362874
5723 2362874 2411972 2436115 2435450 2458581 2494108 2533996 2527906 2519506 2495708 2532825 2551775 2508108
5711 2508108 2495970 2555033 2552621 2481666 2568005 2695475 2694420 2747169 2709376 2703895 2734503 2726360
5699 2726360 2701300 2742770 2877257 2820593 2739384 2633658 2594696 2615418 2561252 2531745 2441087
5688 2441087 2406117 2448162 2363516 2295236 2332344 2335061 2247495 2290788 2328070 2341578 2386943 2365933
5676 2365933 2448355 2422973 2416092 2456389 2451907 2513347 2468696 2510264 2526269 2513479 2486864 2424268
$$ packed form
5760B014955J7372k14p38j3743M9150J2475l1470L0083j4410L599k5418n70r1692
5747A949379K363M3199J4653L9417P948L0957J503m7153j2234J35277L0744l7902
5735B158151k120P4027j8735L0819K6018K4081P1038q627L8804L0255j8146m2691
5723B362874M9098K4143o65K3131L5527L9888o090q400k3798L7117J8950m3667
5711B508108j2138N9063k412p0955Q6339J27470j055N2749l7793n481L0608q143
5699B726360k5060M1470J34487n6664q1209j05726l8962K0722n4166k9507r0658
5688B441087l4970M2045q4646o8280L7108K717q7566M3293L7282J3508M5365k1010
5676B365933Q2422k5382o881M0297m482O1440m4651M1568J6005j2790k6615o2596
$$ plain form
5664 2424268 2449907 2485753 2393413 2281383 2220823 2149573 2139891 2107771 2074878 2043455 2041939 2008127
5652 2008127 2014540 2006463 2027907 2127072 2119345 2050003 2008419 2024167 2102437 2110129 2118754 2121241 2145513
5639 2145513 2143470 2121498 2115819 2148580 2172995 2129366 2167452 2143506 2136853 2145192 2069024 2013029
5627 2013029 2101422 2101357 2105128 2084193 2072197 2022157 2020483 2012505 2055675 2052495 2079350 2086187 2046751
5614 2046751 2029532 2030632 2022486 2008266 1971783 1948832 1944129 1921189 1992243 2002060 1990912 1960995
5602 1960995 1932007 1957600 2024487 2010099 1988269 1984764 2017416 2056579 2084659 2068502 2063507 2029034
5590 2029034 2112130 2089514 2069213 2041929 2066810 1967140 1930864 1966158 2022673 2075720 2009775
5579 2009775 2014501 2050379 2040745 2066371 2052472 2066078 2114961 2029067 2066902 2071024 2010100 1940353
$$ packed form
5664B424268K5639L5846r2340j12030o0560p1250r682l2120l2893l1423j516l3812
5652B008127O413q077K1444R9165p727o9342m1584J5748P8270P692Q625K487K4272
5639B145513k043k1972n679L2761K4415m3629L8086k3946o653Q339p6168n5995
5627B013029Q8393o5L771k0935j1996n0040j674p978M3170l180K6855O837l9436
5614B046751j7219J100q146j4220l6483k2951m703k2940P1054R817j1148k9917
5602A960995k8988K5593O6887j4388k1830l505L2652L9163K8080j6157m995l4473
5590B029034Q3096k2616k0301k7284K4881r9670l6276L5294N6515N3047o5945
5579B009775M726L5878r634K5626j3899J3606M8883q5894L7835M122o0924o9747
$$ plain form
5567 1940353 1986448 2047069 2048811 2099406 2038944 2025057 2075785 2091026 2076036 2090852 2016732 2081578
5555 2081578 2123441 2066709 2004752 2037311 2051207 2041631 2073011 2044881 1986724 2007734 2029816 1972876
5543 1972876 1936274 1910805 1958766 2017064 2042669 2026782 2064973 2051629 2024778 2027369 2037529 2022452
5531 2022452 1953108 1978911 2056602 1982644 2040087 2050346 1998537 1969543 1930982 1912586 1919193 1956962
5519 1956962 1915729 1838156 1920154 1891924 1905072 1877321 1822898 1826969 1796550 1869673 1941867 1899470
5507 1899470 1912957 1872469 1858886 1801793 1815372 1859581 1846594 1849100 1832786 1803088 1807410 1803781
5495 1803781 1833297 1864025 1865499 1779843 1844589 1934363 1933225 1922716 1839703 1782229 1800896 1787115
5483 1787115 1713656 1746548 1744799 1774506 1823528 1836701 1816973 1852680 1873364 1832625 1818634 1849593
$$ packed form
5567A940353M6095O0621J742N0595o0462j3887N0728J5241j4990J4816p4120O4846
5555B081578M1863n6732o1957L2559J3896r576L1380k8130n8157K1010K2082n6940
5543A972876l6602k5469M7961N8298K5605j5887L8191j3344k6851K591J0160j5077
5531B022452o9344K5803P7691p3958N7443J0259n1809k8994l8561j8396O607L7769
5519A956962m1233p7573Q1998k8230J3148k7751n4423M071l0419P3123P2194m2397
5507A899470J3487m0488j3583n7093J3579M4209j2987K506j6314k9698M322l629
5495A803781K9516L0728J474q5656O4746Q9774j138j0509q3013n7474J8667j3781
5483A787115p3459L2892j749K9707M9022J3173j9728L5707K0684m0739j3991L0959
$$ plain form
5471 1849593 1846487 1842801 1840389 1833916 1839165 1808037 1775090 1789426 1752481 1815743 1828978 1694137
5459 1694137 1721213 1724400 1705688 1740791 1770038 1823813 1814280 1873529 1870299 1815752 1779194 1846500
5447 1846500 1816499 1837674 1835894 1772810 1816899 1803802 1801276 1773227 1754113 1749200 1723127 1737724
5435 1737724 1712606 1705722 1705842 1716866 1695595 1711279 1707613 1690170 1734300 1711951 1623042 1631121
5423 1631121 1673968 1631836 1602819 1648448 1650086 1695098 1660456 1779057 1797872 1730958 1650489
5412 1650489 1566573 1625126 1668155 1712635 1655854 1691902 1691337 1635503 1620075 1611427 1622612 1719327
5400 1719327 1712269 1655105 1609881 1593618 1626478 1686429 1705693 1609283 1609534 1625595 1677725 1719322
5388 1719322 1628331 1589095 1662307 1667737 1669891 1663788 1587135 1603346 1670987 1602417 1650990 1642646
$$ packed form
5471A849593l106l686k412o473N249l1128l2947J4336l6945O3262J3235j34841
5459A694137K7076L187j8712L5103K9247N3775r533N9249l230n4547l6558O7306
5447A846500l0001K1175j780o3084M4089j3097k526k8049j9114m913k6073J4597
5435A737724k5118o884J20J1024k1271J5684l666j7443M4130k2349q8909Q079
5423A631121M2847m2132k9017M5629J638M5012l4642J18601J8815o6914q0469
5412A650489q3916N8553M3029M4480n6781L6048n65n5834j5428q648J1185R6715
5400A719327p058n7164m5224j6263L2860N9951J9264r6410K51J6061N2130M1597
5388A719322r0991l9236P3212N430K154o103p6653J6211O7641o8570M8573q344
$$ plain form
5376 1642646 1636106 1627281 1583761 1638563 1605240 1658318 1697499 1703606 1672515 1643894 1643903 1609815 1653262
5363 1653262 1665488 1672052 1687238 1666780 1640246 1629220 1672843 1669659 1609823 1631279 1627150 1587738
5351 1587738 1610646 1534831 1535523 1556747 1579770 1558459 1540205 1554000 1623687 1534466 1573355 1592578
5339 1592578 1596354 1539311 1581098 1601705 1620716 1609097 1553446 1572975 1584168 1554067 1508119 1548212
5327 1548212 1566938 1563824 1520183 1486368 1527157 1526575 1525803 1528827 1544142 1557307 1582292 1588635 1536800
5314 1536800 1625710 1633821 1513444 1575670 1578941 1495275 1540146 1550830 1570914 1547330 1561089 1518912
5302 1518912 1491260 1496933 1508180 1525694 1567176 1561639 1525967 1498598 1550240 1525300 1500706 1535558
5290 1535558 1516700 1481386 1426951 1413805 1438092 1468308 1452724 1445856 1418212 1452712 1445313 1422853
$$ packed form
5376A642646o540q825m3520N4802l3323N3078L9181O107l1091k8621Rl4088M3447
5363A653262J2226O564J5186k0458k6534j1026M3623l184n9836K1456m129l9412
5351A587738K2908p5815O92K1224K3023k1311j8254J3795O9687q9221L8889J9223
5339A592578L776n7043M1787K0607J9011j1619n5651J9529J1193l0101m5948M0093
5327A548212J8726l114m3641l3815M0789n82p72L024J5315J3165K4985O343n1835
5314A536800Q8910Q111j20377O2226L271q3666M4871J0684K0084k3584J3759m2177
5302A518912k7652N673J1247J7514M1482n537l5672k7369N1642k4940k4594L4852
5290A535558j8858l5314n4435j3146K4287L0216j5584o868k7644L4500p399k2460
$$ plain form
5278 1422853 1466348 1420078 1379416 1384822 1399358 1420638 1409575 1341625 1407217 1394572 1383271 1370002
5266 1370002 1404000 1361486 1384523 1399103 1390712 1307261 1244714 1316650 1402311 1425069 1371686 1361015
5254 1361015 1475439 1464912 1390839 1389857 1423214 1400874 1418446 1459661 1475147 1497693 1395217
5243 1395217 1365514 1384121 1421594 1424238 1448063 1471318 1466282 1426010 1435839 1438492 1421897 1390355
5231 1390355 1392921 1336098 1360268 1401918 1475204 1515688 1487313 1455383 1445968 1478281 1481803 1455484
5219 1455484 1425536 1427765 1444038 1413455 1379529 1314125 1321718 1317712 1289111 1330247 1314358 1325773
5207 1325773 1326542 1372611 1382386 1456854 1452394 1385893 1376648 1398647 1308869 1261812 1377074 1347221
5195 1347221 1355984 1339488 1355749 1357643 1244960 1229345 1250315 1309090 1317868 1323097 1322008 1311664
$$ packed form
5278A422853M3495m6270m0662N406J4536K1280j1063o7950O5592j2645j1301j3269
5266A370002L3998m2514K3037J4580q391q3451o2547P1936Q5661K2758n3383j0671
5254A361015J14424j0527p4073r82L3357k2340J7572M1215J5486K2546j02476
5243A395217k9703J8607L7473K644K3825K3255n036m0272R829K653j6595l1542
5231A390355K566n6823K4170M1650P3286M0484k8375l1930r415L2313L522k6319
5219A455484k9948K229J6273l0583l3926o5404P593m006k8601M1136j5889J1415
5207A325773P69M6069R775P4468m460o6501r245K1999q9778m7057J15262k9853
5195A347221Q763j6496J6261J894j12683j5615K0970N8775Q778N229j089j0344
$$ plain form
5183 1311664 1357209 1338175 1371244 1349940 1277695 1283773 1344697 1363716 1393501 1338768 1356190 1404075
5171 1404075 1407084 1304432 1303302 1337475 1377354 1464523 1491804 1515581 1544288 1511307 1498194 1547534
5159 1547534 1533525 1582000 1577671 1581675 1618232 1592896 1575779 1617228 1626237 1649412 1635182 1660023
5147 1660023 1730868 1699630 1679577 1751109 1763849 1735940 1770835 1720291 1689307 1652543 1619663
5136 1619663 1630687 1716975 1772853 1806217 1761063 1724415 1741026 1694449 1706223 1681478 1676154 1658211
5124 1658211 1629612 1591470 1667601 1657922 1606035 1562154 1575997 1631880 1642538 1533461 1535467 1602088
5112 1602088 1542619 1595654 1583195 1635813 1611652 1549451 1598253 1601614 1543452 1583229 1599479 1579851
5100 1579851 1575406 1595191 1656494 1769767 1790052 1688239 1709088 1752002 1836324 1838877 1796222
$$ packed form
5183A311664M5545j9034L3069k1304p2245O078O0924J9019K9785n4733J7422M7885
5171A404075L009j02652j130L4173L9879Q7169K7281K3777K8707l2981j3113M9340
5159A547534j4009M8475m329M004L6557k5336j7117M1449R009K3175j4230K4841
5147A660023P0845l1238k0053P1532J2740k7909L4895n0544l0984l6764l2880
5136A619663J1024Q6288N5878L3364m5154l6648J6611m6577J1774k4745n324j7943
5124A658211k8599l8142P6131r679n1887m3881J3843N5883J0658j09077K006O6621
5112A602088n9469N3035j2459N2618k4161o2201M8802L361n8162L9777J6250j9628
5100A579851m445J9785O1303J13273K0285j01813K0849M2914Q4322K553m2655
$$ plain form
5089 1796222 1813465 1793586 1783494 1879597 1841641 1851196 1864473 1835553 1814435 1854933 1836592 1839000
5077 1839000 1843108 1803757 1836462 1858442 1846125 1858049 1902203 1924064 1942575 1918658 1915499 1951892
5065 1951892 1925849 1967831 1996968 2050417 2009627 1994784 2073212 2084413 2048512 2036615 2028094 1999110
5053 1999110 1933441 1913563 1963437 1965319 1934711 1964842 1935147 1903737 1925928 1906329 1931858 1935394
5041 1935394 1923103 1893531 1928655 1934354 1953286 1936702 1865829 1901626 1932829 1875235 1868901 1825944
5029 1825944 1799264 1793021 1856964 1905345 1889814 1757985 1802776 1799650 1793407 1747656 1746652 1793534
5017 1793534 1737383 1701399 1652924 1720741 1780428 1771048 1751961 1737656 1846537 1823802 1803909
5006 1803909 1741053 1768760 1833034 1868064 1808834 1766386 1798742 1793848 1881161 1832564 1887761 1971618
$$ packed form
5089A796222J7243j9879j0092R6103l7956R555J3277k8920k1118M0498j8341K408
5077A839000M108l9351L2705K1980j2317J1924M4154K1861J8511k3917l159L6393
5065A951892k6043M1982K9137N3449m0790j4843P8428J1201l5901j1897q521k8984
5053A999110o5669j9878M9874J882l0608L0131k9695l1410K2191j9599K5529L536
5041A935394j2291k9572L5124N699J8932j6584p0873L5797L1203n7594o334m2957
5029A825944k6680o243O3943M8381j5531j31829M4791l126o243m5751j004M6882
5017A793534n6151l5984m8475O7817N9687r380j9087j4305J08881k2735j9893
5006A803909o2856K7707O4274L5030n9230m2448L2356m894Q7313m8597N5197Q3857
$$ plain form
4994 1971618 1993295 1970689 1996822 2010461 1967773 2019512 2053710 2014736 2082455 2159487 2231533
4983 2231533 2243038 2234438 2199878 2204862 2234072 2290306 2444365 2459106 2421879 2418288 2475549 2601600
4971 2601600 2631515 2643598 2709190 2743936 2769212 2791787 2860741 2959804 3069983 3074978 3127427
4960 3127427 3211816 3327542 3405982 3481598 3547618 3619703 3732757 3811523 3942392 4050852 4138075
4949 4138075 4219167 4422265 4613283 4643670 4720410 4897910 5085945 5255148 5466579 5661026
4939 5661026 5838259 6111064 6339477 6640226 6841121 7198222 7526296 7996360 8468296 9041220
4929 9041220 9568128 10171348 10849787 11573143 12320917 13049839 13817984 14396261 15010374 15511670
4919 15511670 16003953 16363000 16647291 16882268 17151192 17341265 17458873 17612179 17673377 17741277
$$ packed form
4994A971618K1677k2606K6133J3639m2688N1739L4198l8974O7719P7032P2046
4983B231533J1505q600l4560M984K9210N6234J54059J4741l7227l591N7261J26051
4971B601600K9915J2083O5592L4746K5276K2575O8954R9063J10179M995N2449
4960C127427Q4389J15726P8440P5616O6020P2085J13054P8766J30869J08460Q7223
4949D138075Q1092K03098J91018L0387P6740J77500J88035J69203K11431J94447
4939E661026J77233K72805K28413L00749K00895L57101L28074M70064M71936N72924
4929I041220N26908O03220O78439P23356P47774P28922P68145N78277O14113N01296
4919A5511670M92283L59047K84291K34977K68924J90073J17608J53306O1198O7900
$$ plain form
4909 17741277 17969559 18164137 18446707 18719231 18945537 19171776 19388268 19591300 19674877 19769413
4899 19769413 19940858 20043401 20138766 20289482 20432476 20592293 20782359 21064039 21512040 22119259
4889 22119259 22747945 23590522 24605092 25699785 26894484 28251924 29732010 31342400
4881 31342400 33095515 34863338 36753510 38831579 40858090 42985397 45156235 47260486
4873 47260486 49594700 51916745 54313816 56758868 59247755 61699508 64061242 66448945
4865 66448945 68829826 71345238 73784121 76282342 78817932 81451884 84136096 86830859
4857 86830859 89584782 92417137 95217594 98030496 100740368 103396955 105860168 108155452
4849 108155452 110117027 111721826 113057297 114067335 114849660 115280922 115499500 115396966 115041910
$$ packed form
4909A7741277K28282J94578K82570K72524K26306K26239K16492K03032Q3577R4536
4899A9769413J71445J02543R5365J50716J42994J59817J90066K81680M48001O07219
4889B2119259O28686Q42577J014570J094693J194699J357440J480086J610390
4881C1342400J753115J767823J890172K078069K026511K127307K170838K104251
4873D7260486K334214K322045K397071K445052K488887K451753K361734K387703
4865F6448945K380881K515412K438883K498221K535590K633952K684212K694763
4857H6830859K753923K832355K800457K812902K709872K656587K463213K295284
4849A08155452J961575J604799J335471J010038P82325M31262K18578j02534l55056
$$ plain form
4840 115041910 114306223 113345552 112167688 110732955 109330430 107967905 106500666 105104474
4832 105104474 103767510 102491544 101123034 99803265 98615598 97505884 96487860 95638661
4824 95638661 94875967 94212600 93502376 92818234 92078607 91290763 90581646 90015414 89424608
4815 89424608 88996563 88539195 88114737 87888782 87769411 87601909 87681003 87918729 88178284 88602437
4805 88602437 89139167 89709926 90286805 90848022 91296288 91785896 92214196 92699882 93217414
4796 93217414 93799046 94357841 95051888 95899584 96859472 97954753 99296741 100902133 102796350
4787 102796350 104902264 107114489 109392795 111778525 114113963 116446751 118640984 120663198
4779 120663198 122703807 124578937 126027210 127121689 127758552 127946164 127781883 127081433 125993783
$$ packed form
4840A15041910p35687r60671j177864j434733j402525j362525j467239j396192
4832A05104474j336964j275966j368510j319769j187667j109714j018024q49199
4824I5638661p62694o63367p10224o84142p39627p87844p09117n66232n90806
4815H9424608m28045m57368m24458k25955j19371j67502P9094K37726K59555M24153
4805H8602437N36730N70759N76879N61217M48266M89608M28300M85686N17532
4796I3217414N81632N58795O94047Q47696R59888J095281J341988J605392J894217
4787A02796350K105914K212225K278306K385730K335438K332788K194233K022214
4779A20663198K040609J875130J448273J094479O36863J87612j64281p00450j087650
$$ plain form
4770 125993783 124498872 122682027 120436996 117737940 114736715 111384635 107831658 104270416
4762 104270416 100672211 97116863 93690807 90296009 86927646 83778505 80881766 78262751
4754 78262751 75821514 73414248 71299915 69228565 67215082 65169834 63101023 60989024
4746 60989024 58900814 56700865 54391235 52046839 49614032 47129929 44612871 42110866
4738 42110866 39640615 37217989 34860525 32587181 30425986 28413786 26480316 24757154
4730 24757154 23107033 21581241 20185789 18937596 17837504 16760091 15815905 14972599
4722 14972599 14275152 13673911 13157023 12653809 12168936 11696923 11395244 11103743 10804676
4713 10804676 10591879 10429478 10195567 10003685 9881812 9761706 9689596 9609256 9605790 9574899
$$ packed form
4770A25993783j494911j816845k245031k699056l001225l352080l552977l561242
4762A04270416l598205l555348l426056l394798l368363l149141k896739k619015
4754G8262751k441237k407266k114333k071350k013483k045248k068811k111999
4746F0989024k088210k199949k309630k344396k432807k484103k517058k502005
4738D2110866k470251k422626k357464k273344k161195k012200j933470j723162
4730B4757154j650121j525792j395452j248193j100092j077413r44186q43306
4722A4972599o97447o01241n16888n03214m84873m72013l01679k91501k99067
4713A0804676k12797j62401k33911j91882j21873j20106p2110q0340l466l0891
$$ plain form
4703 9574899 9578559 9590874 9655163 9746294 9901082 10144326 10442941 10786381 11210160 11666681
4693 11666681 12262538 12954025 13696934 14514016 15451452 16373697 17310334 18216747 19037967
4684 19037967 19770393 20387442 20813020 21104125 21226686 21120251 20942894 20631210 20133736
4675 20133736 19443370 18734906 17960012 17075678 16204865 15417387 14736979 14105601 13562044
4666 13562044 13234308 12975806 12788833 12707310 12723089 13005963 13439605 13919001 14631063 15445970
4656 15445970 16453162 17655448 19069048 20580823 22133692 23761937 25365441 26935608
4648 26935608 28227642 29326538 30207329 30852461 31291692 31467374 31345617 31064074 30608912
4639 30608912 29860621 28959410 27948572 26907227 25924089 25004711 24157157 23348710 22747539
$$ packed form
4703I574899L660J2315O4289R1131J54788K43244K98615L43440M23779M56521
4693A1666681N95857O91487P42909Q17082R37436R22245R36637R06413Q21220
4684A9037967P32426O17049M25578K91105J22561j06435j77357l11684m97474
4675B0133736o90366p08464p74894q84334q70813p87478o80408o31378n43557
4666A3562044l27736k58502j86973q1523J5779K82874M33642M79396P12062Q14907
4656A5445970J007192J202286J413600J511775J552869J628245J603504J570167
4648B6935608J292034J098896Q80791O45132M39231J75682j21757k81543m55162
4639C0608912p48291r01211j010838j041345r83138r19378q47554q08447o01171
$$ plain form
4630 22747539 22223243 21690040 21227482 20739539 20379365 20022849 19747637 19599535 19420389
4621 19420389 19394305 19309653 19286530 19342222 19426763 19512921 19675870 19885500 20010823 19985287 19978845
4610 19978845 19928858 19954011 19872081 19662768 19522592 19328407 19140210 19006847 18952568 18977729
4600 18977729 19033740 19204587 19488061 19886762 20345338 20774650 21177813 21434695 21569787 21641685
4590 21641685 21559025 21260716 20889931 20394677 19803105 19117287 18307440 17441902 16503222 15410601
4580 15410601 14339840 13405964 12589390 11849915 11222882 10594124 10028579 9527387 9181996
4571 9181996 8886835 8706754 8659036 8717171 8856156 9115415 9397113 9735635 10116671 10499007
4561 10499007 10873319 11152594 11411108 11521123 11626247 11706322 11628415 11497046 11261095 11038668
$$ packed form
4630B2747539n24296n33203m62558m87943l60174l56516k75212j48102j79146
4621A9420389k6084q4652k3123N5692Q4541Q6158J62949K09630J25323k5536o442
4610A9978845m9987K5153q1930k09313j40176j94185j88197j33363n4279K5161
4600A8977729N6011J70847K83474L98701M58576M29312M03163K56882J35092P1898
4590B1641685q2660k98309l70785m95254n91572o85818q09847q65538r38680j092621
4580A5410601j070761r33876q16574p39475o27033o28758n65545n01192l45391
4571I181996k95161j80081m7718N8135J38985K59259K81698L38522L81036L82336
4561A0499007L74312K79275K58514J10015J05124Q0075p7907j31369k35951k22427
$$ plain form
4551 11038668 10731727 10362871 9802210 9231851 8757005 8287284 7856914 7341798 6857005
4542 6857005 6423360 5989275 5650997 5408613 5124681 4835117 4589656 4413281 4264131 4103332
4532 4103332 3931688 3828557 3817035 3739682 3598087 3526083 3464043 3419128 3363893 3285146 3178651
4521 3178651 3151063 3097948 3029519 3016437 2941668 2887627 2853176 2802814 2815803 2762969 2713973
4510 2713973 2733548 2690894 2622470 2606408 2565714 2576098 2556086 2505975 2556041 2543844 2473309
4499 2473309 2400072 2410471 2401462 2364748 2466947 2454951 2389104 2386413 2334186 2376262 2442140 2418889
4487 2418889 2389069 2398341 2509098 2494529 2420029 2445978 2385674 2371332 2397708 2328995 2317271
4476 2317271 2294656 2284307 2248756 2237407 2271169 2241629 2168723 2174930 2198587 2185776 2173082 2142977
$$ packed form
4551A1038668l06941l68856n60661n70359m74846m69721m30370n15116m84793
4542F857005m33645m34085l38278k42384k83932k89564k45461j76375j49150j60799
4532D103332j71644j03131j1522p7353j41595p2004o2040m4915n5235p8747j06495
4521C178651k7588n3115o8429j3082p4769n4041l4451n0362J2989n2834m8996
4510B713973J9575m2654o8424j6062m0694J0384k0012n0111N0066j2197p0535
4499B473309p3237J0399r009l6714J02199j1996o5847k691n2227M2076O5878k3251
4487B418889k9820R272J10757j4569p4500K5949o0304j4342K6376o8713j1724
4476B317271k2615j0349l5551j1349L3762k9540p2906O207K3657j2811j2694l0105
$$ plain form
4464 2142977 2083384 2099161 2041641 2041574 2076416 2036779 1994629 1923289 1947097 1923205 1905686 1953792
4452 1953792 1872696 1873925 1887914 1801738 1863251 1876985 1800577 1719504 1714903 1687983 1638885 1646758
4440 1646758 1694322 1702417 1711998 1737094 1788106 1776862 1804165 1738244 1677639 1687422 1701440 1730834
4428 1730834 1728553 1813738 1813116 1817838 1852475 1909097 1960227 1987869 2031056 2047973 2082602 2116949
4416 2116949 2186085 2182534 2228790 2304396 2332559 2295156 2292721 2299260 2304517 2346363 2256681 2288976
4404 2288976 2300562 2149425 2132493 2148479 2090726 2110359 2107837 2079788 2090857 2129169 2104113
4393 2104113 2013934 2053873 2125219 2085662 2077283 2119244 2179062 2197297 2136449 2165459 2153804 2207138
4381 2207138 2205545 2267233 2257236 2183138 2276417 2377290 2365189 2331816 2389020 2355582 2458418
$$ packed form
4464B142977n9593J5777n7520o7L4842l9637m2150p1340K3808k3892j7519M8106
4452A953792q1096J229J3989q6176O1513J3734p6408q1073m601k6920m9098P873
4440A646758M7564Q095R581K5096N1012j1244K7303o5921o0605R783J4018K9394
4428A730834k281Q5185o22M722L4637N6622N1130K7642M3187J6917L4629L4347
4416B116949O9136l551M6256P5606K8163l7403k435O539N257M1846q9682L2295
4404B288976J1586j51137j6932J5986n7753J9633k522k8049J1069L8312k5056
4393B104113r0179L9939P1346l9557q379M1961N9818J8235o0848K9010j1655N3334
4381B207138j593O1688r997p4098R3279J00873j2101l3373N7204l3438J02836
$$ plain form
4370 2458418 2461896 2459384 2535853 2555922 2632313 2689762 2665766 2705552 2818563 2909030 2978149 3065172
4358 3065172 3168903 3261151 3319939 3450561 3653213 3771307 3986849 4257442 4468151 4698513
4348 4698513 4994507 5293047 5672759 6102586 6487902 6910672 7404397 7819340 8189634 8635687
4338 8635687 9096699 9610955 10014328 10364898 10670486 11042986 11400894 11785943 12130888 12349620
4328 12349620 12616474 12961602 13325831 13684314 14012733 14319545 14635846 14891449 15192813
4319 15192813 15506817 15683341 15750779 15779735 15839093 15820598 15697200 15646526 15597759 15453569
4309 15453569 15368840 15304618 15214857 15172811 15191345 15181931 15134740 15102977 15106010 15199628 15245240 15285682
4297 15285682 15402372 15488348 15563261 15616417 15765179 15865813 15982621 16144014 16362018 16679296
$$ packed form
4370B458418L478k512P6469K0069P6391N7449k3996L9786J13011R0467O9119Q7023
4358C065172J03731R2248N8788J30622K02652J18094K15542K70593K10709K30362
4348D698513K95994K98540L79712M29827L85316M22770M93725M14943L70294M46053
4338H635687M61012N14256M03373L50570L05588L72500L57908L85049L44945K18732
4328A2349620K66854L45128L64229L58483L28419L06812L16301K55603L01364
4319A5192813L14004J76524O7438K8956N9358j8495j23398n0674m8767j44190
4309A5453569q4729o4222q9761m2046J8534r414m7191l1763L033R3618M5612M0442
4297A5285682J16690Q5976P4913N3156J48762J00634J16808J61393K18004L17278
$$ plain form
4287 16679296 17010340 17391229 17814358 18265260 18757507 19236319 19768972 20303607 20864997
4278 20864997 21372632 21789780 22238377 22764502 23191572 23534901 23931721 24195102 24465706
4269 24465706 24665816 24905886 25014574 25168083 25351574 25456142 25498845 25571243 25584251 25506957
4259 25506957 25345938 25108906 24833376 24456031 24052935 23630508 23207276 22707492 22227643
4250 22227643 21829578 21320032 20779573 20288251 19854647 19408645 18969310 18570381 18168154
4241 18168154 17888699 17618493 17335989 17076520 16871972 16638125 16293734 16026327 15762502
4232 15762502 15512862 15309383 15105272 14998662 14879601 14839030 14808745 14749431 14885238 14973590
4222 14973590 15026173 15094026 15244853 15351729 15460655 15577544 15589232 15657065 15710688 15631928
$$ packed form
4287A6679296L31044L80889M23129M50902M92247M78812N32653N34635N61390
4278B0864997N07635M17148M48597N26125M27070L43329L96820K63381K70604
4269B4465706K00110K40070J08688J53509J83491J04568M2703P2398J3008p7294
4259B5506957j61019k37032k75530l77345m03096m22427m23232m99784m79849
4250B2227643l98065n09546n40459m91322m33604m46002m39335l98929m02227
4241A8168154k79455k70206k82504k59469k04548k33847l44391k67407k63825
4232A5762502k49640k03479k04111j06610j19061m0571l0285n9314J35807Q8352
4222A4973590N2583O7853J50827J06876J08926J16889J1688O7833N3623p8760
$$ plain form
4212 15631928 15504057 15329886 15141779 14954178 14777912 14564695 14374856 14167016 13937045
4203 13937045 13759517 13550736 13296184 13081176 12819134 12587027 12290895 11901685 11567203
4194 11567203 11232081 10901193 10567774 10230517 9836087 9469898 9128684 8712710 8391771
4185 8391771 8223315 7985871 7762310 7522918 7417099 7376068 7355962 7366395 7426669 7488017
4175 7488017 7631227 7849789 8061983 8335655 8624429 8992728 9359563 9724122 10176880 10617952
4165 10617952 11128377 11681063 12175307 12644591 13200899 13665513 14154571 14641141 15207479
4156 15207479 15845009 16416069 16897996 17418522 18037114 18651984 19300309 20013768 20649162
4147 20649162 21254733 21919150 22573352 23313448 24077885 24680085 25368009 26129448 26934521
$$ packed form
4212A5631928j27871j74171j88107j87601j76266k13217j89839k07840k29971
4203A3937045j77528k08781k54552k15008k62042k32107k96132l89210l34482
4194A1567203l35122l30888l33419l37257l94430l66189l41214m15974l20939
4185H391771j68456k37444k23561k39392j05819m1031k0106J0433O0274O1348
4175G488017J43210K18562K12194K73672K88774L68299L66835L64559M52758M41072
4165A0617952N10425N52686M94244M69284N56308M64614M89058M86570N66338
4156A5207479O37530N71060M81927N20526O18592O14870O48325P13459O35394
4147B0649162O05571O64417O54202P40096P64437O02200O87924P61439Q05073
$$ plain form
4138 26934521 27685563 28454699 29192059 29939885 30771437 31599150 32458114 33309503 34217585
4129 34217585 35176433 36165576 37259627 38297105 39374646 40488354 41580125 42746902
4121 42746902 43810653 44837732 45837728 46833847 47691952 48540236 49349237 50117027 50858806
4112 50858806 51529375 52030881 52561598 53112729 53639620 54213152 54741687 55303009 55898138
4103 55898138 56594542 57398271 58252747 59244426 60369149 61581895 62945582 64511044 66200949
4094 66200949 67973936 69806756 71641136 73481284 75505727 77430230 79288979 81113712
4086 81113712 82829822 84408055 85789462 87008877 88053288 88933771 89623658 90259937 90688206
4077 90688206 91089207 91437196 91636250 91702042 91755032 91688874 91571472 91489345 91240603 91114812
$$ packed form
4138B6934521P51042P69136P37360P47826Q31552Q27713Q58964Q51389R08082
4129C4217585R58848R89143J094051J037478J077541J113708J091771J166777
4121D2746902J063751J027079R99996R96119Q58105Q48284Q09001P67790P41779
4112E0858806O70569N01506N30717N51131N26891N73532N28535N61322N95129
4103E5898138O96404Q03729Q54476R91679J124723J212746J363687J565462J689905
4094F6200949J772987J832820J834380J840148K024443J924503J858749J824733
4086H1113712J716110J578233J381407J219415J044411Q80483O89887O36279M28269
4077I0688206M01001L47989J99054O5792N2990o6158j17402q2127k48742j25791
$$ plain form
4067 91114812 90995884 90993182 90921294 90883085 90860583 90877213 90913947 90939377 90918222 90821895 90737755
4056 90737755 90538970 90289403 89826183 89188559 88476168 87574127 86528778 85305666 83883884
4047 83883884 82205670 80433168 78521224 76533467 74569341 72669101 70781141 68845169
4039 68845169 66966546 65242983 63653316 62055371 60640377 59296650 58049288 57031346
4031 57031346 56160654 55364455 54602792 53907815 53294510 52728298 52134755 51556023 51005922
4022 51005922 50476587 49893729 49196424 48368389 47610590 46837164 45945109 45070644 44107720
4013 44107720 43092657 42121992 41081706 39961868 38807819 37671266 36656654 35581150
4005 35581150 34524907 33467504 32534272 31634355 30804229 29966521 29158644 28376951 27617443
$$ packed form
4067I1114812j18928k702p1888l8209k2502J6630L6734K5430k1155r6327q4140
4056I0737755j98785k49567m63220o37624p12391r02041j045349j223112j421782
4047H3883884j678214j772502j911944j987757j964126j900240j887960j935972
4039F8845169j878623j723563j589667j597945j414994j343727j247362j017942
4031E7031346q70692p96199p61663o94977o13305n66212n93543n78732n50101
4022E1005922n29335n82858o97305q28035p57799p73426q92055q74465r62924
4013D4107720j015063r70665j040286j119838j154049j136553j014612j075504
4005C5581150j056243j057403r33232q99917q30126q37708q07877p81693p59508
$$ plain form
3996 27617443 26862732 26183478 25590292 24948774 24322083 23725502 23117287 22459938 21851688
3987 21851688 21278481 20641187 20025575 19407994 18816338 18183804 17678472 17195968 16717015
3978 16717015 16197812 15695787 15374887 14993018 14623332 14304766 13990720 13673357 13388041
3969 13388041 13097229 12862985 12681598 12410457 12198781 12049654 11815995 11658602 11507163
3960 11507163 11374794 11313559 11330908 11331126 11383435 11492696 11586185 11713015 11854104 12004799 12121801
3949 12121801 12342836 12596383 12720359 12907386 13012314 13020651 13085201 13164123 13278682 13324853
3939 13324853 13360131 13465784 13586168 13732383 13893993 14010327 14178490 14279331 14342882 14429339
3929 14429339 14497184 14502139 14586176 14595813 14592432 14628496 14661566 14710291 14776752 14886164 14975787 15103600
$$ packed form
3996B7617443p54711o79254n93186o41518o26691n96581o08215o57349o08250
3987B1851688n73207o37294o15612o17581n91656o32534n05332m82504m78953
3978A6717015n19203n02025l20900l81869l69686l18566l14046l17363k85316
3969A3388041k90812k34244j81387k71141k11676j49127k33659j57393j51439
3960A1507163j32369o1235J7349K18N2309J09261R3489J26830J41089J50695J17002
3949A2121801K21035K53547J23976J87027J04928Q337O4550P8922J14559M6171
3939A3324853L5278J05653J20384J46215J61610J16334J68163J00841O3551Q6457
3929A4429339O7845M955Q4037R637l381L6064L3070M8725O6461J09412Q9623J27813
$$ plain form
3917 15103600 15200753 15370935 15546536 15664583 15767132 15966227 16106746 16222930 16511055 16738899
3907 16738899 16972497 17269268 17646614 17995450 18334013 18844121 19337887 19841924 20424035
3898 20424035 21026214 21652867 22293989 22765638 23157504 23571674 23915401 24283625 24596087
3889 24596087 24761733 25043555 25310659 25588489 25931659 26220821 26468717 26845458 27144159
3880 27144159 27435256 27724552 27907836 28107350 28217961 28224219 28083744 27852803 27677014 27436096
3870 27436096 27155907 26742954 26417229 26147221 25792594 25504119 25202983 24978475 24777917
3861 24777917 24510832 24351203 24219398 24085862 23977340 23900106 23863094 23899317 23970988 23987637
3851 23987637 24129240 24279104 24518223 24851665 25189259 25656276 26246317 26869841 27580445
$$ packed form
3917A5103600R7153J70182J75601J18047J02549J99095J40519J16184K88125K27844
3907A6738899K33598K96771L77346L48836L38563N10108M93766N04037N82111
3898B0424035O02179O26653O41122M71649L91866M14170L43727L68224L12462
3889B4596087J65646K81822K67104K77830L43170K89162K47896L76741K98701
3880B7144159K91097K89296J83284J99514J10611O258j40475k30941j75789k40918
3870B7436096k80189m12953l25725k70008l54627k88475l01136k24508k00558
3861B4777917k67085j59629j31805j33536j08522p7234l7012L6223P1671J6649
3851B3987637J41603J49864K39119L33442L37594M67017N90041O23524P10604
$$ plain form
3842 27580445 28337236 29038858 29816607 30697901 31630784 32558503 33664389 34923091 36336241
3833 36336241 37871996 39548768 41432364 43553957 45836630 48261399 50905623 53562555
3825 53562555 56182405 58725940 61041193 63164374 65110729 66715664 68001440 68948035
3817 68948035 69575445 69882323 69950816 69808677 69563132 69229166 68907493 68592103 68521054 68539479
3807 68539479 68800106 69238879 69718480 70220718 70750474 71377609 71840886 72101189 72125320 71930072
3797 71930072 71407557 70692286 69654129 68443479 67015983 65377703 63570276 61818960
3789 61818960 59980040 58262239 56607379 55017761 53630755 52269327 51010926 49853225
3781 49853225 48736575 47635145 46588942 45519710 44528734 43438288 42438454 41449936 40527373
$$ packed form
3842B7580445P56791P01622P77749Q81294R32883R27719J105886J258702J413150
3833C6336241J535755J676772J883596K121593K282673K424769K644224K656932
3825E3562555K619850K543535K315253K123181J946355J604935J285776R46595
3817F8948035O27410L06878O8493j42139k45545l33966l21673l15390p1049J8425
3807F8539479K60627M38773M79601N02238N29756O27135M63277K60303K4131j95248
3797G1930072n22515p15271j038157j210650j427496j638280j807427j751316
3789F1818960j838920j717801j654860j589618j387006j361428j258401j157701
3781D9853225j116650j101430j046203j069232r90976j090446r99834r88518r22563
$$ plain form
3772 40527373 39625835 38625984 37651428 36748411 35788549 34910844 33970780 33148184 32365432
3763 32365432 31617039 30938411 30326643 29742951 29272690 28766982 28312368 27873271 27398117
3754 27398117 27092396 26815571 26475019 26155761 25847682 25500200 25096255 24660282 24195434
3745 24195434 23751788 23329404 22887502 22456346 22052557 21694592 21258968 20932226 20689591
3736 20689591 20447393 20238788 20108291 20097048 20027465 19927169 19936846 19865124 19790599 19647053
3726 19647053 19522463 19366704 19210899 18931877 18565573 18169065 17838434 17459488 17027549
3717 17027549 16722765 16314838 15993625 15669610 15417726 15170811 14896681 14685140 14475921
3708 14475921 14281457 13966064 13647441 13348905 13084550 12701358 12228486 11775363 11286298
$$ packed form
3772D0527373r01538r99851r74556r03017r59862q77705r40064q22596p82752
3763C2365432p48393o78628o11768n83692m70261n05708m54614m39097m75154
3754B7398117l05721k76825l40552l19258l08079l47482m03945m35973m64848
3745B4195434m43646m22384m41902m31156m03789l57965m35624l26742k42635
3736B0689591k42198k08605j30497j1243o9583j00296R677p1722p4525j43546
3726A9647053j24590j55759j55805k79022l66304l96508l30631l78946m31939
3717A7027549l04784m07927l21213l24015k51884k46915k74130k11541k09219
3708A4475921j94464l15393l18623k98536k64355l83192m72872m53123m89065
$$ plain form
3699 11286298 10820848 10292913 9754419 9296185 8760986 8285687 7873827 7427557 7017062
3690 7017062 6676980 6308251 6048796 5806278 5591287 5358171 5162534 4972863 4869699 4725270
3680 4725270 4650146 4545072 4496247 4394456 4298972 4294816 4227485 4152225 4075671 4098779 4034169
3669 4034169 4009169 3972593 3903773 3818116 3841457 3842790 3794329 3812959 3705247 3700343 3743050 3728640
3657 3728640 3721842 3708537 3589117 3528980 3561022 3531094 3494519 3432492 3357672 3361977 3417192 3445404
3645 3445404 3461379 3375691 3276560 3302661 3271178 3283159 3272299 3242011 3284269 3282168 3248792 3213036
3633 3213036 3188050 3101537 3137487 3158052 3226080 3220160 3219479 3263132 3216611 3232382 3207864 3297358
3621 3297358 3289510 3194334 3264334 3272839 3265435 3206886 3196073 3247405 3350151 3351915 3393977 3363948
$$ packed form
3699A1286298m65450n27935n38494m58234n35199m75299m11860m46270m10495
3690G017062l40082l68729k59455k42518k14991k33116j95637j89671j03164j44429
3680D725270p5124j05074m8825j01791r5484m156o7331p5260p6554K3108o4610
3669D034169k5000l6576o8820q5657K3341J333m8461J8630j07712m904M2707j4410
3657C728640o798j3305j19420o0137L2042k9928l6575o2027p4820M305N5215K8212
3645C445404J5975q5688r9131K6101l1483J1981j0860l0288M2258k101l3376l5756
3633C213036k4986q6513L5950K0565O8028n920o81M3653m6521J5771k4518Q9494
3621C297358p848r5176P0000Q505p404n8549j0813N1332J02746J764M2062l0029
$$ plain form
3609 3363948 3358348 3344510 3357466 3415250 3491969 3506134 3464030 3436674 3510629 3534084 3602802 3659042
3597 3659042 3688993 3742186 3836304 3895704 3896849 3887063 3950287 4018025 4077958 4107149 4173583 4305948
3585 4305948 4376619 4523069 4563895 4616357 4710354 4826451 4953721 5128542 5321583 5539764
3575 5539764 5759247 5922596 6151925 6327871 6541239 6796236 7050280 7277844 7479021 7757024
3565 7757024 8117582 8389436 8635348 8929086 9326490 9735640 10131727 10545681 10839044 11207046
3555 11207046 11668054 12105455 12512363 12958209 13396380 13815881 14249772 14776637 15318383
3546 15318383 15819536 16303255 16866495 17425004 17984181 18478444 19038187 19424209 19790684
3537 19790684 20203593 20692253 21090176 21480544 21816675 22043529 22322762 22540104 22597507 22627299
$$ packed form
3609C363948n600j3838J2956N7784P6719J4165m2104k7356P3955K3455O8718N6240
3597C659042K9951N3193R4118N9400J145r786O3224O7738N9933K9191O6434J32365
3585D305948P0671J46450M0826N2462R3997J16097J27270J74821J93041K18181
3575E539764K19483J63349K29329J75946K13368K54997K54044K27564K01177K78003
3565G757024L60558K71854K45912K93738L97404M09150L96087M13954K93363L68002
3555A1207046M61008M37401M06908M45846M38171M19501M33891N26865N41746
3546A5318383N01153M83719N63240N58509N59177M94263N59743L86022L66475
3537A9790684M12909M88660L97923L90368L36131K26854K79233K17342N7403K9792
$$ plain form
3527 22627299 22520113 22470964 22505877 22360256 22154203 21961367 21682564 21415320 21181221 20887396
3517 20887396 20639991 20421991 20145753 19950606 19862574 19816397 19750745 19734628 19845214 19966299
3507 19966299 20130732 20269837 20533237 20793461 21008356 21340196 21687270 22052218 22394778
3498 22394778 22735041 23150704 23623557 23998270 24367578 24853096 25314135 25701250 26164623
3489 26164623 26623024 27058835 27449504 27667259 27990425 28387395 28675291 28882636 29186556
3480 29186556 29336638 29462942 29571215 29601197 29604183 29522363 29388145 29206637 29047432 28746341
3470 28746341 28376441 27931350 27471217 26965658 26440786 25849860 25150785 24369225 23575028
3461 23575028 22835832 22105332 21362467 20466197 19638218 18685534 17865524 17106267 16332920
$$ packed form
3527B2627299j07186m9149L4913j45621k06053j92836k78803k67244k34099k93825
3517B0887396k47405k18000k76238j95147q8032m6177o5652j6117J10586J21085
3507A9966299J64433J39105K63400K60224K14895L31840L47074L64948L42560
3498B2394778L40263M15663M72853L74713L69308M85518M61039L87115M63373
3489B6164623M58401M35811L90669K17755L23166L96970K87896K07345L03920
3480B9186556J50082J26304J08273K9982K986q1820j34218j81508j59205l01091
3470B8746341l69900m45091m60133n05559n24872n90926o99075p81560p94197
3461B3575028p39196p30500p42865q96270q27979r52684q20010p59257p73347
$$ plain form
3452 16332920 15618661 14862583 14230258 13661468 13118839 12680007 12241518 11863513 11621582
3443 11621582 11419445 11207585 11135397 11128877 11088733 11117934 11218190 11427645 11650583 11808869
3433 11808869 12047713 12428455 12740063 13031658 13334053 13620461 13937137 14374491 14729069
3424 14729069 14998921 15349622 15617432 15853346 16140828 16339769 16518400 16708385 16818797
3415 16818797 16935067 17056310 17210181 17364867 17525854 17699026 17829553 18012370 18197504
3406 18197504 18343456 18481384 18600007 18802670 19009758 19168841 19240112 19269488 19235442 19164662
3396 19164662 18988025 18827350 18621255 18330463 18048628 17797830 17484993 17180850 16999447
3387 16999447 16844291 16724666 16718089 16721950 16799194 16953155 17231705 17547686 17873506 18175701
$$ packed form
3452A6332920p14259p56078o32325n68790n42629m38832m38489l78005k41931
3443A1621582k02137k11860p2188o520m0144K9201J00256K09455K22938J58286
3433A1808869K38844L80742L11608K91595L02395K86408L16676M37354L54578
3424A4729069K69852L50701K67810K35914K87482J98941J78631J89985J10412
3415A6818797J16270J21243J53871J54686J60987J73172J30527J82817J85134
3406A8197504J45952J37928J18623K02663K07088J59083P1271K9376l4046p0780
3396A9164662j76637j60675k06095k90792k81835k50798l12837l04143j81403
3387A6999447j55156j19625o577L861P7244J53961K78550L15981L25820L02195
$$ plain form
3377 18175701 18500903 18907755 19284505 19619304 19918265 20241997 20505106 20711008 20890418
3368 20890418 21038528 21212845 21334677 21431931 21499915 21513128 21580447 21635630 21768630 21912252
3358 21912252 22041134 22202428 22421327 22545779 22811278 22927229 23034771 23174882 23282656
3349 23282656 23386281 23521640 23574181 23481521 23470731 23492555 23485571 23528320 23603874 23714651 23878678
3338 23878678 24049515 24206377 24457153 24682941 24884679 25161661 25399714 25600956 25767786
3329 25767786 25883945 25938720 25921000 25932443 25775713 25671211 25533233 25414304 25162492 24845304
3319 24845304 24628307 24414388 24246757 24037938 23933680 23877560 23742360 23678029 23581745 23558363
3309 23558363 23563727 23541493 23519247 23475105 23445246 23214451 22989874 22763223 22446448 22009976
$$ packed form
3377A8175701L25202M06852L76750L34799K98961L23732K63109K05902J79410
3368B0890418J48110J74317J21832R7254O7984J3213O7319N5183J33000J43622
3358B1912252J28882J61294K18899J24452K65499J15951J07542J40111J07774
3349B3282656J03625J35359N2541r2660j0790K1824o984M2749P5554J10777J64027
3338B3878678J70837J56862K50776K25788K01738K76982K38053K01242J66830
3329B5767786J16159N4775j7720J1443j56730j04502j37978j18929k51812l17188
3319B4845304k16997k13919j67631k08819j04258n6120j35200o4331r6284k3382
3309B3558363N364k2234k2246m4142k9859k30795k24577k26651l16775m36472
$$ plain form
3299 22009976 21535291 20994181 20505278 19898750 19355111 18757940 18128248 17581109 17129607
3290 17129607 16655753 16253932 15943390 15762484 15569338 15501241 15462599 15493880 15502380 15471158
3280 15471158 15439747 15423479 15415602 15431947 15370900 15268946 15135028 14905909 14726364 14488348
3270 14488348 14229102 13960748 13696947 13436445 13215566 12988315 12761140 12513071 12326900
3261 12326900 12124295 11887063 11728794 11469317 11135570 10912891 10697950 10322511 9956067
3252 9956067 9732566 9511431 9267120 9023725 8767681 8562973 8406355 8177396 7986101 7778377
3242 7778377 7645187 7488537 7362145 7292852 7259028 7262037 7189314 7039777 6984130 7005619 7029292
3231 7029292 7047176 7027771 7029424 7139495 7116064 7098884 7199084 7264704 7332768 7413617 7498397
$$ packed form
3299B2009976m74685n41110m88903o06528n43639n97171o29692n47139m51502
3290A7129607m73854m01821l10542j80906j93146o8097l8642L1281Q500l1222
3280A5471158l1411j6268p877J6345o1047j01954j33918k29119j79545k38016
3270A4488348k59246k68354k63801k60502k20879k27251k27175k48069j86171
3261A2326900k02605k37232j58269k59477l33747k22679k14941l75439l66444
3252I956067k23501k21135k44311k43395k56044k04708j56618k28959j91295k07724
3242G778377j33190j56650j26392o9293l3824L009p2723j49537n5647K1489K3673
3231G029292J7884j9405J653J10071k3431j7180J00200O5620O8064Q0849Q4780
$$ plain form
3220 7498397 7578574 7641861 7741128 7853942 7963824 8116613 8261085 8420790 8674047 8922735
3210 8922735 9156214 9471018 9779809 10074151 10461482 10836370 11164087 11462029 11784662 12080571
3200 12080571 12345900 12626525 12916363 13119254 13206968 13247406 13272334 13273202 13285653 13257869 13221520
3189 13221520 13150366 13107895 13017890 13021035 13028835 12900476 12842137 12936204 12959886 13092553 13315023
3178 13315023 13393098 13526546 13673038 13892238 14152945 14393530 14564458 14794510 15147323 15465713
3168 15465713 15731710 16014917 16273782 16660831 16991510 17320234 17711567 18128801 18529969
3159 18529969 18906547 19363069 19891726 20278736 20796269 21439225 22111893 22813184 23550163
3150 23550163 24388560 25244373 26189849 27315156 28569521 29970297 31580485 33416622 35614694
$$ packed form
3220G498397Q0177O3287R9267J12814J09882J52789J44472J59705K53257K48688
3210H922735K33479L14804L08791K94342L87331L74888L27717K97942L22633K95909
3200A2080571K65329K80625K89838K02891Q7714M0438K4928Q68J2451k7784l6349
3189A3221520p1154m2471r0005L145P800j28359n8339R4067K3682J32667K22470
3178A3315023P8075J33448J46492K19200K60707K40585J70928K30052L52813L18390
3168A5465713K65997K83207K58865L87049L30679L28724L91333M17234M01168
3159A8529969L76578M56522N28657L87010N17533O42956O72668P01291P36979
3150B3550163Q38397Q55813R45476J125307J254365J400776J610188J836137K198072
$$ plain form
3141 35614694 38133851 41095635 44581792 48509999 52992020 58203324 64216746 70964253
3133 70964253 78768223 87689305 97974904 109914470 123724130 139596016 157678784
3126 157678784 178081714 200759230 225368772 251468532 278448444 305416998 331281673
3119 331281673 355322785 376743538 394965787 409600796 420481201 427701383 431332729
3112 431332729 431591796 428597647 422944188 415016795 405260880 394478155 383087279 371525727
3104 371525727 360166838 349062978 338277901 327897069 317927499 308488842 299943397
3097 299943397 292412324 285905933 280239660 275231469 270725994 266471246 262095038 257407057
3089 257407057 252421396 247046250 240939100 234381892 227756729 221139190 214429904 207480732
$$ packed form
3141C5614694K519157K961784L486157L928207M482021N211304O013422O747507
3133G0964253P803970Q921082J0285599J1939566J3809660J5871886J8082768
3126A57678784K0402930K2677516K4609542K6099760K6979912K6968554K5864675
3119C31281673K4041112K1420753J8222249J4635009J0880405P220182L631346
3112D31332729K59067k994149n653459p927393r755915j0782725j1390876j1561552
3104C71525727j1358889j1103860j0785077j0380832r969570r438657q545445
3097B99943397p531073o506391n666273n008191m505475m254748m376208m687981
3089B57407057m985661n375146o107150o557208o625163o617539o709286o949172
$$ plain form
3081 207480732 200163146 192243492 183913351 175888338 168769721 163366369 160138959 159197612
3073 159197612 160214085 163234588 167636618 172853377 178122325 182829023 186387443 188332682
3065 188332682 188802340 188205022 186708749 184308415 180920058 176063062 169413080 160886053
3057 160886053 150769942 139682823 128386238 117376390 107275418 98018316 89602789
3050 89602789 81889645 74866467 68426634 62598944 57253944 52544609 48532723 45230343
3042 45230343 42697060 40747679 39104948 37703904 36483372 35278952 34149626 33020209
3034 33020209 31849774 30723137 29641140 28542737 27482337 26370793 25270964 24166749
3026 24166749 23052661 22101674 21117013 20250696 19541622 18928414 18405962 17977284 17762798
$$ packed form
3081B07480732p317586p919654q330141q025013p118617n403352l227410r41347
3073A59197612J016473L020503M402030N216759N268948M706698L558420J945239
3065A88332682M69658n97318j496273k400334l388357m856996o649982q527027
3057A60886053j0116111j1087119j1296585j1009848j0100972r257102q415527
3050H9602789p713144p023178o439833n827690n345000m709335m011886l302380
3042D5230343k533283j949381j642731j401044j220532j204420j129326j129417
3034C3020209j170435j126637j081997j098403j060400j111544j099829j104215
3026B4166749j114088r50987r84661q66317p09074o13208n22452m28678k14486
$$ plain form
3017 17762798 17491021 17412113 17448511 17553569 17812664 18181595 18763103 19416678 20282902 21273058
3007 21273058 22461589 23772327 25056761 26533585 27955761 29289947 30632933 31780177
2999 31780177 32667235 33467629 34001194 34360956 34561298 34631261 34568568 34361765 34124721 33860820
2989 33860820 33626164 33436642 33347164 33370033 33374539 33410342 33497249 33450325 33340008 32995035 32524523
2978 32524523 31915290 31105388 30203418 29114671 27907433 26615420 25171448 23668455 22168247
2969 22168247 20648322 19229488 17902422 16663506 15487647 14432632 13573886 12822764
2961 12822764 12173848 11671408 11299080 11026090 10819147 10759474 10797063 10970711 11271424 11605764
2951 11605764 12045028 12578424 13229946 13906855 14607338 15267207 15966514 16577553 17102865
$$ packed form
3017A7762798k71777p8908L6398J05058K59095L68931N81508O53575Q66224R90156
3007B1273058J188531J310738J284434J476824J422176J334186J342986J147244
2999C1780177Q87058Q00394N33565L59762K00342O9963o2693k06803k37044k63901
2989C3860820k34656j89522q9478K2869M506L5803Q6907m6924j10317l44973m70512
2978C2524523o09233q09902r01970j088747j207238j292013j443972j502993j500208
2969B2168247j519925j418834j327066j238916j175859j055015q58746p51122
2961A2822764o48916n02440l72328k72990k06943n9673L7589J73648L00713L34340
2951A1605764M39264N33396O51522O76909P00483O59869O99307O11039N25312
$$ plain form
2942 17102865 17550880 17852827 18066220 18122392 18164149 18212331 18148481 18041416 17942769 17771569
2932 17771569 17564015 17503620 17478398 17513741 17593781 17708278 17685489 17618881 17530869 17379697 17060872
2921 17060872 16728729 16300894 15740666 15215941 14569385 13779677 12956427 12143404 11272450
2912 11272450 10453792 9625286 8905356 8276212 7683834 7163818 6676541 6156702 5780588
2903 5780588 5452411 5176312 4927095 4717632 4505730 4356598 4271248 4140187 4060908 4028695
2893 4028695 3932685 3806993 3826551 3775234 3679198 3622128 3474402 3402957 3399452 3304221 3276720
2882 3276720 3225742 3202793 3155017 3072670 3057186 2996987 2927701 2966137 2941195 2903567 2838373
2871 2838373 2806450 2866746 2763925 2704231 2740728 2791000 2712984 2678322 2668698 2684476 2683678 2686213
$$ packed form
2942A7102865M48015L01947K13393N6172M1757M8182o3850j07065r8647j71200
2932A7771569k07554o0395k5222L5343Q0040J14497k2789o6608q8012j51172l18825
2921A7060872l32143m27835n60228n24725o46556p89708q23250q13023q70954
2912A1272450q18658q28506p19930o29144n92378n20016m87277n19839l76114
2903E780588l28177k76099k49217k09463k11902j49132q5350j31061p9279l2213
2893D028695r6010j25692J9558n1317r6036n7070j47726p1445l505r5231k7501
2882C276720n0978k2949m7776q2347j5484o0199o9286L8436k4942l7628o5194
2871B838373l1923O0296j02821n9694L6497N0272p8016l4662r624J5778p98K535
$$ plain form
2859 2686213 2690998 2641936 2609715 2616996 2647542 2647590 2630011 2646963 2616970 2710232 2720360 2708661
2847 2708661 2766389 2856251 2924532 3063858 3206532 3235676 3282226 3370444 3552493 3678865 3801123
2836 3801123 3935045 4063692 4184556 4147240 4154766 4248120 4277878 4238787 4212598 4245191 4251805
2825 4251805 4272694 4182314 4050280 3923089 3901298 3797517 3667501 3549266 3541641 3509229 3511449
2814 3511449 3422876 3357010 3357147 3275793 3305172 3312911 3233634 3187797 3142354 3062711 3034165 3001152
2802 3001152 2983401 2934251 2890095 2816280 2804643 2707215 2621116 2558989 2471776 2465502 2419905 2438849
2790 2438849 2466060 2414763 2395149 2436082 2511129 2527937 2516007 2532464 2532245 2562162 2565877 2509913
2778 2509913 2476334 2453388 2433841 2303914 2237370 2167344 2154181 2047683 2027064 2015225 1904031
$$ packed form
2859B686213M785m9062l2221P281L0546M8j7579J6952k9993R3262J0128j1699
2847B708661N7728Q9862O8281J39326J42674K9144M6550Q8218J82049J26372J22258
2836C801123J33922J28647J20864l7316P526R3354K9758l9091k6189L2593O614
2825D251805K0889r0380j32034j27191k1791j03781j30016j18235p625l2412K220
2814C511449q8573o5866J37q1354K9379P739p9277m5837m5443p9643k8546l3013
2802C001152j7751m9150m4156p3815j1637r7428q6099o2127q7213o274m5597J8944
2790B438849K7211n1297j9614M0933P5047J6808j1930J6457k19K9917L715n5964
2778B509913l3579k2946j9547j29927o6544p0026j3163j06498k0619j1839j11194
$$ plain form
2767 1904031 1927090 1932198 1913245 1795108 1797552 1746976 1650706 1615669 1673765 1697653 1610656 1575074
2755 1575074 1644493 1602975 1575498 1608442 1551703 1550735 1572645 1524847 1512691 1508978 1459176 1462706
2743 1462706 1416478 1361222 1348403 1409688 1375877 1347218 1387742 1379558 1390883 1304880 1296657 1357319
2731 1357319 1387460 1401250 1345930 1313299 1317343 1250024 1302260 1240883 1274704 1284008 1224026 1211302
2719 1211302 1215167 1183434 1163395 1233531 1314895 1281476 1247648 1281110 1290005 1261368 1146992 1177663
2707 1177663 1210515 1231061 1245511 1237678 1236372 1193982 1207093 1259783 1281093 1275302 1264851 1266438
2695 1266438 1314882 1275117 1271534 1295784 1252395 1295723 1256411 1203438 1161765 1179951 1201165 1207522
2683 1207522 1207012 1198786 1178055 1229147 1204133 1182954 1122481 1084459 1065620 1080846 1098386 1069482
$$ packed form
2767A904031K3059N108j8953j18137K444n0576r6270l5037N8096K3888q6997l5582
2755A575074O9419m1518k7477L2944n6739r68K1910m7798j2156l713m9802L530
2743A462706m6228n5256j2819O1285l3811k8659M0524q184J1325q6003q223O0662
2731A357319L0141J3790n5320l2631M044o7319N2236o1377L3821R304n9982j2724
2719A211302L865l1733k0039P0136Q1364l3419l3828L3462Q895k8637j14376L0671
2707A177663L2852K0546J4450p833j306m2390J3111N2690K1310n791j0451J587
2695A266438M8444l9765l583K4250m3389M3328l9312n2973m1673J8186K1214O357
2683A207522n10q226k0731N1092k5014k1179o0473l8022j8839J5226J7540k8904
$$ plain form
2671 1069482 1031703 1096558 1052577 1077837 1038474 1022147 1019307 946303 986847 1030175 1021788 981433
2659 981433 986051 1044490 1073054 1039757 1038538 1076064 1043946 1031934 1045571 1043113 1117152 1103499
2647 1103499 1079061 1078297 1116320 1083986 1141220 1048605 1079615 1149787 1185187 1226509 1186560 1211351
2635 1211351 1303444 1320325 1273877 1251674 1292040 1219443 1169861 1180274 1172455 1141141 1159980 1111884
2623 1111884 1077969 1030305 1025546 1056273 1024155 1036389 963135 905996 951384 1041569 878829
2612 878829 899383 935683 922303 911536 842519 850369 867291 874193 826884 820642 816218 806316 790904
2599 790904 840790 874487 829413 803696 708427 732150 794168 810665 804070 809077 791069 770859
2587 770859 792509 794268 782061 729836 710822 743263 765095 763132 776337 781923 748620 776169
$$ packed form
2671A069482l7779O4855m3981K5260l9363j6327k840p3004M0544M3328q387m0355
2659I81433M618N8439K8564l3297j219L7526l2118j2012J3637k458P4039j3653
2647A103499k4438p64L8023l2334N7234r2615L1010P0172L5400M1322l9949K4791
2635A211351R2093J6881m6448k2203M0366p2597m9582J0413p819l1314J8839m8096
2623A111884l3915m7664m759L0727l2118J2234p3254n7139M5388R0185j62740
2612H78829K0554L6300j3380j0767o9017P850J6922O902m7309o242m424r902j5412
2599G90904M9886L3697m5074k5717r5269K3723O2018J6497o595N007j8008k0210
2587G70859K1650J759j2207n2225j9014L2441K1832j963J3205N586l3303K7549
$$ plain form
2575 776169 815757 810255 769226 767761 815873 837696 792186 831146 890809 836027 774915 754046
2563 754046 821047 802039 858142 904339 829531 809185 839079 816590 827332 877966 798928 712070
2551 712070 745264 717005 731982 776080 728414 721039 755198 739249 753192 771926 758550 723531
2539 723531 679319 715239 662539 654714 724461 683206 668113 692679 665762 712033 762307 747629
2527 747629 708076 639041 676377 640850 624556 644319 607697 608180 687771 677206 604124 618992
2515 618992 621486 637266 648990 641563 647953 714434 682362 650139 688973 646787 637702 650966
2503 650966 577269 609314 612750 606569 617919 702189 726809 746377 755190 688967 616268 634334
2491 634334 665020 686701 640221 645008 696212 594844 580968 588608 660726 751474 711324 691781
$$ packed form
2575G76169L9588n502m1029j465M8112K1823m5510L8960N9663n4782o1112k0869
2563G54046O7001j9008N6103M6197p4808k0346K9894k2489J0742N0634p9038q6858
2551G12070L3194k8259J4977M4098m7666p375L4159j5949J3943J8734j3376l5019
2539G23531m4212L5920n2700p825O9747m1255j5093K4566k6917M6271N0274j4678
2527G47629l9553o9035L7336l5527j6294J9763l6622M83P9591j0565p3082J4868
2515F18992K494J5780J1724p427O390O6481l2072l2223L8834m2186r085J3264
2503F50966p3697L2045L436o181J1350Q4270K4620J9568Q813o6223p2699J8066
2491F34334L0686K1681m6480M787N1204j01368j3876P640P2118R0748m0150j9543
$$ plain form
2479 691781 741763 755051 757244 742400 727669 691041 680123 691830 738868 758823 726808 719465
2467 719465 741215 687561 713687 736405 762178 800238 786317 798946 764591 748992 756305 696145
2455 696145 739373 789529 767653 828748 874253 919400 833526 820598 840688 809268 891764 839540
2443 839540 834312 896210 889874 840355 886410 964775 890297 914268 1001021 946420 932506 970707
2431 970707 983761 1001976 1028094 1027740 1037704 1032484 1038403 1049589 1126750 1142387 1122846 1146705 1192803
2418 1192803 1203722 1239487 1258953 1333734 1338150 1302786 1265472 1314298 1328480 1340588 1435151 1448888
2406 1448888 1471071 1512156 1607366 1580806 1657778 1749267 1788218 1851486 1960653 2048278 2068210
2395 2068210 2194455 2400344 2579066 2817323 3119759 3521317 3916245 4355402 4897375 5555054
$$ packed form
2479F91781M9982J3288K193j4844j4731l6628j0918J1707M7038J9955l2015p343
2467G19465K1750n3654K6126K2718K5773L8060j3921J2629l4355j5599P313o0160
2455F96145M3228N0156k1876O1095M5505M5147q5874j2928K0090l1420Q2496n2224
2443H39540n228O1898o336m9519M6055P8365p4478K3971Q6753n4601j3914L8201
2431I70707J3054J8215K6118l54R964n220N919J1186P7161J5637j9541K3859M6098
2418A192803J0919L5765J9466P4781M416l5364l7314M8826J4182J2108R4563J3737
2406A448888K2183M1085R5210k6560P6972R1489L8951O3268J09167Q7625J9932
2395B068210J26245K05889J78722K38257L02436M01558L94928M39157N41973O57679
$$ plain form
2385 5555054 6211576 6998982 7740791 8674207 9684889 10845249 12392861 14483419 16937226
2376 16937226 19724524 22899912 26451522 30589175 34662423 38097326 41450405 44161707
2368 44161707 45345871 45931902 46109785 45933416 45401174 44564712 43388807 41241280 38155502
2359 38155502 34643942 30796867 26903048 23508415 20655783 18246731 16049018 14000495
2351 14000495 12140006 10548470 9040855 7696154 6540096 5453374 4754742 4299755
2343 4299755 3933810 3569241 3344649 3133059 2863749 2660804 2453576 2320770 2234314 2069711
2333 2069711 1988067 1900862 1811137 1716610 1721557 1548471 1441102 1387443 1321530 1347540 1318096
2322 1318096 1286420 1167995 1135658 1123120 1076239 1062028 1123189 1025372 985155 1011149 991806
$$ packed form
2385E555054O56522P87406P41809R33416J010682J160360J547612K090558K453807
2376A6937226K787298L175388L551610M137653M073248L434903L353079K711302
2368D4161707J184164N86031J77883j76369n32242q36462j175905k147527l085778
2359C8155502l511560l847075l893819l394633k852632k409052k197713k048523
2351A4000495j860489j591536j507615j344701j156058j086722o98632m54987
2343D299755l65945l64569k24592k11590k69310k02945k07228j32806q6456j64603
2333B069711q1644q7205q9725r4527M947j73086j07369n3659o5913K6010k9444
2322A318096l1676j18425l2337j2538m6881j4211O1161r7817m0217K5994j9343
$$ plain form
2311 991806 962515 1001991 1010211 889412 844939 862476 872831 895486 923880 882233 810486 766162
2299 766162 762168 799279 814250 741478 637277 635123 707842 670192 681905 639384 600651 650629
2287 650629 685321 715560 705613 709156 716111 658176 632996 620643 601774 593974 612994 619493 594000
2274 594000 539594 530228 562927 550964 521900 558551 526452 445584 418911 463795 513792 531876
2262 531876 556656 519841 552255 547072 474954 426196 419896 488463 496457 465733 464525 437353
2250 437353 428526 453952 457529 413673 413704 377338 414224 447975 397143 392261 423829 369787 332909
2237 332909 406731 398399 340803 338222 340578 354010 407513 440809 391981 367817 329103 377491
2225 377491 326332 388431 374310 300198 322835 331180 357982 352782 287630 223408 239276 307872
$$ packed form
2311I91806k9291L9476Q220j20799m4473J7537J0355K2655K8394m1647p1747m4324
2299G66162l994L7111J4971p2772j04201k154P2719l7650J1713m2521l8733M9978
2287F50629L4692L0239r947L543O955n7935k5180j2353j8869p800J9020O499k5493
2274E94000n4406r366L2699j1963k9064L6651l2099q0868k6673M4884M9997J8084
2262E31876K4780l6815L2414n183p2118m8758o300O8567P994l0724j208k7172
2250D37353q827K5426L577m3856L1l6366L6886L3751n0832m882L1568n4042l6878
2237C32909P3822q332n7596k581K356J3432N3503L3296m8828k4164l8714M8388
2225C77491n1159O2099j4121p4112K2637Q345K6802n200o5152o4222J5868O8596
$$ plain form
2213 307872 329588 329760 366253 330483 361955 280083 279807 295645 356624 391536 377480 342173
2201 342173 356432 316728 258406 273017 270690 217704 216602 222232 207642 226025 229751 259128
2189 259128 278378 293332 231432 204063 260027 222806 170358 251535 276636 215345 203143 242508
2177 242508 248453 204322 264903 246294 179255 238330 197913 194359 209672 232892 231512 178348
2165 178348 198241 250435 284476 305982 294678 236670 221258 311531 307648 218015 156244 221998
2153 221998 311871 364823 318749 291881 299477 292970 202204 190884 280993 261534 244805 293031
2141 293031 305542 238595 261811 257561 241983 268189 236903 246173 321653 239355 158382 194353
2129 194353 186196 173644 236319 295161 274349 209427 196037 236557 225877 245504 285763 289957
$$ packed form
2213C07872K1716J72L6493l5770L1472q1872k76J5838O0979L4912j4056l5307
2201C42173J4259l9704n8322J4611k327n2986j102N630j4590J8383L726K9377
2189B59128J9250J4954o1900k7369N5964l7221n2448Q1177K5101o1291j2202L9365
2177B42508N945m4131O0581j8609o7039N9075m0417l554J5313K3220j380n3164
2165A78348J9893N2194L4041K1506j1304n8008j5412R0273l883q9633o1771O5754
2153B21998Q9873N2952m6074k6868P596o507r0766j1320R0109j9459j6729M8226
2141B93031J2511o6947K3216m250j5578K6206l1286R270P5480q2298q0973L5971
2129A94353q157j2552O2675N8842k0812o4922j3390M0520j0680J9627M0259M194
$$ plain form
2117 289957 264004 258110 280655 241258 253426 276083 253244 233805 308611 341019 346144 371400
2105 371400 322773 353080 374201 376002 452611 400647 495112 527318 538343 523256 452677 461084
2093 461084 429168 407449 387017 406350 405591 318239 263360 299170 337316 315347 300927 246119
2081 246119 261653 294716 290617 298844 245334 255028 237764 310768 307493 237662 227551 181861
2069 181861 120790 162310 191632 147198 197250 167826 155369 230470 219308 208585 248189 197000
2057 197000 136670 168677 163341 160986 185474 178415 200397 240816 255923 250215 244226 191070 171687
2044 171687 127585 100560 161169 160354 221207 141488 116477 116195 136282 149636 109111 71135
2032 71135 67143 120745 129919 124289 234550 213387 184433 181937 206720 202587 141987 94248 94152
$$ packed form
2117B89957k5953n894K2545l9397J2168K2657k2839j9439P4806L2408N125K5256
2105C71400m8627L0307K1121J801P6609n1964R4465L2206J1025j5087p0579Q407
2093D61084l1916k1719k0432J9333p59q7352n4879L5810L8146k1969j4420n4808
2081B46119J5534L3063m099Q227n3510R694j7264P3004l275o9831j0111m5690
2069A81861o1071M1520K9322m4434N0052k9424j2457P5101j1162j0723L9604n1189
2057A97000o0330L2007n336k355K4488p059K1982M0419J5107n708n989n3156j9383
2044A71687m4102k7025O0609q15O0853p9719k5011k82K0087J3354m0525l7976
2032G1135l992N3602R174n630J10261k1163k8954k496K4783m133o0600m7739r6
$$ plain form
2019 94152 123368 118662 125991 162825 158473 116326 111638 92325 96110 119974 128236 176760 182279
2006 182279 148466 172850 164355 120542 158034 157003 159081 165427 190136 187990 88996 134907 190176
1993 190176 128073 78998 115755 138449 153209 131647 127737 96397 124884 146112 187895 123160
1981 123160 115254 139515 176621 129656 95375 85238 145501 153594 137852 22634 57038 150223
1969 150223 41063 19103 85290 147701 196852 91824 37980 83691 124473 167502 146774
1958 146774 89860 129829 156955 191173 219729 197658 142784 99070 82010 23662 24634 105941
1946 105941 170366 166625 112336 54058 45236 -36546 54256 96342 128542 57927 31010 42753
1934 42753 46661 67987 12714 13176 45646 29950 15622 35204 11360 41506 56229 40657
$$ packed form
2019I4152K9216m706P329L6834m352m2147m688j9313L785K3864Q262M8524N519
2006A82279l3813K4384q495m3813L7492j031K078O346K4709k146r8994M5911N5269
1993A90176o2103m9075L6757K2694J4760k1562l910l1340K8487K1228M1783o4735
1981A23160p906K4261L7106m6965l4281j0137O0263Q093j5742j15218L4404R3185
1969A50223j09160k1960O6187O2411M9151j05028n3844M5711M0782M3029k0728
1958A46774n6914L9969K7126L4218K8556k2071n4874m3714j7060n8348R72Q1307
1946A05941O4425l741n4289n8278q822q1782R0802M2086L2200p0615k6917J1743
1934D2753L908K1326n5273M62L2470j5696j4328J9582k3844L0146J4723j5572
$$ plain form
1922 40657 78357 117827 101174 41305 89078 77859 60207 88512 66155 106189 120041 128674
1910 128674 110516 88959 175947 179293 149940 114597 69589 9058 30842 6640 13644 10465
1898 10465 34544 107578 59243 3721 52695 129384 162545 163770 140307 138454 130325 143519
1886 143519 99615 62099 150400 180041 155346 164733 230341 168015 114359 110260 110433 70675
1874 70675 87104 103470 29680 76332 136008 129724 94191 109556 130481 123427 119046 98349
1862 98349 54990 77214 46209 32920 98564 10301 -13237 1373 28278 73641 113695 44499
1850 44499 42247 15131 -69 66980 -18001 38568 106782 63139 75450 97081 61963 114208
1838 114208 82429 78005 31980 80498 91529 32506 54571 -10565 -29782 60007 88638 118505
$$ packed form
1922D0657L7700L9470j6653n9869M7773j1219j7652K8305k2357M0034J3852Q633
1910A28674j8158k1557Q6988L346k9353l5343m5008o0531K1784k4202P004l179
1898A0465K4079P3034m8335n5522M8974P6689L3161J225k3463j853q129J3194
1886A43519m3904l7516Q8301K9641k4695R387O5608o2326n3656m099J73l9758
1874G0675J6429J6366p3790M6652N9676o284l5533J5365K0925p054m381k0697
1862I8349m3359K2224l1005j3289O5644q8263k3538J4610K6905M5363M0054o9196
1850D4499k252k7116j5200O7049q4981N6569O8214m3643J2311K1631l5118N2245
1838A14208l1779m424m6025M8518J1031n9023K2065o5136j9217Q9789K8631K9867
$$ plain form
1826 118505 86421 59345 99117 117941 82460 51376 29027 5887 58351 3140 11955 37504
1814 37504 45397 42068 104416 110743 90073 128866 63617 38242 92693 134999 79229 51814
1802 51814 -13562 -12376 -2513 -6692 11083 40228 34850 12329 45341 91006 75013 113879 144858
1789 144858 110321 99795 40954 -15742 64239 100469 116544 77931 67190 -9126 -40900 63750
1777 63750 45364 24364 31218 3377 45136 19799 25458 30136 83803 121886 123477 136718 89228
1764 89228 56247 12995 22833 22328 -11051 21253 52453 42148 1963 -73597 -4522 8055
1752 8055 314 18174 40854 -16109 19105 28224 18372 38551 24834 56689 70285 80676 11718
1739 11718 -15012 34290 30384 1573 24896 7706 -5653 -940 41952 90228 141171 86644
$$ packed form
1826A18505l2084k7076L9772J8824l5481l1084k2349k3140N2464n5211Q815K5549
1814C7504P893l329O2348O327k0670L8793o5249k5375N4451M2306n5770k7415
1802E1814o5376J186R863m179J7775K9145n378k2521L3012M5665j5993L8866L0979
1789A44858l4537j0526n8841n6696P9981L6230J6075l8613j0741p6316l1774J04650
1777F3750j8386k1000O854k7841M1759k5337N659M678N3667L8083J591J3241m7490
1764H9228l2981m3252R838n05l3379L2304L1200j0305m0185p5560O9075J2577
1752H055p741J7860K2680n6963L5214R119r852K0179j3717L1855J3596J0391o8958
1739A1718k6730M9302l906k8811K3323j7190j3359M713M2892M8276N0943n4527
$$ plain form
1727 86644 58491 61799 68834 78319 19300 37729 75846 84495 -3071 -4624 16784 -15904 -40232
1714 -40232 -2488 -26687 -30785 -34829 -31654 -18808 38523 28906 -10616 -31590 -18662 -76869 468
1701 468 2051 -7662 1288 43310 33367 49684 20742 18461 -17335 -67926 12141 -27577 -24341
1688 -24341 -5651 43809 -1381 -49261 -11449 -38930 10572 17547 30714 24314 -63966 -35685
1676 -35685 -8404 18206 11029 10136 40003 56637 50320 116078 22864 16517 32834 19568 -12448
1663 -12448 -68775 3112 51508 24988 132528 97320 83077 50151 25472 55737 52227 18150
1651 18150 -57245 -10975 71233 11276 58279 48945 43199 64510 -80 31975 69546 36795
1639 36795 -36065 -86537 -44039 33106 53569 68861 69345 61083 63219 32253 20561 33406 -32333
$$ packed form
1727H6644k8153L308P035R485n9019J8429L8117Q649q7566j553K1408l2688k4328
1714d0232L7744k4199m098m044L175J2846N7331r617l9522k0974J2928n8207P7337
1701D68J583r713Q950M2022r943J6317k8942k281l5796n0591Q0067l9718L236
1688b4341J8690M9460m5190m7880L7812k7481M9502O975J3167o400q8280K8281
1676c5685K7281K6610p177q93K9867J6634o317O5758r3214o347J6317j3266l2016
1663a2448n6327P1887M8396k6520J07540l5208j4243l2926k4679L0265l510l4077
1651A8150p5395M6270Q2208n9957M7003r334n746K1311o4590L2055L7571l2751
1639C6795p2860n0472M2498P7145K0463J5292M84q262K136l0966j1692J2845o5739
$$ plain form
1626 -32333 -43724 -50385 -15078 -58168 -15236 -13143 68127 5325 28710 79617 52178 106035
1614 106035 82517 53813 8259 33075 48144 15684 38738 47892 40587 2166 -18333 39550
1602 39550 7911 -66676 -164723 -67707 -29958 -9342 26071 -23113 28671 91538 110059 71773
1590 71773 14296 -21316 -33514 -55017 -16430 32812 73107 67164 5035 -8628 -97758 -53957
1578 -53957 -23180 17647 41422 43129 -4048 9850 -13254 -19408 -18479 -8402 -89918 -61729 -4396
1565 -4396 -17520 -38159 -34705 -5114 -55863 -27190 -20523 -33061 -27267 -36538 -1145 43053 28021
1552 28021 29937 -9293 29455 46834 91885 29191 20384 -14995 -22057 13551 6385 -25349 6749
1539 6749 34298 -14986 -34839 27560 65840 4847 -50465 -98270 -64242 -1866 27212 19175
$$ packed form
1626c2333j1391o661L5307m3090M2932K093Q1270o2802K3385N0907k7439N3857
1614A06035k3518k8704m5554K4816J5069l2460K3054R154p305l8421k0499N7883
1602C9550l1639p4587r8047R7016L7749K0616L5413m9184N1784O2867J8521l8286
1590G1773n7477l5612j2198k1503L8587M9242M0295n943o2129j3663q9130M3801
1578e3957L0777M0827K3775J707m7177J3898k3104o154R29J0077q1516K8189N7333
1565d396j3124k0639L454K9591n0749K8673O667j2538N794r271L5393M4198j5032
1552B8021J916l9230L8748J7379M5051o2694q807l5379p062L5608p166l1734L2098
1539F749K7549m9284j9853O2399L8280o0993n5312m7805L4028O2376K9078q037
$$ plain form
1527 19175 7514 6208 -39654 -97801 -82466 -44121 -47569 -72083 -23512 59571 20896 23174
1515 23174 29932 36075 11021 -31100 -5133 -27072 -99674 -120889 -84273 -80723 15982 29225
1503 29225 10304 -35352 -61004 -42536 -85691 -42239 -17292 10090 -71812 -45626 13303 -14685
1491 -14685 10721 31723 -6988 -32240 62295 77940 -22606 -69497 -41230 -34756 -74876 -73562
1479 -73562 -64501 -73976 -41849 -116784 -55968 16166 4630 -17268 -40921 -40322 -15300 2556 -28192
1466 -28192 -29076 -79937 -82822 -78102 -39668 -87272 -2060 51467 31361 -7231 -38859 -12239 32820
1453 32820 16027 300 -74497 -79645 -76298 -139245 -85769 -68093 -28371 -8283 -31306 1361
1441 1361 -24802 -55925 -35053 -119807 -73605 -24041 1592 -4873 -12178 -37545 -72919 -74360 -59519
$$ packed form
1527A9175j1661j306m5862n8147J5335L8345l448k4514M8571Q3083l8675K278
1515B3174O758O143k5054m2121K5967k1939p2602k1215L6616L550R6705J3243
1503B9225j8921m5656k5652J8468m3155M3452K4947K7382q1902K6186N8929k7988
1491a4685K5406K1002l8711k5252R4535J5645j00546m6891K8267O474m0120J314
1479g3562R061r475L2127p4935O0816P2134j1536k1898k3653N99K5022J7856l0748
1466b8192q84n0861k885M720L8434m7604Q5212N3527k0106l8592l1628K6620M5059
1453C2820j6793j5727p4797n148L347o2947N3476J7676L9722K0088k3023L2667
1441A361k6163l1123K0872q4754M6202M9564K5633o465p305k5367l5374j441J4841
$$ plain form
1428 -59519 -46969 -19495 -16490 -4119 6451 26988 -29489 -24681 -36778 -92507 -2676 -17538
1416 -17538 -64900 -74371 -137682 -154267 -124666 -28676 19144 11039 -36204 -75472 -16610 -40722
1404 -40722 -87071 -48285 -44514 -62336 -76067 -60265 -93699 -88764 -67987 -5485 -28290 -54190
1392 -54190 -50707 -47555 -5885 20932 -7048 -52004 -46379 -50800 -9622 8681 10818 46452 64759
1379 64759 50848 41328 22462 10180 -11658 -62197 -48641 -58552 -59229 -14092 13883 4231 9755
1366 9755 -4256 3496 -3570 -53526 -51728 -50492 -24640 7305 15877 -9377 -82 2822 -1964 -40700
1352 -40700 -31910 -88305 -40708 -4414 6627 -30240 -59039 5970 46556 33157 -51277 -90080
1340 -90080 -43079 -15959 -40792 -15935 15051 -5790 -40231 -102886 -61136 -53426 -23496 -73541
$$ packed form
1428e9519J2550K7474L005J2371J0570K0537n6477M808j2097n5729Q9831j4862
1416a7538m7362r471o3311j6585K9601R5990M7820q105m7243l9268N8862k4112
1404d0722m6349L8786L771j7822j3731J5802l3434M935K0777O2502k2805k5900
1392e4190L483L152M1670K6817k7980m4956N625m421M1178J8303K137L5634J8307
1379F4759j3911r520j8866j2282k1838n0539J3556r911o77M5137K7975r652N524
1366I755j4011P752p066m9956J798J236K5852L1945Q572k5254R295K904m786l8736
1352d0700Q790n6395M7597L6294J1041l6867k8799O5009M0586j3399q4434l8803
1340i0080M7001K7120k4833K4857L0986k0841l4441o2655M1750P710K9930n0045
$$ plain form
1328 -73541 -89763 -105621 -135649 -100251 -55135 -53166 -21207 -87236 -99448 2449 33642 22791
1316 22791 35739 -20300 -16833 -20966 -71243 20638 61293 63393 31427 30371 8421 32553 81838
1303 81838 113837 41518 41261 27457 25666 -48805 -20708 -84862 21101 31382 16384 66993
1291 66993 -49140 -45753 -19985 -10116 3630 -14492 -53831 -45083 -6047 -22737 -54215 -49702
1279 -49702 -9913 32450 21652 -45730 -53852 -36426 -53739 -88506 -92806 -123731 -133144 -66488
1267 -66488 -93844 -60286 10896 80165 41896 6747 37902 18035 59005 -6945 -49923 -38094
1255 -38094 -88351 -42237 -21883 -56381 -97002 -106169 -53782 -43742 22828 -42170 -105223 -74479
1243 -74479 -59959 -28364 -53021 -129094 -108996 -64747 -76399 -38304 -33609 -44738 -85817 -41988
$$ packed form
1328g3541j6222j5858l0028L5398M5116J969L1959o6029j2212J01897L1193j0851
1316B2791J2948n6039L467m133n0277R1881M0655K100l1966j056k1950K4132M9285
1303H1838L1999p2319k57j3804j791p4471K8097o4154J05963J0281j4998N0609
1291F6993j16133L387K5768R869J3746j8122l9339Q748L9036j6690l1478M513
1279d9702L9789M2363j0798o7382q122J7426j7313l4767m300l0925r413O6656
1267f6488k7356L3558P1182O9269l8269l5149L1155j9867M0970o5950m2978J1829
1255c8094n0257M6114K0354l4498m0621r167N2387J0040O6570o4998o3053L0744
1243g4479J4520L1595k4657p6073K0098M4249j1652L8095M695j1129m1079M3829
$$ plain form
1231 -41988 -23938 -80193 -64559 50933 25449 14031 -1112 -39578 -110209 -43946 -53070 -100320
1219 -100320 -139269 -69813 -65583 -67376 -50111 -6956 18629 64241 9360 -66009 -98430 -76017
1207 -76017 -1404 22095 -2025 25089 -10856 -114107 -91950 -87609 -37974 -40660 -90356 -141745
1195 -141745 -166235 -162707 -96701 -84442 55882 30943 -20840 29049 -7063 -56574 -113419 -130615
1183 -130615 -131257 -91270 -48065 -117359 -63023 6386 -42930 -77944 -80110 -63602 15857 46935
1171 46935 35273 -31451 -91566 -81257 -78913 -38972 -44144 513 22584 -58852 -39734 4416
1159 4416 30373 -2106 27211 -4068 -55599 -117988 -128532 -41727 -8972 -64791 -100491 -58810
1147 -58810 -40101 -57002 -85940 -71112 -41113 29315 16638 -76903 -68735 -84068 -7308 -16442
$$ packed form
1231d1988J8050n6255J5634J15492k5484j1418j5143l8466p0631O6263r124m7250
1219a00320l8949O9456M230j793J7265M3155K5585M5612n4881p5369l2421K2413
1207g6017P4613K3499k4120K7114l5945j03251K2157M341M9635k686m9696n1389
1195a41745k4490L528O6006J2259J40324k4939n1783M9889l6112m9511n6845j7196
1183a30615o42L9987M3205o9294N4336O9409m9316l5014k166J6508P9459L1078
1171D6935j1662o6724o0115J0309K344L9941n172M4657K2071q1436J9118M4150
1159D416K5957l2479K9317l1279n1531o2389j0544Q6805L2755n5819l5700M1681
1147e8810J8709j6901k8938J4828K9999P0428j2677r3541Q168j5333P6760r134
$$ plain form
1135 -16442 -58795 -55979 -47744 -96596 -46935 -5456 -10342 -61681 -55174 27355 -27246 -38520 -34759
1122 -34759 -19716 -39807 -6347 -45145 -40200 -5363 7434 -74789 -61999 10585 -3504 -48564
1110 -48564 -66827 -27201 -71827 -81187 -79394 -21447 -10289 19469 2418 8143 39081 -42577
1098 -42577 -68866 -17770 43537 11586 -15883 -10758 -51192 -64188 -24252 6425 32306 12940
1086 12940 27761 13612 4654 2507 23031 93332 55541 -9452 -29402 45867 12850 -56883
1074 -56883 10562 1046 19171 1150 9940 -12300 6205 1598 23396 6935 -3015 -27558 -98314
1061 -98314 -20645 31461 -4992 -36746 -55373 17613 -49528 -21101 37771 6577 11488 -14936
1049 -14936 -37387 -99795 -127865 -94548 -43853 -1838 35490 7719 -20155 -8600 31701 56250
$$ packed form
1135a6442m2353K816Q235m8852M9661M1479m886n1339O507Q2529n4601j1274L761
1122c4759J5043k0091L3460l8798M945L4837J2797q2223J2790P2584j4089m5060
1110d8564j8263L9626m4626r360J793N7947J1158K9758j7051N725L0938q1658
1098d2577k6289N1096O1307l1951k7469N125m0434j2996L9936L0677K5881j9366
1086A2940J4821j4149q958k147K0524P0301l7791o4993j9950P5269l3017o9733
1074e6883O7445r516J8125j8021Q790k2240J8505m607K1798j6461r950k4543p0756
1061i8314P7669N2106l6453l1754j8627P2986o7141K8427N8872l1194M911k6424
1049a4936k2451o2408k8070L3317N0695M2015L7328k7771k7874J1555M0301K4549
$$ plain form
1037 56250 62025 34213 -51945 -94733 -37487 -62140 -57909 -12663 -9579 37456 30834 -29561 -88209
1024 -88209 -29911 27449 -16117 35755 21204 -10168 -4413 2592 -67556 -50225 -11821 32470
1012 32470 22659 36217 77412 24230 29055 -30181 -17560 -3464 -36711 -7672 10637 10450 -53281
999 -53281 -68434 -37319 -54996 7714 14701 -2757 11070 -32158 3101 -2599 -41570 -72408
987 -72408 -44890 11774 10992 14870 20374 -35262 -61758 -71913 -69239 -69926 -64072 -40761 -44956 -86518
973 -86518 -121558 -66990 -64035 -92240 -18702 27386 15353 -40795 -43071 1948 9355 -21288 -51778
960 -51778 17093 -11893 -43134 -52356 8489 -12487 -80600 -54028 -38830 -43133 -9101 90348
948 90348 60018 10050 -57932 -105103 -30156 -64406 -66410 -43503 -26508 -10430 10509 717
$$ packed form
1037E6250N775k7812q6158m2788N7246k4653M231M5246L084M7035o622o0395n8648
1024h8209N8298N7360m3566N1872j4551l1372N755P005p0148J7331L8404M4291
1012C2470r811J3558M1195n3182M825n9236J2621J4096l3247K9039J8309j87o3731
999e3281j5153L1115j7677O2710O987j7458J3827m3228L5259n700l8971l0838
987g2408K7518N6664p82L878N504n5636k6496j0155K674o87N854K3311m195m1562
973h6518l5040N4568K955k8205P3538M6088j2033n6148k276M5019P407l0643l0490
960e1778O8871k8986l1241r222O0845k0976o8113K6572J5198m303L4032R9449
948I0348l0330m9968o7982m7171P4947l4250k004K2907J6995J6078K0939r792
$$ plain form
936 717 -91958 -52004 -36155 -22036 -43471 -85864 -70222 -66731 -99620 -96744 -48661 5497 1337
923 1337 -21232 -24177 -60702 -36588 -81246 -54243 -43762 -20310 -45566 -52492 -17870 -32793 -62989
910 -62989 19263 29327 -11415 41084 35899 37094 19611 40089 61167 40015 11640 -40935
898 -40935 -103994 -55820 -37412 25854 -23073 -39582 -80866 -108660 -43097 24465 31071 -6942
886 -6942 -33036 26133 9286 15975 -8633 -91884 2362 -10288 14201 61542 -7238 -82118
874 -82118 -85918 -51518 2797 -13451 43528 41116 22598 50574 -38189 -47109 -51340 -119507 -83135
861 -83135 -88682 -113279 -388 -24614 -34687 1050 -45799 -1072 46306 23596 39944 48163
849 48163 40544 7550 -17287 -17376 -8747 28398 64180 -34144 -84281 -65201 -46116 -86860 -117498
$$ packed form
936G17r2675L9954J5849J4119k1435m2393J5642L491l2889K876M8083N4158m160
923A337k2569k945l6525K4114m4658K7003J0481K3452k5256o926L4622j4923l0196
910f2989Q2252J0064m0742N2499n185J195j7483K0478K1078k1152k8375n2575
898d0935o3059M8174J8408O3266m8927j6509m1284k7794O5563O7562O606l8013
886f942k6094N9169j6847O689k4608q3251R4246j2650K4489M7341o8780p4880
874h2118l800L4400N4315j6248N6979k412j8518K7976q8763q920m231o8167L6372
861h3135n547k4597J12891k4226j0073L5737m6849M4727M7378k2710J6348Q219
849D8163p619l2994k4837q9Q629L7145L5782r8324n0137J9080J9085m0744l0638
$$ plain form
836 -117498 6381 -10814 12541 660 -23564 45667 14068 -9524 -17078 30463 35218 -30340
824 -30340 -35303 -41716 -51892 -46506 -32495 -65359 -42505 -6129 18196 6550 -5884 -48986 -46757
811 -46757 55687 37113 4893 -4679 -23617 12364 -73945 -111106 -81960 -118395 -57931 -50027
799 -50027 -89507 -51479 -86522 -5797 -6522 -52329 -51755 -6082 -9391 20420 -1516 528 31372
786 31372 -6015 36943 3162 -66038 -54797 -24676 -17774 -22064 -72285 -79287 -80903 -39207 -55494
773 -55494 -10172 -31963 -28451 -22487 -3668 58106 55834 17743 15468 16789 -40958 -387 -27556
760 -27556 -65622 -83296 -53122 13487 -3241 28937 -4674 -16800 12181 -2588 1686 -3479
748 -3479 -2989 -12315 68811 81320 -16963 -39881 -80114 -68944 -40802 -37500 16509 -24446 -53787
$$ packed form
836a17498J23879j7195K3355j1881k4224O9231l1599k3592p554M7541M755o5558
824c0340m963o413j0176N386J4011l2864K2854L6376K4325j1646j2434m3102K229
811d6757J02444j8574l2220r572j8938L5981q6309l7161K9146l6435O0464P904
799e0027l9480L8028l5043Q0725p25m5807N74M5673l309K9811k1936K044L0844
786C1372l7387M2958l3781o9200J1241L0121O902m290n0221p002j616M1696j6287
773e5494M5322k1791L512N964J8819O1774k272l8091k275J321n7747M0571k7169
760b7556l8066j7674L0174O6609j6728L2178l3611j2126K8981j4769M274n165
748c479M90r326Q1126J2509r8283k2918m0233J1170K8142L302N4009m0955k9341
$$ plain form
735 -53787 3199 14401 -9393 69312 70016 38677 6872 -40648 -47762 -48242 -3411 -1035 39836
722 39836 -13681 28263 47110 89087 40730 47447 44849 -7203 -17960 11173 -12616 -99139
710 -99139 -6087 -13769 -36341 -21159 31014 75188 49559 50668 -21783 -59117 27467 37744
698 37744 -27437 -45928 -477 2037 -34563 -35846 35779 85169 79173 60264 23514 5055 25058
685 25058 43564 67597 31468 10264 28647 36292 60349 124484 108426 47252 3447 -28933
673 -28933 -7209 59537 68551 1715 14640 20337 -17667 -4172 -45323 -96484 -58625 -2008
661 -2008 -1973 -67291 -54894 26018 -5171 8582 43860 45374 -24044 -5399 17454 -316 -36042
648 -36042 9486 42726 28849 104510 81747 36463 20262 17367 -22933 -34284 -10099 38315
$$ packed form
735e3787N6986J1202k3794P8705P04l1339l1805m7520p114m80M4831K376M0871
722C9836n3517M1944J8847M1977m8357O717k598n2052j0757K9133k3789q6523
710i9139R3052p682k2572J5182N2173M4174k5629J109p2451l7334Q6584J0277
698C7744o5181j8491M5451K514l6600j283P1625M9390n996j8909l6750j8459K0003
685B5058J8506K4033l6129k1204J8383P645K4057O4135j6058o1174m3805l2380
673b8933K1724O6746R014o6836J2925N697l8004J3495m1151n1161L7859N6617
661b008L5o5318J2397Q0912l1189J3753L5278J514o9418J8645K2853j7770l5726
648c6042M5528L3240j3877P5661k2763m5284j6201k895m0300j1351K4185M8414
$$ plain form
636 38315 27503 -21939 -9178 25907 3199 -32566 24263 67738 83296 143549 56828 36481
624 36481 22136 43875 19997 -73974 -30985 18138 6450 50733 64411 -22370 -52037 -37874
612 -37874 38203 3745 -13008 -46455 -29653 -12125 41434 76891 61205 32772 22023 -63059
600 -63059 -32046 1325 30275 109588 81861 7812 31152 29496 39321 79318 51215 84084
588 84084 36558 18203 14375 -16771 37430 36210 -15484 -32313 1531 41666 24721 88702
576 88702 62089 7082 -21007 -21304 22964 89704 20039 -30221 -52439 45216 1102 18584
564 18584 62466 38321 8751 128527 97512 38238 20919 -2163 5401 16746 4837 24434
552 24434 124357 128415 111295 99632 86463 48259 15981 -27337 72485 108591 57445 9990
$$ packed form
636C8315j0812m9442J2761L5085k2708l5765N6829M3475J5558O0253q6721k0347
624C6481j4345K1739k3878r3971M2989M9123j1688M4283J3678q6781k9667J4163
612c7874P6077l4458j6753l3447J6802J7528N3559L5457j5686k8433j0749q5082
600f3059L1013L3371K8950P9313k7727p4049K3340j656R825L9997k8103L2869
588H4084m7526j8355l828l1146N4201j220n1694j6829L3844M0135j6945O3981
576H8702k6613n5007k8089k97M4268O6740o9665n0260k2218R7655m4114J7482
564A8584M3882k4145k9570J19776l1015n9274j7319k3082P564J1345j1909J9597
552B4434R9923M058j7120j1663j3169l8204l2278m3318R9822L6106n1146m7455
$$ plain form
540 9990 -28012 54094 109358 43978 42089 23904 23968 54037 -31014 7427 30840 -63623 -125
527 -125 -82693 -93540 13016 64699 36358 18650 -33162 -35967 -87602 -19789 -13611 -45108 19470
514 19470 29879 50331 -21427 -47479 45271 119732 67550 -15593 25687 46001 20458 77215
502 77215 95585 112817 109875 52471 -12112 -26559 11098 -6019 -17193 -48571 12856 -5220
490 -5220 27342 -2489 -65511 -92343 -25242 37117 28174 -3635 -20593 40158 46895 2616 -28159
477 -28159 -19503 13684 27992 -6437 -29969 27418 23880 6743 87789 86438 10927 -28251 -4147
464 -4147 13691 57423 29675 18777 49180 66085 69629 87570 107368 97657 46116 -20847 -54135
451 -54135 41169 86054 45355 -21785 -50299 -98792 -120034 -75871 -65274 -60865 -13883 -29761
$$ packed form
540I990l8002Q2106N5264o5380j889j8185O4L0069q5051L8441K3413r4463O3498
527a25q2568j0847J06556N1683k8341j7708n1812k805n1635O7813O178l1497O4578
514A9470J0409K0452p1758k6052R2750P4461n2182q3143M1280K0314k5543N6757
502G7215J8370J7232k942n7404o4583j4447L7657j7117j1174l1378O1427j8076
490e220L2562k9831o3022k6832O7101O2359q943l1809j6958O0751O737m4279l0775
477b8159Q656L3187J4308l4429k3532N7387l538j7137Q1046j351p5511l9178K4104
464d147J7838M3732k7748j0898L0403J6905L544J7941J9798r711n1541o6963l3288
451e4135R5304M4885m0699o7140k8514m8493k1242M4163J0597M409M6982j5878
$$ plain form
439 -29761 31697 83552 65982 -19302 -28876 36105 75603 60988 59455 86173 80619 87514 73175
426 73175 50792 23627 23496 29379 9826 51397 69745 115077 124790 96514 53476 49161 57405
413 57405 51654 14004 53287 82199 84411 117724 134545 89171 136413 109850 84696 67310
401 67310 30905 57024 33538 -26779 -3089 14074 -44666 -11468 12036 23229 28905 42690
389 42690 37362 63477 -32332 -19237 26045 45950 -7537 -5765 32306 -3898 -28972 -63307
377 -63307 -49716 -19282 2510 75381 75410 104305 82676 78417 87729 114129 69490 32263 127379
364 127379 31683 47632 76124 101757 93900 48101 74264 71968 95733 94952 25829 -40313 -31619
351 -31619 50834 90693 73245 38409 114093 113441 57658 62228 57224 84588 54237 78775 94525
$$ packed form
439b9761O1458N1855j7570q5284r574O4981L9498j4615j533K6718n554O895j4339
426G3175k2383k7165j31N883j9553M1571J8348M5332R713k8276m3038m315Q244
413E7405n751l7650L9283K8912K212L3313J6821m5374M7242k6563k5154j7386
401F7310l6405K6119k3486o0317K3690J7163n8740L3198K3504J1193N676J3785
389D2690n328K6115r5809J3095M5282J9905n3487J772L8071l6204k5074l4335
377f3307J3591L0434K1792P2871K9K8895k1629m259R312K6400m4639l7227R5116
364A27379r5696J5949K8492K5633p857m5799K6163k296K3765p81o9123o6142Q694
351c1619Q2453L9859j7448l4836P5684o52n5783M570n004K7364l0351K4538J5750
$$ plain form
338 94525 108337 103738 94955 115109 118670 78249 44040 20246 54747 11821 30817 55108 47196
325 47196 5407 20773 13972 61991 120880 138457 93359 51705 53633 28860 20112 53396 49486
312 49486 71780 58311 33490 89595 99622 97406 100455 107161 134784 109928 82437 45372 73507
299 73507 28666 -33372 14759 57026 36626 -32692 -50358 39865 102182 121670 113335 69248
287 69248 77821 68397 42233 48617 87920 74829 72918 12450 24274 75123 88789 163378 204819
274 204819 90763 25588 -21321 33342 63867 111029 69796 55697 35033 35479 17525 22100
262 22100 47129 11325 53658 19999 -24461 -15838 -247 -612 -48502 -27416 -18244 -397 3886
249 3886 6036 86869 87005 26026 58526 53404 -119 18310 31823 47714 35124 21150 -43036
$$ packed form
338I4525J3812m599q783K0154L561m0421l4209k3794L4501m2926J8996K4291p912
325D7196m1789J5366o801M8019N8889J7577m5098m1654J928k4773q748L3284l910
312D9486K2294j3469k4821N6105J0027k216L049O706K7623k4856k7491l7065K8135
299G3507m4841o2038M8131M2267k0400o9318j7666R0223O2317J9488q335m4087
287F9248Q573r424k6164O384L9303j3091j911o0468J1824N0849J3666P4589M1441
274B04819j14056o5175m6909N4663L0525M7162m1233j4099k0664M46j7954M575
262B2100K5029l5804M2333l3659m4460Q623J5591l65m7890K1086R172J7847M283
249C886K150Q0833J36o0979L2500n122n3523J8429J3513J5891j2590j3974o4186
$$ plain form
236 -43036 -67986 55380 63212 106563 150719 167705 101703 116914 105297 85883 80289 85189
224 85189 83933 123268 108807 48197 106127 82903 61307 67705 84188 44820 4320 19116
212 19116 85388 94373 26756 -18625 -7417 108713 138957 158344 123279 101335 62410 111264
200 111264 111243 129145 178449 95049 92998 34743 55028 92682 135092 101474 20328 40952 5821
187 5821 -8951 105437 77233 95460 108551 69720 56500 79731 82765 95328 50193 102022
175 102022 74797 101763 98169 14708 -67646 2354 64565 75726 97045 50433 65620 101172
163 101172 70928 47097 69810 133213 127865 93395 47821 40475 64624 77213 44211 44854 39789
150 39789 91927 136216 127530 107558 71467 39395 70182 72629 50510 5303 11582 109950 73790
$$ packed form
236d3036k4950J23366P832M3351M4156J6986o6002J5211j1617j9414n594M900
224H5189j256L9335j4461o0610N7930k3224k1596O398J6483l9368m0500J4796
212A9116O6272Q985o7617m5381J1208J16130L0244J9387l5065k1944l8925M8854
200A11264k1J7902M9304q3400k051n8255K0285L7654M2410l3618q1146K0624l5131
187E821j4772J14388k8204J8227J3091l8831j3220K3231L034J2563m5135N1829
175A02022k7225K6966l594q3461q2354P0000O2211J1161K1319m6612J5187L5552
163A01172l0244k3831K2713O3403n348l4470m5574p346K4149J2589l3002O43n065
150C9789N2138M4289q686j9972l6091l2072L0787K447k2119m5207O279R8368l6160
$$ plain form
137 73790 36530 71454 114746 99458 59526 70162 67073 7284 2744 42148 89855 101014
125 101014 112620 92031 89636 76193 84846 133530 134957 147170 137380 90851 82564 61724 36042
112 36042 36829 22148 12336 26472 39196 43349 38344 103596 66054 71465 78309 53352 37344
99 37344 90790 159114 122410 46952 93014 117033 164977 143090 68598 101352 100618 16574 -6733
86 -6733 22699 75604 104023 111001 54241 31540 63681 53915 41356 54360 32005 38964 70107
73 70107 121085 114965 86561 104615 79232 117135 115058 142516 146344 114105 119928 87639 45412
60 45412 29405 55484 46204 21357 37268 27092 53494 41590 10273 92912 102592 80468 82708
47 82708 96805 100356 102316 61174 54538 41891 83267 112478 107459 71605 51407 94633 86357
$$ packed form
137G3790l7260L4924M3292j5288l9932J0636l089n9789m540L9404M7707J1159
125A01014J1606k0589k395j3443Q653M8684J427J2213r790m6529q287k0840k5682
112C6042P87j4681r812J4136J2724M153n005O5252l7542N411O844k4957j6008
99C7344N3446O8324l6704p5458M6062K4019M7944k1887p4492L2754p34q4044k3307
86f733K9432N2905K8419O978n6760k2701L2141r766j2559J3004k2355O959L1143
73G0107N0978o120k8404J8054k5383L7903k077K7458L828l2239N823l2289m2227
60D5412j6007K6079r280k4847J5911j0176K6402j1904l1317Q2639R680k2124K240
47H2708J4097L551J960m1142o636j2647M1376K9211n019l5854k0198M3226q276
$$ plain form
34 86357 80691 79244 62277 107929 102906 78650 103478 98984 78295 94663 122864 54985 56503
21 56503 82589 100854 92887 116910 107502 93915 94276 92350 99948 76318 68352 46061 28796 83809
7 83809 56553 94722 130558 104245 83448 110801 64506
0 64506
$$ packed form
34H6357n666j447j6967M5652n023k4256K4828m494k0689J6368K8201o7879J518
21E6503K6086J8265p967K4023r408j3587L61j926P598k3630p966k2291j7265N5013
7H3809k7256L8169L5836k6313k0797K7353m6295
0F4506
$$ Imaginary data points
##PAGE= N=2
##DATA TABLE= (X++(I..I)), XYDATA
$$ plain form
16383 -2237418 -2189129 -2181376 -2145245 -2133700 -2090734 -2036965 -2023541 -2018025 -1956517 -1890068 -1936287 -1885733
16371 -1885733 -1830428 -1823758 -1740666 -1666448 -1703618 -1721385 -1693828 -1657332 -1639020 -1552127 -1530781
16360 -1530781 -1532547 -1518872 -1489883 -1461864 -1427084 -1418911 -1324061 -1330509 -1298834 -1252380 -1229223 -1147017
16348 -1147017 -1135530 -1142831 -1128830 -1074679 -1035623 -1040402 -975346 -916772 -887586 -846712 -827685 -814705
16336 -814705 -765936 -753103 -715878 -668447 -602818 -560990 -620861 -584692 -555153 -548942 -534588 -483419
16324 -483419 -443830 -407543 -343386 -350415 -369728 -301240 -252403 -282470 -239570 -180010 -145539 -108431
16312 -108431 -86987 -60513 -73751 -67014 -28772 -8669 20698 104226 102333 177352 171455 191349
16300 191349 232149 233448 238354 236929 275432 330559 363180 352723 362342 388744 367765 362565
$$ packed form
16383b237418M8289P753L6131J1545M2966N3769J3424N516O1508O6449m6219N0554
16371a885733N5305O670Q3092P4218l7170j7767K7557L6496J8312Q6893K1346
16360a530781j766J3675K8989K8019L4780Q173R4850o448L1675M6454K3157Q2206
16348a147017J1487p301J4001N4151L9056m779O5056N8574K9186M0874J9027J2980
16336h14705M8769J2833L7225M7431O5629M1828n9871L6169K9539O211J4354N1169
16324d83419L9589L6287O4157p029j9313O8488M8837l0067M2900N9560L4471L7108
16312a08431K1444K6474j3238O737L8242K0103K9367Q3528j893P5019n897J9894
16300A91349M0800J299M906j425L8503N5127L2621j0457R619K6402k0979n200
$$ plain form
16288 362565 383845 459556 521717 516183 569899 597191 670809 658349 643822 706756 714298 696995
16276 696995 734017 764745 758007 752668 784684 842649 902115 923825 924843 956149 975574 1001478
16264 1001478 1025640 998090 966244 1000404 1031068 1021582 1107257 1163195 1174688 1217403 1242364
16253 1242364 1272154 1310604 1256235 1282856 1319141 1315746 1339504 1331135 1296364 1326606 1324434 1352114
16241 1352114 1393037 1443061 1458715 1457624 1481867 1512142 1539138 1576896 1567893 1527461 1560854 1614135
16229 1614135 1622677 1644941 1665889 1686376 1734909 1699607 1697525 1701300 1700724 1749408 1752923 1754379 1786939
16216 1786939 1769555 1805657 1804543 1811238 1831279 1857569 1839415 1849301 1915285 1919895 1892734 1876538
16204 1876538 1919867 1943260 1896034 1888252 1897085 1914494 1959761 1969227 1972458 2023654 2095993 2152941
$$ packed form
16288C62565K1280P5711O2161n534N3716K7292P3618j2460j4527O2934P542j7303
16276F96995L7022L0728o738n339L2016N7965N9466K1710J018L1306J9425K5904
16264A001478K4162k7550l1846L4160L0664r486Q5675N5938J1493M2715K4961
16253A242364K9790L8450n4369K6621L6285l395K3758q369l4771L0242k172K7680
16241A352114M0923N0024J5654j091K4243L0275K6996L7758r003m0432L3393N3281
16229A614135Q542K2264K0948K0487M8533l5302k082L775n76M8684L515J456L2560
16216A786939j7384L6102j114O695K0041K6290j8154R886O5984M610k7161j6196
16204A876538M3329K3393m7226p782Q833J7409M5267R466L231N1196P2339N6948
$$ plain form
16192 2152941 2142264 2154670 2052599 2056157 2070296 2147454 2159489 2158143 2190629 2246790 2231153
16181 2231153 2240614 2187819 2140629 2185206 2198556 2162995 2206934 2251149 2209994 2244782 2279831
$$ packed form
16192B152941j0677J2406j02071L558J4139P7158J2035j346L2486N6161j5637
16181B231153R461n2795m7190M4577J3350l5561M3939M4215m1155L4788L5049
$$ [...]
##END NTUPLES=NMR SPECTRUM
##END=
