##TITLE=1H_DE-80H_X3
 200.13MHz, d2o
 8 sc
 
 19ns.26.2.2025
##JCAMPDX= 6.0         $$ Bruker NMR JCAMP-DX V2.0
##DATA TYPE= NMR SPECTRUM
##DATA CLASS= NTUPLES
##ORIGIN= UXNMR, Bruker Analytische Messtechnik GmbH
##OWNER= pz
$$ XWIN-NMR		Version 3.5
$$ Wed Mar 25 10:25:38 2026 Russian Standard Time (UT+4h)  Yarkov@DPX200
##.OBSERVE FREQUENCY= 200.1313
##.OBSERVE NUCLEUS= ^1H
##.ACQUISITION MODE= SIMULTANEOUS
##.ACQUISITION SCHEME= undefined
##.AVERAGES= 8
##.DIGITISER RES= 18
##SPECTROMETER/DATA SYSTEM= spect
##.PULSE SEQUENCE= zg30
##.SOLVENT NAME= CDCl3
##.SHIFT REFERENCE= (INTERNAL, CDCl3, 0, 15.4714)
##AUDIT TRAIL= $$ (NUMBER, WHEN, WHO, WHERE, WHAT)
$$ ##TITLE= Audit trail, XWIN-NMR		Version 3.5
$$ ##JCAMPDX= 5.01
$$ ##ORIGIN= Bruker BioSpin GmbH
$$ ##OWNER= Yarkov
$$ C:/Bruker/XWIN-NMR/data/yarkov2/nmr/H-C/1/pdata/1/auditp.txt
$$ ##AUDIT TRAIL=  $$ (NUMBER, WHEN, WHO, WHERE, WHAT)
(   1,<2026-03-25 10:24:45.26 +0400>,<Yarkov>,<DPX200>,
      <created by zg, POWCHK disabled, PULCHK disabled
       configuration hash MD5:
       00 E9 B6 7A A2 85 ED C7 34 08 36 98 17 FE 4E 26
       data hash MD5: 16K
       41 B6 FB 35 9E 77 EA 48 5D B3 73 07 0E A9 6B 09>)
(   2,<2026-03-25 10:24:51.90 +0400>,<Yarkov>,<DPX200>,
      <Start of raw data processing
       efp BC_mod = 2 LB = 0.25 FT_mod = 6 PKNL = 1 PHC0 = -5299.148 PHC1 = 6.821927 SI = 16K 
       data hash MD5: 16K
       79 C7 6D 4C 33 34 15 3A D8 22 65 EA B6 33 18 68>)
$$ ##END=
$$ 
$$ hash MD5
$$ 9D CE 11 0C B1 B7 72 1D D9 6A B3 E0 32 E1 62 93
##$RELAX= 
##$RELAX= 
##$RELAX= 
##$RELAX= 
##$RELAX= 
##$RELAX= 
$$ Bruker specific parameters
$$ --------------------------
##$DU= <C:/Bruker/XWIN-NMR>
##$EXPNO= 1
##$NAME= <H-C>
##$PROCNO= 1
##$TYPE= <nmr>
##$USER= <yarkov2>
##$AMP= (0..31)
100 100 100 100 100 100 100 100 100 100 100 100 100 100 100 100 100 100 
100 100 100 100 100 100 100 100 100 100 100 100 100 100 
##$AQSEQ= 0
##$AQ_mod= 1
##$AUNM= <au_zg>
##$AUTOPOS= <>
##$BF1= 200.13
##$BF2= 200.13
##$BF3= 200.13
##$BF4= 200.13
##$BF5= 200.13
##$BF6= 200.13
##$BF7= 200.13
##$BF8= 200.13
##$BYTORDA= 1
##$CFDGTYP= 0
##$CFRGTYP= 5
##$CHEMSTR= <none>
##$CNST= (0..31)
1 1 145 1 1 1 1 1 1 1 1 1 1 1 1 1 1 1 1 1 1 1 1 1 1 1 1 1 1 1 1 1 
##$CPDPRG= <>
##$CPDPRG1= <>
##$CPDPRG2= <>
##$CPDPRG3= <>
##$CPDPRG4= <mlev>
##$CPDPRG5= <mlev>
##$CPDPRG6= <mlev>
##$CPDPRG7= <mlev>
##$CPDPRG8= <mlev>
##$CPDPRGB= <>
##$CPDPRGT= <>
##$D= (0..31)
0 0.7 0 0 0 0 0 0 0 0 0 0.03 0 0 0 0 0 0 0 0 0 0 0 0 0 0 0 0 0 0 0 0 
##$DATE= 1774419884
##$DBL= (0..7)
120 120 120 120 120 120 120 120 
##$DBP= (0..7)
150 150 150 150 150 150 150 150 
##$DBP07= 0
##$DBPNAM0= <>
##$DBPNAM1= <>
##$DBPNAM2= <>
##$DBPNAM3= <>
##$DBPNAM4= <>
##$DBPNAM5= <>
##$DBPNAM6= <>
##$DBPNAM7= <>
##$DBPOAL= (0..7)
0.5 0.5 0.5 0.5 0.5 0.5 0.5 0.5 
##$DBPOFFS= (0..7)
0 0 0 0 0 0 0 0 
##$DE= 6
##$DECBNUC= <off>
##$DECIM= 32
##$DECNUC= <off>
##$DECSTAT= 4
##$DIGMOD= 1
##$DIGTYP= 9
##$DL= (0..7)
0 120 120 120 120 120 120 120 
##$DP= (0..7)
$$ [...]
##$SUBNAM2= <"">
##$SUBNAM3= <"">
##$SUBNAM4= <"">
##$SUBNAM5= <"">
##$SUBNAM6= <"">
##$SUBNAM7= <"">
##$SUBNAM8= <"">
##$SUBNAM9= <"">
##$SW= 18.0517328524113
##$SWIBOX= (0..15)
0 0 2 0 0 0 0 0 0 0 0 0 0 0 0 0 
##$SW_h= 3612.71676300578
##$TD= 16384
##$TD0= 1
##$TE= 0
##$TE2= 300
##$TE3= 300
##$TEG= 300
##$TL= (0..7)
0 120 120 120 120 120 120 120 
##$TP= (0..7)
150 150 150 150 150 150 150 150 
##$TP07= 0
##$TPNAME0= <>
##$TPNAME1= <>
##$TPNAME2= <>
##$TPNAME3= <>
##$TPNAME4= <>
##$TPNAME5= <>
##$TPNAME6= <>
##$TPNAME7= <>
##$TPOAL= (0..7)
0.5 0.5 0.5 0.5 0.5 0.5 0.5 0.5 
##$TPOFFS= (0..7)
0 0 0 0 0 0 0 0 
##$TUNHIN= 0
##$TUNHOUT= 0
##$TUNXOUT= 0
##$USERA1= <user>
##$USERA2= <user>
##$USERA3= <user>
##$USERA4= <user>
##$USERA5= <user>
##$V9= 5
##$VALIST= <valist>
##$VCLIST= <CCCCCCCCCCCCCCC>
##$VD= 0
##$VDLIST= <DDDDDDDDDDDDDDD>
##$VPLIST= <PPPPPPPPPPPPPPP>
##$VTLIST= <TTTTTTTTTTTTTTT>
##$WBST= 1024
##$WBSW= 4
##$XGAIN= (0..3)
0 0 0 0 
##$XL= 0
##$YL= 0
##$YMAX_a= 135640
##$YMIN_a= -126808
##$ZGOPTNS= <>
##$ZL1= 120
##$ZL2= 120
##$ZL3= 120
##$ZL4= 120
##$ABSF1= 0
##$ABSF2= 0
##$ABSG= 0
##$ABSL= 0
##$ALPHA= 0
##$AQORDER= 0
##$ASSFAC= 0
##$ASSFACI= 0
##$ASSFACX= 0
##$ASSWID= 0
##$AUNMP= <proc_1d>
##$AZFE= 0.1
##$AZFW= 0.1
##$BCFW= 0
##$BC_mod= 2
##$BYTORDP= 0
##$COROFFS= 0
##$CY= -3
##$DATMOD= 1
##$DC= 0
##$DFILT= <>
##$DTYPP= 0
##$F1P= 0
##$F2P= 0
##$FCOR= 1
##$FTSIZE= 16384
##$FT_mod= 6
##$GAMMA= 0
##$GB= 0
##$INTBC= 1
##$INTSCL= 3.241238e-09
##$ISEN= 128
##$LB= 0.25
##$LEV0= 0
##$LPBIN= 0
##$MAXI= 10000
##$MC2= 0
##$MEAN= 0
##$ME_mod= 0
##$MI= 1.114404
##$NCOEF= 0
##$NC_proc= -8
##$NLEV= 6
##$NOISF1= 3.799351
##$NOISF2= 2.8
##$NSP= 0
##$NTH_PI= 0
##$NZP= 0
##$OFFSET= 15.47144
##$PC= 1
##$PHC0= -5299.148
##$PHC1= 6.821927
##$PH_mod= 1
##$PKNL= yes
##$PPARMOD= 0
##$PSCAL= 0
##$PSIGN= 0
##$REVERSE= no
##$SF= 200.130010059566
##$SI= 16384
##$SIGF1= 3
##$SIGF2= 2
##$SINO= 0.751879
##$SIOLD= 32768
##$SREGLST= <19F.Aceton>
##$SSB= 0
##$STSI= 16384
##$STSR= 0
##$SW_p= 3612.71676300578
##$SYMM= 0
##$S_DEV= 0
##$TDeff= 16384
##$TDoff= 0
##$TI= <>
##$TILT= no
##$TM1= 0
##$TM2= 0
##$TOPLEV= 0
##$USERP1= <user>
##$USERP2= <user>
##$USERP3= <user>
##$USERP4= <user>
##$USERP5= <user>
##$WDW= 1
##$XDIM= 16384
##$YMAX_p= 316624631
##$YMIN_p= -1289879
$$ End of Bruker specific parameters
$$ ---------------------------------
##NTUPLES= NMR SPECTRUM
##VAR_NAME=  FREQUENCY,     SPECTRUM/REAL,   SPECTRUM/IMAG
##SYMBOL=    X,             R,               I
##VAR_TYPE=  INDEPENDENT,   DEPENDENT,       DEPENDENT
##VAR_FORM=  AFFN,          ASDF,            ASDF
##VAR_DIM=   16384,         16384,           16384
##UNITS=     HZ,            ARBITRARY UNITS, ARBITRARY UNITS
##FACTOR=    0.220516191357247, 1,           1
##FIRST=     3096.29950592627, 0,            0
##LAST=      -516.417257079507, 0,           0
##MIN=       -516.417257079507, -1289879,    0
##MAX=       3096.29950592627, 316624631,    0
$$ Real data points
##PAGE= N=1
##DATA TABLE= (X++(R..R)), XYDATA
$$ [...]
5828A7968019k46875l97087o67911k56973m16563r9420o96823o57771o18355o17750
$$ 17968019 17721144 17324057 16656146 16399173 15982610 15883190 15186367 14528596 13910241 13292491
5818A3292491o83018q98262n30111m64483o03593n80007o25602m33711k44878
$$ 13292491 12609473 11711211 11181100 10716617 10113024 9533017 8907415 8473704 8228826
5809H228826k33561k71280n061k62805k56691k03821j04241k20558k13239j92554
$$ 8228826 7995265 7723985 7718924 7456119 7199428 6995607 6891366 6670808 6457569 6265015
5799F265015q7548k22727n25859m10897n09027j92366k5184k09217l02223o8796
$$ 6265015 6177467 5954740 5428881 5017984 4508957 4316591 4291407 4082190 3779967 3711171
5789C711171k11626k77719j33453j21159m01464j01976p2990P0656j3896J23477
$$ 3711171 3499545 3221826 3088373 2967214 2565750 2463774 2390784 2461440 2447544 2571021
5779B571021N9418j12540k35585K24386N1593k50702j19140q4523K26819O5642
$$ 2571021 2630439 2517899 2282314 2506700 2558293 2307591 2188451 2103928 2330747 2396389
5769B396389j52061J28802n7786j14055K4082k80073J6645L6828K7152K18768
$$ 2396389 2244328 2373130 2315344 2201289 2225371 1945298 1961943 1998771 2025923 2244691
5759B244691j40732K5904J14858Q535j15198k87413R6972q9240n5531K05844L6451
$$ 2244691 2103959 2129863 2244721 2253256 2138058 1850645 1947617 1858377 1802846 2008690 2045141
5748B045141o3393M9405k16469J54179K48920j94618r9282j31708j51477M6437
$$ 2045141 1981748 2031153 1814684 1968863 2217783 2023165 1923883 1792175 1640698 1687135
5738A687135L21902J85093j50417L3612J37311m9758J35559p0840L2343R6230
$$ 1687135 2009037 2194130 2043713 2077325 2214636 2164878 2300437 2229597 2261940 2358170
5728B358170K93130J38354O9027j6917o5651L8927j98325Q1079N7950M220q5580
$$ 2358170 2651300 2789654 2858681 2841764 2776113 2815040 2616715 2697794 2755744 2759964 2674384
5717B674384n5015Q7037j99500k37697M0567j35606K05062r474k58385J80212
$$ 2674384 2619369 2706406 2506906 2269209 2309776 2174170 2379232 2369758 2111373 2291585
5707B291585Q3666J82421j74360J04457O1105J89553j6907M38832j32150M1689
$$ 2291585 2375251 2557672 2383312 2487769 2548874 2738427 2721520 3160352 3028202 3069891
5697C069891R1002K6928j35882p3049n7299L98292j32824k16943j59959J00867
$$ 3069891 3160893 3187821 3051939 2978890 2921591 3319883 3187059 2970116 2810157 2911024
5687B911024J51988k20314j33848j30033j03620j60031J106q6518Q4357k54393
$$ 2911024 3063012 2842698 2708850 2578817 2475197 2315166 2316272 2229754 2314111 2059718
5677B059718K98982K7537j08095K06501l43220j01076L30043j83895j89237K8914
$$ 2059718 2358700 2386237 2278142 2484643 2141423 2040347 2370390 2186495 1997258 2026172
5667B026172j2481M9282L00978l06368k28278J0633M45059O5764j58916k5712
$$ 2026172 2013691 2062973 2363951 2057583 1829305 1839938 2284997 2350761 2191845 2166133
5657B166133L0758j31050N5932j17175R7364k03886j5804K01579M4751j09700
$$ 2166133 2196891 2065841 2121773 2004598 2101962 1898076 1882272 2083851 2128602 2018902
5647B018902k17702P112L66948L9841o0332q1079j03598L8621o7714j7665J48134
$$ 2018902 1801200 1808312 2175260 2215101 2154769 2073690 1970092 2008713 1940999 1923334 2071468
5636B071468o8462J65991k07192L037K42829J45369k6602j3258J49235N5526l50670
$$ 2071468 2003006 2168997 1961805 1964842 2207671 2353040 2326438 2313180 2462415 2517941 2167271
5625B167271K24995P3187r5533j58170n7177n9955J39885K97917j44006k36922
$$ 2167271 2392266 2465453 2369920 2211750 2154573 2094618 2234503 2532420 2388414 2151492
5615B151492J7372R6491r5244K33158L0842r8744M8321n7614J28900Q2071j73036
$$ 2151492 2168864 2265355 2170111 2403269 2434111 2335367 2383688 2326074 2454974 2537045 2364009
5604B364009J8103J62647N7781q2726j4654l6269J32897r969N9651j89357L4927
$$ 2364009 2382112 2544759 2602540 2519814 2505160 2468891 2601788 2591819 2651470 2462113 2497040
5593B497040J52732j57758j77613j0284q6999J30918K42770q1852N4841m6982
$$ 2497040 2649772 2492014 2314401 2304117 2217118 2348036 2590806 2508954 2563795 2516813
5583B516813j36107R1400j24643R2819r3549m1230k04130Q4716L18699J14168
$$ 2516813 2380706 2472106 2347463 2440282 2346733 2305503 2101373 2186089 2504788 2618956
5573B618956j02258j46460K53098j4783k93596o3512K00474l5576j07332R8456
$$ 2618956 2516698 2370238 2623336 2608553 2314957 2251445 2451919 2416343 2309011 2407467
5563B407467K10666K32052j93274K089n0516J22212r3328j80264j11164P6705
$$ 2407467 2618133 2850185 2656911 2659000 2608484 2730696 2637368 2457104 2345940 2422645
5553B422645j41607M52463k03617J85096J07685P4439j40911j46077J9196j40513
$$ 2422645 2281038 2733501 2529884 2714980 2822665 2897104 2756193 2610116 2629312 2488799
5543B488799K73104o2716K0079k09406p4044o6607j06211R472M77178K72342j16284
$$ 2488799 2761903 2699187 2719266 2509860 2435816 2369209 2262998 2272470 2749648 3021990 2905706
5532B905706l07389j79467J61288j57297j250J17150j6387J54203J26940j2973
$$ 2905706 2598317 2418850 2580138 2422841 2421591 2538741 2522354 2676557 2803497 2790524
5522B790524l01383j941R9124L47881k4843k79873P3457K29701r9585j92630K2096
$$ 2790524 2489141 2487200 2586324 2934205 2909362 2629489 2702946 2932647 2833062 2640432 2662528
5511B662528o4770R1305K23291R065j31990r6538n6095K44683n0097k7789J40862
$$ 2662528 2597758 2689063 2912354 2921419 2789429 2692891 2636796 2881479 2831382 2803593 2944455
5500B944455p757q9251j80159k202K94703k91369k4150K64816J69211l60603o9712
$$ 2944455 2936698 2847447 2667288 2665086 2959789 2668420 2644270 2909086 3078297 2717694 2647982
5489B647982L19862k04537O7709j40625k9288k545J35215l80505P8525J01153
$$ 2647982 2967844 2763307 2831016 2690391 2661103 2658558 2793773 2413268 2491793 2592946
5479B592946L1901K17873J91760k5035j8913r5024n134L6438j73066J45649P0572
$$ 2592946 2624847 2842720 3034480 3009445 2990532 2895508 2890374 2926812 2753746 2899395 2969967
5468B969967j95155L0082J0613o5430l9878M7608J87716Q2709k36943j06937J28940
$$ 2969967 2774812 2804894 2815507 2750077 2710199 2757807 2945523 3028232 2791289 2684352 2813292
5457B813292L7172m4369j32818r3408K36177j23370m25177K93973L88211p4826
$$ 2813292 2850464 2806095 2673277 2579869 2816046 2692676 2267499 2561472 2949683 2874857
5447B874857j15920J89288k0395n8807k5224o8831j12932M5466j36175m6816K70006
$$ 2874857 2758937 2948225 2927830 2869023 2843799 2774968 2662036 2707502 2571327 2524511 2794517
5436B794517K94909P5772j35264N662m9774l8557l5481k10597L3258K23467j70835
$$ 2794517 3089426 3165198 3029934 3035596 2985822 2947265 2911784 2701187 2734445 2957912 2787077
5425B787077n2450J85009j1404r2689K12627r3834J43882j19856j86324K14709
$$ 2787077 2734627 2919636 2908232 2815543 3028170 2934336 3078218 2958362 2772038 2986747
5415B986747j57154J61836n8427n47907K87206K07779o214p8716L53054K04988
$$ 2986747 2829593 2991429 2933002 2385095 2672301 2880080 2873866 2795150 3148204 3353192
5405C353192n65544n5353K05616R1831K10112l80760J59137K81406k24284k14851
$$ 3353192 2787648 2732295 2937911 3029742 3239854 2859094 3018231 3299637 3075353 2860502
5395B860502l38359O5784L0893M68859J17802j16188p937O2943J09100j3456j34343
$$ 2860502 2522143 2587927 2618820 3087679 3205481 3089293 3081356 3144299 3253399 3239943 3105600
5384C105600p9034M4542K22116k27354n9875J16486M0739O8897j79094l63578
$$ 3105600 3026566 3071108 3293224 3065870 3005995 3122481 3163220 3232117 3053023 2689445
5374B689445Q086K31220k3462J00522J50476N6719r4463j84074J27151J21459
$$ 2689445 2697531 2928751 2905289 3005811 3156287 3213006 3118543 2934469 3061620 3183079
5364C183079O0701l64932R5756J56847o0756J27529j03023K9581k8859L6222l9602
$$ 3183079 3243780 2878848 2974604 3131451 3070695 3198224 3095201 3124782 3095923 3132145 3092543
5353C092543J8114J06086n1799N2659k1773M0363J15553k25803J64190J43391
$$ 3092543 3110657 3216743 3164944 3217603 3195830 3236193 3351746 3125943 3290133 3433524
5343C433524j92453k70581K37244N3804O3401o1274q6712j9173J17702K57496
$$ 3433524 3241071 2970490 3207734 3261538 3324939 3263665 3176953 3157780 3275482 3532978
5333C532978j44749k84861j18978L0013J59596K33338l0996j39753N9701L4888
$$ 3532978 3388229 3103368 2984390 3014403 3173999 3407337 3376341 3236588 3296289 3331177
5323C331177p8312k23455J15219Q1219k94227L44930P4934n4405j3741k21953
$$ 3331177 3252865 3029410 3144629 3225848 2931621 3276551 3351485 3297080 3283339 3061386
5313C061386K63236j08684k17400N9459N4818k1883k0500M7496k15804J03008
$$ 3061386 3324622 3215938 2998538 3057997 3112815 3090932 3070432 3117928 2902124 3005132
5303C005132N2050J1845p7613k32349N5560K01717J76170J4991J10398M288o2728
$$ 3005132 3057182 3069027 2991414 2759065 2814625 3016342 3192512 3207503 3317901 3322189 3259461
5292C259461M7937k46961j69765j18532K64960L2934q410J83378O640j50432j7602
$$ 3259461 3307398 3060437 2890672 2772140 3037100 3070034 3061624 3245002 3251642 3101210 3083608
5281C083608K48989n5659k21043J50674j61735Q1370n4347L5729M3808K86255
$$ 3083608 3332597 3276938 3055895 3206569 3044834 3126204 3071857 3107586 3151394 3437649
5271C437649j03023k59963K50538J18161N3353J64665k31847k21309K72706L1233
$$ 3437649 3334626 3074663 3325201 3443362 3496715 3661380 3429533 3208224 3480930 3512163
5261C512163J06092J5523l06986r364J56576q45n6964K64412k16022j43849j0414
$$ 3512163 3618255 3633778 3326792 3317428 3474004 3473159 3416195 3680607 3464585 3320736 3310322
5250C310322L72389j56175l42802L47319O476k33634n0190M9273J2319J0545l11795
$$ 3310322 3682711 3526536 3183734 3531053 3537529 3303895 3253705 3302978 3315297 3325842 3014047
5239C014047J71378q1090j4992J10357J98023J63578k32772q3990P9066K14427
$$ 3014047 3185425 3104335 3089343 3199700 3397723 3561301 3328529 3244539 3323605 3538032
5229C538032j10273k96006K18019M7280K5438j97771J20759M9176O0763j47920
$$ 3538032 3427759 3131753 3349772 3397052 3422490 3224719 3345478 3394654 3455417 3307497
5219C307497L366p9792J76332j50159K3609J2909o1722J19202J48458j50831r351
$$ 3307497 3310863 3231071 3407403 3257244 3280853 3293762 3232040 3351242 3499700 3348869 3339518
5208C339518K58821j36524l91118K6019R4570N2966k8504K95207k80634P1355
$$ 3339518 3598339 3461815 3070697 3096716 3191286 3244252 3215748 3510955 3230321 3301676
5198C301676L56996l18723r3923r8760M6326j88046J04087j15772K041R7150K9247
$$ 3301676 3658672 3339949 3246026 3147266 3193592 3005546 3109633 2993861 2995902 3093052 3122299
5187C122299K29193M4495p3355l12865K8446j02607P148J64966J71413J65690
$$ 3122299 3351492 3395987 3322632 3009767 3038213 2935606 2942754 3107720 3279133 3444823
5177C444823j16205n71762P2726L25490n2135j76999O6988M2413k25882o0638
$$ 3444823 3328618 2756856 2829582 3155072 3102937 2925938 2992926 3035339 2809457 2748819
5167B748819J09999L30632M7631N1032p3982K07401n5535P0925k73634j08307
$$ 2748819 2858818 3189450 3237081 3288113 3214131 3421532 3365997 3436922 3163288 3054981
5157C054981K04431J30347q0417q1032K2027p549L2954j36710k20418K51064j49326
$$ 3054981 3259412 3389759 3309342 3228310 3250337 3242788 3275742 3139032 2918614 3169678 3020352
5146C020352J35748j03772J31131j12387M8352K28806R3995q9372J7829N2057
$$ 3020352 3156100 3052328 3183459 3071072 3119424 3348230 3442225 3352853 3370682 3422739
5136C422739O4858K19110j39515p4318K0635l21725R6642J75505k10951m9448
$$ 3422739 3487597 3706707 3567192 3492874 3513509 3191784 3288426 3463931 3252980 3203532
5126C203532J26396K67748n0711m3947q0488J21751J97363R493k38776r2492P1271
$$ 3203532 3329928 3597676 3546965 3503018 3422530 3544281 3741644 3751137 3512361 3419869 3491140
5115C491140P4598o9157k90425L6743K2951j0411M9844j04585L28837o3055n0932
$$ 3491140 3565738 3496581 3206156 3242899 3265850 3255439 3305283 3200698 3529535 3466480 3415548
5104C415548P8569k78214p269K44526J15799k24841m6893j44785j010J81551j48497
$$ 3415548 3494117 3215903 3208634 3453160 3568959 3344118 3297225 3152440 3151430 3332981 3184484
5093C184484K84717r891k00817j63583L40028K83607o6891l9559k6191j34167
$$ 3184484 3469201 3459310 3258493 3094910 3434938 3718545 3651654 3612095 3585904 3451737
5083C451737p3002k23328J39637J26627k30478J38153K2111N3819L01827K10933
$$ 3451737 3378735 3155407 3295044 3421671 3191193 3329346 3351457 3405276 3707103 3918036
5073C918036K10227m87843r9790J80401j0617n54N2366p4483O5235k04289k60672
$$ 3918036 4128263 3640420 3540630 3721031 3710414 3709860 3762226 3687743 3752978 3548689 3288017
5062C288017N4908L50926j56467J55785J17728J2029K10322P1215j11487j50338
$$ 3288017 3342925 3693851 3537384 3693169 3810897 3822926 4033248 4104463 3992976 3842638
5052C842638k6674K28155L08089k00231J6283j97496J91856Q9358J23293m26615
$$ 3842638 3815964 4044119 4352208 4151977 4168260 3970764 4162620 4251978 4375271 3948656
5042C948656R1551n1261j39723j39781L72156k92432j8265K73520l12853j49110
$$ 3948656 4040207 3988946 3849223 3709442 4081598 3789166 3770901 4044421 3731568 3582458
5032C582458j22362J23334Q8142j12100K99544j3038K40792j15183k02590P4547
$$ 3582458 3460096 3583430 3671572 3559472 3859016 3845978 4086770 3971587 3768997 3843544
5022C843544j88429R4868p3534L01662L72195j34980k36555j11012K17539o3595
$$ 3843544 3655115 3749983 3676449 3978111 4350306 4215326 3978771 3867759 4085298 4021703
5012D021703k5137r2613j81181K09266P5367k00208O8800m2386k23363P0190o6894
$$ 4021703 3996566 3903953 3722772 3932038 4007405 3807197 3875997 3833611 3610248 3680438 3613544
5001C613544N9117J6771O0409m978l073N3350j93869l7181M19155J25K0133k55675
$$ 3613544 3672661 3689432 3749841 3744863 3741790 3795140 3601271 3564090 3983245 3983370 4003503 3747828
4989C747828k1985l62595K13626K88345K5900j22519K8901J4432j83587J7876
$$ 3747828 3725843 3363248 3576874 3865219 3891119 3768600 3797501 3811933 3628346 3646222
4979C646222J45365N7558K368J25800n0531N9047K6138J10296j03328J00954J97674
$$ 3646222 3791587 3849145 3851513 3977313 3926782 3985829 4011967 4122263 4018935 4119889 4317563
4968D317563l26723L19754J07477L570j03178K10738L09203R7588J51824k16000
$$ 4317563 3990840 4310594 4418071 4421641 4318463 4529201 4838404 4935992 5087816 4871816
4958D871816j11059k0128n960K42165R9896N3605J66119J45422P2473q8891K1515
$$ 4871816 4760757 4740629 4734669 4976834 5076730 5130335 5296454 5441876 5514349 5425458 5446973
4947E446973L4472N4835K46612j6836L11296L29926l9583K06647K15644J59488
$$ 5446973 5481445 5536280 5782892 5766056 6077352 6407278 6367695 6574342 6789986 6949474
4937F949474J75214L3501Q9088L15550J67937o01K31663P2501M85253K43133j30719
$$ 6949474 7124688 7158189 7247277 7562827 7730764 7730163 7961826 8034327 8519580 8762713 8631994
4926H631994J16083J68512J13946L89354K69998r080k28075M72897J43599m15932
$$ 8631994 8748077 8916589 9030535 9419889 9689887 9680807 9452732 9925629 10069228 9653296
4916I653296L67762L72066L31285m5234K37586J39136L5967o8668J40755K01255
$$ 9653296 10021058 10393124 10724409 10679175 10916761 11055897 11091864 11023196 11163951 11365206
4906A1365206Q4729j31716n9200Q9138K06894o7298r5803j41065L15847J33953
$$ 11365206 11449935 11318219 11259019 11348157 11555051 11487753 11391950 11250885 11566732 11700685
4896A1700685p1501J21770J51193J57643L66900J04011J08112K77008Q73848L95975
$$ 11700685 11629184 11750954 11902147 12059790 12426690 12530701 12638813 12915821 13789669 14185644
4886A4185644K86850M19322N96352L86986N48829R77793Q02136J060143P47032
$$ 14185644 14472494 14891816 15488168 15875154 16423983 17401776 18203912 19264055 20011087
4877B0011087J065933J153030J356370J174938R74918J015823J263610J716689
$$ 20011087 21077020 22230050 23586420 24761358 25736276 26752099 28015709 29732398
4869B9732398J367580J208613J523227J424842J274371J468369J552674J641493
$$ 29732398 31099978 32308591 33831818 35256660 36531031 37999400 39552074 41193567
4861D1193567K069928J646022J369642K110584J850481K056751K231599J872575
$$ 41193567 43263495 44909517 46279159 48389743 50240224 52296975 54528574 56401149
4853E6401149J949277K181794K148161K108207K232361K148103K155130K150467
$$ 56401149 58350426 60532220 62680381 64788588 67020949 69169052 71324182 73474649
4845G3474649J916625K207700K140472K166853J768268J635398J416974J364466
$$ 73474649 75391274 77598974 79739446 81906299 83674567 85309965 86726939 88091405
4837H8091405J534526J221364J353258J001960M35453O91031O04596j795M4895
$$ 88091405 89625931 90847295 92200553 93202513 93637966 94328997 94933593 94931798 94976693
4828I4976693P2168m0356n10438m53682n37623q29515o17156r10868r80429j035883
$$ 94976693 95048861 95008505 94498067 94044385 93506762 92677247 92060091 91149223 90168794 89132911
4818H9132911j098668j125997j029515r72775j323552j433516j122858j191597
$$ 89132911 88034243 86908246 85878731 84905956 83582404 82148888 81026030 79834433
4810G9834433j145233p27662p24914q3986k90080r8351K10452K25018O62973J076472
$$ 79834433 78689200 77961538 77236624 77152638 76862558 76764207 76974659 77199677 77862650 78939122
4800G8939122J184212J702012J603601J625276J580798J837883J607442J932072
$$ 78939122 80123334 81825346 83428947 85054223 86635021 88472904 90080346 92012418
4792I2012418J483354J421621R27382Q93376Q72496O49202L19937J82881n2513
$$ 92012418 93495772 94917393 95844775 96738151 97610647 98259849 98579786 98762667 98710154
4783I8710154l47894j99828k87069K601J84061o2058K21979K2054L43601N72905
$$ 98710154 98362260 98162432 97875363 97877964 98062025 97999967 98221946 98244000 98587601 99160506
4773I9160506N37908Q88752R00277J250683J181683J258458J280872J301331J654532
$$ 99160506 99698414 100587166 101487443 102738126 103919809 105178267 106459139 107760470 109415002
4764A09415002J046101R71810J020501O14172M85667j87138o37806q17375j276083
$$ 109415002 110461103 111432913 112453414 113067586 113553253 113366115 112728309 111910934 110634851
4755A10634851k116087j816745k424388k973678k739057k731389l081677k813076
$$ 110634851 108518764 106702019 104277631 101303953 98564896 95833507 92751830 89938754
4747H9938754k945661k746234k541873k173410j987469j609289j809790j500630
$$ 89938754 86993093 84246859 81704986 79531576 77544107 75934818 74125028 72624398
4739G2624398j042138j063934j114743j019306j389907j121380r67886j403202
$$ 72624398 71582260 70518326 69403583 68384277 66994370 65872990 64905104 63501902
4731F3501902j442596j152990j717497j553209j656447j905657j794362j440354
$$ 63501902 62059306 60906316 59188819 57635610 55979163 54073506 52279144 50838790
4723E0838790j313885j545922j846914j784950j649059j544378j410736j483077
$$ 50838790 49524905 47978983 46132069 44347119 42698060 41153682 39742946 38259869
4715C8259869j441788j608557j303836j339884j253961j102013j083471q14156
$$ 38259869 36818081 35209524 33905688 32565804 31311843 30209830 29126359 28312203
4707B8312203o49859o38430m79143p12635q38402o99426p59663j045848j135888
$$ 28312203 27662344 27023914 26544771 25832136 24993734 24294308 23534645 22488797 21352909
4698B1352909o20507j105936q33470q33297j145569n88575o99738q78037q92999
$$ 21352909 20732402 19626466 18792996 17959699 16814130 16225555 15525817 14647780 13754781
4689A3754781m26301n05450l91976l21946j70564n5731J62811q0652j0477K02278
$$ 13754781 13328480 12823030 12431054 12109108 11938544 11882813 12045624 11964972 11954495 12156773
4679A2156773K51183j76779J31875J75007l2142r1633J52686k75240k42755k71440
$$ 12156773 12407956 12231177 12363052 12538059 12505917 12414284 12566970 12291730 12048975 11777535
4669A1777535j51101O4067l43223n14293m63559m97409M2665l06209n28346l93758
$$ 11777535 11626434 11690501 11347278 10832985 10369426 9872017 9914682 9608473 9080127 8686369
4659H686369k41755N908J22310J34348J44386L5991m0658J25200M35578L04068
$$ 8686369 8444614 8450522 8572832 8707180 8851566 8887557 8846899 8972099 9407677 9711745
4649I711745J45494J41505O41422N96719N71718P99182R35384N19893O58413J134017
$$ 9711745 9857239 9998744 10640166 11236885 11808603 12607785 13543169 14063062 14721475 15855492
4639A5855492O99346M82144L98322J006439J088690R90459O10028R25675R94057
$$ 15855492 16554838 17036982 17435304 18441743 19530433 20520892 21130920 22056595 23050652
4630B3050652J040897Q03591J193155J201984J345271J401469R78195J249532
$$ 23050652 24091549 24895140 26088295 27290279 28635550 30037019 31015214 32264746
4622C2264746J300542R94376R61164M50353L62252j78047j44110j81921k56692
$$ 32264746 33565288 34559664 35520828 35971181 36333433 36155386 36011276 35829355 35572663
4613C5572663r54891q93844r78734r91655j242207q87262r45905j003900q13358
$$ 35572663 34617772 33723928 32745194 31753539 30511332 29624070 28678165 27674265 26860907
4604B6860907p70899l62184l39662n59472j16306L46428L91545K86764P55360
$$ 26860907 26090008 25727824 25388162 24828690 24712384 25058812 25450357 25737121 26492481
4595B6492481R61398J116788J228219J755448J658494J563020K061574K021061
$$ 26492481 27453879 28570667 29798886 31554334 33212828 34775848 36837422 38858483
4587C8858483K058725J671373J878381J540377J293903Q70076N75718M323M94977
$$ 38858483 40917208 42588581 44466962 46007339 47301242 48171318 48747036 48751359 49246336
4578D9246336M8993n74740n69593m57874r08787p84580o12023p21877p04755l32414
$$ 49246336 49295329 48720589 48150996 47693122 46784335 45999755 45387732 44665855 43961100 43628686
4568D3628686o70177n22014o10431q76972j110324j086555q33226j072091j168481
$$ 43628686 42958509 42436495 41826064 40949092 39838768 38752213 37918987 36846896 35678415
4559C5678415q44126n65469j083466j367444n78090m94838l97337p6766l50440
$$ 35678415 34834289 34268820 33185354 31817910 31239820 30744982 30347645 30270879 29920439
4550B9920439k93860q7666j11109J48864K46512R0651J89452J52567K25302k3838
$$ 29920439 29626579 29538913 29427804 29576668 29823180 29913831 30103283 30255850 30481152 30457314
4540C0457314J99557L40076o5823Q9461J27648K65210L20582K35157Q2798k62229
$$ 30457314 30656871 30996947 30931124 31020585 31148233 31413443 31734025 31969182 32051980 31789751
4530C1789751l80184k67629p16601q28698p85241q85227j262688j530013j381731
$$ 31789751 31409567 31141938 30425337 29596639 28811398 27926171 26663483 25133470 23751739
4521B3751739j158261q88128j319769j247391j096913q10976l82023m77451o68146
$$ 23751739 22593478 21705350 20385581 19138190 18041277 17230301 16848278 16370827 15702681
4512A5702681l83997j95919r6735J4977j41367l00275N2376j79102k11581l87466
$$ 15702681 15318684 15122765 15026030 15041007 14899640 14599365 14651741 14472639 14261058 13873592
4502A3873592o12766m99184l51213m75282p94491q05006p13575p91565m79950
$$ 13873592 13260826 12761642 12410429 11935147 11140656 10335650 9622075 8830510 8350560
4493H350560n46823l54492n18158o64804l70481j37323l66349m70827k48350k73305
$$ 8350560 7803737 7449245 6931087 6266283 5895802 5758479 5392130 4921303 4672953 4399648
4483D399648J26625L9390l93302l406j0207l6077j56382r6431l4510j68165J28390
$$ 4399648 4526273 4565663 4172361 4168955 4158748 4122671 3966289 3869858 3835348 3667183 3795573
4472C795573p8753J19419R782m03123n6822L24326q05m0406k08271J2616N924
$$ 3795573 3716820 3836239 3846021 3442898 3386076 3710402 3709597 3669191 3460920 3473536 3479460
4461C479460J99854n4749r7197k11781n7602o2111K05232O2124n12580j00995
$$ 3479460 3679314 3624565 3527368 3315587 3257985 3195874 3401106 3463230 2950650 2849655
4451B849655k61201M7555N40736j93956j01250Q4539J2794J75305J18607q9174
$$ 2849655 2588454 2636009 3176745 2982789 2881539 2966078 2978872 3154177 3272784 3183610
4441C183610j54063J92215j8618k73637k14430j00254j82020N4061J89360n2420
$$ 3183610 3029547 3221762 3203144 2929507 2715077 2614823 2432803 2486864 2676224 2623804
4431B623804R0786N0286J06161N4389j95885m1647j258L18324M7537l8348j16866
$$ 2623804 2714590 2764876 2871037 2925426 2729541 2687894 2686636 3004960 3052497 3014149 2897283
4420B897283n0734j44528K00193J43720r4524j89706J20774R7599N07J71374L3896
$$ 2897283 2846549 2702021 2902214 3045934 2951410 2761704 2882478 2980077 2980584 3151958 3185854
4409C185854n6327P5060J93223q1275L1534L4383k77332j39652K62716N8282L62745
$$ 3185854 3129527 3204587 3397810 3316535 3348069 3382452 3105120 2965468 3228184 3286466 3649211
4398C649211l259k62976J83914J13822j3865L052M1550K7173K35952j0182l36198
$$ 3649211 3645952 3382976 3566890 3680712 3666847 3669899 3711449 3738622 3974574 3964392 3628194
4387C628194j27214J58693k19576J24841p179j5648l6371j05769r56j88843j21420
$$ 3628194 3500980 3659673 3440097 3564938 3557759 3542111 3505740 3399971 3399015 3210172 3088752
4376C088752J0481J19604J50512J02209q7646r5719r2997j59443O2053J76227
$$ 3088752 3099233 3218837 3369349 3471558 3383912 3288193 3195196 3035753 3097806 3274033
4366C274033L11244J51138o25l3885n2247o946K417r2578p2843L03595P2432k06101
$$ 3274033 3585277 3736415 3735790 3701905 3649658 3642712 3645129 3552551 3479708 3783303 3855735 3649634
4354C649634R1811J68475N5605j46059k20837O0697L8063L21434r5211o382j17563
$$ 3649634 3741445 3909920 3965525 3819466 3598629 3659326 3697389 4018823 3923612 3917230 3799667
4343C799667J39578K55477n3239k21383l6629J30468J94261L40579K66112L4917
$$ 3799667 3939245 4194722 4141483 3920100 3883471 4013939 4208200 4548779 4814891 4849808
4333D849808J07724J09064n5591J35817J62118J07999K66779J99866J4201Q3564
$$ 4849808 4957532 5066596 5011005 5146822 5308940 5416939 5683718 5883584 5897785 5981349
4323E981349J93522J81492J33006n7719M21897K11555M359L91000J38928l0857
$$ 5981349 6174871 6356363 6489369 6431650 6853547 7065102 7069461 7460461 7599389 7568532
4313G568532j22533k98395p3044K89362K60284J78467k78744j17158L0898m6430
$$ 7568532 7445999 7147604 7074560 7363922 7624206 7802673 7523929 7406771 7437669 7391239
4303G391239k09484J0926O0581k09095J40998p2449J07010j19154q4224R0578
$$ 7391239 7181755 7192681 7253262 7044167 7185165 7112716 7219726 7100572 7016348 7106926
4293G106926k57809k20424J8907J72107l7058K47705m3246J70505M8806k38444
$$ 7106926 6849117 6628693 6647600 6819707 6782649 7030354 6987108 7157613 7206419 6967975
4283F967975K68115J11292k0056J54642q590N2409k14616n3707K98811n4351L53745
$$ 6967975 7236090 7347382 7327326 7481968 7473378 7525787 7311171 7257464 7556275 7501924 7855669
4272G855669R2622J09381L25923q7744K45441l956J77452J42305K79443r5632
$$ 7855669 7948291 8057672 8383595 8295851 8541292 8537336 8714788 8857093 9136536 9040904
4262I040904K17415o3663j48774L24877j65749K67098r363j46451O4252r8734
$$ 9040904 9258319 9194656 9045882 9370759 9205010 9472108 9462745 9316294 9380546 9281812
4252I281812P1138q3184j09616J11227j48093J32681r2846j72093n0716n1141
$$ 9281812 9352950 9269766 9160150 9271377 9123284 9255965 9163119 8991026 8940310 8889169
4242H889169n0288l61706j42034L12755j67833j39012k52276K61242j77901m16602
$$ 8889169 8838881 8477175 8335141 8647896 8480063 8341051 8088775 8350017 8172116 7755514
4232G755514J64300J36204j83511o4517J32282J27107j5205l86450j23849N3504
$$ 7755514 7919814 8056018 7872507 7807990 7940272 8067379 8052174 7665724 7541875 7595379
4222G595379L5624K0244l98788O1553K4332j62791J69397m0529M9237J76977K12935
$$ 7595379 7631003 7651247 7252459 7314012 7338344 7175553 7344950 7304421 7353658 7530635 7743570
4211G743570m7307j83126m9393M80987N210L7792R1785K00326N957k67889J33527
$$ 7743570 7696263 7513137 7463744 7944731 7949941 7987733 8079518 8279844 8285801 8017912 8151439
4200H151439L91159r6004l19898J89567Q690j82117q2221j8047n7861L23K491
$$ 8151439 8542598 8446594 8126696 8316263 8324953 8142836 8060615 8042568 7984707 7985030 7987521
4189G987521k26804J57375j40844k08370m4817K55368P328l01568k82945J35249
$$ 7987521 7760717 7918092 7777248 7568878 7524061 7779429 7786757 7485189 7202244 7337493
4179G337493J32291K1274p2285j8231J17729K36529R7387j90073j68689J42776
$$ 7337493 7469784 7491058 7418773 7400542 7518271 7754800 7852187 7662114 7493425 7636201
4169G636201M92138J85423q824K9272K03716J78583M30985R7655O1695K47047
$$ 7636201 8128339 8313762 8304938 8334210 8537926 8716509 9147494 9245149 9306844 9553891
4159I553891L91169N44353O03414K55531M08418M65669M73430L19845O60117O05725
$$ 9553891 9945060 10489413 11092827 11348358 11756776 12222445 12695875 13015720 13675837 14281562
4149A4281562P94720L25350M69666P30739M65951R63073P46723M16743L94293
$$ 14281562 15076282 15401632 15871298 16602037 17067988 18031061 18777784 19194527 19588820
4140A9588820P74996N49975M48957O72499P62800N67516P98574O54962N54446
$$ 19588820 20363816 20913791 21362748 22035247 22798047 23365563 24164137 24819099 25373545
4131B5373545P05269Q69751P24011R36665P39163Q64436Q23174O63127R18225
$$ 25373545 26078814 26948565 27672576 28609241 29348404 30212840 31036014 31699141 32617366
4122C2617366R06103R02744P94692Q77717J029996J061532J000797R93696O87373
$$ 32617366 33523469 34426213 35220905 36098622 37128618 38190150 39190947 40184643 40872016
4113D0872016R63014R23441J222781J354945J116471J182435J283767J269936
$$ 40872016 41835030 42758471 43981252 45336197 46452668 47635103 48918870 50188806
4105E0188806J158286J117607Q37764R91246R26956P22410Q44835N24104O85477
$$ 50188806 51347092 52464699 53302463 54293709 55220665 55943075 56787910 57312014 57997491
4096E7997491P35075N87822L13283J78938O79473O81257N48222N14574Q34734
$$ 57997491 58732566 59320388 59633671 59812609 60492082 61173339 61721561 62236135 63070869
4087F3070869R71069R02723J003247J247217J325252J313677J583769J811172
$$ 63070869 64041938 64944661 65947908 67195125 68520377 69834054 71417823 73228995
4079G3228995J603248K002671J879046J794611J981030K042854J942014J693302
$$ 73228995 74832243 76834914 78713960 80508571 82489601 84532455 86474469 88167771
4071H8167771J682492J691933J545345J029593J071308R32418K95155P92324N37421
$$ 88167771 89850263 91542196 93087541 94117134 95188442 96120860 96416015 97208339 97745760
4062I7745760M08530K98065j96099j32478L786O8505p6801k2118l64652k28124
$$ 97745760 98154290 98452355 98256256 98123778 98127564 98196069 98119268 98097150 97732498 97504374
4052I7504374r4894n0788L3194o5645l52593p5147P8588k02922k12521J84601
$$ 97504374 97409480 97358692 97391886 97326241 96973648 96898501 96977089 96774167 96561646 96746247
4042I6746247j12338n60583m08642k71287o50484q73746q14438j223898j454144
$$ 96746247 96633909 96073326 95664684 95393397 94742913 93869167 93054729 91830831 90376687
4033I0376687j398458j966351k000566k044051k118024k148195k091492k056667
$$ 90376687 88978229 87011878 85011312 82967261 80849237 78701042 76609550 74552883
4025G4552883j843694j876696j937338j947136j574920j640886j283884r53748
$$ 74552883 72709189 70832493 68895155 66948019 65373099 63732213 62448329 61494581
4017F1494581q16532q55140q16924j038842q96622l28008o52769o69002m46730
$$ 61494581 60678049 59822909 59005985 57967143 57070521 56742513 56089744 55420742 54974012
4008E4974012o17152q62741p71813l31663o38560q82364q95411r61359j039304
$$ 54974012 54356860 53494119 52722306 52390643 51752083 50869719 49974308 49012949 47973645
3999D7973645r82478j218758j383994o97448j044224j294987j011926j427442
$$ 47973645 46991167 45772409 44388415 43690967 42646743 41351756 40339830 38912388
3991C8912388j093004r57804r01785j063007j220795p76871p63088o60544j013008
$$ 38912388 37819384 36861580 35959795 34896788 33675993 32899122 32136034 31475490 30462482
3982C0462482r00436r45559q00857p12685m36182r57991m76812m49777n25570
$$ 30462482 29562046 28616487 27815630 27102945 26666763 25708772 25231960 24782183 24256613
3973B4256613m96308o29779q86173o25647m01092o43849q73417p19252o48887
$$ 24256613 23760305 23130526 22244353 21618706 21217614 20573765 19700348 18981096 18332209
3964A8332209l84849l93021p13111n48405n86181l05938j73018l33146k44052
$$ 18332209 17947360 17554339 16841228 16292823 15706642 15400704 15227686 14894540 14650488
3955A4650488l08797k76544k23349o12963k43919l95737n26701r1180j59659j95667
$$ 14650488 14341691 14065147 13841798 13228835 12984916 12589179 12062478 11971298 11811639 11615972
3945A1615972o9059j8128k61212J4098k0180Q079j06902R3387K92156K53066k87900
$$ 11615972 11546913 11528785 11267573 11281671 11261491 11269570 11162668 11256055 11548211 11801277 11513377
3934A1513377J27234L41685l4608K94561L25018J28180j33994M78602J23319J77177
$$ 11513377 11640611 11982296 11947688 12242249 12567267 12695447 12561453 13040055 13163374 13340551
3924A3340551p4089J90831L10627O6616N68485K16611L95529L12806K07307L67644
$$ 13340551 13266462 13457293 13767920 13834536 14403021 14619632 15015161 15327967 15535274 15902918
3914A5902918L02317M75037N10707Q6717K63870M39787K59768L14709O65227J62468
$$ 15902918 16205235 16680272 17190979 17277696 17541566 17981353 18241121 18555830 19221057 19383525
3904A9383525M03358L80964M07353O88597Q15853P49453L87377Q43496R01810
$$ 19383525 19786883 20167847 20575200 21263797 22079650 22829103 23216480 24059976 24961786
3895B4961786O22186N12481O66953P11530Q45215P22108O89264P76490J099924
$$ 24961786 25583972 26096453 26763406 27474936 28320151 29042259 29731523 30508013 31607937
3886C1607937J143673J184013R59574J177367Q65593J420205J425928J052430
$$ 31607937 32751610 33935623 34895197 36072564 36938157 38358362 39784290 40836720
3878D0836720J206111J384094J238383J398260J558067J152478J234817J352923
$$ 40836720 42042831 43426925 44665308 46063568 47621635 48774113 50008930 51361853
3870E1361853J373040J048969J221104J179366J163233J035698R96066J122937
$$ 51361853 52734893 53783862 55004966 56184332 57347565 58383263 59379329 60502266
3862F0502266L22039L61344P15023P70642L87923M29710J48937N01229J06565
$$ 60502266 60824305 61185649 61900672 62671314 63059237 63488947 63637884 64139113 64245678
3853F4245678l61554m28923n02061j28240p62283n93388q57410p72025n71061
$$ 64245678 63884124 63455201 62953140 62824900 62062617 61469229 60611819 59839794 59268733
3844E9268733q03276j128452j165626j064849r83108o50013o85163j138886j106193
$$ 59268733 58465457 57337005 56171379 55106530 54123422 53473409 52788246 51649360 50543167
3835E0543167n35684o72139o45087o55736m46113p20401o39548m69413l33472
$$ 50543167 50007483 49335344 48690257 48034521 47588408 46868007 46228459 45759046 45425574
3826D5425574k97549l47210l85168k85847l18497n17789m90072l14564m63210
$$ 45425574 45128025 44780815 44395647 44109800 43791303 43273514 42783442 42468878 42005668
3817D2005668l89558j98994j14109k04082q9893J98283k04059p3546q3316p3787
$$ 42005668 41616110 41417116 41303007 41098925 41009032 41207315 41003256 40929710 40846394 40772607
3807D0772607N7381k63495o9963k59281k66385l06358k47309j18340q0825j19214
$$ 40772607 40829988 40566493 40496530 40237249 39970864 39664506 39417197 39298857 39218032 39098818
3797C9098818k74025j76441J05831N08249M94987M04466P31597O55738O07453
$$ 39098818 38824793 38648352 38754183 39262432 39757419 40161885 40893482 41549220 42156673
3788D2156673P10149N31238N89122Q09112Q21609L45346Q43654Q97456Q00615
$$ 42156673 42866822 43398060 43987182 44796294 45617903 45963249 46806903 47704359 48504974
3779D8504974O37477Q57646J053936J181363J114909Q08900R68597R47570O35158
$$ 48504974 49142451 50000097 51054033 52235396 53350305 54159205 55127802 56075372 56710530
3770E6710530O30814M10669L87667J30571L851n61473o28880q64137q40433j173316
$$ 56710530 57341344 57752013 58139680 58270251 58274102 57712629 57083749 56219612 55379179 54205863
3760E4205863j066260j134468r16253p32169o19862m99321k39391L76858L93295
$$ 54205863 53139603 52005135 51088882 50356713 49736851 49237530 48998139 49374997 49768292
3751D9768292L52909J037437J193663J073908J174917J743066J669549J716944
$$ 49768292 50121201 51158638 52352301 53426209 54601126 56344192 58013741 59730685
3743E9730685J922202K023714K323301K392212K202859K259681J825826J452383
$$ 59730685 61652887 63676601 65999902 68392114 70594973 72854654 74680480 76132863
3735G6132863J282320Q12364M89423J50986n07336r72882j067714j028737j600854
$$ 76132863 77415183 78227547 78716970 78867956 78360620 77387738 76320024 75291287 73690433
3726G3690433j890371j567921j923624k050196j831841j686016j415327j093434
$$ 73690433 71800062 70232141 68308517 66258321 64426480 62740464 61325137 60231703
3718F0231703j251515q16160q48141o50812n61993l59553m96746k20943m13526
$$ 60231703 58980188 58164028 57315887 56665075 56103082 55743529 55246783 55025840 54612314
3709E4612314k01677o60726j023363p10776p09153r15278r45423q51109j125031
$$ 54612314 54410637 53749911 52726548 52015772 51306619 50391341 49445918 48594809 47469778
3700D7469778j031325q22402j280339j123125j303167j332437j218605p60364
$$ 47469778 46438453 45616051 44335712 43212587 41909420 40576983 39358378 38598014
3692C8598014j299297j348553j370831j247544j202923j254924j114866j141345
$$ 38598014 37298717 35950164 34579333 33331789 32128866 30873942 29759076 28617731
3684B8617731r72455j270236q76621o98517o60360l77626p11967o79903p81786
$$ 28617731 27645276 26375040 25498419 24799902 24139542 23761916 23049949 22370046 21588260
3675B1588260n18320o55446L6670J92904l48522K4569k18460j92335m96797K36216
$$ 21588260 21069940 20414494 20451164 20644068 20295546 20320115 20101655 19909320 19412523 19648739
3665A9648739K19382L8818K4740M2072j45694J13151o718j76292O4116L72903
$$ 19648739 19868121 19906939 19931679 19973751 19828057 19941208 19934490 19758198 19822314 20195217
3655B0195217k38741l80957K35624j94261J93796k2170M3801K2964L4269k88190
$$ 20195217 19956476 19575519 19811143 19616882 19810678 19788508 19832309 19855273 19889542 19601352
3645A9601352k72335k40827j94745k85020p21582p74642l53977n26221o10451
$$ 19601352 19329017 19088190 18893445 18608425 17886843 17112201 16758224 16232003 15621552
3636A5621552o25457j060527q21207n39667n42670p72843o81198n44774m92350
$$ 15621552 14996095 13935568 13114361 12574694 12032024 11259181 10577983 10033209 9540859
3627I540859n92518j99930k77501j85053m75774l22610j54320j86447j34003j41332
$$ 9540859 8948341 8748411 8470910 8285857 7810083 7487473 7333153 7146706 7012703 6871371
3617F871371k74145Q7992O9706r8145J33768n4115J4862j51293j56686l4029O8198
$$ 6871371 6597226 6685218 6754924 6656779 6790547 6736432 6751294 6600001 6443315 6409286 6477484
3606F477484K1406j36325J29568M1270J220J7611l7547M1925J34067k16520N6720
$$ 6477484 6498890 6362565 6492133 6533403 6534623 6552234 6514687 6556612 6690679 6474159 6530879
3595F530879J86218J06406J3973J33435k36918k02395L45074p8319j79306j1424
$$ 6530879 6717097 6823503 6837476 6970911 6733993 6531598 6876672 6798353 6619047 6607623
3585F607623j37576l3427J93562j21236K6164R934k31390j27060K20219L8926
$$ 6607623 6470047 6436620 6630182 6508946 6535110 6545044 6313654 6186594 6406813 6445739
3575F445739o4036J67372j91462j02904l5733j65390M66782K24064k09884o8743
$$ 6445739 6381703 6549075 6357613 6254709 6218976 6053586 6520368 6744432 6534548 6465805
3565F465805j03963N0756K19768j67148k45344L54960K01120N7881N5563J25350
$$ 6465805 6361842 6412598 6632366 6465218 6219874 6574834 6775954 6833835 6889398 7014748
3555G014748m6383o7197J87928K22994n4456N181n4560J94893q4249J76142L42583
$$ 7014748 6968365 6901168 7089096 7312090 7257634 7262815 7208255 7403148 7318899 7495041 7837624
3544G837624J05271O6509K2197K97457O7274m5647L7966J73618M3095L49295K90551
$$ 7837624 7942895 8009404 8031601 8329058 8396332 8350685 8388651 8562269 8605364 8954659 9245210
3533I245210M9605M25570K40773P7952j12458R8350L61425K77246J7157L9445
$$ 9245210 9294815 9720385 9961158 10039110 9926652 10025002 10386427 10663673 10680830 10720275
3523A0720275J62391J89748n3347j50396M99985L01927Q5810r613L24317n0099
$$ 10720275 10882666 11072414 11019067 10868671 11368656 11670583 11756393 11746780 12071097 12020998
3513A2020998J86540O0038j63540j01374K44943J59838j74706N3252J36554P2053
$$ 12020998 12207538 12267576 12104036 12002662 12247605 12407443 12232737 12285989 12422543 12494596
3503A2494596R1883k01180m5810L07495J04787Q3136K25717j74561K2284J12984
$$ 12494596 12586479 12385299 12339489 12646984 12751771 12834907 13060624 12886063 12908347 13021331
3493A3021331K82172J75399q3299j58285K91040N1119K24873K34247k26154J63959
$$ 13021331 13303503 13478902 13395603 13237318 13528358 13579477 13804350 14038597 13812443 13976402
3483A3976402L42970O0407L30217M49527N7524J33958j15151K67143l6530K13269
$$ 13976402 14319372 14379779 14709996 15159523 15217047 15351005 15235854 15502997 15466467 15679736
3473A5679736K26477L7599l9639K28004J45739M9118K84737j11011J8534n9415
$$ 15679736 15906213 15943812 15904173 16132177 16277916 16327034 16611771 16500760 16519294 16459879
3463A6459879Q7820P5315k86175j4189k0928M4384r1615m51820k79027k34882
$$ 16459879 16547699 16623014 16336839 16322650 16301722 16346106 16254491 15802671 15523644 15288762
3453A5288762l73950k35246n12556j14641k40823m86530o0250j19871m30699m83071
$$ 15288762 14914812 14679566 14167010 14052369 13811546 13325016 13264766 13144895 12714196 12231125
3443A2231125j66782l14893l71366l70866j40514M8388m02495j10126k80688q3357
$$ 12231125 12064343 11749450 11378084 11007218 10866704 10915092 10512597 10402471 10121783 10038426
3433A0038426J82812k34440n50576p8154L93545k02005j74125K27469k01223r1850
$$ 10038426 10221238 9986798 9436222 9358068 9751613 9549608 9375483 9602952 9401729 9309879
3423I309879P1335k69895j38246M8173j37635k03891M15343J01762q4910K14859
$$ 9309879 9381214 9111319 8973073 9021246 8883611 8679720 9095063 9196825 9111915 9326774
3413I326774K0225n0814l5321J94653l8442J95316R9900q6495m3302r0721J98143
$$ 9326774 9346999 9296185 9260864 9455517 9417075 9612391 9712291 9625796 9582494 9491773 9689916
3402I689916K28000J89890J86331j43023K86681L71099k2815l5756K86022j69684
$$ 9689916 9917916 10107806 10294137 10151114 10437795 10808894 10786079 10750323 11036345 10866661
3392A0866661N802k41841L6099J23091j01904K32213k5764j04375l11417L77416
$$ 10866661 10872463 10630622 10666721 10789812 10687908 10920121 10894357 10789982 10478565 10855981
3382A0855981o3108o2100P2952j0437J2223K37897k76199m5643J80237N751l1169
$$ 10855981 10792873 10730773 10803725 10793288 10805511 11043408 10767209 10721566 10901803 10907554 10876385
3371A0876385N4058j15163J42918M29623M12884L34414J76721L82188K75525L83455
$$ 10876385 10930443 10815280 10958198 11387821 11800705 12135119 12311840 12694028 12969553 13353008
3361A3353008J68151N05169O81924K27621N49510K08153J76518M0692N38778P97743
$$ 13353008 13521159 14026328 14708252 14935873 15485383 15693536 15870054 15910746 16449524 17247267
3351A7247267L58501K74263K95183J84119K38557L91402L68713J1968L92629N53508
$$ 17247267 17605768 17880031 18175214 18359333 18597890 18989292 19358005 19369973 19762602 20316110
3341B0316110L02732J62473J57513N42525L9429L07001M03492K60133J22477L4095
$$ 20316110 20618842 20781315 20938828 21481353 21520782 21827783 22231275 22491408 22613885 22647980
3331B2647980j93239r3703K330J81106j8216P5677P2912P8861l23058j70138L22965
$$ 22647980 22454741 22361038 22363368 22544474 22526258 22601935 22674847 22753708 22430650 22260512 22583477
3320B2583477J93146L83813J11598M4326N09909K78316K52487O09358Q16199P10419
$$ 22583477 22776623 23160436 23272034 23316360 23826269 24104585 24357072 24966430 25782629 26493048
3310B6493048J014258J296908J074396J049674J751962J786322J937805J970162
$$ 26493048 27507306 28804214 29878610 30928284 32680246 34466568 36404373 38374535
3302C8374535J943526K391995K515452L116884K776692K831760L347472L098175
$$ 38374535 40318061 42710056 45225508 48342392 51119084 53950844 57298316 60396491
3294F0396491K478518K428136K012796K063507J261595O37213o8873m98414p66645
$$ 60396491 62875009 65303145 67315941 69379448 70641043 71278256 71209383 70710969 69944324
3285F9944324j572686k396080k595879k394734k848009l130612k728056k646094
$$ 69944324 68371638 65975558 63379679 60984945 58136936 55006324 52278268 49632174
3277D9632174k891721k719745k072080j505568j183201r12767p61132k33764j26170
$$ 49632174 46740453 44020708 41948628 40443060 39259859 38347092 37585960 37352196 37226026
3268C7226026M59854P62706J101355J216413J405219J738737J888195K186014
$$ 37226026 37685880 38448586 39549941 40766354 42171573 43910310 45798505 47984519
3260D7984519K016910K000705J947535J966410J584069J216773J033469N74222
$$ 47984519 50001429 52002134 53949669 55916079 57500148 58716921 59750390 60324612
3252F0324612J89370k47873o46274j014754j333694j659782k165236k489407k188861
$$ 60324612 60513982 60266109 59619835 58605081 57271387 55611605 53446369 50956962 48768101
3243D8768101k639607k420610k165086k492985k404332j911834j993775j847691
$$ 48768101 46128494 43707884 41542798 39049813 36645481 34733647 32739872 30892181
3235C0892181j639900j390458r71251r50275p01723n16578o94261p90211k83257
$$ 30892181 29252281 27861823 26890572 25940297 25238574 24721996 24027735 23237524 22954267
3226B2954267j71333l30816j87563j00756k17046k84124K33750M8306L72195M30203
$$ 22954267 22782934 22452118 22264555 22163799 21946753 21662629 21896379 21944685 22316880 22747083
3216B2747083K50719L74647M14467L60511M09605L74057M70459O43098J243143
$$ 22747083 22997802 23372449 23786916 24147427 24557032 24931089 25401548 26044646 27287789
3207B7287789J277475J048942R70723J384812J491262J833068K000497K313079
$$ 27287789 28565264 29614206 30584929 31969741 33461003 35294071 37294568 39607647
3199C9607647L092932L229669L909860M325879N198202N714594O393372P312413
$$ 39607647 42700579 45930248 49840108 54165987 59364189 65078783 71472155 78784568
3191G8784568P856306Q929329R983321J0701820J1305952J1696446J1678504J1128029
$$ 78784568 86640874 95570203 105553524 116255344 127561296 139257742 150936246 162064275
3183A62064275J0297752R534867Q401490P203951N754577L967123K170469l94248
$$ 162064275 172362027 181896894 190298384 197502335 203256912 207224035 209394504 209000256
3175B09000256k240965m714198o638741q304184r520587j0442144j1258908j1553406
$$ 209000256 206759291 202045093 195406352 187102168 177581581 167139437 155880529 144327123
3167A44327123j1540359j1882046j1687122j1408864j0388622r359439q233939
$$ 144327123 132786764 120904718 109217596 97808732 87420110 78060671 69826732
3160F9826732p438263o444873n563877m773445m134742l557156l107476k165937
$$ 69826732 62388469 55943596 50379719 45606274 41471532 37914376 34806900 32640963
3152C2640963j782255j731397j582050j042235p41272m57511l90832m94720l81559
$$ 32640963 30858708 29127311 27545261 26503026 25761754 25304243 24913411 24418691 24037132
3143B4037132j17080j62678r9082j08745P2105j67467o8513J71722Q1956M22843
$$ 24037132 23920052 23757374 23658292 23549547 23621652 23454185 23385672 23557394 23639350 24062193
3133B4062193j7414J09901J57307K71164L93203O43451L15906K33749M54887J003853
$$ 24062193 24044779 24154680 24311987 24583151 24976354 25619805 25935711 26169460 26624347 27628200
3123B7628200P57064Q21629O63360R34100J479786J649135J570006J976067K371641
$$ 27628200 28385264 29206893 29870253 30804353 32284139 33933274 35503280 37479347 39850988
3114C9850988K488157K635150L119228L585893M362485M894794N044590N198295
$$ 39850988 42339145 44974295 48093523 51679416 56041901 60936695 65981285 71179580
3106G1179580O029638O728710O947187P157781Q254687Q092682Q104309Q330905
$$ 71179580 77209218 83937928 90885115 98042896 106297583 114390265 122494574 130825479
3098A30825479P986809P320068O829684O779559O322102N964003N649373N557322
$$ 130825479 138812288 146132356 152962040 159741599 166063701 172027704 177677077 183234399
3090A83234399N813939O199857O891568P562735Q352343R269291R232113R311927
$$ 183234399 189048338 195248195 202139763 209702498 218054841 227324132 236556245 245868172
3082B45868172Q652488P794381P064798O583009N956936N610324N489730N178728
$$ 245868172 254520660 262315041 269379839 275962848 281919784 287530108 293019838 298198566
3074B98198566M895393L903663K581101J680091J482864J216007J188798R93184
$$ 298198566 303093959 306997622 309578723 311258814 312741678 313957685 315146483 316139667
3066C16139667M84964r7977p44773j980699l543989l770627m042186m302030m392987
$$ 316139667 316624631 316526654 315781881 313801182 310257193 306486566 302444380 298142350 293749363
3057B93749363m990505n787477o572950p463660q029246q934239r672387j0110379
$$ 293749363 288758858 282971381 276398431 268934771 260905525 251971286 242298899 232188520
3049B32188520j0878552j1187411j1957921j2821637j3498556j2885066j2921817
$$ 232188520 221309968 210122557 198164636 185342999 171844443 158959377 146037560
3042A46037560j2349553j1829960j1277759j1095093j0587748r662061q430807
$$ 146037560 133688007 121858047 110580288 99485195 88897447 79235386 70804579
3035G0804579p465668o752793n647409n332866m392209l739331l208668k965603
$$ 70804579 63338911 56586118 50938709 45605843 41213634 37474303 34265635 31300032
3027C1300032k390705k086931j910573j964921j640819j364504o64899q27388
$$ 31300032 28909327 26822396 24911823 22946902 21306083 19941579 19276680 18449292
3019A8449292j147645j061860n73229l46936m51934o70312p75751o63898l80151
$$ 18449292 17301647 16239787 15666558 15319622 14867688 14197376 13421625 12757727 12377576
3010A2377576l67223m20663l58201k60291j25746k76098M3740J31434p5806Q7273
$$ 12377576 12010353 11589690 11231489 10971198 10845452 10569354 10613094 10744528 10668722 10755995
3000A0755995J01426j5434K07051K27177J40309K29716L61639M34042K85104K17854
$$ 10755995 10857421 10841987 11049038 11276215 11416524 11646240 12007879 12441921 12727025 12944879
2990A2944879K50305N52056J60032K27938m7506p2401r5130j48468k25724M0997
$$ 12944879 13195184 13747240 13907272 14135210 14087704 14015303 13920173 13771705 13545981 13586978
2980A3586978q2323n40964j78190J36263k8975k93575q3761L5189q1549L7581
$$ 13586978 13504655 12963691 12785501 12921764 12892789 12599214 12515453 12550642 12469093 12506674
2970A2506674j03204k74003k82801k28936o12022o29140m44505m38120l90756
$$ 12506674 12403470 12129467 11846666 11617730 11005708 10376568 9932063 9493943 9103187
2961I103187j031786o01447l56359j28563m75523l30733l72733k86618n49053
$$ 9103187 8071401 7469954 7113595 6985032 6509509 6178776 5806043 5519425 4970372
2952D970372k52980r9033m0134j40865k12998j0150p0540j71539mM47975j21577
$$ 4970372 4717392 4618359 4578225 4437360 4224362 4214212 4143672 3972133 3972129 4420104 4298527
2941D298527j09630J49157K55762M15100K52350K80109J25269l4490P4222K42004
$$ 4298527 4188897 4338054 4593816 5008916 5261266 5541375 5666644 5632154 5706376 5948380
2931E948380K72695O4077J39884j1920J00664j3498n8013J21033O2132l00173
$$ 5948380 6221075 6285152 6425036 6413116 6513780 6500282 6442269 6563302 6625434 6325261
2921F325261l34156p8103J47354p8991K53593n6066o6459j11193l07998K22147
$$ 6325261 5991105 5913002 6060356 5981365 6234958 6178892 6112433 6001240 5693242 5915389
2911E915389J0639j48112q1402j38514j51126j01744l11926J54049j16186l51692
$$ 5915389 5926028 5777916 5696514 5558000 5406874 5305130 4993204 5147253 5031067 4679375
2901D679375j34971o3189l50181j99030K88l62840j59972o8681l90872k34874
$$ 4679375 4544404 4481215 4131034 3932004 3932292 3569452 3409480 3340799 2949927 2715053
2891B715053k99886J84438j82134j46222O6102n1026R9865q6210l4003q4951j90023
$$ 2715053 2415167 2599605 2417471 2271249 2337351 2286325 2386190 2299980 2265977 2181026 1991003
2880A991003j89029j0428K1151O147j34444q0054j09423k87828r3058P7041K6922
$$ 1991003 1801974 1791546 1812697 1818844 1684400 1604346 1494923 1207095 1114037 1191078 1218000
2869A218000o6010l94355j953K27838J6023k4711J17336k40342k03844J10706
$$ 1218000 1151990 757635 755682 983520 999543 974832 1092168 851826 647982 758688
2859G58688P1005j40962m6098L14841J64887j14763o3910J0073Q662M6427j65355
$$ 758688 829693 688731 642633 957474 1122361 1007598 943688 953761 962423 1008850 843495
2848H43495j9367r1576J56109J23934K30788J65926j13498p5203k92944k36033
$$ 843495 824128 732552 888661 1012595 1243383 1409309 1295811 1220608 927664 691631
2838F91631J93240K46089l02603L0306j54361J29637J69170J77493o223k15911
$$ 691631 884871 1130960 828357 858663 704302 833939 1003109 1180602 1174379 958468
2828I58468j40646p5770o1165J28190J86601j09849J57232K31940k23880l10975
$$ 958468 817822 742052 680887 809077 995678 885829 1043061 1275001 1051121 740146
2818G40146L14250O6789k33297J50575K4301r4272L83473j4844p7821j94791K02236
$$ 740146 1054396 1121185 887888 1038463 1062764 968492 1351965 1337121 1259300 1064509 1266745
2807A266745Q0975k15776J48836K87577l1539q2779J88357M4628l61680j82637
$$ 1266745 1347720 1131944 1280780 1568357 1536818 1454039 1642396 1687024 1325344 1142707
2797A142707M13139O963r6827o448L01764J12965j35716K33298K3557K09253J3817
$$ 1142707 1555846 1562809 1465982 1459534 1761298 1874263 1738547 1971845 1995402 2204655 2218472
2786B218472P9626q0343k21957J38431k93860J93529M8532j82076Q2693o3396
$$ 2218472 2298098 2217755 1995798 2134229 1840369 2033898 2082430 1900354 1983047 1919651
2776A919651j35128k34382J70487r1921k9252J78614J7516P9664j97944j80227
$$ 1919651 1784523 1550141 1720628 1628707 1599455 1778069 1795585 1875249 1677305 1497078
2766A497078l44853l4668p4565Q9020j29843k66761J69279m2043l66993P4697
$$ 1497078 1152225 1117557 1042992 1132012 1002169 735408 904687 862644 495651 570348
2756E70348O3720K08482l3646j24582j2720r4198R1019l0411k96163O4257K22796
$$ 570348 634068 842550 808904 684322 671602 577404 668423 638012 341849 406106 628902
2745F28902q4142j45743j35107l2443K51277k07648Q7814K57972j75104j15457
$$ 628902 544760 399017 263910 231467 482744 275096 362910 620882 445778 330321
2735C30321j71718L18154k24580k6003j56015M1409J3643K37183j23836J6781
$$ 330321 158603 476757 252177 226174 70159 111568 125211 362394 238558 255339
2725B55339J45623k25476r445L09624j2135l63686r5157j3983J73117n2432L80703
$$ 255339 400962 175486 166041 475665 463530 99844 4687 -9296 163821 111389 492092
2714D92092J3048j93429k81367Q7131K12241R4677q374l49642q6556L92210J37322
$$ 492092 505140 311711 30344 117475 329716 424393 416019 66377 -20179 372031 509353
2703E09353O5444M9039p1361o7762j18623K93525j71715R4453J553j19144j24415
$$ 509353 574797 623836 552475 484713 366090 659615 487900 582353 583906 464762 340347
2692C40347k16154m956j80713J66299J26551N6536m511L08442j1784l50747j68210
$$ 340347 124193 119237 -61476 104823 231374 287910 283399 591841 580057 229310 61100
2681F1100K14349n9269l17567K69003p680n2064j50803j30940n918L10040J07044
$$ 61100 275449 216180 -101387 167616 159936 107872 -42931 -173871 -179789 130251 237295
2670B37295J19823K31141J7570j58159k4473p0231K8884j92282q8020J35903j80486
$$ 237295 357118 588259 605829 447670 423197 352966 381850 189568 101548 237451 56965
2659E6965q935J13517p0811K11903J71268j08711J94240j75129j09097m4346m32617
$$ 56965 48030 161547 90736 302639 473907 365196 559436 384307 275210 230864 -201753
2648b01753L43464M03053k67038J41736R3602m31973k91618K47722O7573j47776
$$ -201753 141711 544764 277726 419462 513064 81091 -210527 37195 104768 -43008
2638d3008J72388J12033j16244J43133J09538r7709j51321M7962R4586K11337
$$ -43008 129380 241413 125169 268302 377840 280131 128810 176772 271358 482695
2628D82695j85101j02820J65955J22667M2289K04198k04301k938K14056j25523
$$ 482695 297594 194774 360729 483396 525685 729883 525582 522644 736700 611177
2618F11177J30031P7596l08025M7875N54730J79921l3640J47642Q3623j41329
$$ 611177 741208 818804 510779 558654 1113384 1293305 1259665 1407307 1490930 1349601
2608A349601k84142j35825q4079J96988R9210k1799j59453j97601j85758j58119
$$ 1349601 1065459 929634 845555 1042543 1141753 1119954 960501 762900 577142 419023
2598D19023J41151J32097j7056l3913K68961k2874j88114l08659J93203m1292
$$ 419023 560174 692271 675215 641302 910263 887389 699275 390616 583819 542527
2588E42527l71240k15890K49452J41020n446m6515Q0662k19410J0755M8934M139
$$ 542527 171287 -44603 204849 345869 340423 293908 374570 155160 165915 214849 218988
2577B18988L1965k31952k55071Q1666J26381j59324K20090J50606n8845J42190
$$ 218988 250953 19001 -236070 -154404 -28023 -187347 32743 183349 124504 266694
2567B66694M7302l93521K51728K85862j44356n33579M6163J65856j45602L32349
$$ 266694 313996 -79525 172203 458065 313709 -219870 -173707 -7851 -153453 178896
2557A78896J0181Q5062o1261j18774J17406M5302j42779J03534j33345o2127m8245
$$ 178896 189077 274139 212878 94104 211510 256812 114033 217567 84222 22095 -26150
2546b6150p1953K09063J14265J07020j36942n9769j39408O4207K52232j08658
$$ -26150 -98103 110960 225225 332245 195303 135534 -3874 60333 312565 203907
2536B03907O5553p8617j49597j6602L64074J90905k49874n5473M2344k6224o2926
$$ 203907 269460 190843 41246 24644 388718 579623 329749 274276 316620 290396 227470
2525B27470L3213k73004M08133q3442j73496M7896J37710J46601N1367K23864
$$ 227470 260683 -12321 395812 312370 138874 186770 324480 471081 522448 746312
2515G46312k64757j0996P2687k32439J8051j54509N9813J35219j02041K0317o126
$$ 746312 481555 470559 543246 310807 328858 174349 234162 369381 267340 287657 281531
2504B81531m9784J02103m9115L02640M4100R619q4516M217K22354J49735n2617
$$ 281531 231747 333850 284735 587375 631475 641094 556578 560795 783149 932884 880267
2493H80267k10517L9755K9878K2455O4364k16734j19M4202J5457L58850L0576
$$ 880267 669750 709505 739383 761838 826202 609468 609349 653551 669008 1027858 1058434
2482A058434l28423j77151M0191K85700j1461j73362k03331Q625M27699q5644
$$ 1058434 730011 552860 593051 878751 867290 693928 490597 499222 926921 841277
2472H41277J57811L0142p2903L28367J21166n6688j99671j50415J5825n540J05650
$$ 841277 999088 1029230 956327 1284694 1405860 1349172 1149501 999086 1014911 1009371 1115021
2461A115021n7857j33279n4735J11033J04792R3659J33375J6186Q5686J81010
$$ 1115021 1057164 923885 869150 980183 1084975 1178634 1312009 1328195 1413881 1594891
2451A594891j16963o0088P0808l9553P5465R6131k78818J53820J11270P3007J18852
$$ 1594891 1477928 1417840 1488648 1449095 1524560 1620691 1341873 1495693 1606963 1679970 1798822
2440A798822K6851L62984j81306l20648j14904K2082K25311Q4203Q5486k89734
$$ 1798822 1825673 2188657 2007351 1686703 1571799 1593881 1819192 1903395 1988881 1699147
2430A699147K80670K73784j79960j65893K62969n5328j54149k98144L5942L82748
$$ 1699147 1979817 2253601 2073641 1907748 2170717 2115389 1961240 1663096 1699038 2081786
2420B081786J03669J2348j30266k02801J60082L15083K97196J70762J8422J94115
$$ 2081786 2185455 2197803 2067537 1864736 2024818 2339901 2637097 2807859 2826281 3020396
2410C020396j3300j54184K54373K37942k36883J97869L54880J13448k72955J14898
$$ 3020396 3007096 2852912 3107285 3345227 3108344 3306213 3661093 3774541 3501586 3616484
2400C616484K76017J09104L03257M7853j1031k0621J94887K06234K53705Q9971
$$ 3616484 3892501 4001605 4304862 4352715 4341684 4321063 4515950 4722184 4975889 5065860
2390E065860J20647J23933N3773K26403J32255L20431L01317M4335L88209M79189
$$ 5065860 5186507 5310440 5364213 5590616 5722871 6043302 6344619 6388954 6777163 7256352
2380G256352M66462L36493M7586L43946M13803N88893M36882N11636P36391P88423
$$ 7256352 7722814 8059307 8106893 8450839 8864642 9453535 9890417 10402053 11138444 11926867
2370A1926867R39544N94863J099624J102808J221935J531114J970989K530708
$$ 11926867 12866411 13461274 14560898 15663706 16885641 18416755 20387744 22918452
2362B2918452K711616L053863L383847M228050N856662O721223P639314Q272466
$$ 22918452 25630068 28683931 32067778 36295828 42152490 48873713 56513027 64785493
2354F4785493Q490638R205698R989154J1635448J2691241J4641328J7106350J8824395
$$ 64785493 73276131 82481829 92470983 104106431 116797672 131439000 148545350 167369745
2346A67369745J5587428J2008663J0952277R705874K940381k419810m385514n994876
$$ 167369745 182957173 194965836 205918113 215623987 218564368 216144558 211759044 205764168
2338B05764168p522993r742291j2943108j5494025j8369028j8337925j6051349
$$ 205764168 198241175 188498884 175555776 160061751 141692723 123354798 107303449
2331A07303449j3891390j2605985j2032854r710382q387851p298952o660053n806862
$$ 107303449 93412059 80806074 68773220 59062838 50674987 43376035 36715982 30909120
2323C0909120n055732l978806l130283k726250k471567j803454j197501j147185
$$ 30909120 25853388 21874582 18744299 16018049 13546482 11743028 10545527 9398342
2315I398342j107957q25655q23396m17723p19007o08569o94357j01579j29719
$$ 9398342 8290385 7464730 6641334 6223611 5504604 4896035 4201678 4100099 3970380
2306C970380k03472j94953l39542m94264L9468N1761m41414j23526J0120k40408
$$ 3970380 3766908 3571955 3232413 2738149 2777617 2829378 2387964 2264438 2274558 2034150
2296B034150q8386J61110l88719Q9436j44588j29843N2776k7113J1301p0343R55
$$ 2034150 1945764 2106874 1718155 1807591 1663003 1533160 1585936 1558823 1570124 1499781 1500736
2285A500736l18081p8545R3055k41800M8684N5114K3445k1720K10850k05057k91156
$$ 1500736 1182655 1104110 1197165 955365 1004049 1059163 1082608 1060888 1271738 1066681 775525
2274G75525N27304m8542j84130M6110l8087j59004K0673M463L3484j72082K2031
$$ 775525 1302829 1254287 1070157 1116267 1078180 919176 939849 944312 977796 805714 827745
2263H27745o6321p2303p9349j85265k41374j53426J09591K67315n8735j67711
$$ 827745 761424 689121 609772 424507 183133 29707 139298 406613 347878 180167
2253A80167l6642P1798J85902q9079k37696J09049L5284K22767j83518l24307
$$ 180167 143525 215323 401225 312146 74450 183499 218783 441550 258032 -66275
2243f6275n557j90200J5923l0099J67198j00753n1928j53053J48629J0767O6678
$$ -66275 -71832 -262032 -246109 -276208 -109010 -209763 -261691 -414744 -266115 -255348 -188670
2232a88670K14715J12277m9920k24296O3268n85k52615l3277J52434J95624k04683
$$ -188670 26045 138322 88402 -135894 -72626 -73211 -325826 -359103 -206669 -11045 -215728
2221b15728M9819K99556k22892j05906k6899L0600Q628K26981k51630j40420J7034
$$ -215728 -165909 133647 -89245 -195151 -222050 -191450 -182822 44159 -207471 -347891 -330857
2210c30857R3409q0067l2942m8327k10697J3549K64546q9066j05878K00451m2862
$$ -330857 -237448 -317515 -350457 -398784 -609481 -595932 -331386 -420452 -526330 -325879 -368741
2199c68741j29947L0032J53840J1498O0759n4354l1502N3276J5521m0657k989
$$ -368741 -498688 -468656 -314816 -303318 -242559 -296913 -328415 -275139 -259618 -300275 -303264
2188c03264j8492J07178o6370l728J56960K86919L7473q6445j67608k36947M37846
$$ -303264 -321756 -214578 -280948 -284676 -127716 159203 196676 110231 -57377 -294324 143522
2177A43522j58831k53510J47549j1000K378j44926j12080L18456j33228j99811
$$ 143522 -15309 -268819 -121270 -132270 -129892 -274818 -386898 -68442 -201670 -401481
2167d01481P7948L91176L18883j60737k23796j84165K87127o25083p4163L26175
$$ -401481 -323533 67643 386526 225789 1993 -182172 104955 -520128 -594291 -268116
2157b68116k5878J40991J71145j25307n2751k11406L6027P1417K0299O0673n3435
$$ -268116 -293994 -153003 18142 -107165 -159916 -371322 -335295 -263878 -243579 -182906 -236341
2146b36341k28395L8434L40446L50775k14742j49014l7783j44905J432J28871
$$ -236341 -464736 -426302 -85856 264919 50177 -98837 -136620 -281525 -280093 -151222
2136a51222K0005j60722p8851K80312Q3118q3559k6786J75127K06916k61028r1924
$$ -151222 -131217 -291939 -370790 -90478 -7360 -90919 -117705 57422 264338 3310 -88614
2125h8614Q7597K2703p8745j5661o0970J65822r8170r5563j54039l179J95097
$$ -88614 -1017 21686 -57059 -72720 -133690 32132 -66038 -161601 -315640 -318819 -123722
2114a23722j6148o8161J14997k14992P93J67150O9457L9663q584l04113L9382
$$ -123722 -139870 -208031 -93034 -308026 -307233 -140083 -70626 -30963 -39547 -343660 -304278
2103c04278K73740J68973j20333j47273l0574N037J44393j91945J5638O6313M3682
$$ -304278 -30538 138435 18102 -129171 -159745 -154708 -10315 -202260 -186622 -120309 -76627
2092g6627K73878J03995n0051M8279p8611k28675R4960K06562J51250p1876J80034
$$ -76627 197251 301246 251195 299474 220863 -7812 87148 293710 444960 373084 553118
2081E53118j65786P3828K45371J5742j67303O7904R8410k9977P843J63927O9798
$$ 553118 387332 461160 706531 722273 554970 622874 721284 691307 699150 863077 932875
2070I32875o6618Q9138m5046j09941k11411m6910l39080J44861m5177J06737k11717
$$ 932875 866257 955395 910349 800408 588997 542087 203007 347868 302691 409428 197711
2059A97711j82444N3945k1039j26892k46296p8196K9377J79992m0578j64199j03269
$$ 197711 15267 69212 48173 -78719 -325015 -403211 -373834 -193842 -234420 -398619 -501888
2048e01888K6448j6500J81141j3770o811L7149J71078Q3164M9285k58386N7263
$$ -501888 -475440 -491940 -310799 -324569 -331380 -294231 -123153 -39989 9296 -249090 -191827
2037a91827P1649j12567J30330Q0846q6224j12894m1190n0504J71808M0973r2048
$$ -191827 -120178 -232745 -102415 -21569 -107793 -220687 -261877 -312381 -140573 -99600 -191648
2026a91648k17748L63887J7315L0205p2223M079O2910l23514k12507m3935L69420
$$ -191648 -409396 -45509 -28194 2011 -70212 -66133 -3223 -326737 -539244 -583179 -213759
2015b13759o458j95704Q3717J16354O7787j92392n4036P2460M7910j94223m7384
$$ -213759 -220217 -415921 -332204 -215850 -148063 -340455 -394491 -322031 -274121 -468344 -515728
2004e15728L64676J55789K2362j70745j63183R2382J31804N9077n2101l4140O426
$$ -515728 -151052 4737 27099 -143646 -306829 -214447 -82643 -23566 -75667 -109807 -103381
1993a03381j25617l1511k3673J58711k16495j6222J9396o6390J83093k522J56161
$$ -103381 -228998 -260509 -284182 -125471 -341966 -358188 -338792 -405182 -222089 -224611 -68450
1982f8450l23365r826J13118l6640L60678k96369j65897N7918l660J64765J36808
$$ -68450 -391815 -401641 -288523 -325163 35515 -260854 -426751 -368833 -372493 -207728 -70920
1971g0920J0487k78722l32064o4033K22N8935P4591L7927k60401J42987J09812
$$ -70920 -60433 -339155 -671219 -735252 -735030 -676095 -601504 -563577 -823978 -680991 -571179
1960e71179O3938J45352J3517p8508K00220J60272m01205M7279J41596K31559
$$ -571179 -507241 -361889 -348372 -426880 -226660 -66388 -467593 -420314 -278718 -47159
1950d7159j23224k29317J2116K12314N499j78336Q4895m2310J14621l1711N4195
$$ -47159 -170383 -399700 -387584 -175270 -169771 -348107 -263212 -305522 -190901 -222612 -168417
1939a68417L5407l15928l2022J88987n7460J29975P2056Q3398J21653k40213k47752
$$ -168417 -133010 -448938 -480960 -291973 -349433 -219458 -147402 -64004 57649 -182564 -430316
1928d30316J2875K86231j43047r4574K7966J74589j31200p6213L1684j54213r7313
$$ -430316 -417441 -131210 -274257 -368831 -340865 -166276 -297476 -373689 -342005 -496218 -593531
1917e93531m3850J17170L45595J1142k47196k05284K78613K7460j707n6257P3613
$$ -593531 -637381 -520211 -174616 -163474 -410670 -615954 -337341 -309881 -311588 -367845 -294232
1906b94232l5748l50120R5122K15370K26455J9667k64560K07422J44657l25416
$$ -294232 -329980 -680100 -584978 -369608 -143153 -123486 -388046 -180624 -35967 -361383
1896c61383j02159L18783j75752l89073J72627l0286J91706j4991n8258J164l7003
$$ -361383 -463542 -144759 -320511 -709584 -536957 -567243 -375537 -390528 -448786 -447622 -484625
1885d84625J55643J27888m22J14845J98715q5474o4111l9904j22644j44585j46604
$$ -484625 -328982 -201094 -201516 -86671 112044 26570 -37541 -77445 -200089 -344674 -491278
1874d91278J86364K3284N6293M575j53166Q9855J3879K3732J7736R8580r1278
$$ -491278 -304914 -281630 -225337 -220762 -373928 -284073 -270194 -246462 -228726 -130146 -221424
1863b21424o4428Q1572j75825j07287M939J93912k18066O8902K4150j62312J31855
$$ -221424 -285852 -204280 -380105 -487392 -482453 -288541 -506607 -437705 -413555 -575867 -444012
1852d44012J74471J1328j96533n5484M0216J07384j06470k31726J78832N8481
$$ -444012 -269541 -258213 -454746 -510230 -470014 -362630 -469100 -700826 -521994 -463513
1842d63513Q88M6549L8988k82850L02440R9317O0474l1330j92660L7904l199K86293
$$ -463513 -462625 -416076 -377088 -659938 -357498 -258181 -197707 -229037 -421697 -383793 -386992 -100699
1830a00699r1663k80974P5587J69716n8297K22963M9815j10691n2804o4729j02803
$$ -100699 -192362 -473336 -397749 -228033 -286330 -63367 -13552 -124243 -177047 -241776 -344579
1819c44579J65685J30491k1781k97696P6038K67377j30344k87547J63473L8626
$$ -344579 -178894 -48403 -70184 -367880 -291842 -24465 -154809 -442356 -278883 -240257
1809b40257j38361M20275K9554J07375k0115m42143R2483P496j43181p8904L42285
$$ -240257 -378618 41657 71211 178586 158471 -283672 -191189 -183693 -326874 -405778 -63493
1798f3493j7100k26540Q8158M8824j58585n5897M8422j2000K52182r6750p3605
$$ -63493 -80593 -307133 -218975 -170151 -328736 -384633 -336211 -348211 -96029 -192779 -266384
1787b66384J99257J21540k43885p0200K13383j55835J50436j43484p5062J34874
$$ -266384 -67127 54413 -189472 -259672 -46289 -202124 -51688 -195172 -270234 -135360
1777a35360k82617J5260J40124j29338j67217J00264L425K06427L59660k22144
$$ -135360 -417977 -402717 -262593 -391931 -559148 -458884 -455459 -249032 110628 -111516
1767a11516p4012K45593N3951m89524l00355J94062J02766K22262j42640p8194
$$ -111516 -185528 60065 114016 -375508 -675863 -481801 -379035 -156773 -299413 -377607
1757c77607K5508K00574O0525q7265k7682J1728J05036j09615j73017J77100p2393
$$ -377607 -352099 -151525 -91000 -178265 -205947 -194219 -89183 -198798 -371815 -194715 -267108
1746b67108k16360r6049K75145Q9168r3997N5395n5069n6823K13670l0036r9357
$$ -267108 -483468 -579517 -304372 -215204 -309201 -253806 -308875 -365698 -152028 -182064 -281421
1735b81421K41989k25664J88817J43725l28668k07951J59231J15727K4081K6416
$$ -281421 -39432 -265096 -76279 67446 -261222 -469173 -309942 -194215 -170134 -143718
1725a43718N9482k63079R1499K24678k64498q0809Q7968k03938J43367K24656
$$ -143718 -84236 -347315 -255816 -31138 -295636 -376445 -288477 -492415 -349048 -124392
1715a24392J62767L18704j99044j54637Q1515j33536J9644J60920n0043j00718
$$ -124392 38375 357079 158035 3398 84913 -48623 -28979 131941 81898 -18820
1705a8820p5392J6160k57375J39974R0216p7913p845L05747p5788j22529j3497
$$ -18820 -94212 -78052 -335427 -195453 -105237 -183150 -190995 114752 38964 -83565 -97062
1694i7062l077l608P2108l26072l32662J21595j59529M6084R5851J41736m9090
$$ -97062 -100139 -103747 -31639 -357711 -690373 -568778 -728307 -682223 -586372 -444636 -493726
1683d93726K56062j899J22352J38005q8943n5246r9463j38691P0417l7950j89064
$$ -493726 -237664 -239563 -117211 20794 -68149 -123395 -222858 -361549 -291132 -329082 -518146
1672e18146O574K12035Q3064q0792N5122J07366J346k41905N1639r9770p9834
$$ -518146 -511572 -299537 -216473 -297265 -242143 -134777 -133431 -375336 -323697 -423467 -503301
1661e03301Q4135K07787O3122p6134K8616j16067O2448O3897J25190p4440J2932
$$ -503301 -419166 -211379 -148257 -224391 -195775 -311842 -249394 -185497 -60307 -134747 -121815
1650a21815j31870Q6604K96219k00265j94802n5085j6398J57354K02571o92m40331
$$ -121815 -253685 -167081 129138 -71127 -265929 -321014 -337412 -180058 22513 21821 -418510
1639d18510J98201Q3441M5500M6876j94743q8324J18027m2593k67234p0255K44425
$$ -418510 -220309 -136868 -91368 -44492 -239235 -327559 -209532 -252125 -519359 -589614 -345189
1628c45189J20651l867K26697k61493k39201k1239L42701o6760j15461L5418K413
$$ -345189 -224538 -228405 -1708 -263201 -502402 -523641 -180940 -247700 -363161 -327743 -325330
1617c25330m9817K2307j01025J96429j4161j06603J69809L3550j8242J70217j43045
$$ -325330 -375147 -352840 -453865 -257436 -271597 -378200 -208391 -174841 -193083 -22866 -165911
1606a65911k59023l4119j7505L19403j16611J03746M3976j53438Q1217J98145
$$ -165911 -424934 -459053 -476558 -157155 -273766 -170020 -126044 -279482 -198265 -120
1596a20L0018m81104K339K06904j50287J03462J66742j5399r7288Q3066k6430
$$ -120 29898 -451206 -448867 -241963 -392250 -288788 -122046 -137445 -234733 -151667 -178097
1585a78097j78579p6204J50673J45090o702K08188k32896j8449K6748M2526j71980
$$ -178097 -356676 -432880 -282207 -137117 -143819 64369 -168527 -186976 -160228 -117702 -289682
1574b89682j1721q130K309j79735j36009L93553K22319k5953k39109J7150L6050
$$ -289682 -301403 -309533 -307224 -486959 -622968 -229415 -7096 -33049 -272158 -255008 -218958
1563b18958j63503j5988l2449k42292j3713L6791q8534K13247M3411J73745P601
$$ -218958 -382461 -398449 -430898 -673190 -686903 -650112 -738646 -525399 -481988 -308243 -300642
1552c00642k39767K01095N9712j17068m4094n3182j56677p7868J31271J27974
$$ -300642 -540409 -339314 -279602 -396670 -440764 -493946 -650623 -728491 -597220 -469246
1542d69246L1141J2795N9805J30640P5654k58833O2622K44772j20275M8517j90970
$$ -469246 -438105 -425310 -365505 -234865 -159211 -418044 -355422 -110650 -230925 -182408 -373378
1531c73378N0184L7579r4429K50031j48482j78656K26384P5969l8022j27750r9562
$$ -373378 -323194 -285615 -380044 -130013 -278495 -457151 -230767 -154798 -192820 -320570 -420132
1520d20132r5468Q5846J48147o33j48020O0309P4013J24155R3111k73794N1822
$$ -420132 -515600 -429754 -281607 -282240 -430260 -369951 -295938 -171783 -78672 -352466 -300644
1509c00644J30664l68542R9627K20148k24383j54210K70079J69278j99673J41782
$$ -300644 -169980 -538522 -438895 -218747 -443130 -597340 -327261 -157983 -357656 -215874
1499b15874l9252K5377K97209R2800l54022J47293j27505k14019J9388q5108K83354
$$ -215874 -255126 -229749 67460 160260 -193762 -46469 -173974 -387993 -368605 -453713 -170359
1488a70359J85729N9309n3145N0805l14118p0373j89711J18638R8218m0341J07736
$$ -170359 15370 74679 21534 72339 -241779 -312152 -501863 -383225 -285007 -325348 -217612
1477b17612j05340j31773K21424p0705m1600j8885k83756J48912K81039L4880
$$ -217612 -322952 -454725 -233301 -304006 -345606 -364491 -648247 -499335 -218296 -183416
1467a83416N0226J1054j29092m4314J96553l4477R9627p1211m1278l2869j67469
$$ -183416 -133190 -122136 -251228 -295542 -98989 -133466 -33839 -105050 -146328 -179197 -346666
1456c46666P3108J6416Q2777n5577R8093P5617J75920j74098J74151K8823k98867
$$ -346666 -273558 -257142 -174365 -229942 -131849 -56232 119688 -54410 119741 148564 -150303
1445a50303q1418K83420r850j68752r1609r8520K45700j91722J44605j87422j8064
$$ -150303 -231721 51699 41849 -126903 -218512 -317032 -71332 -263054 -118449 -305871 -323935
1434c23935J74069l0349J0972k46139j13885J15743J63287O0419k14982K23870
$$ -323935 -149866 -180215 -169243 -415382 -529267 -413524 -250237 -189818 -404800 -180930
1424a80930K40614j04477j46321o3800J77088J02094j16970O6474L3884j8866
$$ -180930 59684 -44793 -191114 -254914 -77826 24268 -92702 -26228 7656 -11210
1414a1210o6038l43371k0455q5272L4543Q1557L03709Q3133m4910k65354L8874
$$ -11210 -77248 -420619 -441074 -526346 -491803 -410246 -106537 -23404 -68314 -333668 -294794
1403b94794m8847Q3290j90782R6602L67301o6902n6855k6842M5483l56757L7092
$$ -294794 -343641 -260351 -451133 -354531 12770 -54132 -110987 -137829 -92346 -449103 -412011
1392d12011O6560l17121K26578J41688K1734M5051J22033j85094J71283k11388
$$ -412011 -345451 -662572 -435994 -294306 -272572 -227521 -105488 -290582 -119299 -330687
1382c30687m4657J77338O5571M4179o8090L8401J3449j10272l31267L0790K64639
$$ -330687 -375344 -198006 -132435 -88256 -156346 -117945 -104496 -214768 -546035 -515245 -250606
1371b50606j381k08795J46892K87409j44699J5388K87709p7216o8333p8967j95885
$$ -250606 -251987 -460782 -313890 -26481 -171180 -155792 131917 54701 -13632 -92599 -288484
1360b88484j76153J92853J828l7107K70101o9454p3264Q0096K23818m7075j74095
$$ -288484 -464637 -271784 -269956 -307063 -36962 -106416 -179680 -99584 124234 77159 -96936
1349i6936P7283L4691m5966j4324p5829j28735L32367p6986j93672J16161o5305
$$ -96936 -19653 15038 -30928 -45252 -121081 -249816 82551 5565 -188107 -71946 -137251
1338a37251j17417J86860L0242J37443k23948j84012O5507j66535K5780J46198
$$ -137251 -254668 -67808 -37566 99877 -124071 -308083 -242576 -409111 -383331 -237133
1328b37133q6163j40768k395M62947N9265p4101k43644j02557J7480l520K01493
$$ -237133 -323296 -464064 -466459 -3512 55753 -18348 -261992 -364549 -347069 -350589 -149096
1317a49096L09243j95170l69446J85238k13125L9462K94729O261j61315k63633
$$ -149096 160147 -35023 -404469 -219231 -432356 -392894 -98165 -91904 -253219 -516852
1307e16852K58961R3471K8117n7911K9842j99906J13825Q9406j92269n3766j05851
$$ -516852 -257891 -164420 -136303 -194214 -164372 -364278 -250453 -161047 -353316 -407082 -512933
1296e12933K26359p7374j52348P4186k6556K51220O650M5445l3592j13087N0707
$$ -512933 -286574 -363948 -516296 -442110 -468666 -217446 -210796 -165351 -198943 -312030 -261323
1285b61323P7304J74566r3760n9818J63946j43326k74434k8358N7018j39121j11946
$$ -261323 -184019 -9453 -103213 -163031 915 -142411 -416845 -445203 -388185 -527306 -639252
1274f39252L57169o8780r1706m1727J35662K48783j62003J48377k35524l17593
$$ -639252 -282083 -350863 -442569 -484296 -348634 -99851 -261854 -113477 -349001 -666594
1264f66594l6008J1230M409L73114Q2761J0522J78331k6973L26862j06732k77048
$$ -666594 -702602 -691372 -686963 -313849 -231088 -220566 -42235 -69208 257654 150922 -126126
1253a26126k56993m6244l51068J80336L30370K34579L4369k971j17331j74807
$$ -126126 -383119 -429363 -780431 -600095 -269725 -35146 -777 -3748 -121079 -295886
1243b95886k47872J16874j30034K33083R4801k02955J81793J75342Q266j77982
$$ -295886 -543758 -426884 -556918 -323835 -229034 -431989 -250196 -74854 -66588 -244570
1233b44570j82523M0387n6756o3478K9672K53787l0054j65531Q2883J57119p8643
$$ -244570 -427093 -386706 -443462 -506940 -477268 -223481 -253535 -419066 -336183 -179064 -257707
1222b57707J15962K39855j46421o1807j26659j22887j24588J39000M219J03487
$$ -257707 -141745 98110 -48311 -110118 -236777 -359664 -484252 -345252 -341033 -237546
1212b37546J20988l4822j37022j61978N02412J7736j51940l31044k5316K76114
$$ -237546 -116558 -151380 -288402 -450380 52032 69768 -82172 -413216 -438532 -162418
1202a62418j79108M03819q4074k21299J9830n4820l5567K21684l9905q5982k00891
$$ -162418 -341526 62293 -21781 -243080 -223250 -278070 -313637 -91953 -131858 -217840 -418731
1191d18731j7279J34333K52041k36945R7427K39447K4655p3211m2830o9292o0189
$$ -418731 -436010 -301677 -49636 -286581 -189154 50293 74948 1737 -41093 -110385 -170574
1180a70574o7110M909K41449q5786j18833L2694m1876k41781K35977j75678L4655
$$ -170574 -237684 -232775 8674 -77112 -195945 -163251 -205127 -446908 -210931 -386609 -351954
1169c51954L41836N6355l2479j25126L01J34004k21696k10108L1426Q1500k8360
$$ -351954 -10118 46237 13758 -111368 -111067 22937 -198759 -408867 -377441 -295941 -324301
1158c24301M4826j5712R0595j17781J74787M8325R7067l6229j93536p0193l9586
$$ -324301 -279475 -295187 -204592 -322373 -147586 -99261 -2194 -38423 -231959 -302152 -341738
1147c41738K76956j69544j25073l26838J74816J99735P3058k05559j42490Q3684
$$ -341738 -64782 -234326 -359399 -686237 -511421 -311686 -238628 -444187 -586677 -502993
1137e02993k04614J20828L06302M5264N8477R7197K62623k4462j62312k19098
$$ -502993 -707607 -586779 -280477 -235213 -176736 -79539 183084 158622 -3690 -222788
1127b22788m0277P4143j00378R0715Q1076j77398K14072j34921q1132j61293j21607
$$ -222788 -263065 -188922 -289300 -198585 -117509 -294907 -80835 -215756 -296888 -458181 -579788
1116e79788Q9201q5006K54695Q3640O9869J50831O4844m04113J5561K80151J03722
$$ -579788 -490587 -575593 -320898 -237258 -167389 -16558 48286 -355827 -340266 -60115 43607
1105D3607j32578l21195P0271o5104j71026j1178K73543R3206j1918k08749J62853
$$ 43607 -88971 -410166 -339895 -404999 -576025 -587203 -313660 -220454 -232372 -441121 -278268
1094b78268N0289k10400j84867K06807J13786k20092r9644J49725J3053k90694
$$ -278268 -227979 -438379 -623246 -416439 -302653 -522745 -622389 -472664 -459611 -750305
1084g50305K66488M22359j67844k6166N09417j98270m34818R7471Q8414k44815
$$ -750305 -483817 -61458 -229302 -255468 253949 55679 -379139 -281668 -193254 -438069
1074d38069R3781q231K6656J7403o7770R3550P6298p0234J21523K1912K0002j61178
$$ -438069 -344288 -352519 -325863 -308460 -376230 -282680 -206382 -276616 -155093 -133181 -113179 -274357
1062b74357R9727l6013m746J7695m1701M5280j51805p7492J68085n1477r5990
$$ -274357 -174630 -210643 -215389 -197694 -239395 -194115 -345920 -423412 -255327 -306804 -402794
1051d02794M3952J64556L10994q454k50373k73704P0767J81261r8239J33986k49819
$$ -402794 -358842 -194286 116708 108254 -142119 -415823 -345056 -163795 -262034 -128048 -377867
1040c77867J99372m5662k88980j48642K23313L18752q5576k19074J06585N7584
$$ -377867 -178495 -224157 -513137 -661779 -438466 -119714 -205290 -424364 -317779 -260195
1030b60195P9347p5327k24994K11015k7392L17926o2147p7775k46920j6176J00167
$$ -260195 -180848 -256175 -481169 -270154 -297546 20380 -41767 -119542 -366462 -382638 -282471
1019b82471J10771P314j07o5293P2463K50146j87389k80079J48419j12730K3390
$$ -282471 -171700 -164386 -164493 -229786 -157323 92823 -94566 -374645 -226226 -338956 -315566
1008c15566K14704k23949J56020K24026P8935k28032o0910n8078p4285J66246
$$ -315566 -100862 -324811 -168791 55235 134170 -93862 -154772 -212850 -287135 -120889
998a20889R4563J66534r6080j25132l66680O5154L40709Q1116J2707P3128N9213
$$ -120889 -26326 140208 44128 -81004 -447684 -382530 -41821 39295 52002 125130 184343
987A84343l6084k89503p7390m9814j41132M3243J16302J87052j44600p2185j01565
$$ 184343 148259 -141244 -218634 -268448 -409580 -366337 -250035 -62983 -207583 -279768 -381333
976c81333K5995m6894Q2943o7589j32221K92236K2565N3016k03161j56818J79222
$$ -381333 -355338 -402232 -319289 -386878 -519099 -226863 -204298 -151282 -354443 -511261 -332039
965c32039j15167K6438L05162O9515M896k2204l09797M4325J47935j51474j31775
$$ -332039 -447206 -420768 -115606 -46091 -41195 -63399 -373196 -328871 -180936 -332410 -464185
954d64185o5472P3374J61387J74469K45449l04750P8498m8014J12882l8407l76940
$$ -464185 -529657 -456283 -294896 -120427 125022 -179728 -101230 -149244 -36362 -74769 -451709
943d51709J28224J37572P3535k45094K16168J15970k17291P1142K18788k05085
$$ -451709 -323485 -185913 -112378 -357472 -141304 -25334 -242625 -171483 47305 -157780
933a57780j26726P490R6484J00636N9494l00804m0898J13559k4329q9772J43537
$$ -157780 -284506 -277016 -180532 -79896 -20402 -321206 -362104 -248545 -272874 -362646 -219109
922b19109n0881j6756O057q0173J63644k95588J04632k093J0483K31713r2033
$$ -219109 -269990 -286746 -280689 -360862 -197218 -492806 -388174 -390267 -379784 -148071 -240104
911b40104R5706q0997n1787J24328O7888j8056j33428J81572K10269J17024k91102
$$ -240104 -144398 -225395 -277182 -152854 -84966 -103022 -236450 -54878 155391 272415 -18687
900a8687m7508q2444J33554L4510m17816J07426N8912J52060J1937q062j84539
$$ -18687 -66195 -148639 -15085 19425 -398391 -290965 -232053 -79993 -68056 -76118 -260657
889b60657Q1144K9685j76205P4346K4080n2881r2837p4546R2817j17798K82917
$$ -260657 -179513 -149828 -326033 -251687 -227607 -280488 -373325 -447871 -355054 -472852 -189935
878a89935L72461k74368m0062j81041J0461R432n5980n8096J17791K6781m3120
$$ -189935 182526 -91842 -131904 -312945 -302484 -293052 -349032 -407128 -289337 -262556 -305676
867c05676R425k35801K41150L0577j27443J44732L6868J40738Q0347k9031r1907
$$ -305676 -296251 -532052 -290902 -260325 -387768 -243036 -206168 -65430 14917 -14114 -106021
856a06021N8656q2170J037j19391P2582O6389o7054J05198k10726j4774o3457
$$ -106021 -47365 -129535 -128498 -247889 -175307 -108918 -175972 -70774 -281500 -296274 -359731
845c59731O6770K28791r8491p5289J09106J34712j43174k05255K8075Q1004k57286
$$ -359731 -292961 -64170 -162661 -237950 -128844 5868 -137306 -342561 -314486 -233482 -490768
834d90768l9599O0071M6599K05812j72912l4317J39267q7976m1907K41744J60112
$$ -490768 -530367 -470296 -423697 -217885 -390797 -425114 -285847 -373823 -415730 -173986 -13874
823a3874j16180k02065J33690j16104L0118J23728K50756j3014k49417J65272
$$ -13874 -130054 -332119 -198429 -314533 -284415 -160687 90069 77055 -172362 -7090
813g090N3518M20j45459J41379k34331k5063J32385N8302k63578J59694K00421
$$ -7090 46428 46848 -98611 42768 -191563 -216626 -84241 -25939 -289517 -129823 70598
802G0598J54434j50870k14337l7987Q7982p4891j33351J5817j62871Q3752O445
$$ 70598 225032 74162 -140175 -178162 -90180 -165071 -298422 -282605 -445476 -361724 -355279
791c55279L55551q8399k7854J1568n6162j48007K8558n3285N3257l7250J39347
$$ -355279 272 -88127 -115981 -104413 -160575 -308582 -280024 -333309 -280052 -317302 -177955
780a77955Q6457j34158j9782J5498o3244K04350J52118k86538k01468K02231j45152
$$ -177955 -91498 -225656 -245438 -229940 -293184 -88834 63284 -223254 -424722 -222491 -367643
769c67643m9135L20313j08974k78965m6034L15381J14358N6765j36354L4082J57879
$$ -367643 -416778 -96465 -205439 -484404 -530438 -215057 -100699 -43934 -180288 -146206 11673
758A1673k39994k79125K57526J05107r8842n0366J56187O8476k57917K02160N3061
$$ 11673 -228321 -507446 -249920 -144813 -243655 -294021 -137834 -69358 -327275 -125115 -72054
747g2054l54641J40712k4634k5894J73581J08870k12836l19165L7002K62478P5345
$$ -72054 -426695 -285983 -310617 -336511 -162930 -54060 -266896 -586061 -549059 -286581 -211236
736b11236r509M8825J06337K12289r0361J03130q2317o2692N9198k69143l3390
$$ -211236 -220745 -171920 -65583 146706 56345 159475 77158 14466 73664 -195479 -228869
725b28869p9401J05282o5788O3231M8381j09124K39955J29529j29628J26487j1509
$$ -228869 -308270 -202988 -268776 -205545 -157164 -266288 -26333 103196 -26432 100055 88546
714H8546K88040L8710k37082k900k92065j2391J65873l80652J8011J36661l09809
$$ 88546 376586 415296 178214 175314 -116751 -129142 36731 -343921 -325910 -189249 -499058
703d99058k0131K94852Q2507j30216m6548L3835J72502k19159m5304r2594M28647
$$ -499058 -519189 -224337 -141830 -272046 -318594 -284759 -112257 -331416 -376720 -469314 -40667
692d0667K500j09834j4762p6798k16804N4378j09751J29423M06362j71843l95062
$$ -40667 -38167 -148001 -162763 -239561 -456365 -401987 -511738 -382315 24047 -147796 -542858
681e42858P2839K51842j02694k11109J17323m2604K74018K2466j61944n8637n876
$$ -542858 -470019 -218177 -320871 -531980 -414657 -457261 -183243 -160777 -322721 -381358 -387234
670c87234R2920j00025M6304R5402p9293k29295K4446J76751K5725k03632J59860
$$ -387234 -294314 -394339 -348035 -252633 -331926 -561221 -536775 -360024 -334299 -537931 -378071
659c78071j45461K78463N32030J20473k52898l12999o2466J32222K0428j91855
$$ -378071 -523532 -245069 286961 407434 154536 -158463 -220929 -88707 -68279 -260134
649b60134K94904j13214j46584j4678J5586j72214p7879J40020J02392K53893
$$ -260134 34770 -78444 -225028 -239706 -224120 -396334 -474213 -334193 -231801 22092
639B2092P5178l10436p3236L28874k05354j76042J89400J01765j37196Q3005J54987
$$ 22092 97270 -213166 -286402 42472 -162882 -338924 -149524 -47759 -184955 -101950 53037
628E3037p7761j51007j96427r5357K18291o0351J09462j98812J03668l8283L78778
$$ 53037 -24724 -175731 -372158 -467515 -249224 -309575 -200113 -398925 -295257 -333540 45238
617D5238l02421j78628J80296P8445J02810J13221L9973j41659p1719J44146k26200
$$ 45238 -257183 -435811 -255515 -177070 -74260 38961 78934 -62725 -134444 9702 -216498
606b16498k09001J37985Q4597o8908J76214N4319q1513k32256m7992R1481O132
$$ -216498 -425499 -287514 -202917 -271825 -95611 -41292 -122805 -355061 -403053 -311572 -305440
595c05440l4622j09612L45977K3578k00024J04743L75618j12696l9854m51587
$$ -305440 -340062 -449674 -103697 -80119 -280143 -175400 200218 87522 47668 -403919
585d03919J38685J84607n7968Q7660k16791j26747K40321J58263l5704p1977j84487
$$ -403919 -265234 -80627 -138595 -50935 -267726 -394473 -154152 4111 -31593 -103570 -288057
574b88057J9834j0537K00949m4017O877j50391l65702K03057J13191l4995o7602
$$ -288057 -268223 -278760 -77811 -121828 -114951 -265342 -631044 -427987 -314796 -349791 -417393
563d17393K58976q0629m715j20739K13391J5684J81199k61276L19193j04778m10969
$$ -417393 -158417 -239046 -243761 -364500 -151109 -135425 45774 -215502 103691 -1087 -412056
552d12056K51467j21421j1723l4754K49204L8448j29428J2542J35896J6574l67705
$$ -412056 -160589 -282010 -293733 -328487 -79283 -40835 -170263 -157721 -21825 -5251 -372956
541c72956J7243J10193P0817J78181j7076J9587k50204N4590L5908L3664r0047
$$ -372956 -355713 -245520 -174703 3478 -13598 5989 -244215 -189625 -153717 -120053 -210100
530b10100r4773p686J49164j97841R9673J03485m7184J40902j87587p1417Q6502
$$ -210100 -304873 -312559 -163395 -361236 -261563 -158078 -205262 -64360 -251947 -323364 -236862
519b36862K03779k14451j85108N9048O2609J55755q9688O0410p7949k1613k18935
$$ -236862 -33083 -247534 -432642 -373594 -310985 -155230 -244918 -184508 -262457 -284070 -503005
508e03005J18690J33553k25246K85880K52705j10725k43486L0902J82696j49254
$$ -503005 -384315 -250762 -476008 -190128 62577 -48148 -291634 -260732 -78036 -227290
498b27290j46295q1061K3266q3191K1516J98898k64205J3850K53165m0872j63304
$$ -227290 -373585 -454646 -431380 -514571 -493055 -294157 -558362 -544512 -291347 -332219 -495523
487d95523M22681l1528l76268K36259J1445M4675J39837J75919L2739l9510k7344
$$ -495523 -72842 -104370 -480638 -244379 -232934 -188259 -48422 127497 160236 120726 93382
476I3382J9656j40120k48200j08444l436J1986O2757J13202m8158L0989l09476
$$ 93382 113038 -27082 -275282 -383726 -387162 -375176 -312419 -199217 -247375 -216386 -525862
465e25862j66335N19904K29389j31774k28089J24613q522o2570k028j33345j9584
$$ -525862 -692197 -172293 57096 -74678 -302767 -178154 -186676 -249246 -251274 -384619 -404203
454d04203J14348N0010m5574J78658k09664J21074J25614J22069k92410K01104
$$ -404203 -289855 -239845 -285419 -106761 -316425 -195351 -69737 52332 -240078 -38974
444c8974P8436o9003K8656N7420n4419m6179k41837k30834K09898M53205j14009
$$ -38974 39462 -29541 -885 56535 2116 -44063 -285900 -516734 -306836 146369 32360
433C2360r5079q415j97338k3822j35412o367j69431L3828L2161J56347O5923J020
$$ 32360 -62719 -71134 -268472 -292294 -427706 -434073 -603504 -569676 -537515 -381168 -315245 -314225
421c14225r8470L34816M5012m8739p6030L6506l5210k36341j03606K5663K60295
$$ -314225 -412695 -77879 -32867 -81606 -157636 -121130 -156340 -392681 -496287 -470624 -210329
410b10329r8276q3193J1624J63986m9248R5718O2465j58375L25940j71208j39865
$$ -210329 -308605 -391798 -380174 -216188 -265436 -169718 -107253 -265628 60312 -110896 -250761
399b50761J4757L0269p8634l3551l0532j24431m501R8717P9749j4943j42487l619
$$ -250761 -236004 -205735 -284369 -317920 -348452 -472883 -477384 -378667 -298918 -313861 -456348 -459967
387d59967K56463K07929j59386Q857k38211K38375n1327n2151K59264O1717Q431
$$ -459967 -203504 4425 -154961 -146104 -384315 -145940 -197267 -249418 9846 71563 79994
376G9994l82723j3282r9441J64915L74315p6020q7180k99166J69183k818L10569
$$ 79994 -302729 -316011 -415452 -250537 123778 47758 -39422 -338588 -169405 -172223 138346
365A38346j90562j90664o6815m00639J36830J95140j2590L30194K69582k24242
$$ 138346 -52216 -242880 -309695 -710334 -573504 -378364 -390954 -60760 208822 -15420
355a5420l07289j92724K71575J92846j50085N4713J43763j72853m6493j03318
$$ -15420 -322709 -515433 -243858 -51012 -201097 -146384 -2621 -175474 -221967 -325285
345c25285J77514J41987k6166q8609O2005j79366P3125L4531J65841j01523J17217
$$ -325285 -147771 -5784 -31950 -120559 -58554 -237920 -164795 -130264 35577 -65946 51271
334E1271l4208K5085r1490j86902q8353L12129k3130j65874J07116M9560j59318
$$ 51271 17063 42148 -49342 -236244 -324597 -12468 -35598 -201472 -94356 -44796 -204114
323b04114O7128j40585j55081r2361J46611j9846r9385K82288j55084q9518k9314
$$ -204114 -136986 -277571 -432652 -525013 -378402 -398248 -497633 -215345 -370429 -459947 -489261
312d89261K52423l242K01962P7227k81420j16560j8227M7784J07103K41595j65642
$$ -489261 -236838 -240080 -38118 39109 -242311 -358871 -377098 -329314 -222211 19384 -146258
301a46258o5974j02109j06146P8352j34772J24897Q1191O9605q3609K22044K25609
$$ -146258 -212232 -314341 -420487 -342135 -476907 -352010 -270819 -201214 -284823 -62779 162830
290A62830l25047J05143K43772j62827j00615k09189n51J54633L0756k44690J89445
$$ 162830 -162217 -57074 186698 23871 -76744 -285933 -286484 -131851 -101095 -345785 -156340
279a56340k7919j58025J468j46223q7959J4990O544J37429J39175l5961O8065
$$ -156340 -184259 -342284 -340816 -487039 -574998 -560008 -553464 -416035 -276860 -312821 -244756
268b44756q1439m2910p2084r5977R9855J57557j28673M045J53139j06062r7776
$$ -244756 -326195 -369105 -441189 -537166 -437311 -279754 -408427 -404382 -251243 -357305 -455081
257d55081k506j9726J00038M0966J35511j0313j27794j9455r5308J79414J3010
$$ -455081 -457587 -477313 -377275 -336309 -200798 -211111 -338905 -358360 -453668 -274254 -261244
246b61244k8670N4365m0517k16426L25608N9895r7172p9821p4813K55085O2701
$$ -261244 -289914 -235549 -276066 -492492 -166884 -106989 -204161 -283982 -358795 -103710 -41009
235d1009m927k9284j17362j40109j6702K34107r059P626O429k62527J05103j07771
$$ -41009 -45936 -75220 -192582 -332691 -349393 -115286 -124345 -116719 -110290 -372817 -267714 -375485
223c75485P1993J16763q3270k1825L01048j25124n3686o6104l9917N9116J37225
$$ -375485 -303492 -186729 -269999 -291824 9224 -115900 -169586 -235690 -275607 -216491 -79266
212g9266L1719O9063J00303J3159k76622m4259K2457j53298K30172l13005J83883
$$ -79266 -47547 21516 121819 134978 -141644 -185903 -163446 -316744 -86572 -399577 -215694
201b15694J84021k05000k09008K23374J65129k59035J19504o9504m5424J90265
$$ -215694 -31673 -236673 -445681 -222307 -57178 -316213 -196709 -266213 -311637 -121372
191a21372j58007N7976J38980j28319l73259n1773k8849J35632J89989l7657q6189
$$ -121372 -279379 -221403 -82423 -210742 -584001 -635774 -664623 -528991 -339002 -376659 -462848
180d62848j2797J14536K13745r777n2452q5421j71744j67608J53677K65422k0407
$$ -462848 -475645 -361109 -147364 -157141 -209593 -295014 -466758 -634366 -480689 -215267 -235674
169b35674Q1336R9091j58154n836k23017l81151L35521J45755J71864r3863j63233
$$ -235674 -154338 -55247 -213401 -219237 -442254 -823405 -487884 -342129 -170265 -264128 -427361
158d27361J59254k8957j67055J11421l0038J89086O5738k7641j14506R5285K7538
$$ -427361 -268107 -297064 -464119 -352698 -382736 -193650 -127912 -155553 -270059 -174774 -147236
147a47236k7886q67k61884J12684R9923Q2516j44384j62987K40530J94680k66864
$$ -147236 -175122 -175989 -437873 -325189 -225266 -142750 -287134 -450121 -209591 -14911 -281775
136b81775J45717j05471j53233q238O4685J45599o4302j6619J71231R0678l01355
$$ -281775 -136058 -241529 -394762 -403000 -338315 -192716 -257018 -273637 -102406 -11728 -313083
125c13083m3982J44911k7450j15155J7972M1777k9741J22808j97041L5212N7209
$$ -313083 -357065 -212154 -239604 -354759 -336787 -295010 -324751 -201943 -398984 -363772 -306563
114c06563l8280J37661K1006j4739k9101J18513j16948O3515K9700n7178Q2022
$$ -306563 -344843 -207182 -186176 -200915 -230016 -111503 -228451 -164936 -135236 -192414 -110392
103a10392q2038j631m7556l3654N7188J05523j92377m9839m5205J12908J77921
$$ -110392 -192430 -194061 -241617 -275271 -218083 -112560 -304937 -354776 -399981 -287073 -109152
92a09152j63130M0162N1437n3885j52230r2270Q5980q3180J22146j25585j54438
$$ -109152 -272282 -232120 -180683 -234568 -386798 -479068 -393088 -476268 -354122 -479707 -634145
81f34145K42190J665J1133j76645j19287J4413K52273R2724O6212J52134j47043
$$ -634145 -391955 -390290 -379157 -555802 -675089 -660676 -408403 -315679 -249467 -97333 -244376
70b44376j43605J0284j01384l6684j1988n0298J29182K25608j5906j10836j51901
$$ -244376 -387981 -377697 -479081 -515765 -527753 -578051 -448869 -223261 -239167 -350003 -501904
59e01904J71819j01371J22395j2455n5596r497k3111p4834N0799j22727j16210
$$ -501904 -330085 -431456 -309061 -321516 -377112 -386609 -409720 -484554 -433755 -556482 -672692
48f72692P44J17273J95614n2765n5073j57185p2859k9948J96098J7593R5365Q0603
$$ -672692 -671948 -554675 -359061 -411826 -466899 -624084 -696943 -726891 -530793 -513200 -417835 -337232
$$ [...]
##END NTUPLES=NMR SPECTRUM
##END=
