##TITLE=1H_DE-80H_X3
 200.13MHz, d2o
 8 sc
 
 19ns.26.2.2025
##JCAMPDX= 6.0         $$ Bruker NMR JCAMP-DX V2.0
##DATA TYPE= NMR SPECTRUM
##DATA CLASS= NTUPLES
##ORIGIN= UXNMR, Bruker Analytische Messtechnik GmbH
##OWNER= pz
$$ XWIN-NMR		Version 3.5
$$ Wed Mar 25 10:19:42 2026 Russian Standard Time (UT+4h)  Yarkov@DPX200
##.OBSERVE FREQUENCY= 200.1313
##.OBSERVE NUCLEUS= ^1H
##.ACQUISITION MODE= SIMULTANEOUS
##.ACQUISITION SCHEME= undefined
##.AVERAGES= 8
##.DIGITISER RES= 18
##SPECTROMETER/DATA SYSTEM= spect
##.PULSE SEQUENCE= zg30
##.SOLVENT NAME= CDCl3
##.SHIFT REFERENCE= (INTERNAL, CDCl3, 0, 15.4362)
##AUDIT TRAIL= $$ (NUMBER, WHEN, WHO, WHERE, WHAT)
$$ ##TITLE= Audit trail, XWIN-NMR		Version 3.5
$$ ##JCAMPDX= 5.01
$$ ##ORIGIN= Bruker BioSpin GmbH
$$ ##OWNER= Yarkov
$$ C:/Bruker/XWIN-NMR/data/yarkov2/nmr/H-C/1/pdata/1/auditp.txt
$$ ##AUDIT TRAIL=  $$ (NUMBER, WHEN, WHO, WHERE, WHAT)
(   1,<2026-03-25 10:18:51.82 +0400>,<Yarkov>,<DPX200>,
      <created by zg, POWCHK disabled, PULCHK disabled
       configuration hash MD5:
       00 E9 B6 7A A2 85 ED C7 34 08 36 98 17 FE 4E 26
       data hash MD5: 16K
       01 6D 66 B2 8B BD 61 D7 6E FF E2 1D 80 D6 A0 24>)
(   2,<2026-03-25 10:18:57.82 +0400>,<Yarkov>,<DPX200>,
      <Start of raw data processing
       efp BC_mod = 2 LB = 0.25 FT_mod = 6 PKNL = 1 PHC0 = -5299.148 PHC1 = 6.821927 SI = 16K 
       data hash MD5: 16K
       19 06 9F 4F 07 53 BA 1C 4F BA 6A 66 63 50 D8 01>)
$$ ##END=
$$ 
$$ hash MD5
$$ EB E4 4A 9A E1 02 8D DC 6B 33 46 FD CF 66 B1 FC
##$RELAX= 
##$RELAX= 
##$RELAX= 
##$RELAX= 
##$RELAX= 
##$RELAX= 
$$ Bruker specific parameters
$$ --------------------------
##$DU= <C:/Bruker/XWIN-NMR>
##$EXPNO= 1
##$NAME= <H-C>
##$PROCNO= 1
##$TYPE= <nmr>
##$USER= <yarkov2>
##$AMP= (0..31)
100 100 100 100 100 100 100 100 100 100 100 100 100 100 100 100 100 100 
100 100 100 100 100 100 100 100 100 100 100 100 100 100 
##$AQSEQ= 0
##$AQ_mod= 1
##$AUNM= <au_zg>
##$AUTOPOS= <>
##$BF1= 200.13
##$BF2= 200.13
##$BF3= 200.13
##$BF4= 200.13
##$BF5= 200.13
##$BF6= 200.13
##$BF7= 200.13
##$BF8= 200.13
##$BYTORDA= 1
##$CFDGTYP= 0
##$CFRGTYP= 5
##$CHEMSTR= <none>
##$CNST= (0..31)
1 1 145 1 1 1 1 1 1 1 1 1 1 1 1 1 1 1 1 1 1 1 1 1 1 1 1 1 1 1 1 1 
##$CPDPRG= <>
##$CPDPRG1= <>
##$CPDPRG2= <>
##$CPDPRG3= <>
##$CPDPRG4= <mlev>
##$CPDPRG5= <mlev>
##$CPDPRG6= <mlev>
##$CPDPRG7= <mlev>
##$CPDPRG8= <mlev>
##$CPDPRGB= <>
##$CPDPRGT= <>
##$D= (0..31)
0 0.7 0 0 0 0 0 0 0 0 0 0.03 0 0 0 0 0 0 0 0 0 0 0 0 0 0 0 0 0 0 0 0 
##$DATE= 1774419531
##$DBL= (0..7)
120 120 120 120 120 120 120 120 
##$DBP= (0..7)
150 150 150 150 150 150 150 150 
##$DBP07= 0
##$DBPNAM0= <>
##$DBPNAM1= <>
##$DBPNAM2= <>
##$DBPNAM3= <>
##$DBPNAM4= <>
##$DBPNAM5= <>
##$DBPNAM6= <>
##$DBPNAM7= <>
##$DBPOAL= (0..7)
0.5 0.5 0.5 0.5 0.5 0.5 0.5 0.5 
##$DBPOFFS= (0..7)
0 0 0 0 0 0 0 0 
##$DE= 6
##$DECBNUC= <off>
##$DECIM= 32
##$DECNUC= <off>
##$DECSTAT= 4
##$DIGMOD= 1
##$DIGTYP= 9
##$DL= (0..7)
0 120 120 120 120 120 120 120 
##$DP= (0..7)
$$ [...]
##$SUBNAM2= <"">
##$SUBNAM3= <"">
##$SUBNAM4= <"">
##$SUBNAM5= <"">
##$SUBNAM6= <"">
##$SUBNAM7= <"">
##$SUBNAM8= <"">
##$SUBNAM9= <"">
##$SW= 18.0517328524113
##$SWIBOX= (0..15)
0 0 2 0 0 0 0 0 0 0 0 0 0 0 0 0 
##$SW_h= 3612.71676300578
##$TD= 16384
##$TD0= 1
##$TE= 0
##$TE2= 300
##$TE3= 300
##$TEG= 300
##$TL= (0..7)
0 120 120 120 120 120 120 120 
##$TP= (0..7)
150 150 150 150 150 150 150 150 
##$TP07= 0
##$TPNAME0= <>
##$TPNAME1= <>
##$TPNAME2= <>
##$TPNAME3= <>
##$TPNAME4= <>
##$TPNAME5= <>
##$TPNAME6= <>
##$TPNAME7= <>
##$TPOAL= (0..7)
0.5 0.5 0.5 0.5 0.5 0.5 0.5 0.5 
##$TPOFFS= (0..7)
0 0 0 0 0 0 0 0 
##$TUNHIN= 0
##$TUNHOUT= 0
##$TUNXOUT= 0
##$USERA1= <user>
##$USERA2= <user>
##$USERA3= <user>
##$USERA4= <user>
##$USERA5= <user>
##$V9= 5
##$VALIST= <valist>
##$VCLIST= <CCCCCCCCCCCCCCC>
##$VD= 0
##$VDLIST= <DDDDDDDDDDDDDDD>
##$VPLIST= <PPPPPPPPPPPPPPP>
##$VTLIST= <TTTTTTTTTTTTTTT>
##$WBST= 1024
##$WBSW= 4
##$XGAIN= (0..3)
0 0 0 0 
##$XL= 0
##$YL= 0
##$YMAX_a= 351058
##$YMIN_a= -339679
##$ZGOPTNS= <>
##$ZL1= 120
##$ZL2= 120
##$ZL3= 120
##$ZL4= 120
##$ABSF1= 0
##$ABSF2= 0
##$ABSG= 0
##$ABSL= 0
##$ALPHA= 0
##$AQORDER= 0
##$ASSFAC= 0
##$ASSFACI= 0
##$ASSFACX= 0
##$ASSWID= 0
##$AUNMP= <proc_1d>
##$AZFE= 0.1
##$AZFW= 0.1
##$BCFW= 0
##$BC_mod= 2
##$BYTORDP= 0
##$COROFFS= 0
##$CY= -3
##$DATMOD= 1
##$DC= 0
##$DFILT= <>
##$DTYPP= 0
##$F1P= 0
##$F2P= 0
##$FCOR= 1
##$FTSIZE= 16384
##$FT_mod= 6
##$GAMMA= 0
##$GB= 0
##$INTBC= 1
##$INTSCL= 3.241238e-09
##$ISEN= 128
##$LB= 0.25
##$LEV0= 0
##$LPBIN= 0
##$MAXI= 10000
##$MC2= 0
##$MEAN= 0
##$ME_mod= 0
##$MI= 1.114404
##$NCOEF= 0
##$NC_proc= -8
##$NLEV= 6
##$NOISF1= 3.799351
##$NOISF2= 2.8
##$NSP= 0
##$NTH_PI= 0
##$NZP= 0
##$OFFSET= 15.43618
##$PC= 1
##$PHC0= -5299.148
##$PHC1= 6.821927
##$PH_mod= 1
##$PKNL= yes
##$PPARMOD= 0
##$PSCAL= 0
##$PSIGN= 0
##$REVERSE= no
##$SF= 200.13001711594
##$SI= 16384
##$SIGF1= 3
##$SIGF2= 2
##$SINO= 0.751879
##$SIOLD= 32768
##$SREGLST= <19F.Aceton>
##$SSB= 0
##$STSI= 16384
##$STSR= 0
##$SW_p= 3612.71676300578
##$SYMM= 0
##$S_DEV= 0
##$TDeff= 16384
##$TDoff= 0
##$TI= <>
##$TILT= no
##$TM1= 0
##$TM2= 0
##$TOPLEV= 0
##$USERP1= <user>
##$USERP2= <user>
##$USERP3= <user>
##$USERP4= <user>
##$USERP5= <user>
##$WDW= 1
##$XDIM= 16384
##$YMAX_p= 511519867
##$YMIN_p= -3488997
$$ End of Bruker specific parameters
$$ ---------------------------------
##NTUPLES= NMR SPECTRUM
##VAR_NAME=  FREQUENCY,     SPECTRUM/REAL,   SPECTRUM/IMAG
##SYMBOL=    X,             R,               I
##VAR_TYPE=  INDEPENDENT,   DEPENDENT,       DEPENDENT
##VAR_FORM=  AFFN,          ASDF,            ASDF
##VAR_DIM=   16384,         16384,           16384
##UNITS=     HZ,            ARBITRARY UNITS, ARBITRARY UNITS
##FACTOR=    0.220516191357247, 1,           1
##FIRST=     3089.24299056887, 0,            0
##LAST=      -523.473772436912, 0,           0
##MIN=       -523.473772436912, -3488997,    0
##MAX=       3089.24299056887, 511519867,    0
$$ Real data points
##PAGE= N=1
##DATA TABLE= (X++(R..R)), XYDATA
$$ [...]
9563 -69170 -206767 -61013 91498 -159953 -82538 92635 52425 317407 132445 -76973
9553 -76973 -80766 19971 451464 345656 145274 138650 76861 -68579 -51664 -62245 -79978
9542 -79978 85914 56269 -129641 -11327 -31462 -174705 -73559 210948 264991 97954
9532 97954 -53307 69507 31206 -101304 -112335 -349378 -1543 264861 314400 350375 29708
9521 29708 27729 -51021 -88138 16125 38886 95538 181986 321800 238039 323188 260396 268077
9509 268077 208645 92565 34091 236557 379833 290467 490226 351397 10125 -148280
9499 -148280 -36275 185017 648325 624125 775965 393649 513143 613223 584340 694510
9489 694510 714806 633352 402752 371269 743018 572388 382908 491613 520832 499696 380780
9478 380780 624570 434030 217515 229550 328093 384068 460217 557024 776468 665338 702090
9467 702090 935331 993500 888267 861736 850235 879429 957252 1053044 820227 912945 834666
9456 834666 791410 1209184 1504581 1589866 1384154 1269328 1467177 1567301 1368134 1162803
9446 1162803 1416325 1348996 1418888 1624694 1786499 1958646 2044980 2083573 1851299 1924235
9436 1924235 1815227 1800403 1907971 1610712 1949896 2173849 2150078 2160945 2154352 2246437 2245332
9425 2245332 2597587 2824616 2593188 2392442 2574119 2877404 3103423 3187399 3353384 3665787
9415 3665787 3255699 3324334 3664946 4201873 4221299 4222989 4382760 4703165 4856673 4858618 5546343
9404 5546343 5909753 5852709 6038259 6545359 6675417 7041906 7417351 7512383 7645871 7844452
9394 7844452 7919427 8137643 8301514 8563639 8520663 8587994 8913376 8999600 9255369 9434572
9384 9434572 9889862 10229748 9964537 10199778 10573525 10916535 11021799 11110568 11378368 12023836
9374 12023836 12574951 12774889 13040095 13435271 13705482 13868367 14311676 14899522 15514545
9365 15514545 15903792 16219071 16535062 16702909 17045507 17413120 17810267 17991774 17854961
9356 17854961 17943520 18332606 18369702 18195225 18341882 18318646 18148761 17956860 17633829 17493962
9346 17493962 17313540 16992115 16691593 16545689 16363545 15839607 15447756 15068885 14504852
9337 14504852 13912926 13591270 13279433 12781423 12544216 12032639 11528147 11343135 11150671
9328 11150671 10679207 10233045 9947095 9440726 9128144 8919244 8653484 8631507 8340226 7650322
9318 7650322 7489839 7410652 7162129 6617406 6334030 6325326 6091177 5854210 5567910 5378292
9308 5378292 5036749 4880568 4817017 4504820 4629866 4552259 4321139 4137541 3975742 3905102
9298 3905102 3683465 3677839 3575923 3563569 3623330 3636118 3437398 3260245 2989857 2991125 2677414
9287 2677414 2663095 2723968 2678720 2805103 2736163 2690286 2582549 2423975 2336209 2418444 2482920
9276 2482920 2327229 2615911 2489435 2256139 2176023 2273493 2532975 2452093 2405889 2313872
9266 2313872 2455111 2505587 2244492 2379352 2249087 2101977 2182267 2101549 2203789 2023380
9256 2023380 2270855 2132992 2143603 2292330 2207126 2063391 2122955 2295578 2500806 2451313
9246 2451313 2249763 2118061 2101871 1861763 1888021 2172812 2090293 2076465 2066279 2037665 2060958
9235 2060958 2238439 1952308 1671049 1710327 1792394 1422722 1388938 1836471 1720456 1933937
9225 1933937 2097034 2140651 2197954 2160996 1965193 1969082 2017382 1837678 2078276 2239959 2141116
9214 2141116 2117938 2076459 2123505 2031497 2189419 2518659 2641794 2625200 2593691 2526663 2702469
9203 2702469 2660502 2457202 2613972 2823352 2968258 3084003 3130101 3103266 2769106 2689601
9193 2689601 3026178 2742167 2904020 3236126 2842709 2700572 2838990 2883027 2836462 2908589
9183 2908589 2965663 2921966 2962298 2929287 2798334 2922702 2990815 3212235 3151279 3002379 2966759
9172 2966759 3380735 3274260 3381613 3622004 3661692 3570425 3390666 3677482 3629300 3768108
9162 3768108 3962340 4216872 4124482 4010683 4013254 3880962 3974590 3928433 4120876 4173035 3926712
9151 3926712 3651101 3568682 3720688 3795429 4015696 4053553 4030371 4065246 4241622 4032768
9141 4032768 4158727 4311886 4844748 5237804 5255385 5523950 5694333 5461687 5724785 5744177
9131 5744177 6111689 6435517 6374707 6652448 6933997 6863320 6826237 6920862 7104462 7044026
9121 7044026 6934089 6711518 6699463 6874802 6725739 6708309 6713069 6432460 6261397 5904918
9111 5904918 5696653 5586688 5478739 5561276 5300805 5112583 4848031 4518980 4246487 4139811
9101 4139811 4162539 4075237 4096092 4534498 4290146 4207009 4325092 4274236 4373312 4326584 4504333
9090 4504333 4724579 4707839 4650547 4669334 4748648 4818668 5272332 5464972 5401974 5680637 5740957
9079 5740957 5387528 5310572 5202226 5460027 5591981 5755920 5721264 5686942 5499459 5440027
9069 5440027 5795135 5803601 5821989 5744006 5618645 5779640 5832532 5957878 6051828 5818967 5799895
9058 5799895 6163132 6151486 5979542 6017586 6129357 6009278 5965436 5950990 5746699 5670393
9048 5670393 5774148 5748867 5927690 6040441 5854688 6154458 6052666 5747473 5841675 5880342
9038 5880342 5733066 5592062 5762768 5774271 5750492 5733147 5657482 5655086 5689240 5627933 5414669
9027 5414669 5552110 5494654 5530402 5293280 5475020 5440680 5632431 5618789 5773490 6121503
9017 6121503 6315220 6290532 6290837 6366101 6144376 5937899 5836182 5895406 5730577 5663066 5608840
9006 5608840 5335771 5129320 5425198 6003625 6058449 5974654 6299805 6332653 6192419 6457889
8996 6457889 6444651 6449536 6754841 6938715 7250353 7267687 7305411 7848106 8275292 8863593
8986 8863593 9250798 9606962 10194911 10803737 11483961 11895081 12602621 13349085 14197673 14810338
8976 14810338 15296956 15950002 16546553 17299779 18041014 18553992 19055659 19718970 20583706
8967 20583706 20922747 21305491 21952344 22336598 22490409 22532064 22447398 22592227 22752638 23133766
8957 23133766 23357608 23616020 23592489 23912826 24102547 24529226 25269824 26107212 27218790
8948 27218790 28321998 30104622 32297811 34446453 37081915 40138948 43537792 47477518
8940 47477518 52220826 58244719 64805107 71845834 79891476 88811869 99111275 110142222
8932 110142222 122516690 134672807 145323330 154714659 163531297 169515332 171709476 172544228
8924 172544228 172052231 171474516 170342546 168071810 163692675 157139878 149899243 143514982
8916 143514982 138300109 135053933 132587406 131009654 130248017 128671835 127069429 125193729
8908 125193729 122970265 120639032 118092877 115758392 113415439 111113467 108957843 107116733
8900 107116733 105205355 104288624 104429254 105208082 106778030 109280348 112279079 115540395
8892 115540395 118765147 121335279 123247887 124297195 124952371 125515240 125631734 125174753 124151201
8883 124151201 122459623 120676822 119083276 117928186 117361328 117667007 119248026 121592695
8875 121592695 124628149 128169493 132074631 135700659 138694516 140606758 141636569 141897792
8867 141897792 141512301 140779320 139020668 136917711 134195571 130431799 126668293 123261966
8859 123261966 120376337 118949994 118661662 119320910 120995194 123505891 126575738 128900781
8851 128900781 131399392 133317257 134547217 135444301 136412082 136924065 137424844 137673223 137645331
8842 137645331 137108380 136600203 136871045 137644077 139377136 141528013 144341064 147761235 151364900
8833 151364900 154745834 158302521 162468294 167348737 172208011 177061928 181566990 185432822
8825 185432822 188200639 190145885 190773227 190314679 189431772 187763112 185668949 182849183
8817 182849183 179053959 174050658 168186466 161590175 154910698 148655860 142583471 137091717
8809 137091717 131961558 127488737 123168742 118815366 114901109 110838059 107220002 104963851
8801 104963851 103545678 102717242 102863066 104013525 105642125 108083430 111504693 115660385
8793 115660385 120503359 125776980 131083133 136435242 141626419 146796796 151874137 157136641
8785 157136641 162001400 166279784 169572125 171855579 173044170 173212612 172351274 170375460
8777 170375460 167584578 164374094 160555040 156094413 151042784 144640201 137288926 129440157
8769 129440157 121656926 113950694 106422580 99469654 93083208 86818043 80686715 74699371
8761 74699371 68932631 63583151 58283479 53262839 48638464 44699570 41181704 37513653
8753 37513653 33993572 31274934 28479878 26195307 23973351 22203458 20535711 18948996
8745 18948996 17643600 16730251 15789047 15204277 14847180 14297572 13542148 13085012 12984097
8736 12984097 12672631 12248504 11765119 11651016 11342061 11121578 10906271 10679759 10595274 10685567
8726 10685567 10608274 10542549 10312950 10444839 10769974 10901471 10997243 11161600 11254273 11552311
8716 11552311 11675884 12017224 12179914 12085687 11740483 12123203 12131459 12253570 12102406 11978496
8706 11978496 12293656 12403173 12337049 12422778 12594726 12731754 12460496 12460531 12634363 12621470 12480321
8695 12480321 12471770 12513112 12422654 12569978 12546058 12431699 12230563 12220432 12298315 12199079 11788646
8684 11788646 11638237 11304022 11163232 11381004 11297398 11477985 11803796 11952674 11995856 11935789
8674 11935789 12300588 12638454 13038267 13220838 13494124 13805585 14357979 14981048 15674361
8665 15674361 16387194 17550346 19046552 20046180 21280601 23174713 25439443 27820552
8657 27820552 30316746 33427418 37058203 40894317 45094573 49197039 53276107 57169432
8649 57169432 60784309 64350900 67214498 69671110 71868376 74346854 76792996 78968020
8641 78968020 80676468 81783372 82458571 82599791 82276950 82017213 81469645 80309013 78976622
8632 78976622 77509032 75493221 73383842 71032241 68460289 65988469 63661737 61520657
8624 61520657 60122972 58995371 58182620 58002875 58073436 58927673 60416113 62750631 65498227
8615 65498227 69075742 73318542 78028744 83512415 89851753 95954299 101925880 107966160
8607 107966160 113788450 119060782 123795303 128081190 132211229 136527881 140421171 143518980
8599 143518980 145502800 146860431 147556419 147311391 146296886 144443456 142289016 139206490
8591 139206490 136078176 132207823 127398836 122461803 116640152 110471938 104572614 98665175
8583 98665175 93190668 88173546 83677793 79686581 75354186 71911226 69291553 67348638
8575 67348638 65595228 64424511 63790561 63695942 64261612 65269107 66608554 68478320 70656602
8566 70656602 72756467 74937277 76762068 78528217 80557731 82800111 84483448 85964267
8558 85964267 86700594 87166051 87344999 87078084 86544671 85709935 84562399 83156176 81070715
8549 81070715 78739319 75809284 72588338 69293448 65205476 61359479 57624539 54069423
8541 54069423 50371254 46851021 43505204 40356280 37153989 34368054 31800541 29411032
8533 29411032 26963308 25110508 23656924 21978208 20534880 19696202 18859556 18168740 18050277
8524 18050277 17756575 17985783 17991553 18171456 18541948 18858314 19098998 19364337 19674875 19851296
8514 19851296 20317431 20874138 20820443 20756464 21137701 20985742 20737798 20700006 20435699 19786092
8504 19786092 19367813 18779595 18019077 17392064 16603442 16075947 15431004 15008861 14552883
8495 14552883 13780202 13225134 12855691 12644845 12255284 11938229 11306384 10899019 10623140
8486 10623140 10384731 10018068 9097757 8670753 8409289 8023809 7965827 7579733 7314181 7159346
8476 7159346 7267529 7696341 7944992 8018799 7961381 7992894 8307913 8671844 8806939 8471532
8466 8471532 8594196 8588442 8490187 8390783 8400567 8681739 8732037 8515737 8153267 8399748 8331780
8455 8331780 8258396 8239644 8334021 8160412 8299619 8481592 8005840 7560929 7294255 7074115
8445 7074115 6625907 6185607 6046850 5687240 4917327 4285394 3954461 3756357 3420298 3182035
8435 3182035 2890235 2611650 2357952 2220242 2069883 1584693 1587875 1843182 1765290 1793595
8425 1793595 1867413 1761053 1783149 1627542 1450955 1658528 1772689 1771383 1859595 1835031 1798490
8414 1798490 1773446 1742894 1668164 1586973 1857361 1911317 1705542 1607760 1597305 1366783 1393423
8403 1393423 1382545 1177124 1186166 1086505 1272685 1234127 1149861 881407 943399 1027043 870538
8392 870538 556101 630665 489070 712592 994882 994592 807727 961726 1034278 847085 966654
8381 966654 1093209 1126078 1014240 778892 663006 828850 948442 761207 740000 696249
8371 696249 617542 971011 943996 685808 681967 537517 680030 653651 621016 760235 815110
8360 815110 849113 668144 724828 581336 322628 179867 435939 512465 482453 291580
8350 291580 394370 523265 508368 365904 434507 354879 439008 375991 432374 371443 565856
8339 565856 653912 312022 344607 481986 321381 487080 651323 412159 333331 343335
8329 343335 539719 568800 562411 680616 450516 384903 613113 552541 177911 228519 294178
8318 294178 545886 439687 392892 450605 40547 425047 340625 337739 218347 402813 523425
8307 523425 637582 590475 438752 715145 670982 470632 335970 290749 329466 409528 29853
8296 29853 -40711 41259 233887 371442 527248 621539 699465 483841 366844 498892 558462
8285 558462 538966 599458 492375 496610 572415 383601 351121 537021 351134 368847 521926
8274 521926 762694 676838 598776 647668 763619 602553 596787 361966 314220 489487 323802
8263 323802 615868 387729 254529 -5312 46973 222207 326477 368601 279623 -91937
8253 -91937 151546 88115 201240 307898 146048 332074 536165 472581 513580 349991
8243 349991 377457 491382 744117 629324 819180 1147103 1013448 1183174 1145094 888808
8233 888808 817083 675857 721166 503165 470356 697087 355541 543048 647464 657333 712009
8222 712009 603219 598171 575705 725044 527289 457776 537496 498854 715974 696290 741325
8211 741325 547917 656595 446362 134810 96 84509 129348 133210 86200 166009 52658
8200 52658 220494 403263 474012 255140 229364 577253 276083 -375057 -1769558 -1242868
8190 -1242868 -478268 -208038 445443 152952 10736 19780 371384 391299 283848 366971
8180 366971 191121 100195 223742 251667 306230 415844 415905 119584 -161449 -255934 -123766
8169 -123766 -169671 33250 -132404 -259595 180752 -106194 -122738 -203479 -132154 -336546
8159 -336546 -472072 -490413 -481762 -439203 -286365 -466352 -507638 -727907 -606826 -215917 -361841
8148 -361841 -372175 -585534 -278642 -93576 -138757 -262947 -262055 -264554 -272072 -443709 -704026
8137 -704026 -499884 -479836 -431888 -244649 -481852 -438159 -97566 -339215 -351466 -485508
8127 -485508 -477374 -612333 -525543 -356935 -669352 -793270 -549062 -434045 -298453 -597608
8117 -597608 -247648 -44345 -398252 -335945 -724781 -804283 -761393 -506264 -440266 -407662 -443687
8106 -443687 -344453 -437588 -543637 -756511 -517832 -340121 -432217 -591682 -514389 -531380 -814882
8095 -814882 -828033 -394734 -565426 -496809 -582421 -568117 -438117 -319653 -398303 -586352 -438896
8084 -438896 -268218 -434197 -568396 -305419 -550050 -486504 -344747 -703447 -712766 -456256
8074 -456256 -409300 -486861 -458024 -591937 -707801 -508757 -492222 -708551 -498941 -221195
8064 -221195 -429222 -611082 -800657 -659495 -453814 -454989 -497571 -556696 -500620 -531646 -730456
8053 -730456 -500995 -460660 -597496 -678723 -723160 -838455 -697376 -615485 -688670 -684328 -634498
8042 -634498 -707767 -736305 -599622 -363761 -555683 -602398 -535858 -542321 -552924 -567028 -616951
8031 -616951 -516698 -526930 -678857 -695215 -707080 -811463 -482699 -379727 -500649 -609139
8021 -609139 -504656 -498110 -715300 -726570 -874735 -1004205 -757809 -737368 -437943 -793533
8011 -793533 -756176 -546470 -806904 -406580 -611494 -416358 -173795 -192734 -48200 -83753
8001 -83753 -445257 -567391 -285462 -415909 -663495 -641115 -696555 -758267 -327027 -417475 -545519
7990 -545519 -593502 -716968 -635128 -480288 -318811 -550606 -574082 -581271 -522761 -501666 -277412
7979 -277412 -206783 -93516 -200653 -303177 -327894 -338921 -461024 -370822 -417094 -599882 -361928
7968 -361928 -316571 -557501 -427072 -527493 -484642 -605322 -453265 -184743 -244872 -248929 -280383
7957 -280383 -538789 -436950 -252347 -332060 -343583 -185173 -158028 -532602 -466390 -462171 -274864
7946 -274864 -340395 -544246 -446473 -205846 -196953 -188679 -263401 -268014 -359675 -456443 -433999 -679615
7934 -679615 -465987 -458053 -542242 -385597 -547251 -379908 -165379 -285604 -289890 -130502 -11480
7923 -11480 -204971 -59480 -165064 -537248 -313494 -199058 -32321 162027 93831 35526
7913 35526 -275659 -654961 -602997 -335475 -391883 -254355 -150063 -237174 -322994 -323420 -310797
7902 -310797 -523409 -518261 -423491 -227456 -71855 -178373 -449505 -261672 -12724 -170144
7892 -170144 -102173 -406817 -331260 -135698 -328492 -59991 -307730 -358326 -226729 -435532
7882 -435532 -520371 -383807 -52613 -185948 -3426 -31052 -63223 -75117 -446941 -289550
7872 -289550 -146315 -134063 -477977 -295381 -167113 70523 11779 -264875 -457487 -199294
7862 -199294 130629 1332 58853 6808 -356834 -423609 -266411 6822 -91306 -159111 -325872
7851 -325872 -268242 137043 -9279 78626 -175404 -581784 -574458 -482458 -740755 -499769 -343397
7840 -343397 -365442 -275706 -193394 -166434 -368156 -319360 -339040 -212113 -9965 112812 199888
7829 199888 -171951 -174718 72599 34743 -253561 -188147 -267945 10816 12452 -245251 -124416
7818 -124416 -197644 12647 161053 231191 39668 11794 70675 -79167 -121326 -167548 3841
7807 3841 -83031 -125663 -53526 -1673996 -1898737 -905785 -622811 -476770 -692334 -611234 -719536
7796 -719536 -610549 -811646 -617242 -613364 -551142 -443712 -461180 -551725 -489457 -495532 -562103
7785 -562103 -354181 -271998 -330314 -535120 -517541 -308529 -285596 -562786 -428926 -658411
7775 -658411 -771137 -819325 -391795 -424681 -530153 -301839 -37781 60262 -518085 -660554
7765 -660554 -347715 -512286 -490813 -337651 -688870 -575044 -408110 -634046 -608018 -434987
7755 -434987 -296430 -607235 -591719 -566828 -745874 -705248 -544751 -389227 -444998 -396891 -363582
7744 -363582 -569049 -427155 -309120 -601279 -496025 -536951 -456579 -536694 -539025 -503648 -364896
7733 -364896 -312792 -454522 -525932 -710024 -464419 -278056 -177962 -240269 -581746 -818071
7723 -818071 -597350 -531877 -423490 -127855 -129856 -78478 -70451 -377561 -722256 -675577 -618479
7712 -618479 -481362 -348794 -596266 -651608 -299473 -505533 -562090 -545969 -589719 -587838 -496163
7701 -496163 -450489 -658028 -557628 -492931 -671589 -669507 -639687 -729715 -636232 -236194 -75175
7690 -75175 -104820 -186066 -308677 -272977 -137010 -317222 -260871 -137143 -136630 -265816 -130529
7679 -130529 -124504 7365 -118153 -416724 -438743 -287287 -324475 -528291 -451506 -373283 -525064
7668 -525064 -493264 -566788 -660620 -594123 -574365 -429729 -478123 -234980 -170038 -118900 -338262
7657 -338262 -499195 -444595 -210862 -269367 -212926 -292529 -496942 -371045 -322938 -322907 -209004
7646 -209004 -532082 -496167 -415041 -575770 -576928 -679862 -701917 -659497 -713973 -470876 -271027
7635 -271027 -280909 -193262 -139214 -363518 -631044 -491638 -212212 -483379 -390269 -260929 -374579
7624 -374579 -484264 -634416 -570952 -640700 -563584 -376946 -375940 -405271 -439747 -418491 -479325
7613 -479325 -447076 -345740 92940 -157138 -612279 -599284 -544362 -379169 -526294 -449026
7603 -449026 -578118 -552215 -400288 -384501 -309921 -365531 -344370 -456772 -449647 -550269 -714622
7592 -714622 -477922 -371692 -614684 -525535 -432785 -286294 -358986 -243548 -44263 -152019
7582 -152019 -285974 -350192 -493412 -568336 -394120 -299472 -500792 -486616 -536715 -805181 -716299
7571 -716299 -750621 -567896 -703236 -585210 -512121 -412751 -434109 -337508 -190424 -360022 -218419
7560 -218419 -132734 -261981 -213674 -477495 -288603 -113909 -123965 -388460 -594071 -436983
7550 -436983 -277249 -374286 -409122 -289324 -356130 -293704 -164334 -373154 -486274 -806188
7540 -806188 -914991 -877300 -342616 -142420 -234583 -302162 -430404 -449791 -426807 -611813 -676808
7529 -676808 -415434 -673993 -805355 -737684 -365928 -183165 -343189 -483052 -620311 -428577
7519 -428577 -428217 -402798 -530903 -596959 -517868 -480660 -485960 -652115 -472344 -652288 -744329
7508 -744329 -586968 -615633 -470249 -440158 -712271 -773818 -552877 -476395 -487719 -338930 -485823
7497 -485823 -418902 -171740 -376416 -343935 -306164 -284948 -298846 -357065 -35098 -112584 -269782
7486 -269782 -269133 -209585 -226764 -175894 -234713 -361450 -485205 -486709 -397618 -341095 -368706 -180311
7474 -180311 -393071 -498487 -565451 -354629 -507175 -644935 -398975 -147556 -286446 -352055
7464 -352055 -114743 -306415 -457089 -355864 -432168 -503694 -466285 -498623 -769555 -613318
7454 -613318 -393471 -457636 -464387 -465342 -175804 -77089 -37273 -101229 -337075 -284788 -229603 -467529
7442 -467529 -602056 -491161 -527649 -314002 -300418 -340365 -248009 -199320 -230458 -21015 -139744
7431 -139744 -23269 -304906 -277487 -105759 -317334 -237040 -389304 -221625 -331411 -120343
7421 -120343 -112736 -86619 -300754 -358039 -188497 132300 -46827 -52928 -112579 -307300 23700
7410 23700 84879 81586 20218 -242969 -282949 -234941 -108456 -184359 -354216 -418738 -387747
7399 -387747 -158600 -83397 53169 26389 -197030 -324711 -79566 -423326 -680167 -308703
7389 -308703 -381971 -477663 -619287 -318751 -9245 -104152 -153886 -335182 -308440 -354434 -464369
7378 -464369 -472627 -668283 -460563 -352691 -478907 -378923 -20606 -282345 -407335 -475997
7368 -475997 -388614 -216828 -34736 -252569 -292426 -114760 -74672 18934 -90899 -128046 -268495
7357 -268495 -211019 -268464 -317935 -466987 -334103 -303121 -183330 -323496 -427028 -450265 -347980
7346 -347980 -297702 -259878 -238632 -217559 -162664 -18437 61906 -229232 -457900 -652504 -351248
7335 -351248 -276118 -376345 -260519 -29724 -208001 -144306 -192494 -189144 94566 233164 -210427
7324 -210427 -364654 -219428 -147491 -76708 -77070 -83519 -102450 -330496 -604377 -367735 -103892
7313 -103892 1957 -119986 -255200 -350769 -383147 -322442 -233466 -337612 -149453 -215910 -81799
7302 -81799 -54344 -282730 -355357 80544 -36374 -73699 -263423 -443647 -165325 -121560 -78280
7291 -78280 -103765 -27900 -223119 -430016 -183209 -203902 -467220 -574017 -524262 -539472 -385919
7280 -385919 -168081 -967 -121526 -258866 -230149 -514339 -206238 -125017 -374226 -304010
7270 -304010 -253596 -228228 -65104 -327802 -264228 -107213 -312620 -278105 -292227 -573190 -526533
7259 -526533 -211046 -119328 -409701 -133679 61894 -22466 115813 -125349 -275766 -447451
7249 -447451 -345680 -300018 -215654 -218574 -489569 -426994 -343371 -155423 -190696 -269849 -171768
7238 -171768 -149362 -131658 -146096 35762 -168264 -361044 -167803 -188942 -240032 6755 69137
7227 69137 82425 45366 -161708 -36277 -26920 -106858 -45900 53863 -37312 22326 -37729 -75273
7215 -75273 92286 -93805 -124191 -305442 -148947 -29093 -265397 -157137 -286530 -305265
7205 -305265 -270458 -283068 -486319 -346089 -266837 -253763 -123391 -96149 97500 169280 47654
7194 47654 -173338 -104657 -142201 -55507 -68557 -261974 -335588 -207438 144512 -152752 -325857
7183 -325857 -160511 -191973 -344063 -274268 -182648 -56360 151166 138721 -127300 -318271
7173 -318271 -306982 -332865 -289242 -317404 -485729 -426815 -184922 -52543 41669 140326 124128
7162 124128 -315514 -333934 -325442 -305274 -199955 -163981 -391235 -72031 -238375 -260355 -168656
7151 -168656 -164381 5352 24766 -252319 -444655 -399242 -382046 -240315 -192932 -113347 -240883
7140 -240883 -264696 -260673 -214976 -206488 -264053 -251853 -208527 -315106 -210042 -299755 -513294
7129 -513294 -134780 34712 -203276 -218758 -118727 127650 207020 101624 -40662 30828
7119 30828 -24632 -352453 -170260 70295 -102384 335093 187781 -171847 -333973 -124308
7109 -124308 -74364 -7909 88457 261782 278245 101487 53302 -59914 16647 -9382 57769
7098 57769 33407 58170 13746 19431 -77823 59079 76424 -15670 -151783 -163732 -163399 28584
7086 28584 70053 -240286 -199990 109991 -61758 -235350 -162339 -363006 -329224 -139721 -109787
7075 -109787 77683 303249 45988 -202970 -231020 -72764 -23869 -233562 -82537 94382
7065 94382 -84196 -100861 -24578 -196111 -290423 -129574 -35052 1520 -187059 -31023 -270239
7054 -270239 -60645 71146 -101535 -559581 -610176 -181332 -123686 83700 22555 -237080
7044 -237080 -483345 -580353 -421168 73936 71159 -39394 -71202 -161497 -50366 -244090 -181002
7033 -181002 -250046 -235958 190395 75505 -3837 83475 -81083 -244416 -64110 216643
7023 216643 341159 477077 97764 -44793 -19489 -10528 234462 263189 125583 256608
7013 256608 224853 475112 550214 235203 84668 -38987 125553 338352 263985 148731
7003 148731 -137774 -230300 62161 234411 282955 218844 285695 204092 371097 340738 -25737
6992 -25737 -215825 -371316 -266440 -40872 -67498 -71645 -62023 -66457 -190094 9309 141025
6981 141025 112174 -155801 -174316 -345595 -318972 -444082 -34202 117039 -16239 -113680
6971 -113680 -216510 29123 -68338 -185553 -101115 42112 283506 152420 28061 -107311
6961 -107311 89635 20095 203187 234994 376810 229678 142063 525095 754682 440545
6951 440545 253472 246034 116640 -114057 210568 432956 383284 463844 190430 254509 223572
6940 223572 274049 187621 112742 131180 -81309 74697 438045 632024 129265 -11979
6930 -11979 257198 140018 338876 357759 270786 166096 153735 52603 -584 -112970 135927
6919 135927 -66448 -219513 -181648 -120470 -56942 -66615 -278620 -35271 -107013 23671 -199588
6908 -199588 62504 -14856 -73269 32483 -78502 77616 51367 70245 170934 51870
6898 51870 219900 -14770 -321502 -138415 58158 230844 190214 95098 14730 -69981 41683
6887 41683 -85602 31540 -210597 -104090 -67612 -160196 -85330 -101620 -257046 -500070 -165842
6876 -165842 192283 173582 83469 88522 48367 90498 -43091 102267 197980 388308 355239
6865 355239 150172 137287 479898 237601 12796 -147992 -125001 168318 213024 -77143
6855 -77143 71111 156098 -50554 -24164 -276599 -210046 218512 148519 159118 -131313 -132176
6844 -132176 -96735 202649 91801 55202 240081 22104 214496 -239481 -96441 18927
6834 18927 10757 231009 353278 301637 65609 5022 124855 37082 -48725 -7480 230059
6823 230059 137456 -52497 -78166 278370 92910 195826 290521 99517 108634 266577 198763
6812 198763 125019 361344 508512 344393 205589 388012 -55173 21269 -49464 -123604
6802 -123604 -276819 -83880 239939 556327 285293 306999 75255 25843 62997 -92196
6792 -92196 -54642 -51738 104147 134247 -304119 -160912 -38424 47182 -229363 -233817 -51455
6781 -51455 2596 159218 81516 175121 206243 525835 284279 168376 32581 113410 -63835
6770 -63835 23862 193291 220061 205730 161707 341160 479119 543291 398983 210951 148729
6759 148729 20156 8679 191023 337085 502823 605632 347390 741017 1037100 710875
6749 710875 436613 400989 452786 267274 590917 760400 571097 631470 815470 682011
6739 682011 826143 914825 1067284 699311 579399 359906 294883 544179 615125 331573
6729 331573 411690 325023 394602 383957 424519 619534 254514 272477 482096 633401 610876
6718 610876 473322 228994 180179 524183 751621 500053 495561 571967 591577 509932 617087
6707 617087 411414 386918 481118 430127 382106 212962 224999 520363 502868 462115 359278
6696 359278 358489 544811 504879 481794 581593 512944 760220 452833 118038 257119 485937
6685 485937 362586 574875 370326 486777 876610 1022941 807943 409515 342958 5556
6675 5556 470807 777898 644164 560084 348168 198582 306714 349172 401294 482888 568302
6664 568302 738459 722456 612322 449131 697632 551451 567619 719346 785700 641719
6654 641719 704330 1065343 958448 940487 929764 952912 1114978 1106126 1091949 1113472 1076939
6643 1076939 1197741 1311327 1306774 1262568 1291868 1141532 1250132 1224221 1048583 1393086
6633 1393086 1495981 1656051 1701969 1746159 1687309 1699427 2030476 1940088 1875091 1819641 1986444
6622 1986444 2244050 2176117 2386965 2204298 2144860 1909978 2000412 2291378 2211479 2053348
6612 2053348 2211692 2369693 2476005 2509485 2308468 2532953 2639093 2907652 3000781 3070771
6602 3070771 3264815 3277205 3329003 3521570 3715942 3685315 3649100 3922118 4036765 4156629
6592 4156629 4498584 4715676 4840415 5131574 5018453 5158209 5370421 5622358 5797777 6000005
6582 6000005 6268938 6399489 6392866 6502920 6813576 7210781 7405143 7709776 7932161 8395003
6572 8395003 8575070 8787079 8873635 9139793 9269721 9142659 9330765 9634818 9791963 9550279
6562 9550279 9411372 9866694 9940772 9731324 9613662 9803058 9513137 9406587 9229706 8832483
6552 8832483 8641412 8327467 8155070 7777763 7688860 7425262 7161962 7020310 6790716 6589617
6542 6589617 6111467 5616215 5348682 5315483 5454381 5180863 5155646 4962507 4893955 4780114
6532 4780114 4595457 4368291 4189858 4426393 4577269 4562336 4596522 4485086 4299618 4577612
6522 4577612 4654184 4465709 4244219 4192107 4092225 4258362 4020981 4005740 3977618 3977067 4031709
6511 4031709 3975412 3769652 3656429 3804171 3672414 3471296 3386481 3011254 3001602 3006809 2907852
6500 2907852 2750407 2689272 2921362 2562862 2483967 2358886 2229764 2140083 2024279 1906075
6490 1906075 2009997 1692592 1674662 1618521 1876101 1679132 1398515 1446329 1424523 1295993
6480 1295993 1305927 1262769 1116197 1430788 1552292 1611856 1567622 1348539 1060122 1205859
6470 1205859 1380116 1305015 1266135 1114224 1323768 1375679 1269763 1477601 1595106 1658964
6460 1658964 1831959 1489491 1590913 1592581 1739330 1677739 1408716 1223441 1057040 1274124
6450 1274124 1625398 1781262 1999934 1928161 1849632 1495591 1474052 1383502 1400793 1476145 1323788
6439 1323788 1384994 1448982 1604102 1467141 1779046 1870928 1709359 1666484 1580003 1547395 1427507
6428 1427507 1480531 1525500 1570295 1561663 1428602 1425867 1508979 1513549 1688485 1697188 1753993 1564425
6416 1564425 1767996 2039777 1918368 1903753 2030483 2131999 2122455 1967591 2171978 2090167
6406 2090167 1619436 1633813 1899642 2245913 2193362 2261020 2145205 2225051 2377602 2608545
6396 2608545 2479647 2472785 2893805 2807966 2788252 2954612 2977102 3176044 2989739 3052271 3198025
6385 3198025 2952397 2996837 3296551 3536215 3581260 3452140 3515116 3534844 3599357 3741211
6375 3741211 3926890 3905016 3830356 3709776 3986871 4203391 4384223 4278909 4415859 4283343
6365 4283343 4561638 4693479 4723277 4731767 4643907 4584342 4740920 4854212 4687494 4660423 4954786
6354 4954786 5092665 5357687 5353870 5666904 5561215 5698567 5770517 5968312 6165718 6202652
6344 6202652 6366356 6344214 6485306 6922285 7211855 7481334 7634589 7745357 8180580 8819808
6334 8819808 9244850 9681801 10329479 10784363 11782115 12770882 13793399 14576831 15979311
6325 15979311 17901393 19908066 21862455 24274517 27154736 30227660 33434770 37670342
6317 37670342 41910533 45753388 49690443 53572242 57149554 59948950 62118390 64218199
6309 64218199 66091715 67772718 69040962 70305515 71355008 71927455 72018918 72481876 72367613
6300 72367613 72220148 72191785 71768261 70641876 68794927 66665709 64154939 61465315 58534277
6291 58534277 54918926 51476579 47810621 43632591 39546151 36099655 32870972 29828566
6283 29828566 27196322 24942807 22872116 21147133 19513904 18111810 16714452 15788305
6275 15788305 15215660 14560219 14255905 14033531 13995601 14041752 14032558 14174461 14385296 14897202
6265 14897202 15059499 15487715 16090222 16601089 17411119 18449347 19884491 21326789 22963291
6256 22963291 24938408 27349663 30160663 33319695 37259345 42158170 46960561 52389566
6248 52389566 58674748 65742072 73332834 80814001 88167099 95455416 101926267 107660498
6240 107660498 112342530 116066840 119581187 122226225 124540337 126488587 127885795 128719564
6232 128719564 128955049 128906264 129024501 128672203 127686407 126395271 124562322 121596973 117899154
6223 117899154 113390278 108252214 103054957 96729915 89853406 82305810 74346660 66537091
6215 66537091 59787982 53405546 47242445 42170953 37428097 33111986 29484820 25917714
6207 25917714 22728963 20063811 17660970 15798421 14172182 12903302 12139524 11101970
6199 11101970 10704645 10083036 9845327 9438007 8824201 8367945 7876908 7805562 7652626 7570712
6189 7570712 7712062 7417564 7255739 7188228 7020748 6500767 6398105 6768720 6627245 6430025
6179 6430025 6322059 6230159 6387384 6524136 6475657 6577685 6657741 6485080 6253803 6298831
6169 6298831 6261252 6264725 6544846 6474039 6231175 5864399 5911819 6111477 6023271 5984816 6026634
6158 6026634 6003151 6102147 6284564 6183415 6241456 6260557 6495838 6561091 6922200 7283516
6148 7283516 7422994 7562041 7408146 7587447 7889306 7766040 7612960 7665608 8100556 8619536
6138 8619536 8891631 8983089 9021327 9261387 9581986 9729226 10051856 10467779 10747431 11197127
6128 11197127 11715651 11787350 12315360 12620104 12933125 13685564 13851024 14133820 14618977 15011616
6118 15011616 15459464 15828669 16181427 16602077 17221128 17245841 17609977 18036002 18522243 19012700
6108 19012700 19752308 20398862 21332021 22615485 23874661 25320768 26770176 28440988 30733449
6099 30733449 33445850 36366470 39481672 43251937 47963656 53047120 58568194 64489519
6091 64489519 71010539 78102327 84901885 91331978 97402687 102554203 106556810 109382420
6083 109382420 110774610 111103490 111111002 110334472 109034697 106829394 103647907 100174588 96406298
6074 96406298 93637252 91813430 90734072 90799621 92138602 94382634 97446802 101381858
6066 101381858 105177870 109053423 112136699 114873511 116649988 117304939 117245826 116578631 115249155
6057 115249155 113085892 109855058 105269805 99221081 92828741 86415914 80622614 75182731
6049 75182731 70149011 65790750 61837531 58385085 55516395 53121380 51090672 49955846
6041 49955846 49711901 50146219 51421085 53451000 56068520 58976649 62316787 66124091
6033 66124091 69903460 73956670 77940730 81409315 84967735 88439564 91516373 94426420
6025 94426420 97169181 99257808 101080311 102961703 104884884 106522201 108466419 110897369
6017 110897369 113279207 115617405 118149678 120259730 122423426 124041686 125607322 127439601
6009 127439601 128905833 130016613 130357183 129828381 128077143 125725345 122980626 120316957
6001 120316957 117821758 115412478 112826890 109937997 107269941 104690775 102450821 100326463
5993 100326463 97967630 95565314 92496539 89632616 86199353 82912159 79087014 75328120
5985 75328120 71303102 66977835 62107615 56886349 51935092 47409508 43396641 39583673
5977 39583673 36025500 32623923 29848219 27186676 24807611 22977212 21381508 19746977
5969 19746977 18587870 17389858 16635267 16373719 16245070 16024755 15604492 15421795 15250770
5960 15250770 15260586 14947447 14988652 14706217 14414972 14225303 14184875 13919451 13707443 13470813
5950 13470813 13469925 13552839 13644268 13617195 13457915 13673575 14128618 14573910 14917927 15297941
5940 15297941 15771607 16288515 16634555 17318185 17796935 18205245 18486485 19049563 19210820
5931 19210820 19522952 19856107 19845172 19926768 20001344 19990601 20109733 20457726 20679718 20708707
5921 20708707 20843573 20836799 20764133 20770275 20830454 20868581 21141374 20979509 21089745 21158116 21210011
5910 21210011 21297210 21417280 21487590 21640830 21928754 22344298 22690953 22818535 23331357 23535457
5900 23535457 24290788 24722326 25025254 25552763 25906644 26219451 26378156 26482082 26682324
5891 26682324 26783304 26963479 27123819 26910189 27064020 27006722 26975468 27154718 27094076 27514119
5881 27514119 27631721 27372318 27317054 27333050 27387917 27278367 27473343 27547798 27672669 27632549
5871 27632549 27546514 27411958 26998922 26919053 27081291 26965317 26928589 26633663 26540672 26276001
5861 26276001 25613133 25220645 24898586 24399063 24048623 23446876 22986831 22389904 21837080
5852 21837080 21661273 21213202 20740436 20417449 19916821 19440545 19025920 18662133 18372895
5843 18372895 18088325 17722507 17271169 16943118 16367851 15895998 15337590 14915690 14203202
5834 14203202 13707751 13079335 12293310 11739785 10917969 10494060 9894994 9647288 9310225
5825 9310225 8978812 8604411 8009999 7932821 7717022 7403932 7245314 7175862 6867513 6482871
5815 6482871 6260171 5970665 5777286 5592109 5453883 5431398 4744551 4516909 4461968 4351032
5805 4351032 4101524 3953538 3806156 3661791 3595975 3653995 3521259 3260672 3150373 3331446
5795 3331446 3153047 3185687 3209337 3302522 3325241 3123507 2900967 2764534 2817325 2879720 2852704
5784 2852704 2960496 2856749 2839776 2842515 2707731 2857634 3062421 2988181 2870116 2886127
5774 2886127 3005960 2985972 3184970 3002380 2923903 3007551 3205418 3423973 3171665 3351754
5764 3351754 3456113 3467919 3255526 3379007 3165757 3383446 3215422 3054434 2970889 3249385
5754 3249385 3376557 3297033 3223408 3160736 3396167 3724877 3560623 3223776 2948675 2830207
5744 2830207 2900500 2841615 2928074 2853486 2827287 3062331 3208369 2973616 2824697 2704892
5734 2704892 2857273 2831718 2913617 3137396 3033885 2906652 2951566 2975789 2923245 2815756
5724 2815756 2926094 2996695 2948115 3009831 2937618 2817341 2860077 2977505 2768322 3061959
5714 3061959 3244260 3238996 3207295 3031742 2882614 3022472 3127111 2819461 2743384 2806928
5704 2806928 2689491 2854847 3245910 3410697 3344060 3300987 3392493 3274333 3441773 3585741
5694 3585741 3378676 2996758 3075190 3115768 3179752 3156459 2998148 2926165 3086510 2897243
5684 2897243 3295416 3516882 3300373 3083712 2960948 2793573 2704347 2958887 2607862 2925618
5674 2925618 2790426 2853041 2972163 3051700 3123011 2895378 2992940 3189789 3147802 3141071 2917440
5663 2917440 3004054 3130428 3300225 3668466 3422011 3550807 3819722 4072418 3870542 3871738
5653 3871738 3635826 3642534 3768038 3737413 3824532 3766694 3813629 3773362 4052534 4159550 3879939
5642 3879939 3754029 3823684 4068595 3912013 3878289 3745207 3450439 3668303 3612807 3629678
5632 3629678 3608485 3441339 3662965 3671574 3623049 3520121 3345294 3172900 3144272 3074426 3050593
5621 3050593 3081647 3110640 3318245 3186192 3214425 3131744 3139272 3132703 2895143 3096380 3221456
5610 3221456 3092132 3140245 3059310 3146461 3375065 3774403 3863693 3813188 3821043 3994605 4202978
5599 4202978 4252154 4095419 3901472 3895641 4096893 3951445 4007751 4148287 4370339 4224440
5589 4224440 4174636 4101775 4285975 4463554 4260858 4092559 4363282 4333191 4225137 4382373
5579 4382373 4490062 4263157 4064452 4268669 4211932 3786223 3796948 3845112 3614411 3551281
5569 3551281 3577845 3696749 3585917 3713552 3613778 3736569 3677316 3930260 3977507 4033369
5559 4033369 4276029 4515485 4396654 4366281 4212754 4322529 4206905 3929903 4046718 4147971
5549 4147971 3913414 3912798 3948038 4117861 4397206 4343969 4492462 4427994 4079859 3856587 3764121
5538 3764121 3644092 3524679 3345605 3661008 3752503 3398140 3176172 3079422 3280911 3155333
5528 3155333 3062156 3313064 3206135 3078886 3222007 3372576 3288431 3273764 3167111 3094898
5518 3094898 3241719 3154504 3268584 3172647 3409779 3518105 3636005 3612440 3603918 3631918 3762056
5507 3762056 4041108 4335774 4690847 4917784 4732690 4876185 5040702 5309373 5381449 5509958
5497 5509958 6022978 6313828 6325046 6033784 6095896 6195980 6078621 5722830 6111912 6235398
5487 6235398 6495475 6563435 6346487 6314163 6527965 6378175 6534112 6327649 6090745 6030141
5477 6030141 5933357 6026535 6082873 6207792 6165226 6211583 5934443 5718021 5390050 5200615
5467 5200615 5276384 5103524 5047816 4944659 5028417 5109157 4884891 5005077 5161574 5056255
5457 5056255 4792800 4917794 5059998 5203038 5217510 5487616 5632009 5577367 5992927 6182869
5447 6182869 6185824 6013872 6191362 6174614 6082972 6166789 6216045 6175629 6455812 6732320 6711184
5436 6711184 6620331 6659148 6572273 6457134 6443286 6214881 6125189 5957702 5974955 5657073 5475613
5425 5475613 5652750 5497285 5436983 5321408 5255179 4930506 4756165 4693146 4759701 4546332
5415 4546332 4505298 4139719 4133590 4153172 4213758 3982151 4005581 4028632 3998024 4026679 3970878
5404 3970878 4092015 3838290 3785572 3787381 3739602 3688090 4096583 4045276 4582880 4640025 4393218
5393 4393218 4443052 4670950 4755517 4946229 5299064 5221447 4707188 4901022 5077602 4989834
5383 4989834 4980613 4993858 5335114 5499586 5572656 5644036 5798645 5722923 5819297 5938122 5652427
5372 5652427 5914835 6211297 6150173 6221665 6178143 6268875 6514679 6348633 6542587 6547931 6531038
5361 6531038 6479165 6567910 6571983 6551271 6557066 6670597 6699136 6797994 6722000 6500232 6738736
5350 6738736 6613458 6688877 6785770 6698182 6642013 6604643 6610296 6736230 6971027 7070324 6854876
5339 6854876 6895693 6713037 6466626 6462465 6266944 6372921 6891251 6992928 6896230 6950644
5329 6950644 7151649 7009009 7237734 7562326 7670960 7741055 7644827 7487670 7596631 7752449
5319 7752449 7943771 7829773 7672085 7929956 8197522 8291819 8580632 8791504 8865549 8682104
5309 8682104 8870351 8988067 9137079 9250340 9419493 9786920 10189432 10581571 10948874 11547893
5299 11547893 12114146 12565303 12887962 13282043 13668183 14518488 15232393 16066859 17047232
5290 17047232 17903064 19067844 20644539 22255656 23616728 25735413 28005076 29857954
5282 29857954 31963981 34041425 36472496 38436627 40352198 42403875 44873130 47638703
5274 47638703 50694456 53834142 56719523 59827384 63164776 66759520 70829043 74421371
5266 74421371 78055726 81662522 85228298 88444366 91724127 94825381 97509742 99945060
5258 99945060 102348501 104860319 107043325 109286164 111365428 113314482 115430930 117519711
5250 117519711 119335143 120802788 122308709 123061645 123500496 123736199 123744748 123223470 122341815
5241 122341815 121430609 120155359 118428272 116318734 114282708 111935267 109437640 107378258
5233 107378258 105363454 102752964 100455437 97895174 95148767 92104639 88830401 85585289
5225 85585289 82134742 78344506 74846401 70817521 67058556 63384434 59761186 56528538
5217 56528538 53328004 50022314 46879944 43923420 41138823 38723576 36103768 33650333
5209 33650333 31579105 29505552 27095112 24772793 22594048 20569830 18419346 16637001
5201 16637001 15503419 14028151 12528975 11441040 10667079 9929163 9358481 8758513 8277862
5192 8277862 8021195 7647237 7119848 6810910 6494414 6376231 6177006 6108568 5972420 5976269
5182 5976269 5895617 6026747 6259538 6218764 6197289 6301820 5997925 5675702 5787320 5877240
5172 5877240 5614143 5502566 5706828 5540411 5699819 5626412 5639927 5708846 5852533 5818268
5162 5818268 5707727 5966575 5750713 5759920 5711426 5778450 5878178 5779294 5693047 5908850 6140427
5151 6140427 6075671 6182300 6177553 6412931 6366990 6407715 6319421 6214291 6310496 6163163 6183445
5140 6183445 6171638 6022073 5822802 5911875 5795640 5677487 5858169 6057319 6286118 6030733
5130 6030733 5971356 6109501 6036734 6244210 6328908 6302682 6379409 6180499 6515992 6493932 6430232
5119 6430232 6506453 6534785 6647621 6694999 6607641 6716363 6850362 6957694 6605961 6763300
5109 6763300 6802817 6730287 7063504 7215042 7117772 7146721 7222639 7434120 7389386 7514780 7725146
5098 7725146 7626481 7619829 7886198 7976420 7876061 7989076 8062931 7760191 7388384 7485027 7554174
5087 7554174 8054225 7889795 7901517 7766847 7642944 7594815 7601384 7847659 8119344 8137368
5077 8137368 8193495 8178411 8274466 8393403 8147618 8453580 8646426 8816293 8920057 9299430
5067 9299430 9145214 8805879 8740253 8722122 8748549 8914178 9087584 9004899 8863507 8867311 8899950
5056 8899950 8897195 9226411 9094371 8869973 8722424 8948099 8806073 8655064 8865514 8819642
5046 8819642 8583702 8490006 8600862 8310397 8427767 8313270 8147813 8187248 8505743 8728463
5036 8728463 8474674 8595723 8439395 8290220 8364078 8310587 8058145 7913216 7892513 8183303
5026 8183303 8135035 8204623 8297449 8060025 8004381 8162354 8192565 8127480 8108686 8269274 8317159
5015 8317159 8302309 8416630 8456564 8383271 8215092 8185904 8482010 8543701 8498964 8314613 8222167
5004 8222167 8559851 8664353 8732258 8697193 8581989 8725973 8744137 8713133 9242125 9176192
4994 9176192 9312704 9272103 9139734 9467306 9574534 9460379 9726229 9882469 9950764 10229784
4984 10229784 10399574 10457730 10583265 10828480 10829312 10760246 10987404 11344931 11438196 11729655
4974 11729655 11915549 11842353 11942823 12309082 12439288 12436881 12470094 12937980 13272435 13407656
4964 13407656 13618415 14022801 14491705 14701172 15037273 15307919 15411529 15592938 15722765
4955 15722765 16075841 16376953 16310644 16692990 16960695 16783019 16819328 17204750 17739680 18042662
4945 18042662 18289009 18675574 18802307 18752850 18929246 19318165 19630487 19840807 19980655 20435521
4935 20435521 20966201 21523491 21979557 22706744 22874209 23137246 23782070 23828785 24262546 24516721
4925 24516721 25196103 25702107 25883653 26490391 27108297 27371493 27832133 28178419 28866546
4916 28866546 29484236 29924000 30465126 31054619 31591942 32073672 32601178 33499034 34360641
4907 34360641 35057446 36072597 36685642 37559599 38751610 39975989 41260441 42566136 44120916
4898 44120916 45918941 47703415 49754885 52035385 54284319 56724593 59924413 63188614
4890 63188614 67221383 71766911 76654740 82266444 87887734 94692828 101790214 109011065
4882 109011065 116498609 123940844 131284669 137842732 143556607 148191003 152399173 156340187
4874 156340187 160095082 164008082 167611830 170723816 173778390 177115397 181444767 187240067
4866 187240067 194126065 202311541 211393142 221395712 231759788 241658161 251004367 258972081
4858 258972081 266132283 272641537 277715208 281369095 284070716 286138075 287608172 288526582
4850 288526582 289369023 290045027 290474293 291521627 293719866 296845918 301674698 306697987
4842 306697987 311661553 316426376 320624729 323599694 325710949 326467523 326274196 325902565
4834 325902565 324835415 323104377 320622527 317319030 313654578 310362077 307802075 306707807
4826 306707807 307299557 309377435 313298716 318502107 325132505 333398262 342901648 353362561
4818 353362561 364949187 377154579 389677911 402115330 414027555 424919408 434780295
4811 434780295 443399258 450907675 456565597 460684467 463152981 464237628 464185258 462648672
4803 462648672 460735854 458431906 456234981 453675743 451215204 449098072 447662855 446953850
4795 446953850 447128427 447908700 449269200 451208703 453919362 457198944 461381836 465728661
4787 465728661 470772144 476059802 481422517 486753243 492380582 497557560 501864102 505646924
4779 505646924 508781828 510808905 511519867 511217519 509401774 505953786 500707164 493636616
4771 493636616 485830427 476949340 466991891 456429747 445090476 432948377 421251047
4764 421251047 409463613 397555668 386380988 375652727 365355367 355487815 346658631
4757 346658631 338573749 331024675 323924133 317130146 310977352 304902475 298527726 292643677
4749 292643677 286626937 280343432 273686480 266450862 258931976 250522865 241854366 232915547
4741 232915547 223410238 213469459 203068009 192506382 182048382 171752890 161655394
4734 161655394 151643306 142036957 132841312 124056842 115729952 108033747 100742534 94246233
4726 94246233 88381022 82994861 77755521 72961744 68809208 65047170 61228092 57685384
4718 57685384 54705032 51730852 48754429 46310168 43952589 41695776 39727250 37913257
4710 37913257 36208507 34677591 33256006 31865288 31120511 30124957 29118704 28111523
4702 28111523 27623188 27128356 26323593 25338730 25251901 24741427 24280445 24137247 24016239 23687218
4692 23687218 23228541 22672538 22304402 21841598 21489457 21471129 21180086 20749461 20558381 20457103
4682 20457103 20102592 19422219 19484634 19501097 19266785 19161702 18801894 18681430 18955396 18881419
4672 18881419 19004206 19056815 18901635 19182505 19084824 18929189 19134962 19319293 19354074 19469749
4662 19469749 19747479 20177162 20499347 20809719 21058831 21329372 22007426 22485551 23337515
4653 23337515 23846261 24757946 26167453 27405557 28610320 29834170 31406248 32967375
4645 32967375 34581837 36254689 37937934 39481015 41268150 42962713 44211556 45507058
4637 45507058 46742052 47409018 47701926 47585642 47726762 47333413 46475530 45488542 44329245
4628 44329245 43267128 42256899 41002417 39759658 38604486 37577637 36757331 36319170
4620 36319170 35730536 35448881 35656713 35992462 36781724 37865945 38870172 40386772 42112317
4611 42112317 44146410 46369394 49044539 51512027 53842967 56316331 58758501 61195058
4603 61195058 63585814 65201729 66607190 68225458 69629359 71106362 72468781 73413835
4595 73413835 74298904 75454489 76789014 78333201 80139729 82095115 84695966 87958660
4587 87958660 91729558 95775662 100800277 106719825 112653829 119135537 125699746 131915870
4579 131915870 138012431 143658557 148647160 152920957 156239814 160026943 163990424 167635793
4571 167635793 171208963 173976435 175978791 177178897 178161391 179240289 179740365 179859321
4563 179859321 180642756 181268884 182303130 183441459 183616276 183017699 181315063 178903620 176201277
4554 176201277 173522619 171069901 169189741 167675594 166132360 164445906 161836192 158148854
4546 158148854 153744472 148721156 143463458 138156739 132320612 126206311 120290446 114345529
4538 114345529 108370823 101461253 93998502 86419400 79386340 72458686 66406055 61088309
4530 61088309 56436557 52527187 48409025 44765482 41629907 38642279 35935309 33383095
4522 33383095 30968955 28917205 27122860 25460330 24301622 23324047 22058462 20884924
4514 20884924 20085070 19116226 18434506 17691267 16790172 16216639 15957013 15435601 15099734
4505 15099734 14891526 14681897 14725398 14762255 14470552 14224064 14355350 14328528 14045694 13983588
4495 13983588 14291838 14367978 14217223 14355888 14490103 14352302 13916957 14048439 14094393 13749241
4485 13749241 13992762 14026548 13947568 13622842 13694729 13679067 13630914 13566150 13370791 13380455 13251804
4474 13251804 13425309 13374839 13319993 12931454 12890831 12873737 12667339 12613493 12889677 13067763
4464 13067763 12979078 12809009 12791757 12946698 13042065 13260400 13176272 13325654 13387315 13288360
4454 13288360 13112405 12783120 12736340 12781994 12823741 12937884 12857008 12918619 12812973 12837434
4444 12837434 13032908 12871911 12762171 12946550 12914680 12696041 12466788 12798578 13241245 13762023
4434 13762023 14079845 14205560 14675507 15033555 15426614 16253596 16793808 17785974 18622371
4425 18622371 19743492 20983793 22159960 23293132 24552605 25478661 26514881 27251425
4417 27251425 27683531 27727548 27586114 27522764 27349916 26941869 25978680 25071127 23970590 22828908
4407 22828908 21632046 20729302 19581477 18835136 17952431 17396770 16770400 16349634 16094128
4398 16094128 15530273 14957122 14475092 14375045 14083514 14067113 13932772 13742660 13801415 13845702
4388 13845702 13753990 13539106 13392435 13329144 13533014 13452304 13289725 12886832 13118457 13185435
4378 13185435 13118518 13144576 13005091 12898672 12922557 12988798 12670111 12561209 12483162 12257589
4368 12257589 12224203 12231966 12088409 11891467 11958440 12042328 11952097 12070910 12080146 12130634 12030162
4357 12030162 12037208 12146728 12393284 12793539 12847459 12766035 12857239 13029628 13350114 13794277
4347 13794277 14182830 14365647 14651061 14740846 15250607 15713371 15614487 15608457 15849032 16293696
4337 16293696 16601764 16889477 17454438 17786679 17862218 18183067 18884467 19349997 19706301 20385482
4327 20385482 20512454 20839375 21258520 21426244 21442859 21415805 21206799 21016064 20919573 20679381
4317 20679381 20434737 20185213 20093707 19983161 19890140 19532305 19417871 19394073 19031511 19245192
4307 19245192 18933760 18583902 18543271 18414043 18302028 18158606 18120882 18116162 18135704 18141570 17939952
4296 17939952 17807787 17718020 17496676 17682856 17876035 17599142 17456900 17515786 17803860 18473661
4286 18473661 18495923 18359295 18626898 18994896 19047314 19130573 19576368 20246868 20436067 20633543
4276 20633543 20936812 20831132 21234732 21818497 22417285 22777581 22997871 22950249 22942558 23173147
4266 23173147 23341963 23450443 23651572 23704586 23973062 23898496 23874169 23999306 23998846 24372499
4256 24372499 24445096 24474580 24498599 24714655 24751043 25114229 25054648 25102885 25135043 25232301 25934318
4245 25934318 26212481 26353847 26526157 26754725 26666116 27050678 27530303 27811275 27772268 28055093
4235 28055093 28439636 28604071 28652800 28944240 28957337 28932102 29031378 28666724 28943026 29180858
4225 29180858 29214385 29026989 28854664 29079317 29186286 29101300 29230542 29169674 29482171 29734828
4215 29734828 29901057 30194664 30522061 30873583 31317041 31550918 31835983 32330030 32615623
4206 32615623 32783520 33287387 33886834 34282251 34589413 35220431 35864154 36436471 37139683
4197 37139683 37925964 38545715 39419813 40568849 41077568 41814795 42812539 43743186 44902153
4188 44902153 46272957 47541782 49068894 50781363 52185895 53797233 55495517 57244885
4180 57244885 59410232 61249635 63128594 65139767 67132961 69085804 70909465 72575548
4172 72575548 74222271 75908890 77418600 79458223 81260272 82984161 84635973 86249492
4164 86249492 88175031 90627364 93118316 95497455 98191996 101209568 104331155 107565149
4156 107565149 110650339 113962485 117283410 120688582 124340020 127601828 131183681 134487031
4148 134487031 137780779 141100825 144517965 147871997 150956963 154066138 157414331 160571668
4140 160571668 164046560 167372887 171086722 174974307 178779766 182953346 187631005 192675776
4132 192675776 197200103 201634423 205917665 210400666 214816819 219059268 223367048 227395480
4124 227395480 231031741 234180481 236992938 239497191 241564625 243669649 245576372 247470203
4116 247470203 249217577 250615051 252188033 253949912 255756258 257708295 260086602 263262300
4108 263262300 266999391 271153914 275741974 281132344 286740054 292848863 299911137 307302196
4100 307302196 314634160 322051605 329904250 337724224 345299604 351882588 358273600 364519063
4092 364519063 370511541 375895072 380557738 384900415 389264394 393322634 397111314 400902224
4084 400902224 404780886 408691051 412601822 416658265 421297330 425543376 429362141 433020004
4076 433020004 436484777 439627926 442315538 444571763 446607364 448394622 449703210 450618853
4068 450618853 451089123 451128767 450645053 449954273 449140044 448249552 446846217 445044255 442867368
4059 442867368 440511022 437548493 434094824 430039378 425039231 419501396 413909774 407726706
4051 407726706 400861442 393164709 385074353 376436634 367392736 358859393 350348720 342092636
4043 342092636 333883920 325954145 318611937 311178339 304591603 298793839 293043017 287999924
4035 287999924 283169557 279288359 275494532 271514547 267473267 263380919 259408700 255652147
4027 255652147 251914580 247754379 243888585 239442708 234778132 229458188 224156009 219040066
4019 219040066 213340897 207858891 202116326 196443896 190873077 185294598 179839794 174867079
4011 174867079 169699015 165014098 160873274 156728606 153153884 149857283 146943427 143851553
4003 143851553 141027113 138143561 135287716 132823125 129938189 127072036 124397905 121481608
3995 121481608 118433900 115099677 111913049 108502398 105057168 101572766 98216554 94809769
3987 94809769 91659129 88454670 85350450 82315672 79756490 77388928 75127548 72862115
3979 72862115 70518236 68440604 66489281 64526616 62509056 60743188 59184978 57540022
3971 57540022 55808661 54016309 52954714 51394442 49866126 48659033 47385838 46216576
3963 46216576 45019587 44363783 43910066 43346910 42783153 42524138 42414899 42013045 41757554
3954 41757554 41778493 41637014 41734305 41525292 41481927 41756331 41923325 42256254 42570143 42945451
3944 42945451 43638299 43610009 44017029 44672944 44939653 45219371 45704459 46476710 46935711 47633597
3934 47633597 48164864 48207882 48497005 48985858 49377931 49893974 50391842 50791494 51040598 51247551
3924 51247551 51501670 51971598 52496098 52952980 53254975 53571170 54079548 54772072 55232854
3915 55232854 55636131 56658605 57059624 57984238 58740844 59169127 59852061 61073316 62047050
3906 62047050 63131061 64012470 65165580 66429674 67863723 69355796 70870313 72637072
3898 72637072 74247907 75736955 77653396 79455100 80905656 82505657 83896306 85304666
3890 85304666 86883242 88089199 89170070 90105625 90873145 91575849 92204198 92595409 93365104
3881 93365104 93704089 93808341 94285328 94544379 94518655 94554091 94569286 94054645 93516601 93484541
3871 93484541 93172767 92607357 92022260 91331942 90605217 89508744 88652964 87490727 86269517
3862 86269517 85297006 84049045 82705894 81855277 80808383 79867245 79146810 78156419 77131020
3853 77131020 76455639 75792833 75261729 74479190 73957490 73002100 71902074 71031067 69809587
3844 69809587 68568651 67512978 65973638 64173215 62888723 61485473 59802592 58568685
3836 58568685 57137839 55923522 54686037 53401789 52223775 51439091 50664878 50170188 49258650
3827 49258650 48605939 48188455 47816042 47297554 46943395 46689110 46267808 46344330 46099221 46291992
3817 46291992 46393262 46551315 46865598 46960772 47369200 47935523 48120292 48557084 48904099 49475924
3807 49475924 50338538 50780025 51186120 51946264 52916537 54097514 55432289 56381678 57807442
3798 57807442 59128277 60497972 62051732 63802139 65282113 66372801 67447039 68346114
3790 68346114 69066897 69439233 69565566 69600714 69150988 68541244 67953873 67276323 66687161 65898107
3780 65898107 65132808 64424164 64273884 64308736 64482469 65021036 65734311 66651981 67468019 68794875
3770 68794875 70463750 72312558 74189092 76355609 78386074 80457308 82964318 85269174
3762 85269174 87704887 90323146 92511713 94259764 95964581 97343536 98352311 98771548
3754 98771548 99035327 98551195 97545914 96379971 95264760 93699433 91710740 89842465
3746 89842465 88259457 86264832 84507265 82630819 81068127 79572631 78394117 77125379
3738 77125379 76010118 75451361 74659375 73654359 73246035 72490102 71621478 71058100 70665287
3729 70665287 69805203 68857463 67833436 66500774 65707384 64642730 63292753 61852908 60503900
3720 60503900 59016922 57736333 56260605 54679276 53477613 52338381 50851233 49612363
3712 49612363 48193791 47195304 46239305 44969131 43929828 42906348 41939321 41105173 40754511
3703 40754511 40118321 39603553 39198113 38576871 38286070 38124497 37868409 37469729 37347038
3694 37347038 37221269 37138635 37049873 37005695 36992612 37001374 36827442 36930148 36940217 36636349 36315598
3683 36315598 36350700 36424711 36505295 36703845 36797566 36988857 36923509 36840412 37037293 37051317 37150177
3672 37150177 37198344 37102923 36817232 36391124 36049643 35957432 35606388 35142842 34659966 33864893
3662 33864893 33355572 33025085 32588302 32132978 31552325 30875910 30098142 29662443 29387535
3653 29387535 28728074 28300727 27941368 27747645 27496895 27207099 27024758 27241673 27319067 27151177
3643 27151177 26972419 26810573 26949192 27192903 27469847 27538513 27751539 28104395 28417510 28596320
3633 28596320 29020177 29473861 29581584 29669774 29822792 30226379 30383057 30778968 30900668 31048989
3623 31048989 31457082 31738846 32432337 32306664 32324500 32620062 32913165 33409222 34097958 34357352
3613 34357352 34838102 35435889 35761025 36144191 36683284 37260602 37982099 38495791 39332527
3604 39332527 40307164 40785309 41360163 41785895 42545528 43094444 43601009 44249766 44983777
3595 44983777 45542821 46009586 46213445 46583499 47051236 47492125 47522231 47886185 47999740 48378464
3585 48378464 48755633 49287835 49701785 50139213 50999889 51476740 52276278 53221153 54284763
3576 54284763 55527224 56717336 58270734 59923872 61399563 63151008 64833772 66262057
3568 66262057 68093315 69780204 70982698 72515071 74198894 75712429 77240805 78554731
3560 78554731 79778103 81383672 82911576 84220052 85613382 87191690 88981361 90875442
3552 90875442 92570749 94109316 95940313 97840132 99891555 102573067 105038452 107497747
3544 107497747 109987628 113188222 116222026 119523852 123296725 127423794 131687307 136585517
3536 136585517 141897403 147507285 153894858 161019159 168754257 176953464 185935060 195362291
3528 195362291 205248121 214990798 225200521 235562389 245943465 256357818 266169172
3521 266169172 275426193 283658770 291070644 297112527 301882830 305128456 306739486 306712187
3513 306712187 304830623 301141183 296104144 289749901 282410372 274024950 264516662 254310619
3505 254310619 244027332 233467900 222787682 212439548 202547043 193107213 183903311
3498 183903311 175191836 166953134 159379244 152435561 145861741 139633763 134005099 128795543
3490 128795543 124106372 119721157 115638077 111801535 108138280 105055591 102197828 98966392
3482 98966392 95968480 93240809 90827331 88350919 86243242 83917944 81812619 79566558
3474 79566558 77738121 76274365 74557941 72722167 71006065 69557963 68255438 66920921
3466 66920921 65722539 64655495 63846028 63117008 61553190 60500266 59859605 58891085 57853509
3457 57853509 56918267 55648432 54691521 53790161 52963934 51941557 50890257 50074463 48898697
3448 48898697 47911027 47210685 46403520 45541285 44759524 44097668 43496951 42832246 42508992
3439 42508992 42000030 41581361 41363838 41277595 41036691 41025158 40821043 40718820 40861449 40687335
3429 40687335 40845144 40799255 40862758 40751929 41051436 41078525 41182854 41171638 40986101 41100490
3419 41100490 40924663 41039241 40801541 40634715 40229288 39900156 39691288 39394608 39112343
3410 39112343 38727643 38445898 37777116 37379012 36826616 36227681 35925247 35410448 35098253
3401 35098253 34733963 34621182 34659632 34196073 33795665 33824233 33857242 33320018 33070544 33039259
3391 33039259 33026331 33072210 32861808 32802296 32656134 32873078 32916192 32808141 32762764 32917794
3381 32917794 32936368 33101057 33398772 33546846 33762011 34077867 34095957 34513080 34803486 34980921
3371 34980921 35247694 35507135 36136574 36604374 36786096 37306024 37638031 37772783 38078360
3362 38078360 38586253 38876221 39179487 39409945 39413676 39445848 39308813 39599063 39681850 39789429
3352 39789429 39407702 39143476 39075409 38927534 38763940 38494909 38192898 38094769 38027227 37927571
3342 37927571 37930468 38295283 38716377 39256443 39652421 40177888 40589810 41226894 42115263 43219875
3332 43219875 44554084 45866511 47493100 49782224 51828015 54019726 56605829 59779603
3324 59779603 63086220 66277766 69436484 73023897 76566426 79833924 82945949 85500216
3316 85500216 87806456 89274734 90421897 91094795 90819537 90053418 88706131 86969108 85036282
3307 85036282 82222618 79041409 76037448 72745336 69519051 66748486 64125438 61334251
3299 61334251 59100818 57452005 56056294 54796826 54095865 54178013 54303690 54740621 55368155
3290 55368155 56682488 58524766 60629544 62751685 65001394 67338921 69910012 72465672
3282 72465672 74801110 77247460 79640217 81449507 82382729 82963000 83368374 83618015 83347879
3273 83347879 82315537 81213517 79285829 77272125 75142907 72819522 70675170 68374676
3265 68374676 66123525 63916476 61930639 59795798 58389011 57393306 56163816 55220041
3257 55220041 54675518 54750116 54787135 54896793 55666407 56591061 57373282 58889428 60128236
3248 60128236 61921534 64123748 66414346 69329067 72343659 75418846 78865987 82786562
3240 82786562 87189554 91699267 95795873 99967281 103996712 107548124 110503456 113193404
3232 113193404 115596774 117734838 119472591 120849251 121886373 122684093 123317395 124142767
3224 124142767 125732989 128471352 132258890 137352553 143456163 150852251 159553740 169813229
3216 169813229 181711681 194787589 209138943 224416386 240470589 256799960 273315495
3209 273315495 289297090 304539370 318888588 331676217 343004610 352364918 359265478
3202 359265478 363425571 365020103 364361616 361861266 357702450 351647365 344353745 335703795
3194 335703795 325588041 314677178 303275922 291863115 280772499 269981431 259737232
3187 259737232 249913458 240987206 233524214 227019568 221255018 216565459 213232575 210990512
3179 210990512 209365469 208572986 208445646 208369855 208087430 207943597 207276318 206496996 205495510
3170 205495510 204618019 203018924 200450053 197258777 193528056 189467130 185311942 181199671
3162 181199671 176897777 172831310 169191591 165366119 161783505 158463980 155389601 152637528
3154 152637528 150527779 148990232 147835791 147043906 145904533 145117298 144690036 144455065 143638305
3145 143638305 142452412 140994794 139339626 137380020 135407862 133309315 131038281 128753520
3137 128753520 126565470 124245722 122019429 120104446 118197658 116822079 115986754 115421488
3129 115421488 115388184 115625243 116677632 117781919 119433972 121147129 123230211 125833309
3121 125833309 128240843 131339213 135295604 139568128 144474682 150295350 156844183 164058206
3113 164058206 172444223 182012659 192299855 203403580 214958127 226835576 239001538
3106 239001538 250501252 261700839 272991585 284221876 294677312 304501235 312983958
3099 312983958 319988959 324807743 327460531 329135827 330475247 331969511 333222359 333950598
3091 333950598 333569044 331500534 328570672 325153005 320997027 317233320 313235832 308634306
3083 308634306 303202898 296674980 288673431 278592702 267103820 254554260 241619162
3076 241619162 227917604 213816000 199776459 185002496 169955825 155236419 140890760
3069 140890760 127235777 114964014 103574363 93451098 84580319 76917108 70094919
3062 70094919 64435572 59567263 55396759 51820754 49039080 46995486 45609275 44324754
3054 44324754 43651215 43311441 43233492 43403867 43501403 43669822 43994109 44430023 44679929 45779005
3044 45779005 46845195 48035235 49005675 50345363 51812409 52968523 53903665 54581363 55210905
3035 55210905 55079690 54574377 53682707 52561952 50925531 48929438 46669954 44001049 40983199
3026 40983199 38199084 35098452 32470080 29916545 27323633 25476134 23878579 21832183
3018 21832183 20316596 18663238 17374206 16588760 15688867 14704042 14037636 13755893 13621329
3009 13621329 13437135 13311913 13205521 12955974 12864326 12787681 12808418 12864740 12780319 13128178
2999 13128178 13654043 13761720 14006796 14517699 15292483 16210319 17096705 17750403 18830381
2990 18830381 20332499 22186268 23885098 26116435 28530437 30823364 33138167 35483951
2982 35483951 37565875 38923920 40144105 40709640 40898933 40856937 40163171 39090967 37793297
2973 37793297 36034299 33821929 31323301 28375587 25831096 23428095 21357719 19488705
2965 19488705 18097228 16714707 15290820 13951027 12747999 11664720 10719885 9918717
2957 9918717 9615761 9396843 9227798 9226420 9051918 8757380 8338337 8084949 8034894 7856916
2947 7856916 7795221 7739757 7155258 6671793 6584569 6075495 5643208 5513979 5273679 4697945
2937 4697945 4366584 4452116 4129208 3730541 3490640 3707731 3671730 3641620 3465312 3558143
2927 3558143 3773301 3546132 3354997 3294891 3206757 3259735 3378816 3425913 3621725 3786278
2917 3786278 3463442 3433778 3611282 3244790 3138645 3056458 2854845 2761093 3025073 2872529
2907 2872529 2860441 2362903 2404480 2448374 2421249 2401219 2400985 2096142 1723135 1780691 1739637
2896 1739637 1823638 1574196 1717727 1620328 1742961 1890935 1793132 1862774 1892419 1918525 1673061
2885 1673061 1498903 1560563 1614546 1634820 1649026 1838508 1792677 1734063 1551478 1573848 1514701
2874 1514701 1592379 1564483 1568517 1714721 2073446 1921178 1743643 2350706 2662082 2721692
2864 2721692 3132400 3605435 4060780 4491347 4708349 4919563 5161406 5332121 5488525 5754834
2854 5754834 6265060 6511550 6454786 6371122 6183120 5826166 5395263 5299228 4974394 4593751
2844 4593751 4248672 3474383 3272397 3107452 2609660 2298586 1885893 1660636 1743147 1563421
2834 1563421 1733795 1478631 1032104 983198 760695 841096 935807 832412 867475 1166752
2824 1166752 1219140 1275040 1267871 1068502 1365549 1177541 1258573 1126633 1132032 1576631 1431787
2813 1431787 1474400 1678293 1586142 1553326 1606286 1621630 1748098 1904551 1953995 1662719 1524254
2802 1524254 1408700 1287407 1160966 1211782 1378954 1350615 1023855 725434 732361 708383
2792 708383 750336 755343 811391 581619 374868 439638 233194 102496 63125 57911 -147970
2781 -147970 -110519 -171592 -366518 -479144 -97637 -77178 -41358 -267591 -537063 -848163
2771 -848163 -958002 -806303 -589913 -436185 -466282 -438895 -273641 -318561 -110919 -134984
2761 -134984 -287900 -388380 -577894 -495854 -321219 -169508 -425632 -229376 -356045 -452020
2751 -452020 -367578 -304791 -336004 -173496 -52070 -205500 -257355 -349862 -291932 -486798 -613552
2740 -613552 -325653 -308503 -324573 -479706 -364640 -347901 -627374 -631511 -535332 -525924 -578376
2729 -578376 -617815 -809863 -799189 -833307 -675586 -777895 -842451 -735723 -707198 -810134 -936502
2718 -936502 -1216844 -1137326 -996577 -1173507 -1189254 -1071843 -808956 -993381 -948646 -707787
2708 -707787 -693276 -938053 -878646 -1024399 -1110954 -1043608 -1102225 -949548 -1049275 -1053613 -997121
2697 -997121 -956799 -702650 -700652 -928905 -664727 -824948 -1310196 -985629 -1129576 -1076527
2687 -1076527 -972121 -1081183 -1128716 -1170883 -1152480 -992713 -1068798 -1161416 -1297626 -1300653 -1317398
2676 -1317398 -928004 -960162 -1104212 -869840 -844937 -989774 -1357842 -1071145 -916230 -955611
2666 -955611 -1134212 -1117471 -986554 -1120571 -1047990 -1184691 -1448533 -1474985 -1525965 -1599681 -1257373
2655 -1257373 -1165551 -1282981 -1181531 -946389 -673088 -675814 -594865 -584636 -562995 -554259 -459911
2644 -459911 -558226 -366159 -595407 -744397 -433070 -460158 -570900 -609974 -553905 -545192 -888985
2633 -888985 -834675 -975285 -1094933 -813219 -995310 -1083900 -1076821 -1203969 -1277684 -1253232 -1498844
2622 -1498844 -1353012 -1120556 -1255585 -1130739 -1099846 -1239169 -1294180 -1168099 -1204177 -1218944
2612 -1218944 -1524191 -1347445 -1287242 -1341468 -1311176 -1430747 -1281714 -1468841 -1373186 -1458449
2602 -1458449 -1533689 -1488611 -1743642 -1767946 -1620888 -1338791 -1082595 -968713 -880214 -928002
2592 -928002 -843228 -1004252 -1323810 -1651454 -1713261 -1758363 -1749777 -1582230 -1183840 -1179598 -1409926
2581 -1409926 -1469169 -1334974 -1288782 -1283366 -1148266 -1176011 -1284970 -1450557 -1203635 -1354628
2571 -1354628 -1261141 -888907 -858962 -1090221 -1331123 -1499832 -1433086 -1430997 -1530247 -1190737 -1128584
2560 -1128584 -1206176 -1006101 -944338 -1190141 -1415070 -1354698 -1235537 -1302816 -1432170 -1203102
2550 -1203102 -1180732 -1376008 -1227837 -1241335 -1318373 -1395563 -1149338 -993585 -964077 -1173849
2540 -1173849 -1416260 -1369235 -1297182 -1183648 -794409 -780095 -1262478 -1207960 -1038498 -923212
2530 -923212 -766940 -789889 -1242787 -1020734 -872440 -562194 -584038 -858199 -876580 -752460
2520 -752460 -1079029 -1251916 -861423 -665250 -463446 -516144 -552434 -596326 -677972 -754695 -875726
2509 -875726 -986552 -930010 -952441 -914472 -696638 -653773 -840010 -658568 -922869 -766027
2499 -766027 -826363 -716075 -403571 -493175 -300010 -507424 -210718 57848 -261749 -222163
2489 -222163 -218362 -261764 -260939 -475836 -472014 -363827 -396939 -207066 -220643 -213568 -141144 -95255
2477 -95255 -47453 66772 -113377 -10594 -74636 -80294 -23986 231195 201475 129283 249424
2466 249424 349506 275166 442549 590837 496370 550618 636332 607689 707771 569551 797184
2455 797184 816567 626498 851148 898568 1172229 887317 1045696 1054972 1248519 1311353 1518486
2444 1518486 1558659 1553515 1562598 1610525 1716243 1548283 1761187 1759452 1856985 2128408 1869945
2433 1869945 2105438 2286946 2436861 2544894 2442229 2634093 2639168 2481699 3022197 3411233
2423 3411233 3245036 3279429 3366128 3609300 3905292 4110836 4320357 4319769 4535344 4876427
2413 4876427 5240175 5563455 5860281 6043136 6174036 6369461 6699111 7043179 7414233 8343550
2403 8343550 9215845 9738413 10359655 11143806 12272716 13988012 15747677 17736721 19687659
2394 19687659 21608463 24666221 27860480 31125714 34887468 39403273 45447410 52820807
2386 52820807 60824229 69814385 79795803 91250218 103994129 118475559 133271250 146088327
2378 146088327 156735545 167321111 175004883 177219484 177093753 175054574 172118606 168450499
2370 168450499 162888308 153941553 140832421 125820103 111034781 97023415 84862799
2363 84862799 73870844 64181483 55712415 47858132 40632502 34099185 28261567 22953431
2355 22953431 18193109 14712696 12095973 10175145 8676144 7479467 6382992 5580177
2347 5580177 5094924 4501063 3756573 3178903 2689907 2393128 2076106 1611998 1376070 1268481
2337 1268481 844687 611255 151666 254259 381054 403230 241936 148053 -4711 -234842
2327 -234842 -165634 -96713 -295130 -631374 -697615 -758987 -770117 -756184 -850908 -1056245 -965163
2316 -965163 -953386 -1093012 -940070 -936988 -988868 -1018315 -1355419 -996560 -647798 -572812 -924346
2305 -924346 -1020031 -1033588 -1148574 -1246460 -1192565 -1135177 -991023 -814217 -878353 -839398 -864114
2294 -864114 -869246 -989867 -1072865 -1080331 -1052631 -1007434 -967708 -1165659 -1346671 -1083891 -1381041
2283 -1381041 -1163431 -1136229 -1030739 -1004347 -1384240 -1500000 -1264517 -998594 -1108946 -1533072
2273 -1533072 -1446465 -1150096 -1227403 -1360619 -1164309 -1327918 -1662917 -1369471 -1372492 -1477574
2263 -1477574 -1788156 -1856376 -1716737 -1825397 -1702958 -1488797 -1591171 -1909028 -1996899 -1843585
2253 -1843585 -1735534 -1581681 -1469154 -1632960 -1570155 -1510340 -1762952 -1614171 -1567665 -1445612
2243 -1445612 -1377495 -1143834 -1473449 -1373805 -1318878 -1560273 -1433799 -1496384 -1468061 -1357362
2233 -1357362 -1543934 -1779160 -1426177 -1427814 -1512485 -1602866 -1456289 -1539067 -1582461 -1337006 -1551463
2222 -1551463 -1816616 -1792423 -1706058 -1628226 -1336053 -1445361 -1551984 -1638602 -1811977 -1730064
2212 -1730064 -1574956 -1486912 -1566358 -1690507 -1636613 -1573399 -1502063 -1428575 -1711855 -1864432 -1577602
2201 -1577602 -1245168 -1555629 -1617511 -1449508 -1779199 -1522712 -1520526 -1855082 -1888364 -2046448
2191 -2046448 -1856629 -1751616 -1621178 -1707651 -1789360 -1875987 -1759738 -1625521 -1943706 -1650223
2181 -1650223 -1615540 -1687543 -1875246 -1764027 -1656816 -1429986 -1560120 -1556552 -1478118 -1688641
2171 -1688641 -1420357 -1226684 -1405639 -1512338 -1529006 -1656816 -1673847 -1325148 -1415135 -1363642
2161 -1363642 -1538668 -1728391 -1204401 -1214682 -1267071 -1358467 -1530449 -1659990 -1743118 -1826397
2151 -1826397 -1794970 -1645512 -1567283 -1466005 -1352576 -1526033 -1545922 -1787450 -1848484 -1682775
2141 -1682775 -1604761 -1535588 -1459290 -1340603 -1361082 -1416403 -1545607 -1695931 -1535190 -1354220
2131 -1354220 -1459934 -1540034 -1293535 -1317938 -1415178 -1497499 -1316840 -1466445 -1372959 -1011333
2121 -1011333 -867454 -977144 -1144821 -1304836 -1168541 -1050458 -974436 -1150845 -1162718 -796389
2111 -796389 -754037 -880157 -771064 -672021 -749222 -563533 -509425 -673112 -274851 -253393 -558152
2100 -558152 -635307 -765138 -873428 -1144697 -1055567 -1000100 -1106289 -1247851 -1471020 -1674004
2090 -1674004 -1581494 -1462991 -1583594 -1772861 -1805631 -1683099 -1469840 -1507657 -1692208 -1806763
2080 -1806763 -1868922 -1713571 -1611817 -1658015 -1672490 -1694736 -1713895 -1527693 -1420601 -1456871 -1616721
2069 -1616721 -1974185 -1760064 -1613607 -1412207 -1358655 -1285345 -1442134 -1627190 -1484590 -1647438
2059 -1647438 -1625308 -1630147 -1609611 -1707057 -1554315 -1285165 -1264874 -1323154 -1758909 -1673500 -1519613
2048 -1519613 -1630868 -1449374 -1526446 -1544383 -1723411 -1570310 -1521363 -1639260 -1308361 -1236335
2038 -1236335 -1393076 -1627840 -1516524 -1682046 -1927769 -1901762 -1877503 -2046023 -1744861 -1487945
2028 -1487945 -1587204 -1828157 -1645518 -1793313 -1833644 -1885935 -1738340 -1816893 -1659731 -1431555
2018 -1431555 -1408179 -1643705 -1642318 -1728279 -1732302 -1700504 -1853327 -1717207 -1563928 -1485727 -1564918
2007 -1564918 -1420022 -1600006 -1426574 -1624671 -1908129 -1810026 -1693708 -1495845 -1557492 -1420471
1997 -1420471 -1439536 -1544731 -1693675 -1727861 -1810691 -2015080 -1789392 -1590788 -1620879 -1473632
1987 -1473632 -1319906 -1401112 -1587159 -1819530 -1473820 -1478549 -1501776 -1533894 -1539886 -1636793 -1548281
1976 -1548281 -1520613 -1458086 -1408707 -1514052 -1483557 -1530577 -1809000 -1652012 -1632894 -1718364 -1724100
1965 -1724100 -1644027 -1328729 -1351880 -1307807 -1287730 -1771858 -1597397 -1536954 -1297597 -1399479
1955 -1399479 -1379831 -1477673 -1736397 -1653509 -1567267 -1377724 -1430280 -1596070 -1418527 -1481443 -1577271
1944 -1577271 -1560927 -1719073 -1733284 -1625039 -1412862 -1220257 -1354594 -1485530 -1389093 -1474696
1934 -1474696 -1574781 -1585431 -1568843 -1587789 -1713302 -1772862 -1721720 -1705820 -1538015 -1467133 -1418217
1923 -1418217 -1271405 -1226769 -1570234 -1425148 -1381521 -1507778 -1653476 -1915300 -1825673 -1867981
1913 -1867981 -1569513 -1467292 -1444931 -1274397 -1524357 -1538175 -1474796 -1632378 -1872173 -1593289
1903 -1593289 -1588268 -1710510 -1637031 -1855021 -1772721 -1679431 -1559892 -1742431 -1896172 -1714231
1893 -1714231 -1776910 -1526104 -1576169 -1584095 -1447277 -1298056 -1469947 -1598136 -1352641 -1384879
1883 -1384879 -1619760 -1471320 -1452872 -1595747 -1680295 -1659853 -1421911 -1474167 -1562987 -1363696
1873 -1363696 -1487106 -1520706 -1722450 -1839156 -1583977 -1490313 -1608940 -1522836 -1472801 -1380937
1863 -1380937 -1140448 -1338129 -1641330 -1743434 -1709780 -1907295 -1727644 -1528426 -1567229 -1400606
1853 -1400606 -1294415 -1517797 -1699157 -1611456 -1414894 -1560339 -1487643 -1374847 -1306285 -1091867
1843 -1091867 -1294922 -1408453 -1336195 -1405848 -1407232 -1483537 -1562681 -1320016 -1295635 -1233702 -1386845
1832 -1386845 -1139812 -1350899 -1266668 -1206620 -1119459 -1336554 -1149040 -1083022 -1339167 -1309647
1822 -1309647 -1416322 -1145330 -1109486 -1077456 -1145443 -1225708 -1261921 -1427563 -1569075 -1455699
1812 -1455699 -1418440 -1380278 -1351981 -1442430 -1452716 -1581516 -1497935 -1317318 -1745364 -1503564 -1186408
1801 -1186408 -1179420 -1242555 -1191946 -1060386 -1335321 -1377392 -1475024 -1489791 -1496952 -1547597 -1483354
1790 -1483354 -1663293 -1205933 -1311296 -1391914 -1268925 -1478836 -1578231 -1376802 -1216195 -1040106
1780 -1040106 -1077013 -1204728 -1328536 -1296779 -1549244 -1714475 -1928692 -1584885 -1404580 -1491675
1770 -1491675 -1593022 -1637284 -1390174 -1383924 -1380295 -1552260 -1643820 -1737690 -1835384 -1553171 -1260688
1759 -1260688 -1550054 -1822537 -1686063 -1503848 -1424094 -1366729 -1481914 -1378799 -1295243 -1188173
1749 -1188173 -1425306 -1681741 -1632734 -1882746 -1730196 -1411915 -1315716 -1243795 -1390580 -1592009
1739 -1592009 -1695491 -1647528 -1350719 -1245915 -1418830 -1294413 -1241721 -1365611 -1447378 -1317104
1729 -1317104 -1383429 -1112914 -1205511 -1361272 -1269799 -1518821 -1391189 -1567502 -1694486 -1523358
1719 -1523358 -1498987 -1617306 -1474024 -1425017 -1342381 -1289387 -1363241 -1426691 -1278838 -1401786 -1803510
1708 -1803510 -1540117 -1420186 -1289989 -1226953 -1303408 -1341923 -1453833 -1403495 -1515308 -1291861
1698 -1291861 -1423729 -1485769 -1498995 -1500104 -1539355 -1705614 -1975934 -1818607 -1608072 -1565951 -1443388
1687 -1443388 -1672285 -1555809 -1396795 -1370541 -1387268 -1243608 -1440113 -1534339 -1709112 -1399763
1677 -1399763 -1432703 -1644920 -1572800 -1667630 -1891577 -1746014 -1658267 -1289714 -1365889 -1570057
1667 -1570057 -1626368 -1817343 -1872083 -1940038 -1503040 -1577363 -1653711 -1528656 -1506967 -1185636 -1347138
1656 -1347138 -1484483 -1733835 -1314792 -1216916 -1581400 -1308217 -1291445 -1255017 -1510485 -1727019
1646 -1727019 -1451645 -1468788 -1465631 -1336420 -1310930 -1520319 -1471305 -1296074 -1492449 -1483661 -1494251
1635 -1494251 -1494189 -1501809 -1323931 -1192185 -1242006 -1355190 -1375967 -1465375 -1406307 -1362434 -1552763
1624 -1552763 -1714084 -1560567 -1439139 -1312314 -1298267 -1501617 -1503940 -1646422 -1391632 -1467209
1614 -1467209 -1559370 -1088784 -1567931 -1534728 -1214907 -1406786 -1527383 -1538216 -1470375 -1624545
1604 -1624545 -1496105 -1526320 -1526785 -1678319 -1646620 -1491536 -1451576 -1167383 -1238221 -1226566 -1341359
1593 -1341359 -1244654 -1275356 -1471693 -1491792 -1502258 -1651215 -1865835 -1955670 -1642034 -1483568
1583 -1483568 -1628385 -1536027 -1560695 -1574854 -1594256 -1496635 -1357430 -1457339 -1197128 -1446672 -1497320
1572 -1497320 -1553316 -1580107 -1551335 -1654797 -1704423 -1512115 -1526495 -1451968 -1549781 -1625306 -1339049
1561 -1339049 -1428825 -1587321 -1476837 -1348629 -1355527 -1497724 -1699025 -1773324 -1622379 -1491829
1551 -1491829 -1592125 -1471502 -1198145 -1134168 -1663554 -1766675 -1675399 -1652513 -1449431 -1310257
1541 -1310257 -1303781 -1439527 -1441833 -1141038 -1273848 -1357865 -1284753 -1436862 -1567999 -1665848 -1709013
1530 -1709013 -1590547 -1517393 -1511266 -1674760 -1560268 -1313074 -1288168 -1446681 -1560449 -1616815
1520 -1616815 -1688896 -1763044 -1514392 -1391729 -1451008 -1588909 -1660884 -1693086 -1735908 -1494045 -1254212
1509 -1254212 -1229416 -1308020 -1308287 -1260535 -1197585 -1239875 -1238152 -1225831 -1158710 -1305422 -1442717 -1389623
1497 -1389623 -1563617 -1538083 -1302807 -902174 -1286144 -1489622 -1218385 -1323172 -1335752 -1221789
1487 -1221789 -1355280 -1397444 -1151763 -1403811 -1318359 -1295505 -1383066 -1510725 -1756177 -1544394
1477 -1544394 -1447701 -1598191 -1393898 -1216859 -1336756 -1258975 -1129958 -998007 -1450520 -1482558
1467 -1482558 -1520657 -1618089 -1435220 -1552908 -1488427 -1274572 -1170501 -1115179 -1369392 -1558039
1457 -1558039 -1447188 -1367101 -1392917 -1238100 -1100496 -1271032 -1306501 -1481975 -1629682 -1603789
1447 -1603789 -1638553 -1583306 -1338604 -1049021 -1277254 -1597529 -1564142 -1520483 -1639486 -1698886
1437 -1698886 -1414427 -1580146 -1593686 -1542447 -1251615 -1072308 -1434372 -1609028 -1399740 -1419553
1427 -1419553 -1360093 -1275458 -1428368 -1425133 -1346878 -1343574 -1341989 -1407539 -1398066 -1669386 -1866609 -1697952
1415 -1697952 -1589553 -1304725 -1186363 -1358827 -1296069 -1164288 -1164083 -1454581 -1558002 -1441053
1405 -1441053 -1545695 -1486935 -1420536 -1414735 -1324553 -1555597 -1577934 -1408369 -1450431 -1334854 -925181
1394 -925181 -1061123 -1137873 -1184669 -1189298 -1134457 -1329835 -1458105 -1203191 -1261299 -1462534 -1376406
1383 -1376406 -1292959 -1511929 -1447383 -1372538 -1446062 -1202813 -1429727 -1481121 -1506255 -1591279 -1346546
1372 -1346546 -1342369 -1449557 -1432282 -1305529 -1340194 -1466988 -1506396 -1366252 -1161223 -1170800 -1307126
1361 -1307126 -1317591 -1007542 -1076013 -1037336 -1270422 -1193389 -1033309 -1124606 -1110542 -1302602 -1545738
1350 -1545738 -1577287 -1292448 -1597834 -1608194 -1320940 -1358442 -1178327 -1180448 -1270618 -1379395 -1391096
1339 -1391096 -1519496 -1396268 -1251065 -1021307 -1326718 -1292037 -1231633 -1331121 -1352831 -1342055
1329 -1342055 -1383114 -1197628 -1278684 -1240172 -1343604 -1603106 -1424678 -1397692 -1567816 -1713203
1319 -1713203 -1482476 -1262016 -1245974 -1292083 -1441667 -1336988 -1239465 -1189093 -1341569 -1246561
1309 -1246561 -1319467 -1388707 -1409973 -1574969 -1556787 -1235300 -1039370 -1316843 -1429223 -1379121
1299 -1379121 -1341348 -1528660 -1359564 -1262990 -1250938 -1147033 -963068 -1134479 -1273937 -1278633
1289 -1278633 -1452746 -1431710 -1491023 -1382410 -1176371 -1383294 -1585209 -1503351 -1560292 -1756425
1279 -1756425 -1626297 -1592005 -1220641 -1355195 -1519651 -1465761 -1591504 -1674763 -1564971 -1293579
1269 -1293579 -1046478 -1020728 -1188677 -1543856 -1508924 -1566161 -1555683 -1440956 -1568310 -1639299
1259 -1639299 -1407597 -1302989 -1431233 -1391072 -1004090 -994533 -1245531 -1078635 -1011700 -1245652
1249 -1245652 -1477921 -1457521 -1334239 -1734439 -1762319 -1717694 -1379899 -1446652 -1254641 -1212160
1239 -1212160 -1274274 -1064220 -1048616 -1318267 -1383495 -1308218 -1421430 -1468044 -1516128 -1361867 -1580784
1228 -1580784 -1451011 -1283873 -1216029 -1446712 -1343888 -1298824 -1320019 -1340506 -1286011 -1181010
1218 -1181010 -1463851 -1452466 -1479526 -1487213 -1554805 -1544197 -1524729 -1568661 -1589161 -1439486 -1436900
1207 -1436900 -1668431 -1765985 -1623401 -1322709 -1364573 -1222911 -1340260 -1307577 -1471048 -1382766
1197 -1382766 -1380460 -1284021 -1173301 -1244376 -1393551 -1343038 -1114329 -1012847 -1153355 -1194265 -1160134
1186 -1160134 -1198957 -1095545 -940441 -1206818 -1347365 -1440305 -1456127 -1470542 -1689162 -1579571
1176 -1579571 -1559522 -1537420 -1275505 -1330559 -1365683 -1053131 -958919 -1346152 -1279861 -1131200 -1202903
1165 -1202903 -1270292 -1199918 -1339475 -1285115 -1395404 -1512664 -1374089 -1279274 -1172636 -1333904
1155 -1333904 -1292944 -1258393 -1108919 -1150182 -1381657 -1446013 -1259621 -1229643 -1390965 -1454355 -1184892
1144 -1184892 -1354409 -1255231 -1250390 -1216771 -1212642 -1119303 -1046264 -1162855 -1376942 -1177655 -986304
1133 -986304 -1120093 -1412202 -1355153 -1220783 -1071357 -1139923 -1528365 -1436604 -1483160 -1369645
1123 -1369645 -1516917 -1460355 -1347914 -1310544 -1515487 -1729033 -1384068 -1024604 -1269448 -1317547
1113 -1317547 -1353179 -1386331 -1284712 -1271470 -1535249 -1394194 -1358185 -1199955 -1140327 -1426531
1103 -1426531 -1267343 -1299476 -1256756 -1016937 -1214461 -1395599 -1464509 -1345839 -1094309 -1144673
1093 -1144673 -981181 -1089921 -1163670 -1295711 -1398115 -1304035 -1270419 -1465815 -1459504 -1408494 -1198094
1082 -1198094 -1251027 -1255008 -1339434 -1186581 -1166426 -887778 -906629 -1300078 -1403325 -1382578 -1354965
1071 -1354965 -1295857 -1317024 -1472096 -1593115 -1477138 -1245914 -1321128 -1282397 -1275734 -1125674 -1441287
1060 -1441287 -1446678 -1186866 -880227 -917993 -1348307 -1504299 -1167045 -1096399 -1421550 -1270458
1050 -1270458 -1374614 -1664654 -1597721 -1397105 -1210809 -1051745 -1051594 -1120223 -1236279 -1333154 -1434406
1039 -1434406 -1477317 -1335268 -1311577 -1263077 -1175505 -1103917 -1146092 -1297189 -1337115 -1456608 -1612586
1028 -1612586 -1420227 -1322523 -1198573 -1243211 -1443885 -1293502 -1366123 -1310937 -1195357 -1313264
1018 -1313264 -1294847 -1152012 -1100759 -1284410 -1440990 -1640513 -1344628 -1514841 -1566771 -1438825
1008 -1438825 -1247569 -1332824 -1662582 -1583212 -1506674 -1226221 -1161452 -1326106 -1340097 -1444857
998 -1444857 -1324232 -1174952 -1148259 -1236656 -1359238 -1121883 -1283760 -1405876 -1468816 -1344084
988 -1344084 -1296945 -1558273 -1667077 -1425056 -1486655 -1213911 -1046268 -1229368 -1201655 -1157964
978 -1157964 -1180853 -1099649 -1034221 -984503 -873810 -893557 -1348204 -1299420 -1246365 -1200712 -1279124
967 -1279124 -1406313 -1399164 -1380661 -1106479 -1032853 -1252545 -1313646 -1382109 -1280978 -1169442 -1150254
956 -1150254 -1022331 -1257740 -1418440 -1363221 -1227676 -1155642 -1020976 -1130339 -1226963 -1292115
946 -1292115 -1134094 -906609 -999742 -1432213 -1522095 -1462789 -1584943 -1544737 -1578052 -1781091 -1678102
935 -1678102 -1380686 -1160430 -1132043 -1390506 -1465566 -1310550 -1106834 -1078362 -1143533 -1068401 -1192934
924 -1192934 -1113925 -1224595 -1052776 -1043054 -1234416 -1318116 -1140377 -1105661 -1184800 -1169759 -1040480
913 -1040480 -987260 -1142120 -1506416 -1553780 -1554814 -1241424 -1221087 -1096394 -1042658 -1071706 -1043443
902 -1043443 -1186385 -1096049 -1014069 -699603 -1005166 -1328487 -1197115 -1294207 -1100629 -964200
892 -964200 -1076089 -970646 -1124862 -1118476 -1281658 -1017454 -1114997 -1243393 -1098699 -1107761 -1186134
881 -1186134 -1364771 -1140659 -996706 -1103443 -1052606 -1503363 -1385880 -1286731 -1281828 -1347896 -1190913
870 -1190913 -1189034 -1264015 -1128121 -1215683 -1254674 -1424780 -1199994 -1429701 -1611465 -1425879 -1174169
859 -1174169 -1247521 -1088560 -1217935 -1581494 -1328869 -1229027 -1177965 -1274601 -1429962 -1467605 -1507773
848 -1507773 -1542292 -1523692 -1705169 -1564824 -1516442 -1344944 -1264273 -1429166 -1461896 -1492628 -1312625
837 -1312625 -1217352 -1141765 -1203266 -1351851 -1282943 -1257652 -1227857 -1259885 -1155022 -1193678 -1416895
826 -1416895 -1247442 -1319781 -1489204 -1465137 -1300475 -1647224 -1451883 -1528222 -1558325 -1348266
816 -1348266 -1288527 -1390529 -1287960 -1234665 -1329196 -1355517 -1530509 -1618787 -1541504 -1368036 -1290047
805 -1290047 -1283153 -1417448 -1372427 -1242797 -1548349 -1646979 -1558203 -1529765 -1093843 -1374231 -1326172
794 -1326172 -1257586 -1328820 -1711909 -1602611 -1520562 -1344344 -1307615 -1295020 -1140617 -1173484 -1222806
783 -1222806 -1057658 -1212708 -1065041 -1234456 -1149021 -1077961 -1339783 -1231861 -1018770 -1098776
773 -1098776 -1161737 -994370 -1381602 -1403378 -1488601 -1504230 -1551221 -1283368 -979315 -937046 -1398998
762 -1398998 -1712495 -1588114 -1316457 -1319048 -1166619 -1119593 -1080130 -1071617 -1418617 -1478366 -1585397
751 -1585397 -1521447 -1484525 -1774706 -1600314 -1538763 -1621735 -1455496 -1101818 -1305816 -1214234 -1182895
740 -1182895 -1436485 -1226494 -1168887 -1345109 -1211828 -935513 -1044595 -1183084 -999606 -880524
730 -880524 -1022381 -1338213 -1334705 -1374271 -1157005 -959654 -1181912 -1323392 -1226253 -1204062 -1151002
719 -1151002 -1374058 -1509703 -1217574 -1336869 -1104647 -1251103 -1127570 -989743 -1201076 -986743
709 -986743 -1176480 -898687 -1029382 -1263274 -1246222 -1517096 -1463994 -1232112 -1407595 -1619277
699 -1619277 -1294000 -1240484 -1299022 -1273244 -1277506 -1123791 -1346040 -1216867 -1063655 -1164713 -1396303
688 -1396303 -1385027 -1354068 -1344794 -1192065 -1387823 -1310961 -1275046 -1255418 -1223338 -1279754 -1515808
677 -1515808 -1427153 -1324460 -1385637 -1464704 -1273508 -1234634 -1248452 -1525753 -1647421 -1245257 -1254605
666 -1254605 -1515458 -1241438 -1220980 -958519 -1000084 -1243802 -1392414 -1246191 -1282529 -1317446
656 -1317446 -1244183 -1480166 -1326705 -1523881 -1551395 -1278503 -967614 -1298721 -1250726 -1151813
646 -1151813 -1207620 -975520 -804978 -910473 -1213391 -1453190 -1551345 -1411335 -1427622 -1337727
636 -1337727 -1398472 -1284339 -1174426 -1138180 -1263112 -1026145 -844907 -1457103 -1594293 -1356221
626 -1356221 -1310508 -1386150 -1348040 -1358917 -1634251 -1356078 -1046059 -1102169 -950564 -1175825 -1454431
615 -1454431 -1355396 -1263129 -1123394 -1379580 -1304020 -1185125 -1391372 -1426567 -1258417 -1295026 -1436771
604 -1436771 -1223882 -1274435 -1424797 -1430246 -1238124 -1328254 -1105450 -1155319 -1395313 -1473945 -1402325
593 -1402325 -1531469 -1520400 -1140669 -1461561 -1521659 -1366604 -1553471 -1507011 -1193619 -1157866
583 -1157866 -1234309 -1597173 -1684326 -1313373 -1390491 -1270674 -1225282 -1088216 -1259649 -1447052
573 -1447052 -1253600 -1301931 -1155145 -991884 -1081990 -1422627 -1352951 -1455313 -1646516 -1510967
563 -1510967 -1523877 -1492589 -1436656 -1351279 -1475696 -1354376 -1116666 -1134631 -1218037 -990832 -966283
552 -966283 -992821 -852053 -905785 -916099 -1035731 -1290410 -1339876 -1330433 -1309264 -1338673 -1503734
541 -1503734 -1465037 -1201394 -1054545 -1194579 -1063540 -1125942 -1415219 -1342693 -1023962 -1065846
531 -1065846 -1093210 -1255478 -1547183 -1532638 -1393621 -1547293 -1627120 -1111985 -952264 -1095140
521 -1095140 -1283338 -1375297 -1381146 -1405284 -1448893 -1408830 -1278226 -1308132 -1261233 -1189375 -1294769
510 -1294769 -1512311 -1367889 -968943 -1148584 -1161174 -1068042 -1127616 -1290994 -1542188 -1319525
500 -1319525 -1276333 -1417516 -1434197 -1466977 -1319787 -1322217 -1440326 -1464528 -1383265 -1184431 -1446571
489 -1446571 -1478102 -1412290 -1430148 -1359584 -1282502 -1481081 -1219451 -1096227 -1175043 -1460064 -1446900
478 -1446900 -1376429 -1274974 -1264907 -1247581 -1173513 -1161671 -1143746 -1198073 -1228459 -1344092 -981153
467 -981153 -1136613 -1306585 -1598090 -1675816 -1461986 -1513200 -1365436 -1307766 -1323016 -1253955 -1236214
456 -1236214 -1284023 -1220048 -1305251 -1483213 -1300517 -1385953 -1159759 -1227430 -1149780 -1109381 -1189941
445 -1189941 -1310090 -1398293 -1350722 -1362530 -1395115 -1416791 -1563642 -1404080 -1540362 -1604632 -1667599
434 -1667599 -1722488 -1284444 -1163315 -1362512 -1270968 -1349187 -1292234 -1080365 -1247226 -1241726 -1328055
423 -1328055 -1312013 -1495668 -1364356 -1116210 -1287709 -1164294 -1180852 -1230147 -1195227 -1029386
413 -1029386 -1026035 -1277706 -1048800 -1244893 -1353396 -1027178 -981794 -1014928 -1096104 -1309334 -1094800
402 -1094800 -945580 -929748 -1008964 -1211098 -1136992 -1010728 -1174409 -1190177 -1330503 -1423003 -1195956
391 -1195956 -1074401 -1172958 -840390 -983785 -1248355 -1220989 -1275367 -1387845 -1315709 -1041426
381 -1041426 -939453 -1383371 -1501188 -1377243 -1646068 -1185927 -1188217 -1259652 -1252500 -1427958 -1381532
370 -1381532 -1536064 -1441521 -1229026 -1090051 -1317331 -1508196 -1314102 -1128246 -1124447 -1323845
360 -1323845 -1183281 -1298088 -1249087 -1126682 -1185069 -1208326 -1022658 -1027056 -1181966 -1105525 -905515
349 -905515 -1075232 -1261242 -1118329 -1147511 -1174839 -1162542 -1268413 -1004916 -1109753 -1179061 -1207033
338 -1207033 -1511078 -1200593 -1378893 -1418652 -1460826 -1022914 -1177939 -1165928 -1374312 -1440992
328 -1440992 -1221252 -1104592 -1403146 -1410647 -1495291 -1306751 -1111817 -1313079 -1255095 -1326006 -984894
317 -984894 -1171060 -1294047 -1581674 -1435684 -1167173 -1294817 -1550061 -1443160 -1185589 -1288528
307 -1288528 -1277472 -978175 -1178193 -1254116 -1444840 -1359580 -1456891 -886877 -747918 -1149646
297 -1149646 -1047546 -1205871 -1463673 -1371655 -1253841 -1498967 -1421736 -1166243 -1145773 -1124850
287 -1124850 -986103 -1012553 -877298 -775961 -919407 -1045389 -1436783 -1334187 -1279594 -1299010
277 -1299010 -1250263 -1256946 -1231397 -1426358 -1148088 -972741 -910495 -1175404 -1429503 -1305179 -890991
266 -890991 -788190 -947097 -1117191 -992761 -929718 -1274204 -1392545 -1485659 -1300138 -1434614
256 -1434614 -1571563 -1359516 -1151915 -1181829 -1435449 -1693704 -1530394 -1302405 -1154381 -1221243
246 -1221243 -1350452 -1311870 -1170877 -1134236 -1373694 -1320136 -1425870 -1402585 -1528930 -1434849 -1328770
235 -1328770 -1365414 -1214202 -1033893 -1214174 -1219682 -1191730 -1191558 -1218736 -1195378 -1231066 -1443188
224 -1443188 -1496532 -1225148 -1098336 -1364941 -1370334 -1458184 -1422984 -1607956 -1567976 -1168483 -1218043
213 -1218043 -970380 -1066791 -1238435 -1294946 -1283516 -1307110 -1394840 -1291457 -1414892 -1569272 -1667253
202 -1667253 -1538423 -1671303 -1629471 -1501816 -1346082 -1406597 -1588426 -1368242 -1525080 -1766900
192 -1766900 -1367030 -1229790 -1349656 -1467109 -1186218 -1111589 -1046809 -1180427 -1073088 -1112685
182 -1112685 -1355426 -1104184 -1086777 -1142345 -963188 -1112139 -1219878 -1064604 -1064944 -1077704 -1141676
171 -1141676 -1215504 -1398162 -1153138 -1240724 -1280668 -1428462 -1452471 -1381617 -1269244 -1431725 -1491525
160 -1491525 -1392278 -1333101 -1334368 -1386795 -1348519 -1280169 -1308053 -1321283 -1198285 -1271531 -1371592
149 -1371592 -1437586 -1170738 -1264398 -1489598 -1400751 -1502541 -1469233 -1554533 -1473584 -1321253 -1270630
138 -1270630 -1249863 -1281704 -1397219 -1371058 -1368194 -1380746 -1338691 -1250385 -1254943 -1383028 -1288582 -1265225
126 -1265225 -1062699 -1163109 -1149864 -941185 -910394 -1229665 -1298149 -1291825 -1372295 -1189967 -1162008
115 -1162008 -1379885 -1393118 -1504766 -1601428 -1571554 -1411645 -1445489 -1669131 -1708384 -1594636 -1523456
$$ [...]
##END NTUPLES=NMR SPECTRUM
##END=
