##TITLE=1H_DE-80H_X3
 200.13MHz, d2o
 8 sc
 
 19ns.26.2.2025
##JCAMPDX= 6.0         $$ Bruker NMR JCAMP-DX V2.0
##DATA TYPE= NMR SPECTRUM
##DATA CLASS= NTUPLES
##ORIGIN= UXNMR, Bruker Analytische Messtechnik GmbH
##OWNER= pz
$$ XWIN-NMR		Version 3.5
$$ Tue Mar 24 13:50:43 2026 Russian Standard Time (UT+4h)  Yarkov@DPX200
##.OBSERVE FREQUENCY= 200.1313
##.OBSERVE NUCLEUS= ^1H
##.ACQUISITION MODE= SIMULTANEOUS
##.ACQUISITION SCHEME= undefined
##.AVERAGES= 8
##.DIGITISER RES= 18
##SPECTROMETER/DATA SYSTEM= spect
##.PULSE SEQUENCE= zg30
##.SOLVENT NAME= CDCl3
##.SHIFT REFERENCE= (INTERNAL, CDCl3, 0, 15.4219)
##AUDIT TRAIL= $$ (NUMBER, WHEN, WHO, WHERE, WHAT)
$$ ##TITLE= Audit trail, XWIN-NMR		Version 3.5
$$ ##JCAMPDX= 5.01
$$ ##ORIGIN= Bruker BioSpin GmbH
$$ ##OWNER= Yarkov
$$ C:/Bruker/XWIN-NMR/data/yarkov2/nmr/H-C/1/pdata/1/auditp.txt
$$ ##AUDIT TRAIL=  $$ (NUMBER, WHEN, WHO, WHERE, WHAT)
(   1,<2026-03-24 13:49:47.23 +0400>,<Yarkov>,<DPX200>,
      <created by zg, POWCHK disabled, PULCHK disabled
       configuration hash MD5:
       00 E9 B6 7A A2 85 ED C7 34 08 36 98 17 FE 4E 26
       data hash MD5: 16K
       7C 5A C1 B6 DE E9 B8 B4 9A 9B 17 BF A5 D2 38 A1>)
(   2,<2026-03-24 13:49:53.76 +0400>,<Yarkov>,<DPX200>,
      <Start of raw data processing
       efp BC_mod = 2 LB = 0.25 FT_mod = 6 PKNL = 1 PHC0 = -5299.148 PHC1 = 6.821927 SI = 16K 
       data hash MD5: 16K
       06 26 73 7A 39 93 3B 44 56 39 A1 CB C8 15 CD 08>)
(   3,<2026-03-24 13:49:58.26 +0400>,<Yarkov>,<DPX200>,
      <abs ABSG = 5 
       data hash MD5: 16K
       1D 38 98 91 E9 5E 45 FE 89 16 84 84 EC 79 F8 26>)
$$ ##END=
$$ 
$$ hash MD5
$$ CB EC ED AC A9 53 2D 17 31 52 EA 7D 85 D7 D9 C0
##$RELAX= 
##$RELAX= 
##$RELAX= 
##$RELAX= 
##$RELAX= 
##$RELAX= 
$$ Bruker specific parameters
$$ --------------------------
##$DU= <C:/Bruker/XWIN-NMR>
##$EXPNO= 1
##$NAME= <H-C>
##$PROCNO= 1
##$TYPE= <nmr>
##$USER= <yarkov2>
##$AMP= (0..31)
100 100 100 100 100 100 100 100 100 100 100 100 100 100 100 100 100 100 
100 100 100 100 100 100 100 100 100 100 100 100 100 100 
##$AQSEQ= 0
##$AQ_mod= 1
##$AUNM= <au_zg>
##$AUTOPOS= <>
##$BF1= 200.13
##$BF2= 200.13
##$BF3= 200.13
##$BF4= 200.13
##$BF5= 200.13
##$BF6= 200.13
##$BF7= 200.13
##$BF8= 200.13
##$BYTORDA= 1
##$CFDGTYP= 0
##$CFRGTYP= 5
##$CHEMSTR= <none>
##$CNST= (0..31)
1 1 145 1 1 1 1 1 1 1 1 1 1 1 1 1 1 1 1 1 1 1 1 1 1 1 1 1 1 1 1 1 
##$CPDPRG= <>
##$CPDPRG1= <>
##$CPDPRG2= <>
##$CPDPRG3= <>
##$CPDPRG4= <mlev>
##$CPDPRG5= <mlev>
##$CPDPRG6= <mlev>
##$CPDPRG7= <mlev>
##$CPDPRG8= <mlev>
##$CPDPRGB= <>
##$CPDPRGT= <>
##$D= (0..31)
0 0.7 0 0 0 0 0 0 0 0 0 0.03 0 0 0 0 0 0 0 0 0 0 0 0 0 0 0 0 0 0 0 0 
##$DATE= 1774345786
##$DBL= (0..7)
120 120 120 120 120 120 120 120 
##$DBP= (0..7)
150 150 150 150 150 150 150 150 
##$DBP07= 0
##$DBPNAM0= <>
##$DBPNAM1= <>
##$DBPNAM2= <>
##$DBPNAM3= <>
##$DBPNAM4= <>
##$DBPNAM5= <>
##$DBPNAM6= <>
##$DBPNAM7= <>
##$DBPOAL= (0..7)
0.5 0.5 0.5 0.5 0.5 0.5 0.5 0.5 
##$DBPOFFS= (0..7)
0 0 0 0 0 0 0 0 
##$DE= 6
$$ [...]
##$SUBNAM3= <"">
##$SUBNAM4= <"">
##$SUBNAM5= <"">
##$SUBNAM6= <"">
##$SUBNAM7= <"">
##$SUBNAM8= <"">
##$SUBNAM9= <"">
##$SW= 18.0517328524113
##$SWIBOX= (0..15)
0 0 2 0 0 0 0 0 0 0 0 0 0 0 0 0 
##$SW_h= 3612.71676300578
##$TD= 16384
##$TD0= 1
##$TE= 0
##$TE2= 300
##$TE3= 300
##$TEG= 300
##$TL= (0..7)
0 120 120 120 120 120 120 120 
##$TP= (0..7)
150 150 150 150 150 150 150 150 
##$TP07= 0
##$TPNAME0= <>
##$TPNAME1= <>
##$TPNAME2= <>
##$TPNAME3= <>
##$TPNAME4= <>
##$TPNAME5= <>
##$TPNAME6= <>
##$TPNAME7= <>
##$TPOAL= (0..7)
0.5 0.5 0.5 0.5 0.5 0.5 0.5 0.5 
##$TPOFFS= (0..7)
0 0 0 0 0 0 0 0 
##$TUNHIN= 0
##$TUNHOUT= 0
##$TUNXOUT= 0
##$USERA1= <user>
##$USERA2= <user>
##$USERA3= <user>
##$USERA4= <user>
##$USERA5= <user>
##$V9= 5
##$VALIST= <valist>
##$VCLIST= <CCCCCCCCCCCCCCC>
##$VD= 0
##$VDLIST= <DDDDDDDDDDDDDDD>
##$VPLIST= <PPPPPPPPPPPPPPP>
##$VTLIST= <TTTTTTTTTTTTTTT>
##$WBST= 1024
##$WBSW= 4
##$XGAIN= (0..3)
0 0 0 0 
##$XL= 0
##$YL= 0
##$YMAX_a= 600664
##$YMIN_a= -544765
##$ZGOPTNS= <>
##$ZL1= 120
##$ZL2= 120
##$ZL3= 120
##$ZL4= 120
##$ABSF1= 15.4461
##$ABSF2= -2.605749
##$ABSG= 5
##$ABSL= 3
##$ALPHA= 0
##$AQORDER= 0
##$ASSFAC= 0
##$ASSFACI= 0
##$ASSFACX= 0
##$ASSWID= 0
##$AUNMP= <proc_1d>
##$AZFE= 0.1
##$AZFW= 0.1
##$BCFW= 0
##$BC_mod= 2
##$BYTORDP= 0
##$COROFFS= 0
##$CY= -3
##$DATMOD= 1
##$DC= 0
##$DFILT= <>
##$DTYPP= 0
##$F1P= 0
##$F2P= 0
##$FCOR= 1
##$FTSIZE= 16384
##$FT_mod= 6
##$GAMMA= 0
##$GB= 0
##$INTBC= 1
##$INTSCL= 3.241238e-09
##$ISEN= 128
##$LB= 0.25
##$LEV0= 0
##$LPBIN= 0
##$MAXI= 10000
##$MC2= 0
##$MEAN= 0
##$ME_mod= 0
##$MI= 1.114404
##$NCOEF= 0
##$NC_proc= -6
##$NLEV= 6
##$NOISF1= 3.799351
##$NOISF2= 2.8
##$NSP= 0
##$NTH_PI= 0
##$NZP= 0
##$OFFSET= 15.42186
##$PC= 1
##$PHC0= -5299.148
##$PHC1= 6.821927
##$PH_mod= 1
##$PKNL= yes
##$PPARMOD= 0
##$PSCAL= 0
##$PSIGN= 0
##$REVERSE= no
##$SF= 200.13001998256
##$SI= 16384
##$SIGF1= 3
##$SIGF2= 2
##$SINO= 0.751879
##$SIOLD= 32768
##$SREGLST= <19F.Aceton>
##$SSB= 0
##$STSI= 16384
##$STSR= 0
##$SW_p= 3612.71676300578
##$SYMM= 0
##$S_DEV= 0
##$TDeff= 16384
##$TDoff= 0
##$TI= <>
##$TILT= no
##$TM1= 0
##$TM2= 0
##$TOPLEV= 0
##$USERP1= <user>
##$USERP2= <user>
##$USERP3= <user>
##$USERP4= <user>
##$USERP5= <user>
##$WDW= 1
##$XDIM= 16384
##$YMAX_p= 275496618
##$YMIN_p= -495577
$$ End of Bruker specific parameters
$$ ---------------------------------
##NTUPLES= NMR SPECTRUM
##VAR_NAME=  FREQUENCY,     SPECTRUM/REAL,   SPECTRUM/IMAG
##SYMBOL=    X,             R,               I
##VAR_TYPE=  INDEPENDENT,   DEPENDENT,       DEPENDENT
##VAR_FORM=  AFFN,          ASDF,            ASDF
##VAR_DIM=   16384,         16384,           16384
##UNITS=     HZ,            ARBITRARY UNITS, ARBITRARY UNITS
##FACTOR=    0.220516191357247, 1,           1
##FIRST=     3086.37709817678, 0,            0
##LAST=      -526.339664828998, 0,           0
##MIN=       -526.339664828998, -495577,     0
##MAX=       3086.37709817678, 275496618,    0
$$ Real data points
##PAGE= N=1
##DATA TABLE= (X++(R..R)), XYDATA
$$ [...]
5937A3731447N28624M80592M36282K73628L65824L79874K62896K38000J85651
5928A6882818K07057J54245P6471P9607P5896Q9039K06986J28445J33701J73584
5918A8207849J03777K11386K47020J56553K24045J88039J50027J34518J02054
5909A9725268J41582J53826Q7883J56848K70386K79651K55884K47081K48042K88822
5899B1855273L19405M28281M37031L24768J56957K69598J74467J22418J11520
5890B4199718P2649P7107M0343J709l6141l9149j87549p4825j07298j48896r8361
5879B3699307M9026l1737J930m7862p7536j55753j12630j14515j47235r1887j42761
5868B2828347j54544k39499k72505k25677k98211k44602l52390l44553l74552
$$ y = [13731447, 14260071, 14740663, 15176945, 15450573, 15816397, 16196271, 16459167, 16697167, 16882818, 17089875, 17244120, 17320591, 17400198, 17476094, 17565133, 17772119, 17900564, 18034265, 18207849, 18311626, 18523012, 18770032, 18926585, 19150630, 19338669, 19488696, 19623214, 19725268, 19866850, 20020676, 20108559, 20265407, 20535793, 20815444, 21071328, 21318409, 21566451, 21855273, 22174678, 22602959, 23039990, 23364758, 23521715, 23791313, 23965780, 24088198, 24199718, 24272367, 24349474, 24389817, 24391526, 24355385, 24316236, 24128687, 24053862, 23946564, 23797668, 23699307, 23748333, 23716596, 23718526, 23670664, 23593128, 23437375, 23324745, 23210230, 23062995, 22971108, 22828347, 22673803, 22434304, 22161799, 21936122, 21637911, 21393309, 21040919, 20696366, 20321814]
5859B0321814m28421m47049m58985m17031m48130m30619m48356m25729l88580
5850A6428914m07975m48844m14728k78121k79181l54383k58443k93000l87350
5841A3306889k87677l47898m22865l80697m44154m23683k93585m35209m99823
5832I771298m76839m40179m29381l83803m06792l75088k65159k77243k93270k83456
5822F140088k69108k85495k52431j57601j59974j53462k04239k42065j95028k13787
5812D006898j17009j57161j22653j64348j56716j92995j52319j55334j69654j70926
5802B447783p2969m7947j30595j06414r8969j10708p7222j12977J2733n1780j45580
5791A505355J3793k2976n0495m4850K601j2134p3552N6533K5829J8000j4772j02954
$$ y = [20321814, 19893393, 19446344, 18987359, 18570328, 18122198, 17691579, 17243223, 16817494, 16428914, 16020939, 15572095, 15157367, 14879246, 14600065, 14245682, 13987239, 13694239, 13306889, 13019212, 12671314, 12248449, 11867752, 11423598, 10999915, 10706330, 10271121, 9771298, 9294459, 8854280, 8424899, 8041096, 7634304, 7259216, 6994057, 6716814, 6423544, 6140088, 5870980, 5585485, 5333054, 5175453, 5015479, 4862017, 4657778, 4415713, 4220685, 4006898, 3889889, 3732728, 3610075, 3445727, 3289011, 3096016, 2943697, 2788363, 2618709, 2447783, 2374814, 2326867, 2196272, 2089858, 1990889, 1880181, 1802959, 1689982, 1702715, 1650935, 1505355, 1519148, 1496172, 1445677, 1400827, 1403428, 1391294, 1317742, 1374275, 1400104, 1418104, 1403332, 1300378]
5779A300378j867k8204K7083L454j23920o6711N7825L3517L148L4840K531o3448
5767A178626L4679k3228L4022m2939m9608l5931n9663k0769N2469K6958K4779
5756A119395Q104l6260J1152J3935M7027p8246L9051l0425R867k3594J9268j7392
5744A081882J542k3741k882N8999m8126o7723O7619K8868l0656l9266j1395K9789
5732A044910L2680J5368o9981M8371K3850l129l9407j576k526M285L9857L3554
5720A126256o4592M615J4949M8701N4820L3350k8733m3088n347K6139K6698m9143
5708A144625O9803K2755o0763l4868l2877L5839l7925j1223J8821n6793k6119
5697A031275n3621o850O631K5403K0375M7965k6648J4036P6654q9291n6517j291
$$ y = [1300378, 1298511, 1270307, 1297390, 1300844, 1176924, 1110213, 1168038, 1201555, 1204703, 1239543, 1242074, 1178626, 1213305, 1190077, 1224099, 1181160, 1131552, 1095621, 1035958, 1015189, 1067658, 1094616, 1119395, 1127499, 1091239, 1102391, 1116326, 1163353, 1085107, 1124158, 1093733, 1103600, 1080006, 1099274, 1081882, 1083424, 1059683, 1056801, 1115800, 1067674, 999951, 1067570, 1096438, 1065782, 1026516, 1015121, 1044910, 1077590, 1092958, 1022977, 1071348, 1095198, 1092069, 1052662, 1051086, 1048560, 1052845, 1092702, 1126256, 1061664, 1066279, 1081228, 1129929, 1184749, 1218099, 1189366, 1146278, 1140931, 1167070, 1193768, 1144625, 1214428, 1237183, 1176420, 1141552, 1108675, 1144514, 1106589, 1095366, 1114187, 1057394, 1031275, 977654, 970804, 977435, 1002838, 1023213, 1071178, 1044530, 1058566, 1135220, 1045929, 989412, 988121]
5685I88121k2055O992l192O63l801n4950n4458J9657p3067K4671o2815K2236J3769
5672H01771l886O389m865J5595m2225J7025l5604q3124k3019J312K9789m7101
5660F32057r4306J06010m775N5285K1029j7087n0752j7080K7790P9139N4163l0498
5648G60975m4843M871j2565k2318M2318J265J2048L0311k313j3076l6076j1804
5636G08793K8895K8800j08144j2855L1004J3072m2233n8038K0727N15L2631J7946
5624F61113m9409K4411N545q9071K5662k4788K5888N1977k0916l4950r8771J6666
5612D93357M1211o2105N8505k2552l9297K9779n755O742o147K3466O6711j8229
5600E65686Q054o6139O105K5195j6447O2378J3079j4583m6448M8141L5787k3126
$$ y = [988121, 966066, 973058, 969866, 970529, 966728, 911778, 857320, 876977, 803910, 828581, 765766, 788002, 801771, 797885, 804274, 799409, 815004, 772779, 789804, 754200, 671076, 648057, 649369, 679158, 632057, 537751, 643761, 638986, 694271, 715300, 698213, 647461, 630381, 658171, 737310, 791473, 760975, 716132, 721003, 708438, 686120, 728438, 729703, 741751, 772062, 769749, 756673, 720597, 708793, 737688, 766488, 658344, 645489, 676493, 689565, 647332, 589294, 610021, 610536, 643167, 661113, 611704, 636115, 641660, 552589, 578251, 553463, 579351, 631328, 610412, 575462, 476691, 493357, 534568, 472463, 530968, 508416, 469119, 498898, 493143, 499885, 493738, 517204, 583915, 565686, 573740, 507601, 513706, 538901, 522454, 584832, 597911, 583328, 536880, 585021, 620808, 597682]
5588E97682R6576m5619k6993R8260J8838K7941n4251J1126L9398K1035r525J4274
5576G88742k3804j1455l7130N0O8950M7528j1717l3784M846k8950k255j9918L5988
5563G77091O043o5804k7105l2889R802M6536k5299o3293k1921J4623j5895K8059
5551F29948L7384L151Q958m1620M4603n866O5373R7805k9201l6425J5105k9875
5539G59340n1548r33Q775j0645J7002n6283L8740K2329l4771L3001k0220K5119
5527G29906k2700p760O941p822n4965M69L6144M9155p0927m3124N8581N7773P705
5514G39376K3241o762N4609k200J0397L7490q815l0759M449J21317J5628j04144
5502H53827J9709M6114n457o478m5317R880P7851l4676k5354j7371M9871R2l6996
$$ y = [597682, 694258, 648639, 621646, 719906, 738744, 766685, 712434, 723560, 762958, 783993, 774468, 788742, 764938, 753483, 716353, 716403, 785353, 832881, 821164, 787380, 792226, 763276, 761021, 741103, 777091, 783134, 717330, 690225, 657336, 667138, 713674, 688375, 625082, 603161, 617784, 601889, 629948, 667332, 670483, 679441, 637821, 682424, 676558, 741931, 839736, 810535, 774110, 789215, 759340, 707792, 706859, 715634, 704989, 721991, 665708, 704448, 726777, 692006, 725007, 704787, 729906, 707206, 699446, 706387, 698565, 643600, 644069, 680213, 729368, 658441, 615317, 673898, 731671, 739376, 762617, 755855, 810464, 808264, 818661, 856151, 847336, 816577, 821026, 942343, 957971, 853827, 873536, 919650, 914193, 907715, 862398, 872278, 950129, 915453, 890099, 872728, 922599, 922691, 885695]
5489H85695M2706l4032J6143J0933j30496K2923P6130l4903p1975J5618q144o2066
5477G28532L1717o753L6719l9996p2829K0179J9055j3417m941m0660M0996M8408
5465G47010l8169k0660J469j276P8471L4348L3678k152K3302J1995m3467k4051
5453H00498M9647m5641K3944k278L9738R321j7909o3950m7900N0802N0892K5015
5441H72179k8687m1662J1517m027j2621J0797l8174p420q105n023j28130J2968
5429F33612J183n0111o0370P44k8140L6546n0800n0854N8827k817k8526k5600
5417D33694J7593k3747K1198M2652N208j5136n6599J7829J418Q171N9824Q6o545
5404E05646o1235K8104L5028N4579r718M9925R676l9096N6328n6036j2149L70
$$ y = [885695, 928401, 894369, 910512, 921445, 790949, 813872, 890002, 855099, 783124, 798742, 790598, 728532, 760249, 753496, 790215, 750219, 677390, 697569, 716624, 703207, 698266, 657606, 698602, 747010, 708841, 688181, 689650, 688374, 766845, 801193, 834871, 832719, 856021, 868016, 824549, 800498, 850145, 804504, 828448, 826170, 865908, 875229, 857320, 793370, 745470, 796272, 847164, 872179, 843492, 801830, 813347, 809320, 796699, 807496, 769322, 761902, 753797, 748774, 620644, 633612, 634795, 584684, 524314, 525058, 496918, 533464, 482664, 431810, 490637, 487820, 459294, 433694, 451287, 427540, 448738, 491390, 496598, 481462, 424863, 442692, 444110, 452281, 512105, 512191, 505646, 444411, 472515, 507543, 562122, 552404, 602329, 612005, 572909, 629237, 573201, 561052, 561422]
5392E61422N0377R0773j7664l6877K2103N2269l3825R816O6285k4141L782M3850
5380G88170L0136L9380J7436N3765O412l9430L3909Q449M5056j6511k450j2387
5368I51935k5477J7198K6839M8934L8058p301J03755N844m5836M0965n6008o3320
5356A035586L6693k2956J2977P6700o1994K3883M6413l7047K644K3084o3611q612
5344A063760k0526L6679O2179k452r141m0218k4956M9801J0721J5061M611M243
5332A149762p5183n1164l4284K9034N6089N7257n094n4292K0961J0387l9000l66
5320A064107N57m2418m943O9188K4660m55L3802l0758O0449P2467j1323L6658
5308A271991M124L8078j0244N3579K2884q0132M7322Q0737P9165K0950n890M5795
$$ y = [561422, 611799, 702572, 684908, 648031, 670134, 722403, 688578, 698394, 764679, 740538, 744320, 788170, 818306, 857686, 875122, 928887, 935299, 895869, 929778, 938227, 983283, 966772, 964322, 951935, 926458, 943656, 970495, 1019429, 1057487, 1050186, 1153941, 1159785, 1113949, 1154914, 1098906, 1035586, 1072279, 1049323, 1062300, 1139000, 1077006, 1100889, 1147302, 1110255, 1112899, 1135983, 1072372, 1063760, 1043234, 1079913, 1142092, 1139640, 1130499, 1090281, 1065325, 1115126, 1125847, 1140908, 1145519, 1149762, 1074579, 1023415, 989131, 1018165, 1074254, 1131511, 1126417, 1072125, 1093086, 1103473, 1064473, 1064107, 1064664, 1022246, 1017303, 1086491, 1111151, 1110696, 1144498, 1113740, 1174189, 1246656, 1235333, 1271991, 1276115, 1314193, 1303949, 1357528, 1380412, 1300280, 1347602, 1428339, 1507504, 1528454, 1522564, 1568359]
5296A568359O765M7264P1594N0843J21677Q5891P4602J23484J38872J61726J97911
5285B648988R6401J98974K04559L24857L28220L45911L64581M25600M09682M37381
5275E785154M57407M60934M43404M94515M19440N14237N58218N42216O44385N98373
5265A0918283O11197P43852O83574O75403P72325P33663P17765P11490O25553
5256A7193105O70980N68325N42390M72511M18905M27977M94226N45520M04611
5247B1738550M73227M46802N28348L54416J90313J43294J73107J11410m4363r5207
5237B4019897n4201j03012k16082k88180k87594m60161m26994m48952m91538l82611
5227B0860572l88026m52130n03525m34250m96062o31620o45963o71641p33029
$$ y = [1568359, 1575124, 1622388, 1693982, 1744825, 1866502, 1952393, 2026995, 2150479, 2289351, 2451077, 2648988, 2745389, 2944363, 3148922, 3473779, 3801999, 4147910, 4512491, 4938091, 5347773, 5785154, 6242561, 6703495, 7146899, 7641414, 8060854, 8575091, 9133309, 9675525, 10319910, 10918283, 11529480, 12273332, 12956906, 13632309, 14404634, 15138297, 15856062, 16567552, 17193105, 17864085, 18432410, 18974800, 19447311, 19866216, 20294193, 20788419, 21333939, 21738550, 22211777, 22658579, 23186927, 23541343, 23731656, 23874950, 24048057, 24159467, 24115104, 24019897, 23965696, 23862684, 23646602, 23358422, 23070828, 22610667, 22183673, 21734721, 21243183, 20860572, 20472546, 20020416, 19516891, 19082641, 18586579, 17954959, 17308996, 16637355, 15904326]
5218A5904326p50304p30956p12242p36308o70569o91781o82086n35021n93607
5209I801452n65786n35476n50896n26774m60303m74386l64232l40239l85872m81769
5199E115719l84797l84623l90689l42021k11437j93874k78274k44890j57221j21055
5189B406838o5332j35465j04958l3080j40958q3430o6534o6155N168j5271l3700
5178A667123j9655j8868O6692l1337l9661k5974L3679M362j8030j1152J7126J7909
5166A642214l4997m959K6651J2121n7494j0781j0883L8205Q1782o578N6985N544
5154A737810o2983J0523O0621k2329k7424K2394p9191j9284O082K090n8236j2221
5142A557852R8465J721q5942p1582K7702j6683K033n4060k403l3407N0126M0579
$$ y = [15904326, 15154022, 14423066, 13710824, 12974516, 12303947, 11612166, 10930080, 10395059, 9801452, 9235666, 8700190, 8149294, 7622520, 7162217, 6687831, 6323599, 5983360, 5597488, 5115719, 4730922, 4346299, 3955610, 3613589, 3402152, 3208278, 2930004, 2685114, 2527893, 2406838, 2341506, 2206041, 2101083, 2068003, 1927045, 1843615, 1777081, 1710926, 1716094, 1700823, 1667123, 1647468, 1628600, 1695292, 1663955, 1624294, 1598320, 1631999, 1636361, 1618331, 1607179, 1624305, 1642214, 1607217, 1602258, 1628909, 1641030, 1583536, 1572755, 1561872, 1600077, 1681859, 1675281, 1732266, 1737810, 1674827, 1685350, 1745971, 1723642, 1696218, 1718612, 1639421, 1620137, 1626219, 1628309, 1570073, 1557852, 1656317, 1658038, 1572096, 1500514, 1528216, 1511533, 1513566, 1459506, 1457103, 1423696, 1473822, 1514401]
5130A514401l8562P410l8504M0944K0808o5515O2989J6940j4875N6644P705K8755
5118A599140N2084m0959k3183K5917O046n707J8032p3179L2825Q5470R624M51
5106A686561J00468j359k0989k6630J6927R6217M4957j7451k0693K926j729p8178
5094A781027J1158k8535K1111M8524J1738J9982m679K0098n2002J4034K7391o42
5082A869205K9610L9798o8868J10178N7735L4655o504L4285J5539j1676J4684
5071B118641K8756M2188M2795n0378K2802O0521k4376j6078J0457n7782K2733
5060B200279j3966l3005l2408p3898J09297Q29l2994Q6824p5655l1081N588L5536
5048B145346J8093N5824o5816n9882M4347L4756o059l8417m1535q224m621L4851
$$ y = [1514401, 1475839, 1483249, 1444745, 1485689, 1506497, 1440982, 1503971, 1520911, 1506036, 1562680, 1570385, 1599140, 1651224, 1610265, 1587082, 1612999, 1619045, 1613338, 1631370, 1558191, 1591016, 1676486, 1686110, 1686561, 1787029, 1785670, 1764681, 1738051, 1754978, 1851195, 1896152, 1878701, 1858008, 1860934, 1859205, 1781027, 1792185, 1763650, 1784761, 1833285, 1845023, 1865005, 1860326, 1880424, 1828422, 1842456, 1869847, 1869205, 1898815, 1938613, 1869745, 1979923, 2037658, 2072313, 2065809, 2100094, 2115633, 2103957, 2118641, 2147397, 2189585, 2232380, 2182002, 2204804, 2265325, 2240949, 2224871, 2235328, 2177546, 2200279, 2186313, 2153308, 2120900, 2047002, 2156299, 2157128, 2124134, 2210958, 2135303, 2104222, 2109810, 2145346, 2163439, 2219263, 2153447, 2093565, 2137912, 2172668, 2166609, 2128192, 2086657, 2078433, 2073812, 2108663]
5036B108663J2387n7362k4870l9179J9832k4388k0497n4666q00m7709L8438L1145
5024A940994K0435L553k6191K0364N889k3786r671K2076J09471k0380l3580K1601
5012B030775Q95P049r5066l6306Q310M1776K8963N0327n769m3170j0144O210L8552
4999B022402l1650M2744N2835K2070k3906K4458k1769m9263J50592P0204n396
4988B253321m2709K0340M1651O8387k2018M5006R2618L1326Q4179Q2682p0963
4977B583820M9280J55662O3384K1783N6952J05424J00722J11115Q9456J22060
4967C459658P9071O4570J09172J88134J46374J54157P7371Q1621J22268R3005
4957D575401J53242J05519J33822J93642J62422J21999J59598R2173J55689K40698
$$ y = [2108663, 2121050, 2063688, 2038818, 1999639, 2019471, 1995083, 1974586, 1919920, 1919120, 1871411, 1909849, 1940994, 1961429, 1964982, 1938791, 1959155, 1965044, 1941258, 1931587, 1953663, 2063134, 2042754, 2009174, 2030775, 2031670, 2038719, 1943653, 1907347, 1915657, 1957433, 1986396, 2036723, 2030954, 1987784, 1977640, 1983850, 2022402, 1990752, 2033496, 2086331, 2108401, 2084495, 2108953, 2087184, 2037921, 2188513, 2258717, 2253321, 2210612, 2230952, 2272603, 2340990, 2318972, 2363978, 2456596, 2487922, 2572101, 2654783, 2583820, 2633100, 2788762, 2852146, 2873929, 2930881, 3036305, 3137027, 3248142, 3337598, 3459658, 3538729, 3603299, 3712471, 3900605, 4046979, 4201136, 4278507, 4360128, 4482396, 4575401, 4728643, 4834162, 4967984, 5161626, 5324048, 5446047, 5605645, 5697818, 5853507, 6094205]
4947F094205J27034K81615K28429K81337K16729J68129K56541K56668K37493K33140
4937H381320J11818J85287K39285K26032J39125J17945L2186J13533J11203J01209
4927I758943Q4105O8643N5570J04031J34070J72661J06057M7817O6532J92653
4917A0791082J95650J06444J28789J55105K33062K09102K14829K84941K71129
4908A2590133K89085L55660M06821N29432M62914O08916O06428O88594P32569
4899A7270552Q55911Q89240J008874J098430J180042J313881J345122J478904
4891B6440956J528194J565546J701431J798374J994829J967825K090147K213916
4883D1301218K246662K342028K499586K670721K784018K830626K835904K685651
$$ y = [6094205, 6221239, 6502854, 6731283, 7012620, 7229349, 7397478, 7654019, 7910687, 8148180, 8381320, 8493138, 8678425, 8917710, 9143742, 9282867, 9400812, 9432998, 9546531, 9657734, 9758943, 9843048, 9911691, 9967261, 10071292, 10205362, 10378023, 10484080, 10531897, 10598429, 10791082, 10986732, 11093176, 11221965, 11377070, 11610132, 11819234, 12034063, 12319004, 12590133, 12879218, 13234878, 13641699, 14171131, 14634045, 15242961, 15849389, 16537983, 17270552, 18126463, 19015703, 20024577, 21123007, 22303049, 23616930, 24962052, 26440956, 27969150, 29534696, 31236127, 33034501, 35029330, 36997155, 39087302, 41301218, 43547880, 45889908, 48389494, 51060215, 53844233, 56674859, 59510763, 62196414]
4875F2196414K609259K469302K470781K602951K682537K710909K735022K732319
4867H3209494K645028K484268K415112K474628K833039K964379K941120L069933
4859A05037001L106483K900376K622171K344780K009235J720103J372448J101913
4851A22214510Q45295O80325M54210K19327n0720k64152m99512n76990n01082
4842A22521211l50312j41823n6288m3476r6687l64074o65382q13932r97714r20793
4832A18070730q40865o89020m42140k93623j34524O785K85812P65038J325182
4823A18053375J921377K377125K730532L092763L326509L432380L407486L308637
4815A41650184L100805K785815K201098J837838J290592O62212J92412j67223
$$ y = [62196414, 64805673, 67274975, 69745756, 72348707, 75031244, 77742153, 80477175, 83209494, 85854522, 88338790, 90753902, 93228530, 96061569, 99025948, 101967068, 105037001, 108143484, 111043860, 113666031, 116010811, 118020046, 119740149, 121112597, 122214510, 123059805, 123740130, 124194340, 124413667, 124362947, 124098795, 123599283, 123022293, 122521211, 122170899, 122029076, 121972788, 121929312, 121832625, 121468551, 120803169, 119989237, 118991523, 118070730, 117229865, 116540845, 116098705, 115805082, 115670558, 115677343, 115963155, 116728193, 118053375, 119974752, 122351877, 125082409, 128175172, 131501681, 134934061, 138341547, 141650184, 144750989, 147536804, 149737902, 151575740, 152866332, 153528544, 153720956, 153553733]
4807A53553733n00537q45950j051963r83163r41778p00051m13771j40681L27606
4798A48303445Q10782J319191J827366K298853K794847L076543L344058L425865
4790A67200950L500022L379420L094854K822339K359377J768130J199134L81577
4782A85705803m26809j289444k083050k750568l476515l848728m402338m685343
4774A62743008m847640n013652n036768m933864m692202m349809m108127l703316
4766A26057630l226246k866610k636811k397212k305233k168866j967723k084673
4758A06404256k077143k072309k324887k472012k571546k771936k876671k915960
4750H6321792l080666l121743l068936l062331l051782l008483k881873k822016
$$ y = [153553733, 153053196, 152207246, 151155283, 150172120, 149230342, 148530291, 148116520, 147975839, 148303445, 149114227, 150433418, 152260784, 154559637, 157354484, 160431027, 163775085, 167200950, 170700972, 174080392, 177175246, 179997585, 182356962, 184125092, 185324226, 185705803, 185278994, 183989550, 181906500, 179155932, 175679417, 171830689, 167428351, 162743008, 157895368, 152881716, 147844948, 142911084, 138218882, 133869073, 129760946, 126057630, 122831384, 119964774, 117327963, 114930751, 112625518, 110456652, 108488929, 106404256, 104327113, 102254804, 99929917, 97457905, 94886359, 92114423, 89237752, 86321792, 83241126, 80119383, 77050447, 73988116, 70936334, 67927851, 65045978, 62223962]
4742F2223962k778363k670872k492057k435544k342405k147395k054855j903616
4734D3398855j797163j650580j564434j472516j237834j186324j133296r99116
4726C2357592j019616r39212r38266r64129r43633r69603r16787r50019r86045
4717B3730282r81720j012795r11701r15280r49457p39348n79683n77559n42118
4708A6520621m04156l89356l24397k28017j34584p5870p1965L7151R5076J44641
4698A5169144J65427Q4986J30513J83209k8836o0638k819q4881j38142j83171
4688A5234792k75388l00527l23544l53246l22924l94808l51099l64054k70812
4679A2278390l01318k07520j69024n6464j50093k6994O9451P7379P7148J56558
$$ y = [62223962, 59445599, 56774727, 54282670, 51847126, 49504721, 47357326, 45302471, 43398855, 41601692, 39951112, 38386678, 36914162, 35676328, 34490004, 33356708, 32357592, 31337976, 30398764, 29460498, 28496369, 27552736, 26583133, 25666346, 24716327, 23730282, 22748562, 21735767, 20824066, 19908786, 18959329, 18219981, 17640298, 17062739, 16520621, 16116465, 15727109, 15402712, 15174695, 15040111, 14964241, 14892276, 14929427, 15024503, 15169144, 15334571, 15419557, 15550070, 15733279, 15704443, 15643805, 15640986, 15556105, 15417963, 15234792, 14959404, 14658877, 14335333, 13982087, 13659163, 13264355, 12913256, 12549202, 12278390, 11977072, 11769552, 11600528, 11544064, 11393971, 11366977, 11436428, 11513807, 11590955, 11747513]
4669A1747513L70027L92119L68693M83449O26607O43211P33278Q02423R42799
4660A7110119Q81425R36637R92352R46984R86888J067958J008058R88995R70443
4651B5889859J033477R47673Q49827P26140O99874O68968O99976O53990N76723
4642C2746507N00125L25697J87077k1050k57601l92557n49215n75189o05365p27504
4632C0630925q66356q61709r04832q57728p22473n92491n17176k87989j41811
4623B4878360N8223K24771M61020O11632Q23256Q98937R81858J242665J297477
4614C1478199J384906J379074J352512J328638J366098J293274J220547J149331
4606D1952579R66253P82675O45106L02374P5086j6295j03968l20078n15176n27721
$$ y = [11747513, 12117540, 12509659, 12878352, 13361801, 13988408, 14631619, 15364897, 16167320, 17110119, 17991544, 18928181, 19920533, 20867517, 21854405, 22922363, 23930421, 24919416, 25889859, 26923336, 27871009, 28720836, 29446976, 30146850, 30815818, 31515794, 32169784, 32746507, 33246632, 33572329, 33759406, 33738356, 33480755, 33088198, 32538983, 31963794, 31358429, 30630925, 29764569, 28902860, 27998028, 27140300, 26417827, 25825336, 25308160, 25020171, 24878360, 24936583, 25161354, 25622374, 26234006, 27057262, 27956199, 28938057, 30180722, 31478199, 32863105, 34242179, 35594691, 36923329, 38289427, 39582701, 40803248, 41952579, 42918832, 43701507, 44346613, 44648987, 44724073, 44707778, 44603810, 44283732, 43768556, 43240835]
4596D3240835o87134q15236p69559q93326p64956o79669m18161k85917j33679
4587C7793198M3054J32101L29574N38803O03212P50654J055407J257262J427727
4578D3930992J381542J399845J287415J049757Q12747N31861N77010N46976N97348
4569E2115493O40451N33782M76190L62292J32425l1612p7342j40723j88293j05110
4559E3717553m0324p8430r960j40043l72451p24127r30802r28716r56562r24234
4549D8611904r30457q56563q83759p95776q02595q76068j048628j181864j260286
4540C9975908j336655j330515j507929j385123j434673j568828j641252j833800
4532B7937133j914501j895812j782088j581474j511745j428339j316253j161832
$$ y = [43240835, 42553701, 41738465, 40968906, 40075580, 39310624, 38630955, 38212794, 37926877, 37793198, 37836252, 37968353, 38297927, 38836730, 39439942, 40190596, 41246003, 42503265, 43930992, 45312534, 46712379, 47999794, 49049551, 49862298, 50394159, 50971169, 51518145, 52115493, 52755944, 53289726, 53765916, 54128208, 54260633, 54229021, 54151679, 54010956, 53822663, 53717553, 53677229, 53598799, 53588839, 53448796, 53076345, 52352218, 51421416, 50492700, 49536138, 48611904, 47681447, 46824884, 45941125, 45145349, 44342754, 43466686, 42418058, 41236194, 39975908, 38639253, 37308738, 35800809, 34415686, 32981013, 31412185, 29770933, 27937133, 26022632, 24126820, 22344732, 20763258, 19251513, 17823174, 16506921, 15345089]
4524A5345089j071061j015496q99925p19742o72223n94517n51975m01079l92735
4515I026336m07267k21764k72752j60835j93447j93377j17180j80724j24696j03461
4505G050833j61770l7673m8807j01444n9877p9503q3220K1098n7712j35094m4031
4494F262800p3645q9050p5735n3200m0861o0004o6882n7195k5556r4941J2399
4483E638130n8721o9018n4757j20209m4967L6678m813p6331R278L2084l3163o7239
4471E186952j5630m513o2827J0907O346p6067l0390m99m2033r798M7428j8031
4459D991845j3995n8203q9704k4244M7182n9351k2574q278j190n032k1540K3358
4447D758274L4299K3734p963M9878R1192K3176m1465L7859P8267J01601K10624
$$ y = [15345089, 14274028, 13258532, 12358607, 11638865, 10966642, 10372125, 9820150, 9419071, 9026336, 8619069, 8397305, 8124553, 7963718, 7770271, 7576894, 7459714, 7278990, 7154294, 7050833, 6889063, 6851390, 6802583, 6701139, 6641262, 6561759, 6478539, 6499637, 6441925, 6306831, 6262800, 6189155, 6100105, 6024370, 5971170, 5930309, 5870305, 5803423, 5746228, 5720672, 5625731, 5638130, 5579409, 5510391, 5455634, 5335425, 5290458, 5327136, 5322323, 5245992, 5255270, 5287354, 5254191, 5186952, 5171322, 5166809, 5103982, 5114889, 5121235, 5045168, 5014778, 5014279, 4972246, 4962448, 5009876, 4991845, 4977850, 4919647, 4829943, 4805699, 4852881, 4793530, 4770956, 4762678, 4761488, 4756456, 4734916, 4758274, 4792573, 4816307, 4808344, 4858222, 4949414, 4972590, 4931125, 4968984, 5047251, 5148852, 5359476]
4436E359476J24241K00138J84463K30816K72660K26346K69574L40197K26511K04289
4426G638711J34649j932m778j8208l639k8156j5398j24746j32200k31097l67727
4415F845479k53374k68560k43844j12525k35014j83083j42792j29006r7935j46133
4405E033213q5383q5473o2754j4357p9909l2668N7566n5770j5304p1306l7784
4394D550071N4350o8433o719M9790l46l2541L9940k0874j9883l367R751L2592
4382D584331j1529n1775R341k9906q097J27796j0632q764L4989k6550O2221J33731
4370D805156J3167r243Q0930J55837O0521L5967J13873O9764J91312J49771J01729
4359E768784J47505J95433K10115Q1051J06389J41118J34809L6116M1333R4202
$$ y = [5359476, 5483717, 5683855, 5868318, 6099134, 6371794, 6598140, 6867714, 7207911, 7434422, 7638711, 7773360, 7771428, 7766650, 7748442, 7744803, 7716647, 7701249, 7576503, 7444303, 7213206, 6845479, 6592105, 6323545, 6079701, 5967176, 5732162, 5549079, 5406287, 5277281, 5179346, 5033213, 4947830, 4862357, 4799603, 4785246, 4705337, 4672669, 4730235, 4674465, 4659161, 4587855, 4550071, 4604421, 4535988, 4529269, 4579059, 4578713, 4546172, 4586112, 4565238, 4545355, 4541988, 4551739, 4584331, 4572802, 4521027, 4530368, 4500462, 4492365, 4620161, 4609529, 4600765, 4635754, 4609204, 4671425, 4805156, 4818323, 4809080, 4890010, 5045847, 5106368, 5142335, 5256208, 5325972, 5517284, 5667055, 5768784, 5916289, 6111722, 6321837, 6402888, 6509277, 6650395, 6785204, 6821320, 6862653, 6956855]
4349F956855J37982J51772J35931J14857J02969J27381L9966P8367J08438Q3676
4339H038194Q3844j951J21515N9461K7965M1098J1181J5469K2484n158l5749r108
4327H369245o3975L0169m0534l8313j0822O301j6847J1636J9533k6975O778M0838
4315H287034J2131k946J0192n5254M551Q3242p1999j0484J04351J11635P9063
4304H551516R0704R0146J13965J47669J41993J66399R6303Q1907J09643J81586
4294I771831J33529P9192J86226J06428Q7916J27161J00879Q5646J20205J4273
4284A0813286k4269K1690M2165O1089K9549J8163N9475p4627j15502n8678q7337
4273A0685004j06276j61982q6490o7825n3786o6065j50215j07638j04441p5832
$$ y = [6956855, 7094837, 7246609, 7382540, 7497397, 7600366, 7727747, 7767713, 7846080, 7954518, 8038194, 8122038, 8120087, 8241602, 8301063, 8329028, 8370126, 8381307, 8396776, 8419260, 8414102, 8378353, 8369245, 8305270, 8335439, 8294905, 8256592, 8245770, 8252071, 8235224, 8246860, 8266393, 8239418, 8246196, 8287034, 8299165, 8296219, 8306411, 8251157, 8255708, 8338950, 8266951, 8256467, 8360818, 8472453, 8551516, 8642220, 8732366, 8846331, 8994000, 9135993, 9302392, 9398695, 9480602, 9590245, 9771831, 9905360, 9984552, 10170778, 10277206, 10365122, 10492283, 10593162, 10678808, 10799013, 10813286, 10789017, 10810707, 10852872, 10913961, 10943510, 10961673, 11021148, 10946521, 10831019, 10772341, 10685004, 10578728, 10416746, 10330256, 10262431, 10208645, 10142580, 9992365, 9884727, 9780286, 9704454]
4263I704454q7106j53202k8676k404j39357j0006m6955n7042l8850m7077j19181
4252H974598p0310j9750m6893L568L293l593j8285Q45r555Q5073k9171Q2363J49375
4239I101558R3469M9126P4235M8944J8810O0238Q064P0843L2258o5968J3373O301
4227I511251q7252p3200M3418m7988j00771P148q7536m9008n5085l5478L3982
4216I059481n1791Q866r3738q719q152r2970l2620L4995k2080l7754j5064N279
4204H745733P549M4898J15880J07201O134R1577J86063K25599J84535K11100K40513
4193A0166782L63530L05829L63530L98217M83673N19288N23839N10184N83719
4184A4218591O17497O67074O80992P07915O98822O58651P06332O84675P59466
$$ y = [9704454, 9617348, 9464146, 9435470, 9433066, 9293709, 9283703, 9236748, 9179706, 9140856, 9093779, 8974598, 8904288, 8884538, 8837645, 8841213, 8844506, 8840913, 8822628, 8823473, 8813918, 8898991, 8869820, 8952183, 9101558, 9195027, 9244153, 9318388, 9367332, 9386142, 9446380, 9454444, 9525287, 9557545, 9491577, 9504950, 9511251, 9423999, 9350799, 9394217, 9346229, 9245458, 9252606, 9165070, 9116062, 9060977, 9025499, 9059481, 9007690, 9016556, 8922818, 8914099, 8905947, 8812977, 8780357, 8815352, 8793272, 8755518, 8740454, 8745733, 8753282, 8798180, 8914060, 9021261, 9027395, 9118972, 9305035, 9530634, 9715169, 9926269, 10166782, 10530312, 10836141, 11199671, 11597888, 12081561, 12600849, 13124688, 13634872, 14218591, 14836088, 15503162, 16184154, 16892069, 17590891, 18249542, 18955874, 19640549, 20400015]
4175B0400015P91667P24997P40582P68379P52503Q32880P73608R05140R05966
4166B7595737R83066Q75071R30021R81975J005677J060156J049588J024153J045061
4157C6550505J044953J014540J094144J094236J077531J092223J118935J159465
4149D5246532J150659J146763J203038J283390J320282J402679J432821J601454
4141E5787618J647182J606619J682503J563232J480029J669779J589557J542752
4133F8569271J529573J457580J311159J297948J110200R81495R13491Q94735P48478
4124G8813930P50856P45716O77060O74045P29459P62008P79163R11993J150945
4115H5995175J262866J425109J736057J807883J990996K194065K365682K511427
$$ y = [20400015, 21191682, 21916679, 22657261, 23425640, 24178143, 25011023, 25784631, 26689771, 27595737, 28578803, 29453874, 30383895, 31365870, 32371547, 33431703, 34481291, 35505444, 36550505, 37595458, 38609998, 39704142, 40798378, 41875909, 42968132, 44087067, 45246532, 46397191, 47543954, 48746992, 50030382, 51350664, 52753343, 54186164, 55787618, 57434800, 59041419, 60723922, 62287154, 63767183, 65436962, 67026519, 68569271, 70098844, 71556424, 72867583, 74165531, 75275731, 76257226, 77170717, 78065452, 78813930, 79564786, 80310502, 80987562, 81661607, 82391066, 83153074, 83932237, 84844230, 85995175, 87258041, 88683150, 90419207, 92227090, 94218086, 96412151, 98777833, 101289260]
4107A01289260K671631K778431K851821K801043K698223K690916K672603K414510
4099A22868438K315612K196026K011276J723823J531888J411088J245207J094098
4091A36397456R48234Q29079P40728O63597O39001M98121N32547M28043M10354
4082A42087160L20133L27603K98176L84303M09987L60323L64884L10876K35618
4073A45099063J75883P9186L3157K8259j87587l17949n89317o83477j034434j211917
4063A41390867j437480j715595k050463k202868k511831k785808k765051k864535
4055A23057236k949760k867299k782934k707715k704000k476151k291577k228888
4047A02048912j991410j818578j673392j452091j323341j302297j138145j140875
$$ y = [101289260, 103960891, 106739322, 109591143, 112392186, 115090409, 117781325, 120453928, 122868438, 125184050, 127380076, 129391352, 131115175, 132647063, 134058151, 135303358, 136397456, 137345690, 138174769, 138915497, 139579094, 140218095, 140716216, 141248763, 141676806, 142087160, 142407293, 142734896, 143033072, 143417375, 143827362, 144187685, 144552569, 144863445, 145099063, 145274946, 145354132, 145387289, 145415548, 145227961, 144910012, 144320695, 143637218, 142602784, 141390867, 139953387, 138237792, 136187329, 133984461, 131472630, 128686822, 125921771, 123057236, 120107476, 117240177, 114457243, 111749528, 109045528, 106569377, 104277800, 102048912, 100057502, 98238924, 96565532, 95113441, 93790100, 92487803, 91349658, 90208783]
4039I0208783j186755j135374j032563j055617j022930j016374j194275j307723
4031H1257172j473524j659987j562515j656014j665065j683252j740778j750694
4023F8065343j769490j844343j827733j866081j774208j652411j562655j457348
4015E4311074j305455j292112j312008j190986j080052j151267j000411r37070
4007D5041713j054384j019095r62225j001174j105734j005105j064804j017736
3999C6811456j073951r84705r56436j001370j044253r88752q93699q76099q31460
3990B8160731p77816p03826p44122p08320p58384o43354o19608o57483o20917
3981B1926901n89706n20301n59903n22982n31112m47901l49804l62415l35179
$$ y = [90208783, 89022028, 87886654, 86854091, 85798474, 84775544, 83759170, 82564895, 81257172, 79783648, 78123661, 76561146, 74905132, 73240067, 71556815, 69816037, 68065343, 66295853, 64451510, 62623777, 60757696, 58983488, 57331077, 55768422, 54311074, 53005619, 51713507, 50401499, 49210513, 48130461, 46979194, 45978783, 45041713, 43987329, 42968234, 42006009, 41004835, 39899101, 38893996, 37829192, 36811456, 35737505, 34752800, 33796364, 32794994, 31750741, 30761989, 29868290, 28992191, 28160731, 27382915, 26679089, 25934967, 25226647, 24468263, 23824909, 23205301, 22547818, 21926901, 21337195, 20816894, 20256991, 19734009, 19202897, 18754996, 18405192, 18042777, 17707598]
3972A7707598l37909k55538k10831k05574j28341o2693m6485m4312K9369l3781
3962A6411503r0085K4759O3464O3599J07660K9139R7384J78300J05616J01778
3952A7093117R3309J24226J82513J64544J83092K36060K00039J96928K15041K27862
3942A8916731J62389K79901K82045K82071K95161L49475L40216L15999L20489
3933B1544477L46563M30366L83671L49632M22130M74591M98449N70193M96843
3924B5516915N78527N43099O28795O24933P04115O98580P44228Q17566Q22472
3915C1679230Q55935R37480J028315J018689J064004J095778J066239J042712
3907C9788382J087485J256981J148624J040651J125310J089692J078423J008666
$$ y = [17707598, 17369689, 17114151, 16903320, 16697746, 16569405, 16506712, 16460227, 16415915, 16445284, 16411503, 16321418, 16346177, 16409641, 16473240, 16580900, 16610039, 16707423, 16885723, 16991339, 17093117, 17186426, 17310652, 17493165, 17657709, 17840801, 18076861, 18276900, 18473828, 18688869, 18916731, 19079120, 19359021, 19641066, 19923137, 20218298, 20567773, 20907989, 21223988, 21544477, 21891040, 22321406, 22705077, 23054709, 23476839, 23951430, 24449879, 25020072, 25516915, 26095442, 26638541, 27267336, 27892269, 28596384, 29294964, 30039192, 30856758, 31679230, 32535165, 33472645, 34500960, 35519649, 36583653, 37679431, 38745670, 39788382, 40875867, 42132848, 43281472, 44322123, 45447433, 46537125, 47615548, 48624214]
3899D8624214R00398Q80824Q61743Q11475Q82967P52425O66353M87201M07318
3890E5274918L79269K94240J85389J56413k7787r0192j52913l00410k99626m42530
3880E4976771m67976n63629n94114o01760o76860p84624q02905q46589q15042
3871D8823272p76102p51819p27454p49076n97355o57871n74128n25558n01617
3862D2962292m07226k80183l78403l27052k71037k92469j34597k53484k57002
3853D0360839k52298j27067l00762l41796j62570r7423j48167o1916j2794J3380
3843C8869426l6232L6230k1357l4257q7773j70380j37229j84484j61116k39465
3833C7833363k20294l70059k64764j83732j39645j21427J9742M6118K06841K46404
$$ y = [48624214, 49524612, 50405436, 51267179, 52078654, 52961621, 53714046, 54380399, 54867600, 55274918, 55654187, 55948427, 56133816, 56290229, 56262442, 56172250, 56019337, 55718927, 55419301, 54976771, 54508795, 53945166, 53351052, 52749292, 52072432, 51287808, 50484903, 49638314, 48823272, 48047170, 47295351, 46567897, 45818821, 45221466, 44563595, 43989467, 43463909, 42962292, 42555066, 42274883, 41896480, 41569428, 41298391, 41005922, 40871325, 40617841, 40360839, 40108541, 39981474, 39680712, 39338916, 39176346, 39078923, 38930756, 38868840, 38856046, 38869426, 38833194, 38869424, 38848067, 38813810, 38726037, 38555657, 38418428, 38233944, 38072828, 37833363, 37613069, 37243010, 36978246, 36794514, 36654869, 36533442, 36553184, 36599302, 36806143, 37052547]
3823C7052547L71020M28273N45381N90198M89689N30068M13564N52098L75562
3814D1348400L24041M36070M41404L21915M15972M69270M90581N93047O46810
3805D5487510O14004P38861P73408O88109O10050O39808M74889K55664K17197
3796E0499500k68j82356k74908l78855m94261m81573n48434o02168m79253m69110
3786D6588314l56083k78016j64646L1457J65498L43059N37322P00861Q25518R78111
3776D9371395J080668J343235J428256J485067J469914J558813J430882J411273
3768F0579503J335817J057497R30858O56889M24129L06509j6031k45433n10924
3759F4518814p24801q41936j020174j153169j160027j127201j113426j105560
$$ y = [37052547, 37423567, 37851840, 38397221, 38987419, 39477108, 40007176, 40420740, 40972838, 41348400, 41672441, 42108511, 42549915, 42871830, 43287802, 43757072, 44247653, 44840700, 45487510, 46101514, 46840375, 47613783, 48301892, 48911942, 49551750, 50026639, 50282303, 50499500, 50499232, 50316876, 50041968, 49663113, 49168852, 48687279, 48138845, 47536677, 47057424, 46588314, 46232231, 45954215, 45789569, 45821026, 45986524, 46329583, 46866905, 47567766, 48393284, 49371395, 50452063, 51795298, 53223554, 54708621, 56178535, 57737348, 59168230, 60579503, 61915320, 62972817, 63903675, 64560564, 64984693, 65291202, 65275171, 65029738, 64518814, 63794013, 62952077, 61931903, 60778734, 59618707, 58491506, 57378080, 56272520]
3751E6272520r29040q31256q39210o48278o83859n90418n62408o05102n58081
3742E0024868n99529n48654o36610q07715q10269p59282q28174r63964r68861
3733D3101810r81402q80410r49559j106454j082033j077498j050817j006214r97629
3724C3969794j046966j138761j015075j020764j036049j007465j032561r01192
3716B5770961q63876q49656p67404o21928o46435n48939m56592m82081l71958
3707B0162092l07980l17253j40177k03024j94926q6561p4187n9384p502q1606
3697A8689492j08438l4509q7189r5981k1288k795j9468j5321M1878k1597l364
3686A8321420L1310J9568P2952j7706q1147j32919j42295j90455j86990k58827
$$ y = [56272520, 55343480, 54512224, 53673014, 53024736, 52340877, 51750459, 51188051, 50582949, 50024868, 49425339, 48876685, 48240075, 47432360, 46622091, 45862809, 45034635, 44070671, 43101810, 42120408, 41239998, 40290439, 39183985, 38101952, 37024454, 35973637, 34967423, 33969794, 32922828, 31784067, 30768992, 29748228, 28712179, 27704714, 26672153, 25770961, 24907085, 24057429, 23290025, 22668097, 22021662, 21472723, 21016131, 20534050, 20162092, 19854112, 19536859, 19396682, 19193658, 18998732, 18912171, 18837984, 18778600, 18771098, 18689492, 18581054, 18546545, 18459356, 18363375, 18342087, 18339292, 18319824, 18304503, 18346381, 18324784, 18321420, 18352730, 18372298, 18445250, 18427544, 18346397, 18213478, 18071183, 17880728, 17693738, 17434911]
3676A7434911l35799l49260l73747m50855n08880n38915n34627n44498n59000
3667A3239330n42888n05788n49025n33279m43994m29328m64763l21689l38115
3658I110461l04295k35768j74632j87558k07175j35020r4553r3442q1647j0440
3648G585931l1805o1562M0913Q627o3208O454J11234K1310m744L354K1121l5341
3636G602284R1996M6854L2132N19k2229l5793j4089k726K6339K938L9939j1786
3624G756378O682m2044p3478K3329M4740J2615p1395R364m7660J9547R796O1892
3612G709766L134L4945N5357O2845O1562L719J2202J16144L8317M8606Q5070P8731
3600H310398j8369P0686m3562M1945J05350Q8901J23450J582n7093P6520J03458
$$ y = [17434911, 17099112, 16749852, 16376105, 15925250, 15416370, 14877455, 14342828, 13798330, 13239330, 12696442, 12190654, 11641629, 11108350, 10664356, 10235028, 9770265, 9448576, 9110461, 8806166, 8570398, 8395766, 8208208, 8001033, 7866013, 7771460, 7678018, 7596371, 7585931, 7554126, 7492564, 7533477, 7542104, 7478896, 7485350, 7596584, 7617894, 7613150, 7616504, 7637625, 7602284, 7694280, 7741134, 7773266, 7773785, 7751556, 7715763, 7701674, 7698948, 7725287, 7728225, 7768164, 7756378, 7763060, 7721016, 7647538, 7670867, 7715607, 7728222, 7656827, 7666191, 7618531, 7638078, 7647874, 7709766, 7712900, 7747845, 7803202, 7866047, 7927609, 7931328, 7943530, 8059674, 8097991, 8146597, 8231667, 8310398, 8292029, 8362715, 8319153, 8361098, 8466448, 8555349, 8678799, 8680381, 8623288, 8699808, 8803266]
3589H803266J19571J64332J57283J36408J52273J89363J58483K46507J78331J38020
3579A0443837K86053K46958K60121K13776J98152K20076J99914J98773K49485
3570A2517145K55177K75712K98471K79234L14182L17646L11452K54891K59797
3561A5083707L09970L76858L99469L77335L90933L63568L70643L84458N06681
3552A8563622M87732N55960N89240M69720O85775O62798P55561P88298R13413
3543B4472119R06951R59553R55786J021919J098261J084802J079553R80139J029261
3534C3588344J006452Q63710Q51286O88975N02604M63454K08369r6881k39028
3525C7837285l11640m19049o08061p26521q88173q44422r55292j003272j006106
$$ y = [8803266, 8922837, 9087169, 9244452, 9380860, 9533133, 9722496, 9880979, 10127486, 10305817, 10443837, 10729890, 10976848, 11236969, 11450745, 11648897, 11868973, 12068887, 12267660, 12517145, 12772322, 13048034, 13346505, 13625739, 13939921, 14257567, 14569019, 14823910, 15083707, 15393677, 15770535, 16170004, 16547339, 16938272, 17301840, 17672483, 18056941, 18563622, 19051354, 19607314, 20196554, 20666274, 21352049, 22014847, 22770408, 23558706, 24472119, 25379070, 26338623, 27294409, 28316328, 29414589, 30499391, 31578944, 32559083, 33588344, 34594796, 35458506, 36309792, 36998767, 37501371, 37964825, 38173194, 38076313, 37837285, 37525645, 37106596, 36498535, 35772014, 34883841, 34039419, 33084127, 32080855, 31074749]
3516C1074749j027604q67864r41784r15479p83971o97965o98589n69068n11897
3507B4060528m93288m33266k98957l33440l70817k50762k09955k25532k73830
3498B1170681k20166j32037j83567j17418k26978k71124k37733k39688k46774
3489A9295196k77022j97764k73671k52790l57898l92185k37157k72373k91853
3480A6742483l44949l77681k99166l37943l59672l33374k96751l15899l98489
3471A3678559l24729l51960k58950l06085l46444k76897k62521l20964k60476
3462A0969533k28090k02027j85397j90725j82006j17927n2457o9570r7475p4390
3452I569469m6528k1816r845l0637M1397J5975R3081J47835L6594P0220R1290
$$ y = [31074749, 30047145, 29179281, 28237497, 27322018, 26538047, 25840082, 25141493, 24572425, 24060528, 23567240, 23133974, 22835017, 22501577, 22130760, 21879998, 21670043, 21444511, 21170681, 20950515, 20818478, 20634911, 20517493, 20290515, 20019391, 19781658, 19541970, 19295196, 19018174, 18820410, 18546739, 18293949, 17936051, 17543866, 17306709, 17034336, 16742483, 16397534, 16019853, 15720687, 15382744, 15023072, 14689698, 14392947, 14077048, 13678559, 13353830, 13001870, 12742920, 12436835, 12090391, 11813494, 11550973, 11230009, 10969533, 10741443, 10539416, 10354019, 10163294, 9981288, 9863361, 9810904, 9741334, 9643859, 9569469, 9522941, 9501125, 9491280, 9460643, 9502040, 9518015, 9611096, 9758931, 9795525, 9865745, 9957035]
3441I957035Q6587R6673J22425J12802J18893J33393J23449J29018O7639J09487
3431A1057401R3573P6664j1462N1709L5275N2470R6227n5180K7860L0566n9647
3420A1395456Q3339p295j0527j31214q7586j01193j0323j46745r6938j1818m0923
3409A0834233j01581j15063k621k1551k9129K8434J21446J15521J90734J35379
3399A1155802J74117L21032K33785J72665K44240K75521K89380J95281K25845
3390A3287668K44400K39490J92675K56257K58775J93931K26296K61919K52464
3381A5413875K54163K33291K54206K54169K58866K56446L06463K95505K08669
3372A7735653J25996K55784N4199J12829J47929M6913R3067M5630K6859q0664
$$ y = [9957035, 10043622, 10140295, 10262720, 10375522, 10494415, 10627808, 10751257, 10880275, 10947914, 11057401, 11150974, 11227638, 11216176, 11267885, 11303160, 11355630, 11451857, 11396677, 11424537, 11455103, 11395456, 11478795, 11471500, 11460973, 11329759, 11242173, 11140980, 11130657, 10983912, 10886974, 10875156, 10834233, 10732652, 10617589, 10614968, 10593417, 10564288, 10592722, 10714168, 10829689, 11020423, 11155802, 11329919, 11650951, 11884736, 12057401, 12301641, 12577162, 12866542, 13061823, 13287668, 13532068, 13771558, 13964233, 14220490, 14479265, 14673196, 14899492, 15161411, 15413875, 15668038, 15901329, 16155535, 16409704, 16668570, 16925016, 17231479, 17526984, 17735653, 17861649, 18117433, 18171632, 18284461, 18432390, 18479303, 18572370, 18618000, 18644859, 18564195]
3362A8564195j65627n8750j2199k9905K6818k8366J9880R3832J60821J78823K01714
3351A8951236J80314K65097K72234L59946M55713N53014O62848O63398Q92462
3342B3256262R67208J164231J295398J456783J563573J832455J937111K109883
3334C5582904K320106K368290K448106K398749K454101K160131J904499J693603
3326E3330489J314899Q71803M69148R2058l37308o93481j108915j490687j739833
3317E0708173j974645k157353k187373k198307k176181k009580j784242j618263
3309C4602229j435889j186002r17047n76673l09696l3715K33161N31886P18477
3300C1626731R82085J253609J406649J518439J617873J624337J658597J593019
$$ y = [18564195, 18398568, 18339818, 18327619, 18297714, 18324532, 18296166, 18316046, 18409878, 18570699, 18749522, 18951236, 19131550, 19396647, 19668881, 20028827, 20484540, 21037554, 21700402, 22363800, 23256262, 24223470, 25387701, 26683099, 28139882, 29703455, 31535910, 33473021, 35582904, 37903010, 40271300, 42719406, 45118155, 47572256, 49732387, 51636886, 53330489, 54645388, 55517191, 55986339, 56078397, 55741089, 55047608, 53938693, 52448006, 50708173, 48733528, 46576175, 44388802, 42190495, 40014314, 38004734, 36220492, 34602229, 33166340, 31980338, 31063291, 30486618, 30176922, 30143207, 30376368, 30908254, 31626731, 32608816, 33862425, 35269074, 36787513, 38405386, 40029723, 41688320, 43281339]
3292D3281339J576392J271410J140976P60598N41117K71664n3298k93249o28396
3283D7868553r37693j158498j390746j610111j731148j815667j923895j957176
3275C5343619j808131j692701j618993j592491j457951j292391j141968j049038
3267B3689955q90338p15140n32500m88189l60715k98478j95753j11293P4790J27810
3257B0300149K24651K80862M14531N15822N50180N93329O17496N08428O06484
3248B4611932O19622N12365O64736O85385P80787Q19563R40611J056574J142080
3239C1833655J410114J601348J868366K168215K658207L221797L886306M536172
3231E3184180N204124N989985O790914P586298Q597972R369152J0005236J0314758
$$ y = [43281339, 44857731, 46129141, 47270117, 48030715, 48571832, 48843496, 48790198, 48496949, 47868553, 46930860, 45772362, 44381616, 42771505, 41040357, 39224690, 37300795, 35343619, 33535488, 31842787, 30223794, 28631303, 27173352, 25880961, 24738993, 23689955, 22799617, 22084477, 21551977, 21063788, 20703073, 20404595, 20208842, 20097549, 20172339, 20300149, 20524800, 20805662, 21220193, 21736015, 22286195, 22879524, 23497020, 24005448, 24611932, 25231554, 25743919, 26408655, 27094040, 27874827, 28694390, 29635001, 30691575, 31833655, 33243769, 34845117, 36713483, 38881698, 41539905, 44761702, 48648008, 53184180, 58388304, 64378289, 71169203, 78755501, 87353473, 96722625, 106727861, 117042619]
3223A17042619J0191005R806698R216000Q672222P877009O963649N784799M179533
3215A79733534K384023L65651j590317l405640m792577o052160o896074p546498
3207A52199942q173090q546002q902458r069024q955249q670527q114107p410011
3199H4359474o655306n919592n212209m574713l960008l395395k986855k414902
3191D9240494j973337j652783j535964j112461r07869p06742o42969n96289m13533
3182C9698547m21853l84784m74780n57001n88317n53752n30920n04570m17578
3173C5264992n03489m54851l68389l85461l80243l27704j52090p0352j22749m1258
3163C2458406J12713J86297J61470K42184K97502L32668M24423N31709N21845
$$ y = [117042619, 127233624, 137040322, 146256322, 154928544, 162805553, 169769202, 175554001, 179733534, 182117557, 182483208, 180892891, 177487251, 172694674, 166642514, 159746440, 152199942, 144026852, 135480850, 126578392, 117509368, 108554119, 99883592, 91769485, 84359474, 77704168, 71784576, 66572367, 61997654, 58037646, 54642251, 51655396, 49240494, 47267157, 45614374, 44078410, 42965949, 42058080, 41351338, 40708369, 40112080, 39698547, 39276694, 38891910, 38417130, 37860129, 37271812, 36718060, 36187140, 35682570, 35264992, 34761503, 34306652, 33938263, 33552802, 33172559, 32844855, 32692765, 32622413, 32499664, 32458406, 32571119, 32757416, 32918886, 33161070, 33458572, 33791240, 34215663, 34747372, 35269217]
3154C5269217Q42650R54794J143615J422608J661562J914206K361236K756647
3146D8326535L364033L907395M420474N033877N696634O383248O867912P438731
3138I1438839P786265P914527P837981P575714P212624O691114O185713N782674
3130A48425451N495007N374069N351090N317467N414219N615328N973054O618398
3122A93584083P211222P789378P919119P594087P051195O395463N940488N893110
3114B49378145O035808O033240N549250M477278K887620J135277k72941j134713
3106B74088964j456897j306727r57722q54742j235101j975755k709134l179161
3098B60413725l495013l388908l067003k600252k695058l256502l890508m568181
$$ y = [35269217, 36111867, 37066661, 38210276, 39632884, 41294446, 43208652, 45569888, 48326535, 51690568, 55597963, 60018437, 65052314, 70748948, 77132196, 84000108, 91438839, 99225104, 107139631, 114977612, 122553326, 129765950, 136457064, 142642777, 148425451, 153920458, 159294527, 164645617, 169963084, 175377303, 180992631, 186965685, 193584083, 200795305, 208584683, 216503802, 224097889, 231149084, 237544547, 243485035, 249378145, 255413953, 261447193, 266996443, 271473721, 274361341, 275496618, 275223677, 274088964, 272632067, 271325340, 270367618, 269512876, 268277775, 266302020, 263592886, 260413725, 256918712, 253529804, 250462801, 247862549, 245167491, 241910989, 238020481, 233452300]
3090B33452300n240108n663001n996056o382694o984477p691994q661007r408409
3082A77424554r845676j0136748j0154365j0038182r797562r568481r329293r158100
3074I9396147q686826q187883p521221o777236o002372n243968m569063l976692
3066D8430886l462613l012720k577981k217555j943077j563036j462258j204657
3058C0986989j006642r05807q15405o92590n96227n49938n70549m92818m83566
3049B4873447m63489m27967n43441n72074n84163n64785n46235n99273o46888
3040A9925132n65560o46351o32070n49327m83144m32046l74453l36689k83409
3031A5622083j36908n0187L1201O3259P9930Q2988K33725K05700K83371K24886
$$ y = [233452300, 228212192, 222549191, 216553135, 210170441, 203185964, 195493970, 186832963, 177424554, 167578878, 157442130, 147287765, 137249583, 127452021, 117883540, 108554247, 99396147, 90709321, 82521438, 75000217, 68222981, 62220609, 56976641, 52407578, 48430886, 44968273, 41955553, 39377572, 37160017, 35216940, 33653904, 32191646, 30986989, 29980347, 29074540, 28259135, 27566545, 26970318, 26420380, 25849831, 25357013, 24873447, 24409958, 23981991, 23438550, 22866476, 22282313, 21717528, 21171293, 20572020, 19925132, 19359572, 18713221, 18081151, 17531824, 17048680, 16616634, 16242181, 15905492, 15622083, 15485175, 15434988, 15466189, 15529448, 15609378, 15692366, 15926091, 16131791, 16415162, 16640048]
3021A6640048J60670R9019O9230P403l0691K4187q1209k3244j10282j93856j19826
3010A6441449k8421q0992j13356k5823L8676J32281J14502R9257J69484J31650
3000A6878707J6577J00129P1586R5559K5443k02299k13885l41585l98404m83758
2990A5548070m77739n08106m96277n14369n72980o18276n66692o15683n17570
2981A0660378l85749m74104l95361l02643k27494j86017j89775r3055j8711Q2532
2971H470001M6559J17180N9078J35618K38017K23946J39147P8117J53979R8932
2961I760574O132K9655L5702n0125o6181m2620p0465j27406j08945n0993j07322
2950I208006j07805r212O8417r4455j5595j0334q6417j03704j54635l3490j32892
$$ y = [16640048, 16800718, 16899737, 16968967, 16976370, 16945679, 16969866, 16888657, 16865413, 16755131, 16561275, 16441449, 16413028, 16332036, 16218680, 16192857, 16231533, 16363814, 16478316, 16577573, 16747057, 16878707, 16895284, 16995413, 17066999, 17162558, 17188001, 16985702, 16771817, 16430232, 16031828, 15548070, 15070331, 14562225, 14065948, 13551579, 12978599, 12360323, 11793631, 11177948, 10660378, 10274629, 9800525, 9405164, 9102521, 8875027, 8689010, 8499235, 8406180, 8387469, 8470001, 8516560, 8633740, 8692818, 8828436, 9066453, 9290399, 9429546, 9507663, 9661642, 9760574, 9766706, 9796361, 9832063, 9781938, 9715757, 9673137, 9602672, 9475266, 9366321, 9315328, 9208006, 9100201, 9090989, 9159406, 9064951, 9049356, 9039022, 8952605, 8848901, 8694266, 8660776, 8527884]
2939H527884k49446j46237j49156k48928k40726k68788l17662k49909k12001k16674
2929F228357k02493k43670k27498j29440j54648j72549j61853j07854j21464j43599
2919D563289j49644l9389k5280j23840j49604j12051j6507j38002r6615J1456
2909C723813m5195m5417p8764o2448n7811k7182o7944n2865m5742q5122p0197
2898C085126K7912k1920l9834M5123l8892o5086k5979o8897o8944l8220P51k4639
2886B766501l8436Q7461j02204j5701n459M5201K0702l3833j8039j6313P8731
2875B768611P6327o054P3275R5219L1328J1131N1956Q5946Q9920p1Q55N401P8212
2862C362056K6407j2071K4635k0865o1541j9547J5679j0861k2661l9649l5027
$$ y = [8527884, 8278438, 8132201, 7983045, 7734117, 7493391, 7224603, 6906941, 6657032, 6445031, 6228357, 6025864, 5782194, 5554696, 5425256, 5270608, 5098059, 4936206, 4828352, 4706888, 4563289, 4413645, 4374256, 4348976, 4225136, 4075532, 3963481, 3946974, 3808972, 3712357, 3723813, 3678618, 3633201, 3554437, 3491989, 3434178, 3406996, 3339052, 3286187, 3240445, 3155323, 3085126, 3113038, 3091118, 3051284, 3096407, 3057515, 2992429, 2966450, 2897553, 2828609, 2790389, 2791140, 2766501, 2728065, 2815526, 2713322, 2697621, 2692162, 2737363, 2758065, 2724232, 2706193, 2689880, 2768611, 2844938, 2838884, 2912159, 3007378, 3038706, 3049837, 3101793, 3187739, 3277659, 3277588, 3278443, 3283844, 3362056, 3388463, 3376392, 3401027, 3380162, 3318621, 3299074, 3314753, 3303892, 3281231, 3241582, 3206555]
2851C206555M1793p9771p2017k7176J742m4988K9917M8593k7222k0011j8907O009
2839C044517P9578K9732L9560Q1356N222J9413K0429Q4814N7351p5615l4165J7000
2827C369192O0760J1256L5071j259p8381j43963m753K6775k0333O6070j11248
2816C209187m480j4967K2097n8206q0303k3086l9352m3821j2286L2139l2330n2339
2804B902253p8442J1836n8336j2142o5009j02504n0126m8021q6991n3051m2031
2793B317436q7434o984n5510l8879k7016m5160n6933k000j5502J0321q6650o3441
2781A842248J3001l6402j10887K837K0548j3866m1868M936m8830J950Q4817k5257
2769A693227k2747J740M7926k8880p8871n252l0750M3806p5810j4241J4844l4548
$$ y = [3206555, 3248348, 3168577, 3096560, 3069384, 3071126, 3026138, 3056055, 3104648, 3077426, 3057415, 3038508, 3044517, 3124095, 3153827, 3193387, 3274743, 3279965, 3299378, 3319807, 3404621, 3461972, 3386357, 3352192, 3369192, 3429952, 3441208, 3476279, 3475020, 3396639, 3252676, 3247923, 3274698, 3254365, 3320435, 3209187, 3204707, 3189740, 3211837, 3153631, 3073328, 3050242, 3010890, 2967069, 2954783, 2986922, 2954592, 2902253, 2823811, 2835647, 2777311, 2765169, 2700160, 2597656, 2547530, 2499509, 2412518, 2359467, 2317436, 2230002, 2223018, 2167508, 2128629, 2101613, 2056453, 1999520, 1997520, 1982018, 1992339, 1905689, 1842248, 1855249, 1818847, 1707960, 1710797, 1731345, 1717479, 1675611, 1680547, 1631717, 1633667, 1718484, 1693227, 1670480, 1672220, 1720146, 1691266, 1612395, 1607143, 1576393, 1620199, 1544389, 1530148, 1544992, 1510444]
2757A510444L7641L6369j4959N1317m7487l2579j8020k3569m1541M9741j4965
2746A492392N4051Q015j2940q527J0281l0640m8530l5081n8940L3541P726p4851
2734A336497l404O2720m9446m5138m2734L615p422l456J19398M4830j22556j7270
2722A275634k344Q5255k9720q8022l3556L4658l0083J282K7626q037O3958k8538
2710A268113o7925K8455N4392j5946J0173P7893m4880k1066p5423K079k1659m163
2698A190043N9558n0269j0046K5087o8892m3629k2806j7423P1900l1486r818M4330
2686A136549O7515l5931n3895q182n9571L1220j5842J7519J3953l6604K7681M614
2674A089026P7030K0403n7856j6927l1855J9084o6792M6229L9734N567o1461R2162
$$ y = [1510444, 1548085, 1584454, 1569495, 1620812, 1573325, 1540746, 1522726, 1499157, 1457616, 1507357, 1492392, 1546443, 1554458, 1541518, 1532991, 1543272, 1512632, 1464102, 1429021, 1370081, 1403622, 1411348, 1336497, 1333093, 1395813, 1346367, 1301229, 1258495, 1262110, 1254688, 1251232, 1370630, 1415460, 1292904, 1275634, 1273290, 1358545, 1328825, 1240803, 1207247, 1241905, 1211822, 1213104, 1240730, 1232693, 1296651, 1268113, 1200188, 1228643, 1283035, 1267089, 1277262, 1355155, 1310275, 1289209, 1213786, 1215865, 1194206, 1190043, 1249601, 1199332, 1189286, 1214373, 1145481, 1101852, 1079046, 1061623, 1133523, 1102037, 1092219, 1136549, 1204064, 1168133, 1114238, 1106056, 1046485, 1077705, 1061863, 1079382, 1093335, 1056731, 1084412, 1089026, 1166056, 1186459, 1128603, 1111676, 1079821, 1098905, 1032113, 1078342, 1118076, 1123643, 1062182, 1154344]
2662A154344K8877K9487M824Q211N2594k8598o0063p5803K6912K5378r0744P999
2650A083418k4472r68n54o5927M8831k1157L5881L5837k2858K5762p3665q5209
2638I34919J4925l2289j1017k2026R553m0588m6171L6763p9774M5831O7486n4320
2626H23292N0382o4916P265j3105l362N0245k5154l0937K7439k0782K7324j7033
2614H10658L1330M746n2187m2864Q9393L3461j16712J0208J2888l6944n8072J03650
2602G89555J3533q0479j3560M0202L5872m6621k0472J5163r877M1123m9839j4608
2590F99992J7016n724J2080k708Q581j614M1602k6650L5907l8629l5601M275k3119
2577F85408r359m4140K0744J7940M4638m512J1228o1961K6046L1469j0720N7015
$$ y = [1154344, 1183221, 1212708, 1217532, 1225743, 1278337, 1249739, 1189676, 1113873, 1140785, 1166163, 1075419, 1083418, 1058946, 1057978, 1057424, 991497, 1040328, 1019171, 1055052, 1090889, 1068031, 1093793, 1020128, 934919, 949844, 917555, 906538, 884512, 894065, 853477, 807306, 844069, 764295, 810126, 877612, 823292, 873674, 808758, 816023, 802918, 799556, 849801, 824647, 793710, 821149, 800367, 827691, 810658, 841988, 846734, 794547, 751683, 841076, 874537, 757825, 768033, 780921, 743977, 685905, 789555, 803088, 722609, 709049, 749251, 785123, 738502, 718030, 733193, 723316, 764439, 714600, 699992, 717008, 711284, 723364, 720656, 729237, 727623, 769225, 742575, 778482, 739853, 704252, 708527, 685408, 676049, 631909, 652653, 670593, 715231, 710719, 721947, 659986, 686032, 717501, 706781, 763796]
2565G63796k3471n3781k0221N8036R880M7006l2487k971j6795M8537q386m821
2553G64322r478k8346O3594l5901n4883M7405J5107o5955M9809l2330r2640M3853
2541F64557K5278O0903k9166o2702M3857J6912m8094j5323j5656J1487N6434K470
2529G10957l357j6508j03463L4831l45J7495o110M0612k2332j4537P3943m667
2517G06519m5027q203k2214k0646M5348L7044k2089J0147O7009m4584K738n2888
2505F53154L8251J5369O810o35K489R814l6841p5163M5347O8509q4718P8637P0357
2492G91380k8565p8343p3618j7996J3902J06547R620r8273K2270P0119k2109m2633
2480F52301k520N8757M098N5191k6456J5567j9354Q603r916P249j3572O4231L7261
$$ y = [763796, 740325, 686544, 666323, 724359, 734239, 781245, 748758, 745787, 728992, 777529, 769143, 764322, 754844, 726498, 790092, 754191, 699308, 746713, 761820, 695865, 745674, 713344, 620704, 664557, 689835, 750738, 721572, 658870, 702727, 719639, 671545, 656222, 640566, 652053, 708487, 710957, 707600, 691092, 587629, 622460, 622115, 639610, 633500, 674112, 651780, 637243, 711186, 706519, 661492, 653289, 631075, 610429, 655777, 692821, 670732, 680879, 747888, 703304, 706042, 653154, 691405, 706774, 713584, 712949, 715438, 725252, 688411, 613248, 658595, 727104, 642386, 721023, 791380, 762815, 684472, 610854, 592858, 606760, 713307, 722927, 624654, 646924, 717043, 694934, 652301, 649781, 708538, 712636, 767827, 741371, 756938, 737584, 746187, 736271, 743520, 729948, 794179, 831440]
2467H31440n337M9402J0776n2849L46N5169p561n647M1152l2006j1930N370L0511
2454I08836l5872n5786l6679J5077j5317Q7113l5206m9374J15463K5013K6702
2443I49970j7934O0106Q1324k5639p321J12362L0411O617J3416M1358j0096M2667
2431A277241L9385P816j4192J0191L5676K6810O6260k424n714M6233K1171O1170
2419A569623R9796J36619N5051R4872J33554K19957J61769K77715L02350L64977
2409C416283M88608N32614O00620N40042O04423Q30885J021179J262500J611807
2400A0908961J904907K085939K227539K520811K930928L405544L835957L925805
2392C3746391L360649J941706R98991N58398J73268J6285m08722q20008j033520
$$ y = [831440, 826103, 875505, 886281, 833432, 833778, 888947, 881386, 875739, 916891, 884885, 872955, 878325, 908836, 872964, 817178, 780499, 795576, 780259, 867372, 832166, 782792, 898255, 923268, 949970, 932036, 992142, 1073466, 1047827, 1040506, 1152868, 1183279, 1189896, 1203312, 1244670, 1234574, 1277241, 1316626, 1324442, 1310250, 1320441, 1356117, 1382927, 1449187, 1446763, 1441049, 1487282, 1508453, 1569623, 1669419, 1806038, 1861089, 1955961, 2089515, 2309472, 2471241, 2748956, 3051306, 3416283, 3904891, 4437505, 5038125, 5578167, 6182590, 7013475, 8034654, 9297154, 10908961, 12813868, 14899807, 17127346, 19648157, 22579085, 25984629, 29820586, 33746391, 37107040, 39048746, 40047737, 40606135, 40779403, 40795688, 40386966, 39566958, 38533438]
2383C8533438j597920k448766k992822l108012l132671l043060k783779k402955
2375A7023453k093194j892132j739363j463359j316296j305211j055676r33321
2367E224901o40799m71087l10795l08929k87271j89988j80568j65961j96209j58542
2357B314752j12611j30667j27676j23292m8618r38n6730n1531r9356p8886K1820
2346A506267O740r8176r5397j9433L6778l7433l8930n3102l4683n6978n5605J4078
2334A074126J5679m7602k7948o0022k7047l3086K7936L9171n8762o0311o7655
2323G74479M3345K2177p618m0300P9061l0242j03320K095K3922J021K4615o4798
2311G24437j556M7035j4234p5234j4618m213L2362j5615o4876Q6278O9034o3058
$$ y = [38533438, 36935518, 34486752, 31493930, 28385918, 25253247, 22210187, 19426408, 17023453, 14930259, 13038127, 11298764, 9835405, 8519109, 7213898, 6158222, 5224901, 4584102, 4113015, 3802220, 3493291, 3206020, 3016032, 2835464, 2669503, 2473294, 2314752, 2202141, 2071474, 1943798, 1820506, 1771888, 1770950, 1714220, 1662689, 1563333, 1484447, 1506267, 1513007, 1414831, 1319434, 1300001, 1336779, 1299346, 1260416, 1207314, 1172631, 1115653, 1060048, 1074126, 1089805, 1042203, 1014255, 954233, 927186, 894100, 922036, 961207, 902445, 842134, 774479, 817824, 840001, 832383, 792083, 871144, 840902, 737582, 739677, 763599, 764620, 789235, 724437, 722881, 769916, 755682, 680448, 665830, 661617, 693979, 678364, 613488, 699766, 768800, 705742]
2299G05742n5028j9990j8338m5273K7995L1190n9553l2368L5137n3450k7811j1527
2287D76726M9929l5091M0478m4106L0324J9310p5933L1812O2600K5319q5264J4265
2275E10369K0667o7449q290O3061q1217J0246m278L5972L3223L123j4956M8513
2263E48984l5786q261l7959J7154o1633J7458L2930m0185l6905o535O1384P683
2251D58329j0530M7600K038k6560r8332k4308P2461m788j0498n3013n0460P2905
2239C74844M7652m3174J0115K9886N11j7925P874R251n4314J2060O6307o6874
2227C76213q9095J9160k6011L5038J2928Q605R8913l1347q0864n9064N2762P391
2215C24629k8763j5664o9064K9467K5350N3220O812j895J00792o0372p4260l8043
$$ y = [705742, 650714, 630724, 612386, 567113, 595108, 626298, 566745, 534377, 569514, 516064, 488253, 476726, 526655, 491564, 532042, 487936, 518260, 537570, 461637, 493449, 556049, 581368, 496104, 510369, 531036, 463587, 455297, 518358, 437141, 447387, 443109, 479081, 512304, 515427, 500471, 548984, 513198, 504937, 466978, 484132, 422499, 439957, 472887, 432702, 395797, 389262, 450646, 458329, 447799, 495399, 497437, 470877, 372545, 348237, 420698, 415910, 405412, 352399, 301939, 374844, 422496, 379322, 389437, 419323, 419834, 401909, 409783, 419034, 364720, 376780, 443087, 376213, 287118, 306278, 280267, 315305, 328233, 336838, 435751, 404404, 323540, 264476, 317238, 324629, 295866, 280202, 211138, 240605, 265955, 319175, 325987, 324092, 424884, 364512, 290252, 252209]
2203B52209q102O5610j4364n4363M9322l472k779O2773L778J603o724j8639J4221
2190C41073m529n2833O7807Q871k6746r4973M4664q480Q637M4624j0667J6433
2178C33881m9054K3933k2001k4067o1346R0785L7722K598O5549l8116j8118j8212
2166C23554k1168K0409l5157J4037q7924m4752j2589N5565l2426n6710Q5055Q6050
2154B93944n3633K0617K4304q6493J3942N3626l605J4425r697k204J8081J6248
2142B99555J6517l7003l0992k1878k295L500N784R9538J7745j23835j2087J26200
2130C40749O7269k890l1839N435J6482K693j7770M6631n9069R227K394l214Q6874
2117D62972J4034P016J5777r1543N9087q697j03870O003K2391k8403q015K61n8154
$$ y = [252209, 244107, 309717, 295353, 240990, 290312, 286840, 284061, 346834, 350612, 352215, 345491, 326852, 341073, 336544, 283711, 351518, 360389, 333643, 238670, 283334, 274854, 283491, 328115, 317448, 333881, 284827, 308760, 286759, 262692, 201346, 292131, 329853, 332451, 398000, 359884, 341766, 323554, 302386, 322795, 287638, 301675, 213751, 168999, 156410, 211975, 179549, 122839, 207894, 293944, 240311, 260928, 285232, 198739, 212681, 266307, 262702, 277127, 267430, 265226, 283307, 299555, 316072, 279069, 248077, 226199, 223904, 227404, 233188, 332726, 350471, 226636, 214549, 340749, 408018, 405128, 373289, 378724, 395206, 397899, 380129, 426760, 367691, 376918, 379312, 376098, 462972, 477006, 484022, 499799, 408256, 467343, 458646, 354776, 360779, 383170, 354767, 346752, 347013, 288859]
2104B88859K0540l2359L3483n1944m1509m683M405j6737L3336q8929p3676R3622
2092A64408L3168K1478m002l2258M3431M1188k4453n2422K5603J6552k5337j1222
2080A96134N2545p501n566m1808n876P4703N8595l7443n7405L2791l6166n5166
2068A67837J2405N284K4202m0899J1325O3374M013j2009j6627m4159K8127K1747
2056B24620k763l91n4523k9750P208l861O9666O13n1752j2287L2725q263p214
2043A64028j0431K9342o3779M9311K3401j7282O24j6671K9734L402l2864J5749
2031A74564k381J2646M764q2309J8366l8869J8659P6052L886m2307l2047k4701
2019H6323L0662K8690Q356o0326J6966K3139K8769K2030J4288m3941q6090M7145
$$ y = [288859, 309399, 277040, 310523, 258579, 217070, 212387, 216792, 200055, 233391, 144462, 70786, 164408, 197576, 219054, 215052, 182794, 226225, 267413, 242960, 190538, 216141, 232693, 207356, 196134, 248679, 241178, 235612, 193804, 187928, 262631, 321226, 283783, 226378, 259169, 223003, 167837, 180242, 185526, 209728, 168829, 180154, 243528, 247541, 235532, 218905, 174746, 202873, 224620, 221857, 221466, 166943, 137193, 144401, 140540, 210206, 210819, 159067, 146780, 179505, 171242, 164028, 153597, 182939, 119160, 168471, 191872, 174590, 175214, 158543, 188277, 191679, 158815, 174564, 172183, 184829, 189593, 107284, 125650, 86781, 105440, 181492, 185378, 143071, 111024, 86323, 116985, 145675, 154031, 93705, 110671, 133810, 162579, 184609, 198897, 154956, 68866, 116011]
2007A16011L2297O790K1608q673k3227l9393O9176L7569q704j3358l7916J248
1995A53428p0204k2570Q1464J7246p9599J5374O8606p2356l2920J6095J9221J9666
1983A13451K4543R636k181K0049l0994m0306M0630K5047j2391j4855M6187k0336
1971A58480J6685k1056p4371O792m9263L1406J0366J0481O2168j1452j9048L8078
1959A59266k5271p4623Q3215j5525K9539p2731k00M1945n7668N2152J1083o4999
1947F6183L6028k7289J2475L9376k6517j8044L017L4998K7747k2423n6081R4171
1935A63641l2580j6558L7298l5714l2100J9963j8848q28J3840m094m5596J5756
1923F4180O3640l3049l4565M4187m9407k7326P1971j3016q800j7816r516J8561
$$ y = [116011, 148308, 155098, 176706, 168033, 144806, 105413, 174589, 212158, 203454, 190096, 152180, 153428, 83224, 60654, 142118, 159364, 79765, 95139, 163745, 91389, 58469, 74564, 93785, 113451, 137994, 147630, 145449, 165498, 134504, 94198, 134828, 159875, 147484, 132629, 178816, 158480, 175165, 154109, 79738, 86530, 37267, 68673, 79039, 89520, 151688, 140236, 121188, 159266, 133995, 59372, 142587, 127062, 156601, 83870, 83670, 125615, 67947, 120099, 131182, 66183, 102211, 74922, 87397, 126773, 100256, 82212, 85229, 120227, 147974, 125551, 69470, 163641, 131061, 114503, 151801, 116087, 83987, 103950, 85102, 84274, 98114, 94020, 48424, 64180, 127820, 94771, 60206, 104393, 54986, 27660, 99631, 86615, 77815, 59999, 50483, 69044]
1911F9044L1422j4649k787M3420o781q341L9488o5442K5208m1492J4589J4944
1899I8623m1442L4300o488l9079N3674L6614l7868j1744j0048k9559m116K5405
1887F8272K933K4315L5578j8288o2825k9948R259K9887J0005J4588J623l3027
1875E2372j6822O7028N123J6839j3676M6039m4843l6942k1849K6263O6631p8154
1863F8009J5892L3460n5239R250l705k924L409k8523Q2801j9377n8415J5924R078
1850F9640K9204k8567k3194l7409J8405p827O2416j2546m7488J0518j919L9600
1838G0833L0618j8666l108O568J1284L2012R025o6112K9119r5258k038m1812N5621
1825A8086R9096k6073l3453J765k2988O5234L5248n2256m3463m2001l5850j179
$$ y = [69044, 100466, 85817, 83030, 126450, 119669, 111328, 150816, 85374, 110582, 69090, 83679, 98623, 57181, 91481, 84993, 45914, 99588, 136202, 98334, 86590, 76542, 46983, 42867, 68272, 71205, 95520, 131098, 112810, 49985, 20037, 29296, 59183, 69188, 83776, 85399, 52372, 35550, 102578, 107701, 124540, 110864, 156903, 112060, 75118, 53269, 79532, 146163, 68009, 83901, 117361, 62122, 71372, 67667, 64743, 68152, 39629, 122430, 103053, 44638, 60562, 69640, 98844, 70277, 47083, 9674, 28079, 20252, 82668, 70122, 22634, 33152, 31233, 70833, 101451, 82785, 79677, 86245, 97529, 129541, 138566, 72454, 101573, 6315, 4277, -37535, 18086, 117182, 91109, 57656, 59421, 36433, 101667, 136915, 84659, 41196, -805, -36655, -37834]
1813c7834P7174Q1445k123r0942l6816L7814L5432j7293K4249M0499j4147J6693
1801A14151l1330n8141Q1090q3028m0581j1246k6875N1152L1114l6437J1085j5312
1789a4358L8342k813L307J0388j7248K5076l0087j3206P4329o7664K6855K6335
1777E9256M2949J2312N0490p1710l8548m999J9226O910k360j2440m7192M7500
1765F1394J8940J3713q5511M304P0752m668q555k9103O487J0242p231j0135k3465
1752A7164k9061K2766J044Q0626r2828K4318j142m6845o616j1646K3428K3010
1740D218J8329M649q725k6332N8140m8249K0834L9233K5893L0736k9941l2928
1728E5857j8786k1165N609m0411N2348J6938L3606L7775J2369j8321o3054m8670
$$ y = [-37834, 39340, 120785, 118662, 27720, -9096, 28718, 64150, 46857, 71106, 111605, 97458, 114151, 82821, 24680, 105770, 22742, -17839, -29085, -55960, -4808, 26306, -10131, 954, -14358, 23984, 21171, 24478, 34866, 17618, 42694, 12607, -599, 73730, 6066, 32921, 59256, 102205, 114517, 165007, 93297, 54749, 49750, 68976, 75886, 73526, 61086, 13894, 61394, 80334, 94047, 8536, 12840, 83592, 78924, 70369, 41266, 47753, 57995, 50764, 40629, 17164, -11897, 10869, 11913, 92539, -289, 24029, 22887, -23958, -30574, -42220, -18792, 4218, 22547, 27196, 18471, -7861, 50279, 2030, 22864, 62097, 87990, 118726, 88785, 55857, 37071, 15906, 21515, -18896, 33452, 50390, 83996, 121771, 134140, 115819, 52765, 4095]
1716D095n3135j3421J0771L9910O4315p2769l8774l0237J4668O1201M7519k8971
1704E172j1422M9551O951L8791j4423m1933r565k0453j6994M3988J6672j8772
1692B7563R84k6480K3385j3613L9020o9810L6080j5048l2150j8903J0591j1561
1680d9942R1817K2085n3366k1760J1089J7828J1406j8233p5905Q2077L0598L1220
1668G8914j3719l0152K3088q0350m3879Q4826J4698n571k0651Q743l8419Q702
1656a3770L3471j9702O4459K2130o3550R336O345k3046j2811M632k7405K5273
1644E362J269k1136o2232Q3446N5866m8845m9504L3591P1463r6619m3991O604
1632f4726R383L0910q9N2220k4488k3574k0994k907l744m266j5533k3281M7404
$$ y = [4095, -49040, -62461, -51690, -11780, 52535, -20234, -59008, -89245, -74577, -13376, 34143, 5172, -6250, 43301, 50252, 89043, 74620, 32687, 23122, 2669, -14325, 29663, 46335, 27563, 28547, 2067, 25452, 11839, 50859, -18951, 17129, 2081, -30069, -48972, -38381, -49942, 41875, 63960, 10594, -11166, -77, 17751, 29157, 10924, -64981, 17096, 47694, 78914, 65195, 35043, 58131, -22219, -66098, 18728, 33426, 27855, 7204, 15947, -22472, -13770, 19701, -1, 64458, 86588, 23038, 32374, 38719, 15673, 2862, 7494, -19911, 5362, 6631, -14505, -76737, 6709, 62575, 13730, -35774, -2183, 69280, -27339, -71330, -64726, -55343, -24433, -24522, 27698, 3210, -20364, -41358, -44265, -48009, -52275, -67808, -91089, -43685]
1619d3685K4049P2811j0811J2655j1070l7686K7144l0423j4688m3710M3703J1337
1607c74m8075J9495o8500K0454P3166o1777M9036n69l3296k2072L5193N7717M960
1594B5358Q509m8132k9929K3706J3116N8196o5950L6089m1354Q7801j3920p4344
1582b0854L3884J7123M895k5512k0638k3831J883m6103j7628k470P8320N6198
1570C5267q67p6496J27731k9321N603n8254m6061l0578M5432k5570j593M8971
1558e736J4743R207q941l2299k5008k2804Q587j7292M8632J1244J0664l2607R524
1545c2086J3709n7729O3400K6810n3758Q618N6405M787m0084l6762K4410j7956
1533d0236L2876L8833L1773K5085k5360k7265l8246k4464j5789j7066M5848L1972
$$ y = [-43685, -19636, 53175, 42364, 55019, 43949, 6263, 33407, 2984, -11704, -55414, -11711, -374, -48449, -28954, -97454, -77000, -3834, -65611, -16575, -17144, -50440, -72512, -37319, 20398, 25358, 33867, -14265, -44194, -20488, -7372, 50824, -15126, 20963, -20391, 67410, 53490, -20854, 13030, 30153, 35048, 9536, -11102, -34933, -33050, -79153, -96781, -99251, -20931, 35267, 34400, -42096, 85635, 56314, 61917, 3663, -42398, -72976, -27544, -53114, -54707, -5736, 9007, 18214, 9273, -23026, -48034, -70838, -62251, -79543, -30911, -19667, -9003, -41610, -32086, -18377, -76106, -12706, 14104, -39654, -31036, 25369, 30156, -9928, -46690, -22280, -40236, -7360, 31473, 63246, 88331, 62971, 35706, -2540, -27004, -42793, -59859, -14011, 17961]
1521A7961N5174p7066q0124Q5631L2298k826k1711m9535K0L446P2680k037J7193
1508E1104K339m0829l8134n7915R121L4492L818R528j8790j1903o969j5992K0614
1495e9516L1273o1469Q8851k4959l6009O2949o9256L0697m0133J7964L7749K2533
1483F74p851P551O1260r787K2463N033k6132l8184m7667J2295P1300k2297m2543
1470a3885j2288K2866L0637Q0931q1976p7505N1322M5719N821l3002m9762Q935
1458b2187k478O7M1053P667O469J3681l2728l1933j1131J7911m1112n1014K7647
1445g8088J0360J4280M8424N4208l0824n7404j7254L6167J9924j8826j741M683
1433a6091K1417o6777l3431l0177Q0998K0689P6528n0278l0973N4149q3913J1709
$$ y = [17961, 73135, -3931, -84055, 1576, 33874, 31048, 9337, -40198, -40178, -36732, 35948, 33911, 51104, 53443, 12614, -25520, -83435, -74314, -39822, -36004, -26476, -45266, -57169, -64138, -80130, -59516, -28243, -89712, -861, -25820, -61829, 1120, -68136, -37439, -77572, -59608, -21859, 674, -7177, 374, 61634, 51847, 74310, 79343, 53211, 15027, -32640, -20345, 50955, 28658, -13885, -26173, -3307, 27330, 108261, 26285, -51220, 102, 45821, 51642, 18640, -31122, -22187, -24665, -24598, 16455, 24122, 30591, 44272, 11544, -20389, -31520, -13609, -54721, -105735, -78088, -67728, -53448, -5024, 49184, 18360, -39044, -56298, -20131, -207, -19033, -20774, -16091, 5326, -61451, -94882, -125059, -44061, -23372, 53156, 2878, -28095, 26054, -57859, -46150]
1421d6150K6555O3695k8510l3075l725J8979o815m7486l3690j5764K7099J8389
1409f0498n468j8616R213M369K7167J6351m2382N1161n5611K2766L67j9487j145
1396g1813l923M744L0216K0411m3248n9953M8512R1015k7900K3750n4943q7274
1384a30406K2454M0329L5486j8726j1176l8120P7084J2164j6795K0538k3429j2796
1372d3393n068l868l3153J8292Q2219L0302k2111p850k7083m1801j2765P73M3957
1359b1549J4178J8583j761J0528j759P2704p3088l9808l7451l1468Q5542N557
1347B08j4233k2607j2143N5635l1122k0525j0235j5941n9495K0948P6591l2115
1335f5034j2439Q946j7804N3263K8371l6221j6456P5884R716n3238O2608J8777
$$ y = [-46150, -19595, 44100, 15590, -17485, -21210, -2231, -9046, -56532, -90222, -105986, -78887, -60498, -65966, -84582, -75369, -71000, -43833, -27482, -69864, -18703, -74314, -51548, -51181, -70668, -71813, -75736, -70992, -40776, -20365, -63613, -123566, -75054, 15961, -11939, 11811, -43132, -130406, -107952, -67623, -32137, -50863, -62039, -100159, -23075, -10911, -27706, -7168, -30597, -43393, -48461, -52329, -85482, -67190, 15029, 45331, 23220, 15370, -11713, -53514, -66279, -65506, -21549, -7371, 11212, 9451, 19979, 18220, 90924, 17836, -21972, -59423, -90891, -5349, 208, -14025, -36632, -48775, 6860, -24262, -44787, -55022, -70963, -130458, -109510, -32919, -65034, -77473, -68527, -86331, -33068, -4697, -40918, -57374, 18510, 28226, -25012, 37596, 56373]
1323E6373o3965L317J7076L877k7059j9315j4972k3671M8991K9898o0277k2173
1311g1900P739J7047N343k6455p902N0155K8356o9457J6876r851N1200M2895q7259
1298e3213n0886M5574j562k382n9975J6738N0305J23536j7844n2403m8778j4305
1286f5195O8818j3381J2134M6876n4242j933J289M6106l7086R152j4727p1568
1274g3757O503N5216n4503P4017k8067k3690n5218K9966P260j1258K597N7988
1262a2946M5217j0595K7040l6270n506j9481m7128N045J6661N5036L199l7242
1250a6970o986J5470k4845K9226l5735m8890j0505k4207K0164O0233P2573l2088
1238b560L818n403R648n5850r039R462L0636J0555N4353m7563r610o118k6002
$$ y = [56373, -7592, -4275, 12801, 16678, -10381, -29696, -44668, -68339, -19348, 10550, -49727, -71900, -64161, -47114, -41771, -68226, -76128, -25973, 2383, -67074, -50198, -60049, -8849, 34046, -53213, -104099, -58525, -60087, -62469, -122444, -105706, -55401, 68135, 50291, -2112, -50890, -65195, 3623, -9758, 2376, 49252, -4990, -6923, -5634, 40472, 3386, 12538, -2189, -73757, -67254, -12038, -66541, 7476, -20591, -44281, -99499, -69533, -62273, -73531, -70934, -12946, 32271, 21676, 48716, 12446, 6940, -12541, -59669, -54624, -37963, 17073, 20272, -16970, -23956, -8486, -33331, -4105, -39840, -88730, -99235, -123442, -103278, -43045, 29528, -2560, 1258, -4145, 5503, -50347, -59386, -49924, -19288, -8733, 45620, -1943, -11553, -17671, -43673]
1225d3673J1103J2967m3542p432P3592o7771k1277N5475m3720l5578j4445l435
1213a27736K0043N4067k3038P312K3195j2970K0106k982p8003j2425K9941N8512
1201d3978J4607K1890q6388P6314j2083j0991J208j0964Q7382n0950k2135L8740
1189B652j3364k1588m6515J8345k2564n1077J6550N2664M2393M897L9187k1943
1177c63p7609L6674j0315J0939m3197q35l62J4469j4722K1295K8163M8237j0834
1164A540j3341o4274M8746J8011m3691K1649M9490l1735o7175L5968J6450J1229
1152a7133p0479m36K3257N2478m9430k2191K3359J6017N1790j6671o5024j9865
1140i4328J2568j5212L3951K767K5373K7929j507k9004o8539N7230L3938l6995
$$ y = [-43673, -32570, -19603, -63145, -70577, 3015, -64756, -86033, -30558, -74278, -109856, -124301, -127736, -107693, -53626, -76664, -69352, -46157, -59127, -39021, -42003, -120006, -132431, -102490, -43978, -29371, -7481, -93869, -17555, -29638, -40629, -39421, -50385, 36997, -13953, -36088, 2652, -10712, -32300, -78815, -60470, -83034, -134111, -117561, -64897, -22504, -17607, 21580, -363, -77972, -41298, -51613, -40674, -83871, -84706, -85068, -70599, -85321, -64026, -35863, 12374, 1540, -11801, -76075, -27329, -9318, -53009, -31360, 18130, -13605, -80780, -44812, -28362, -17133, -87612, -88048, -64791, -12313, -61743, -83934, -60575, -44558, 7232, -9439, -74463, -94328, -81760, -96972, -63021, -60254, -34881, -6952, -8459, -37463, -106002, -48772, -14834, -51829]
1128e1829k9265k1420k3038M6807K6157k4931j573L0268n0020L5950N6104K0883
1116A4093N21m2420k8475J05743J9969q9771m33P1660m5342o701k7545k3363K108
1103d9956J4973L7759K2811p4516O7868J8143m9462n6013K9745n1291Q9439p9728
1091h0228m4759L6517n2437K8282J1101l4774J34906l7607l8151k5388N3836j0306
1079e9008n2077M6711N7244J4401p5425l1217N75J7860p5022P8356R029N9703
1067h870l9206L836K111l9474Q0430k534K3625L4485n2411k754k8542j4200j9017
1054f2521J1801K5621L6088m3304J8883M1139J1378K762l3669l9287P1584m4857
1042d382k0701K3814J0573J1493M423K7675m8901m6533k0233K5724J6193q9435
$$ y = [-51829, -81094, -102514, -125552, -78745, -52588, -77519, -79092, -48824, -98844, -62894, -6790, 14093, 14614, -27806, -56281, 49462, 69431, -20340, -20773, 50887, 5545, -1156, -28701, -52064, -49956, -34983, 2776, 25587, -48929, 18939, 37082, -12380, -68393, -38648, -89939, -500, -80228, -124987, -88470, -140907, -112625, -101524, -136298, -1392, -38999, -77150, -102538, -48702, -59008, -111085, -64374, -7130, 7271, -68154, -99371, -98796, -80936, -155958, -77602, -68573, -8870, -48076, -44240, -42129, -81603, -1173, -3707, 19918, 54403, 1992, -762, -29304, -43504, -62521, -50720, -25099, 10989, -32315, -13432, 27707, 39085, 41847, 8178, -31109, 40475, -4382, -25083, -1269, 9304, 20797, 25220, 52895, 3994, -42539, -62772, -37048, -20855, -110290]
1030a10290Q7521K3835J9344p9211M975r831p9870J386N6525L5022K5313m0447
1018f5728k2088L0120P446J0141K7489n393P14P020l2435l5893J6973O015j4350
1005f9969P4187l7477m3498N837J4799J0511L77o8992L2409m5705K0342M8749
993e8430L0719k7754K0227m865j281J7535Q958N943m0363j0226J9166J174J4319
980b4878P2391n2184m9957m1104K4683K6784K2996o4051K2707L4611q175K469
968c3708k8292l9041M6251N4669k8751n8814L3240J5153M3806k9319o5001M4079
956d5728K1256N1615n2890q4330M0467L3573k8484M3343P792J3737M7013l1517
944A5847k4707j6016k033j6466m0569j9203L0919J19987m3166k2884N9229k4988
$$ y = [-110290, -22769, 1066, 20410, -58801, -53826, -63657, -143527, -142141, -85616, -50594, -25281, -65728, -87816, -57696, -50250, -40109, -12620, -18013, -17299, -10279, -42714, -78607, -61634, -55619, -69969, 4218, -33259, -76757, -70920, -56121, -45610, -45233, -114225, -81816, -127521, -107179, -58430, -27711, -55465, -35238, -40103, -41384, -23849, -14891, -8948, -49311, -59537, -40371, -39197, -24878, 47513, -4671, -54628, -95732, -71049, -44265, -21269, -85320, -62613, -28002, -36177, -33708, -62000, -101041, -54790, -121, -28872, -87686, -54446, -39293, 4513, -24806, -89807, -45728, -24472, 27143, -25747, -110077, -69610, -36037, -64521, -21178, -13386, 351, 47364, 15847, -8860, -24876, -26909, -43375, -83944, -103147, -72228, 47759, 4593, -18291, 40938, 15950]
932A5950k0578K7897j46967O1414J2991J1314J4645k0861k1147l4823J3007O046
920h1112j6074N8355L0907k8702M6593k029J243j04282J4257L0627Q8410O288
908D4481l8124J5459o287l075j438j7242p0434m992O7695J0888n247l3430r075
895e0821m883M022O7067l7637q583n7811N9389L2236n453p1898l9661R587L4403
882g0043N2155k5444j7457k6110J2082K5695J1214j2143M9565k1500K991J7246
870a749l866m7044P6370k1024l7103J0382J0283M4857J8979j2381l983r689n6218
857c2186k241O167k2802N2754m3325n887K3244n0918K3598p226K071n0813O4859
844d2705k3052O3396j2123J2732r884k9608J02652p3389p5868M5687P4961r34
$$ y = [15950, -4628, 23269, -123698, -62284, -49293, -37979, -23334, -44195, -65342, -100165, -87158, -81112, -97186, -38831, -7924, -36626, 9967, 7938, 9181, -95101, -80844, -50217, 38193, 44481, 6357, 21816, 15529, 12454, 11016, -6226, -76660, -81652, -13957, -3069, -8316, -41746, -50821, -55704, -51682, 15385, -22252, -30835, -88646, -29257, 2979, -2474, -74372, -114033, -104446, -70043, -17888, -43332, -60789, -86899, -74817, -49122, -37908, -50051, -486, -21986, -18995, -1749, -5615, -52659, 23711, 2687, -34416, -24034, -13751, 31106, 50085, 37704, 33721, 24032, -32186, -34427, -28260, -51062, 1692, -41633, -47520, -24276, -75194, -51596, -58822, -56751, -107564, -42705, -65757, -2361, -14484, -1752, -11636, -41244, 61408, -11981, -87849, -42162, 32799, 31865]
832C1865k3866o6072o247J9079j8719m4965L5003L0967O109o067j9407K3442l9468
819g8346L542P4258p00L7634q5406M500L1863p2108n268M2619J6202k7613o799
806f5622L4020k6211n4920L4714P4045L7458l4880l403l8800J1479J1549o840
794b7411j9051L767K8398M9431m3838l4283j8453M3776J4640l0569R532m8420
782g2481K8468M275M0323k56j8085j3477k1014L9403J07016k1313k9953J773k2891
769B1788L125k7781j1560j209K3791O264k4447o011j0673p10l8186m675O2945
756g339N657j2981j3524O836O47P8433R030J0815k9904m5508k0987J9343k916
743b398k2701J0182J6469L0330O046m1397k9442M379J8957O6380j510p2575K523
$$ y = [31865, 7999, -58073, -64320, -45241, -63960, -108925, -73922, -42955, -36846, -42913, -62320, -38878, -78346, -74804, -546, -1246, 36388, -49018, -44518, -12655, -84763, -90031, -47412, -31210, -58823, -65622, -31602, -57813, -112733, -78019, -3974, 33484, -1396, -4799, -43599, -32120, -20571, -27411, -46462, -42695, -14297, 35134, -8704, -42987, -61440, -17664, -3024, -33593, -24061, -72481, -44013, -39738, 585, 329, -17756, -31233, -52247, -12844, 94172, 72859, 42906, 44679, 21788, 24913, -2868, -14428, -15637, 8154, 14418, -10029, -16040, -26713, -27423, -65609, -70284, -7339, -1682, -14663, -28187, -21351, -20704, 57729, 66759, 77574, 47670, 2162, -18825, 518, -2398, -25099, -14917, 1552, 31882, 37928, -3469, -32911, -28532, -9575, 56805, 55295, -17280, -14757]
730a4757Q300p515K153J015J6296j8372k6862p511J5826K283o247J570P8475p112
716C7542O258R47k3108k7115k4768O3444L2787o546K1588l89p3313K7281L3669
703F8277o1510l777M825m3762k6009N9304r586L3059l601n1145N68M3570Q107
690A8320n8254P2267m7943q7015L2636Q0841L8717p1260N9738K2804n0703n5912
678d5764R2565k4138N1585n8728k2703n583o2965Q9199K74J4098k9163j1758N4639
665D1558M5670L3984O652l920r8997o288N6458k4806m8540l1203K9987R969n423
652E101j6891J6154R131K3620m9818L2471j4714k0412J7041R4833p2807k5072
640a363M1438l4632m8489P8280j5587J3669L9270o5549P175M7082n965J2209k5301
$$ y = [-14757, -6457, -13972, -11819, -10804, 5492, -12880, -39742, -47253, -31427, -29144, -35391, -33821, 44654, 37542, 43800, 44747, 21639, -5476, -30244, 33200, 65987, 59441, 81029, 80640, 7327, 34608, 68277, 6767, 2990, 7815, -35947, -61956, -2652, -12238, 20821, 17220, -33925, -33357, 10213, 18320, -39934, 32333, -15610, -102625, -69989, 10852, 49569, -21691, 38047, 60851, 10148, -45764, 46801, 22663, 74248, 15520, -7183, -12766, -75731, 13468, 13742, 27840, -1323, -13081, 41558, 87228, 121212, 127864, 123944, 24947, 18659, 75117, 50311, 1771, -29432, 555, 10524, 5101, -11790, 4364, 13495, 37115, -12703, 19768, 5054, -15358, 1683, 96516, 23709, -1363, 40075, 5443, -43046, 35234, 19647, 33316, 72586, 7037, 14212, 61294, 55329, 67538, 42237]
627D2237n3772J4741o290j780k9219Q6426j6944j2778j3732n582J2824r65O2329
614G7495q2661K1900K2607j4827m6546M9493K858m8001l1065j111Q549K0122L0769
601I582J996l8932J1634J02722J7828k1407o0392J5994O039M3901k9254k1546
589C8165K4281l0171N7377L617r3330P396K8065q3662n7472L4837J01543L0112
577F0758m8973o2488K2256M2675l7097n8523M9946J10443j3417k0815k7673N8578
565G5670l4724K7529n982m6006J2632K0881k4766j0627K4570m186Q185L0378J5210
552H8764n0996k3759K3400m0904p839o4712k1944M7849P6221O898J3921J5478
540F2377l5317J9592j7660j4722O5885l5265j1665K5965k6830m6684M9245P2805
$$ y = [42237, -11535, 3206, -3084, -4864, -34083, 52343, 35399, 22621, 8889, 3307, 16131, 15166, 77495, -5166, 16734, 39341, 24514, -22032, 27461, 30319, -17682, -48747, -49858, -41309, -21187, 9582, 11578, -27354, -15720, 87002, 104830, 83423, 23031, 39025, 45064, 88965, 59711, 38165, 62446, 32275, 89652, 93269, -61, 7335, 35400, -48262, -105734, -70897, 30646, 60758, 11785, -50703, -28447, 14228, -22869, -81392, -31446, 78997, 65580, 44765, 17092, 75670, 40946, 68475, 62493, 16487, 29119, 50000, 25234, 14607, 39177, 34991, 43176, 73554, 88764, 37768, 14009, 37409, -3495, -11334, -76046, -97990, -50141, 26080, 32978, 46899, 62377, 27060, 46652, 28992, 14270, 80155, 44890, 33225, 59190, 32360, -14324, 34921, 107726]
528A07726n686p3700o0132J07792m2206L5213M1097R019k9707k7924R731p775
516F3448L5742k5249m8341J0739O6946j5904m4108M587n5541J7039K9629O2577
504A01564j0913j6469J611n3330j6766l7171N9344M2896L4478J1739k3482m1608
492E1893l6963j2923M5927q497K9496r214k6882L1618n375O823o1780j1582q664
479a6123L9646L301M7237J8976l4882K0053R723n0993L8428O1161o952m3034l5535
466E1006J4485K0544l4324M4180N8510q6460K0805Q323n7707l1319j3602L7907
454C2348j9681l197J1784j3091k4878J8922J00448k8419k6440J5870M4335J1814
442A19815q3883m285L1747L1169l2561j5079J8854k9401L0423q3639L872R2841
$$ y = [107726, 102040, 28340, -31792, 76000, 33794, 69007, 110104, 119123, 89416, 61492, 71223, 63448, 99190, 73941, 25600, 36339, 103285, 87381, 43273, 47860, -7681, 9358, 38987, 101564, 90651, 74182, 75793, 22463, 5697, -31474, 27870, 70766, 105244, 116983, 93501, 51893, 14930, 2007, 47934, 39437, 68933, 59719, 32837, 64455, 59080, 65903, 4123, -7459, -16123, 23523, 26824, 74061, 93037, 58155, 78208, 87931, 36938, 75366, 136527, 129575, 86541, 51006, 65491, 86035, 51711, 95891, 154401, 67941, 88746, 97069, 39362, 8043, -5559, 32348, 12667, 9470, 21254, 8163, -16715, 2207, 102655, 74236, 47796, 63666, 108001, 119815, 35932, 31647, 63394, 94563, 62002, 46923, 65777, 36376, 66799, -16840, -12968, 79873]
430G9873N271J3021j4146K0816O190o814O916N7782l6923m6644J3863o9666p897
417B1642J3318J0251J9072j4219Q706L1962q894n88n2871M9349J7060K0576m4542
404G0822J5588L8617n7309j4230Q605J6703N1764l6326o6293K3581m0026k7931
392a6435K4927P7842L794q550k33N7138p8532q5322M3672K4692K7144l5034P971
379D3074O1939j3768O1321q7791J9742J9634n6831K5979J5017j61m7366L4840
367G5629L6292j1049L0550k7166k9161K0116L2258n515k6480j3111M3387k0162
355A05588o1377p765m020l0451M359J43883j8673o9870K9796L3631n2006j5238
343E7857J4530l6140n1584Q3285Q2624r826l5587j42l2433K7801j8346o5580N5746
$$ y = [79873, 85144, 98165, 84019, 104835, 111025, 104211, 111127, 168909, 131986, 85342, 99205, 29539, 21642, 34960, 45211, 64283, 50064, 58770, 90732, 81838, 81250, 28379, 77728, 94788, 115364, 70822, 86410, 125027, 67718, 53488, 62093, 78796, 130560, 94234, 27941, 51522, 11496, -16435, 8492, 86334, 90128, 81578, 81345, 138483, 59951, -25371, 18301, 42993, 70137, 35103, 43074, 105013, 91245, 152566, 64775, 84517, 104151, 47320, 73299, 88316, 88155, 40789, 75629, 111921, 100872, 131422, 104256, 75095, 95211, 127469, 121954, 95474, 82363, 125750, 105588, 44211, 36446, 32426, 1975, 6334, 150217, 131544, 61674, 91470, 125101, 73095, 57857, 72387, 36247, -15337, 67948, 150572, 140746, 105159, 105017, 72584, 100385, 82039, 16459, 72205]
330G2205L8972k1484j9329k1112L4861J1694N5484M044p704l6939m437j7684m9939
317C8632j5628O3132M0275k010k9506p3407O4236N226j5045q817M8725l1757K5141
304A09197l9895L5336k575j1770j3808L8624l7765j9991j7252L6349Q976k1117
292F4309l0795L7797R4866m1816r2449L3778J8083m3173J2862O1975N2583n0209
280A17811l8949J5971K4586P6930l838m6224J1149m6469Q8066p4463r3539p1927
268d0896Q4554L8401r943J362O7723J4987j6705m1364l3644P046N8421J2347l6482
255A05807J0165j4727K4553m0527L2365O3551l0740q564o1707Q296N733J7733
243A11938k5070m774L7744k71M2816J6914n2498K1727q8062k6979J1292L4826
$$ y = [72205, 111177, 89693, 70364, 49252, 84113, 95807, 151291, 155335, 147631, 110692, 106255, 88571, 38632, 23004, 86136, 126411, 124401, 94895, 21488, 85724, 90950, 75905, 67088, 115813, 84056, 109197, 69302, 104638, 102063, 90293, 76485, 115109, 77344, 57353, 40101, 76450, 85426, 64309, 33514, 71311, 166177, 124361, 31912, 65690, 83773, 40600, 53462, 115437, 168020, 117811, 78862, 94833, 119419, 196349, 192511, 146287, 157436, 110967, 199033, 124570, 31031, -40896, 43658, 82059, 72116, 73478, 141201, 156188, 139483, 98119, 64475, 71521, 129942, 142289, 105807, 115972, 101245, 125798, 85271, 117636, 181187, 150447, 141883, 80176, 88472, 94205, 111938, 86868, 82094, 119838, 119567, 162383, 179297, 126799, 148526, 60464, 33485, 44777, 79603]
231G9603J0951n737l1940J3222m2541j4994L1802K6491J4376j3924J3196R972
219I0477q753n7621J8354K8006L8909k2064N2881j8748J1892n2488l7607L966
207D7204O742K2880R179r621L237L9139J4723m7231N2297r903j1874j1610M3272
194A48434k329J4685M2424K1739k1665o9443p955J8637m704m2965J336L1113N4670
181A83977m576J2283m330n5720N2441K0440P658n9556N3982k1899o3266L9888
169A61322J9943l0628k5438L4632m674l6266j028J6345J9812K7861m4616m9431
157H7834J8092j915j7144M8207o1320n6454p100J18103J8467O415m3734j3835
145I5616M6936q2568L0551n6029K1710N3980M510n9991J3539L6130j2791j0803
$$ y = [79603, 90554, 84817, 52877, 66099, 23558, 8564, 40366, 66857, 81233, 67309, 80505, 90477, 81724, 24103, 42457, 70463, 109372, 87308, 140189, 121441, 133333, 80845, 43238, 47204, 53946, 76826, 86005, 76384, 79621, 118760, 133483, 86252, 138549, 128646, 116772, 105162, 148434, 146105, 160790, 203214, 224953, 203288, 133845, 125890, 144527, 139823, 96858, 98194, 129307, 183977, 179401, 191684, 187354, 131634, 184075, 204515, 212173, 152617, 206599, 184700, 121434, 161322, 181265, 150637, 125199, 159831, 155157, 118891, 117863, 134208, 154020, 181881, 137265, 87834, 105926, 104011, 86867, 135074, 73754, 17300, 10200, 128303, 146770, 153185, 109451, 95616, 142552, 59984, 90535, 34506, 56216, 110196, 114706, 54715, 68254, 104384, 91593, 80790]
133H0790r954m88K3653K0852j0917l6362P880J5848k0020Q4246L3314j7124m5826
120A25892O846j0237R720j059K643n2485j890Q0373J7785m4513k7617j4234J248
107I2472L4943j9450L0407J8992K5726l9472n629J8165n0966K0716J7300M1023
95A84227k767j8462l4081L4065o729j0300M0946k9053j9766j3060J1151N0912
83A87083r747L2225r773j9034j0960p4434m7684M0797K3132M2634N4351k7151
71A81439J306o258m7561j523K2292J9689L3131k1807m4663K4098J1321l0152K8525
58A69837J03795q8209q3376L9440K5586J1385n1972J0915p183K1077L6380l0480
46A57195k9886P246m3999K8544j1515l5795N1475J0795J4095m1078J7702j6573
$$ y = [80790, 70836, 70348, 94001, 114853, 103936, 67574, 75454, 91302, 71282, 155528, 188842, 171718, 125892, 132738, 122501, 132221, 131162, 133805, 81320, 79430, 159803, 177588, 133075, 105458, 91224, 92472, 127415, 107965, 138372, 157364, 183090, 143618, 137989, 156154, 105188, 125904, 143204, 184227, 181460, 162998, 128917, 162982, 156253, 145953, 186899, 157846, 138080, 125020, 136171, 187083, 177336, 209561, 199788, 180754, 169794, 95360, 47676, 88473, 111605, 154239, 208590, 181439, 182745, 176487, 128926, 127403, 149695, 169384, 202515, 180708, 136045, 160143, 171464, 141312, 169837, 273632, 185423, 102047, 141487, 167073, 178458, 126486, 137401, 130218, 151295, 187675, 157195, 127309, 134555, 90556, 119100, 107585, 71790, 123265, 134060, 148155, 107077, 124779, 108206]
34A08206k6621R870Q161K1718k3148J1123L1715p22L1417j3082r399l3810l8056
21G7372M3360J8904j1851J1564P030L802R985K6330k6937K6998J3959k9540J0270
8A81246K3176k9930K0795p207p0302J6811L4920L2704
0B02213
$$ y = [108206, 81585, 91455, 99616, 121334, 98186, 109309, 141024, 140302, 171719, 158637, 149238, 115428, 77372, 120732, 139636, 127785, 139349, 146379, 150181, 160166, 186496, 159559, 186557, 200516, 170976, 181246, 204422, 174492, 195287, 188080, 117778, 134589, 169509, 202213]
$$ Imaginary data points
##PAGE= N=2
##DATA TABLE= (X++(I..I)), XYDATA
16383b599746K4199N3805J7055K5505M7842N8863N9297M9304L4582k0049O8922
16372b180421Q9734K3601N089K8434P1679M9451R521K8968L1570N5918J6300M9859
16360a720297M7337N0932L1328k6340J9800P7392J9197N4898J9653N373M6796
16349a373931R1664K6282J3833L8856J2899M0800O5221L4806m696O0345Q2725
16338i11196L5962j412O7150J4743L0211K4783L1340K3584j3148L6346L3625M3683
16326e84329M6588O3256O652L3486M7248K4785O0571Q2393K0089J6102L2861M2553
16314a07745M2509Q920K6919N5728M7541N2438K4302K4678J0532r967P2350M7256
16302B95461l5849q028L2617J22981k8160m6623J19376M1411K0029K8848N6057
$$ y = [-2599746, -2575547, -2521742, -2504687, -2479182, -2431340, -2372477, -2313180, -2263876, -2229294, -2249343, -2180421, -2090687, -2067086, -2061997, -2033563, -1961884, -1912433, -1902912, -1873944, -1842374, -1786456, -1770156, -1720297, -1672960, -1622028, -1590700, -1617040, -1597240, -1519848, -1500651, -1445753, -1426100, -1420727, -1373931, -1282267, -1255985, -1242152, -1203296, -1190397, -1149597, -1084376, -1049570, -1054266, -993921, -911196, -875234, -876646, -809496, -794753, -764542, -739759, -708419, -684835, -697983, -661637, -628012, -584329, -537741, -474485, -467833, -434347, -387099, -362314, -301743, -219350, -199261, -183159, -150298, -107745, -65236, -56316, -29397, 26331, 73872, 126310, 150612, 175290, 185822, 175855, 248205, 295461, 259612, 251584, 284201, 407182, 379022, 332399, 451775, 493186, 513215, 542063, 598120]
16291E98120N6750Q368J2815J2750K7375N7265K9915J6477N9350Q408K8827N4620
16279I71040M5783Q036K9153l2937L6412M2338L1067K2676j7205L0912l319l9044
16267A124912J12690O3362P3038L1352l8058Q1985J9095L8409j227J4416l2433
16256A487541L4171M2831K3929j5950j2693O5783M8299O5094J6248P650J5261
16245A778164p6716L5190J02977N948Q274L1837p8947j0779J33107Q7855j1463
16234B005447J5237P088K3660M274k0427L2564Q8091J1012o3811N9601O584M2409
16222B211729k7482O3177J1509K2027J21794J1140r1934l1870K8066O0464Q7034
16211B465654l7938j3304L0273j1711Q602K7311L2234O4694P6123J1558m0744
$$ y = [598120, 654870, 663238, 676053, 688803, 716178, 773443, 803358, 819835, 879185, 887593, 916420, 971040, 1016823, 1024859, 1054012, 1021075, 1057487, 1099825, 1130892, 1153568, 1136363, 1167275, 1163956, 1124912, 1237602, 1300964, 1374002, 1405354, 1367296, 1449281, 1468376, 1506785, 1505558, 1519974, 1487541, 1521712, 1564543, 1588472, 1572522, 1559829, 1625612, 1673911, 1739005, 1755253, 1762903, 1778164, 1701448, 1736638, 1839615, 1845563, 1853837, 1885674, 1806727, 1795948, 1929055, 2016910, 2005447, 2020684, 2027772, 2051432, 2055706, 2035279, 2067843, 2155934, 2166946, 2103135, 2162736, 2169320, 2211729, 2184247, 2247424, 2258933, 2280960, 2402754, 2413894, 2321960, 2290090, 2318156, 2378620, 2465654, 2427716, 2414412, 2444685, 2432974, 2441576, 2468887, 2501121, 2565815, 2641938, 2653496, 2612752]
16200B612752j6907r3211K0805J4188R7745k7046o2060K0676P3069N5414Q713
16189B704138Q0324L3457J098j7677o073l0405K7599p516j2264l1178J095L0175
16177B772773P6573l5869p878J5603l322J9405M3346M9091j0182j4086l745O1584
16165B963293m241n1817P346N2995j1051n5258o283M5287j4437M0179N8360J8929
16153C043302l0327m0744j1958K0263q313J9840o2099J13943N3275K4408P2440
16142C194030r252r446q842j99N1185n3269K0236n5373m8354K7093M8990M5837
$$ y = [2612752, 2595845, 2502634, 2523439, 2537627, 2635372, 2608326, 2546266, 2566942, 2640011, 2695425, 2704138, 2784462, 2817919, 2819017, 2801340, 2795267, 2764862, 2792461, 2784945, 2772681, 2741503, 2742598, 2772773, 2849346, 2813477, 2805599, 2821202, 2817880, 2837285, 2880631, 2929722, 2919540, 2905454, 2901709, 2963293, 2959052, 2907235, 2914581, 2967576, 2956525, 2901267, 2894984, 2940271, 2925834, 2966013, 3024373, 3043302, 3012975, 2972231, 2960273, 2980536, 2972223, 2992063, 2929964, 3043907, 3097182, 3121590, 3194030, 3184778, 3175332, 3166490, 3166291, 3217476, 3164207, 3184443, 3129070, 3080716, 3107809, 3156799, 3202636]
$$ [...]
##END NTUPLES=NMR SPECTRUM
##END=
