##TITLE=1H_DE-80H_X3
 200.13MHz, d2o
 8 sc
 
 19ns.26.2.2025
##JCAMPDX= 6.0         $$ Bruker NMR JCAMP-DX V2.0
##DATA TYPE= NMR SPECTRUM
##DATA CLASS= NTUPLES
##ORIGIN= UXNMR, Bruker Analytische Messtechnik GmbH
##OWNER= pz
$$ XWIN-NMR		Version 3.5
$$ Tue Mar 17 09:56:12 2026 Russian Standard Time (UT+4h)  Yarkov@DPX200
##.OBSERVE FREQUENCY= 200.1313
##.OBSERVE NUCLEUS= ^1H
##.ACQUISITION MODE= SIMULTANEOUS
##.ACQUISITION SCHEME= undefined
##.AVERAGES= 8
##.DIGITISER RES= 18
##SPECTROMETER/DATA SYSTEM= spect
##.PULSE SEQUENCE= zg30
##.SOLVENT NAME= CDCl3
##.SHIFT REFERENCE= (INTERNAL, CDCl3, 0, 15.4439)
##AUDIT TRAIL= $$ (NUMBER, WHEN, WHO, WHERE, WHAT)
$$ ##TITLE= Audit trail, XWIN-NMR		Version 3.5
$$ ##JCAMPDX= 5.01
$$ ##ORIGIN= Bruker BioSpin GmbH
$$ ##OWNER= Yarkov
$$ C:/Bruker/XWIN-NMR/data/yarkov2/nmr/H-C/1/pdata/1/auditp.txt
$$ ##AUDIT TRAIL=  $$ (NUMBER, WHEN, WHO, WHERE, WHAT)
(   1,<2026-03-17 09:55:20.06 +0400>,<Yarkov>,<DPX200>,
      <created by zg, POWCHK disabled, PULCHK disabled
       configuration hash MD5:
       00 E9 B6 7A A2 85 ED C7 34 08 36 98 17 FE 4E 26
       data hash MD5: 16K
       F8 46 AA 82 26 BC 96 BE E7 0D 54 08 2B 88 AD F8>)
(   2,<2026-03-17 09:55:24.20 +0400>,<Yarkov>,<DPX200>,
      <Start of raw data processing
       efp BC_mod = 2 LB = 0.25 FT_mod = 6 PKNL = 1 PHC0 = -5299.148 PHC1 = 6.821927 SI = 16K 
       data hash MD5: 16K
       AE 8B 6B 4E 8D 51 D3 C0 FD D7 BA BB 05 C3 AF 69>)
$$ ##END=
$$ 
$$ hash MD5
$$ F5 D0 00 1F F3 9C 90 C7 ED 17 06 BB 26 A8 31 4F
##$RELAX= 
##$RELAX= 
##$RELAX= 
##$RELAX= 
##$RELAX= 
##$RELAX= 
$$ Bruker specific parameters
$$ --------------------------
##$DU= <C:/Bruker/XWIN-NMR>
##$EXPNO= 1
##$NAME= <H-C>
##$PROCNO= 1
##$TYPE= <nmr>
##$USER= <yarkov2>
##$AMP= (0..31)
100 100 100 100 100 100 100 100 100 100 100 100 100 100 100 100 100 100 
100 100 100 100 100 100 100 100 100 100 100 100 100 100 
##$AQSEQ= 0
##$AQ_mod= 1
##$AUNM= <au_zg>
##$AUTOPOS= <>
##$BF1= 200.13
##$BF2= 200.13
##$BF3= 200.13
##$BF4= 200.13
##$BF5= 200.13
##$BF6= 200.13
##$BF7= 200.13
##$BF8= 200.13
##$BYTORDA= 1
##$CFDGTYP= 0
##$CFRGTYP= 5
##$CHEMSTR= <none>
##$CNST= (0..31)
1 1 145 1 1 1 1 1 1 1 1 1 1 1 1 1 1 1 1 1 1 1 1 1 1 1 1 1 1 1 1 1 
##$CPDPRG= <>
##$CPDPRG1= <>
##$CPDPRG2= <>
##$CPDPRG3= <>
##$CPDPRG4= <mlev>
##$CPDPRG5= <mlev>
##$CPDPRG6= <mlev>
##$CPDPRG7= <mlev>
##$CPDPRG8= <mlev>
##$CPDPRGB= <>
##$CPDPRGT= <>
##$D= (0..31)
0 0.7 0 0 0 0 0 0 0 0 0 0.03 0 0 0 0 0 0 0 0 0 0 0 0 0 0 0 0 0 0 0 0 
##$DATE= 1773726919
##$DBL= (0..7)
120 120 120 120 120 120 120 120 
##$DBP= (0..7)
150 150 150 150 150 150 150 150 
##$DBP07= 0
##$DBPNAM0= <>
##$DBPNAM1= <>
##$DBPNAM2= <>
##$DBPNAM3= <>
##$DBPNAM4= <>
##$DBPNAM5= <>
##$DBPNAM6= <>
##$DBPNAM7= <>
##$DBPOAL= (0..7)
0.5 0.5 0.5 0.5 0.5 0.5 0.5 0.5 
##$DBPOFFS= (0..7)
0 0 0 0 0 0 0 0 
##$DE= 6
##$DECBNUC= <off>
##$DECIM= 32
##$DECNUC= <off>
##$DECSTAT= 4
##$DIGMOD= 1
##$DIGTYP= 9
##$DL= (0..7)
0 120 120 120 120 120 120 120 
##$DP= (0..7)
$$ [...]
##$SUBNAM2= <"">
##$SUBNAM3= <"">
##$SUBNAM4= <"">
##$SUBNAM5= <"">
##$SUBNAM6= <"">
##$SUBNAM7= <"">
##$SUBNAM8= <"">
##$SUBNAM9= <"">
##$SW= 18.0517328524113
##$SWIBOX= (0..15)
0 0 2 0 0 0 0 0 0 0 0 0 0 0 0 0 
##$SW_h= 3612.71676300578
##$TD= 16384
##$TD0= 1
##$TE= 0
##$TE2= 300
##$TE3= 300
##$TEG= 300
##$TL= (0..7)
0 120 120 120 120 120 120 120 
##$TP= (0..7)
150 150 150 150 150 150 150 150 
##$TP07= 0
##$TPNAME0= <>
##$TPNAME1= <>
##$TPNAME2= <>
##$TPNAME3= <>
##$TPNAME4= <>
##$TPNAME5= <>
##$TPNAME6= <>
##$TPNAME7= <>
##$TPOAL= (0..7)
0.5 0.5 0.5 0.5 0.5 0.5 0.5 0.5 
##$TPOFFS= (0..7)
0 0 0 0 0 0 0 0 
##$TUNHIN= 0
##$TUNHOUT= 0
##$TUNXOUT= 0
##$USERA1= <user>
##$USERA2= <user>
##$USERA3= <user>
##$USERA4= <user>
##$USERA5= <user>
##$V9= 5
##$VALIST= <valist>
##$VCLIST= <CCCCCCCCCCCCCCC>
##$VD= 0
##$VDLIST= <DDDDDDDDDDDDDDD>
##$VPLIST= <PPPPPPPPPPPPPPP>
##$VTLIST= <TTTTTTTTTTTTTTT>
##$WBST= 1024
##$WBSW= 4
##$XGAIN= (0..3)
0 0 0 0 
##$XL= 0
##$YL= 0
##$YMAX_a= 627696
##$YMIN_a= -591024
##$ZGOPTNS= <>
##$ZL1= 120
##$ZL2= 120
##$ZL3= 120
##$ZL4= 120
##$ABSF1= 0
##$ABSF2= 0
##$ABSG= 0
##$ABSL= 0
##$ALPHA= 0
##$AQORDER= 0
##$ASSFAC= 0
##$ASSFACI= 0
##$ASSFACX= 0
##$ASSWID= 0
##$AUNMP= <proc_1d>
##$AZFE= 0.1
##$AZFW= 0.1
##$BCFW= 0
##$BC_mod= 2
##$BYTORDP= 0
##$COROFFS= 0
##$CY= -3
##$DATMOD= 1
##$DC= 0
##$DFILT= <>
##$DTYPP= 0
##$F1P= 0
##$F2P= 0
##$FCOR= 1
##$FTSIZE= 16384
##$FT_mod= 6
##$GAMMA= 0
##$GB= 0
##$INTBC= 1
##$INTSCL= 3.241238e-09
##$ISEN= 128
##$LB= 0.25
##$LEV0= 0
##$LPBIN= 0
##$MAXI= 10000
##$MC2= 0
##$MEAN= 0
##$ME_mod= 0
##$MI= 1.114404
##$NCOEF= 0
##$NC_proc= -5
##$NLEV= 6
##$NOISF1= 3.799351
##$NOISF2= 2.8
##$NSP= 0
##$NTH_PI= 0
##$NZP= 0
##$OFFSET= 15.44389
##$PC= 1
##$PHC0= -5299.148
##$PHC1= 6.821927
##$PH_mod= 1
##$PKNL= yes
##$PPARMOD= 0
##$PSCAL= 0
##$PSIGN= 0
##$REVERSE= no
##$SF= 200.130015572412
##$SI= 16384
##$SIGF1= 3
##$SIGF2= 2
##$SINO= 0.751879
##$SIOLD= 32768
##$SREGLST= <19F.Aceton>
##$SSB= 0
##$STSI= 16384
##$STSR= 0
##$SW_p= 3612.71676300578
##$SYMM= 0
##$S_DEV= 0
##$TDeff= 16384
##$TDoff= 0
##$TI= <>
##$TILT= no
##$TM1= 0
##$TM2= 0
##$TOPLEV= 0
##$USERP1= <user>
##$USERP2= <user>
##$USERP3= <user>
##$USERP4= <user>
##$USERP5= <user>
##$WDW= 1
##$XDIM= 16384
##$YMAX_p= 370575167
##$YMIN_p= -741188
$$ End of Bruker specific parameters
$$ ---------------------------------
##NTUPLES= NMR SPECTRUM
##VAR_NAME=  FREQUENCY,     SPECTRUM/REAL,   SPECTRUM/IMAG
##SYMBOL=    X,             R,               I
##VAR_TYPE=  INDEPENDENT,   DEPENDENT,       DEPENDENT
##VAR_FORM=  AFFN,          ASDF,            ASDF
##VAR_DIM=   16384,         16384,           16384
##UNITS=     HZ,            ARBITRARY UNITS, ARBITRARY UNITS
##FACTOR=    0.220516191357247, 1,           1
##FIRST=     3090.78586973293, 0,            0
##LAST=      -521.930893272855, 0,           0
##MIN=       -521.930893272855, -741188,     0
##MAX=       3090.78586973293, 370575167,    0
$$ Real data points
##PAGE= N=1
##DATA TABLE= (X++(R..R)), XYDATA
$$ [...]
5934A1696440N66668N49558O15568N95444N48522M34020K22719R865k06816k63751
$$ 11696440 12263108 12812666 13428234 14023678 14572200 15006220 15228939 15238804 15031988 14768237
5924A4768237l27762k15885j50559j1842J29538K59620L75305M02141M51213M64600
$$ 14768237 14440475 14224590 14074031 14062189 14191727 14451347 14826652 15228793 15680006 16144606
5914A6144606M77329M17516L01231J03379m2220o5114q7981j36551j10328j06562
$$ 16144606 16621935 17039451 17340682 17444061 17401841 17336727 17248746 17112195 17001867 16895305
5904A6895305j13615q6540p505N4120K09799L43817M38092M54557L88037J59426
$$ 16895305 16781690 16695150 16687645 16741765 16951564 17295381 17733473 18188030 18576067 18735493
5894A8735493q5836k56707l22242k40407j47650o8953m7418j72283k41902l07665
$$ 18735493 18649657 18392950 18070708 17830301 17682651 17613698 17566280 17393997 17152095 16844430
5884A6844430k99598k71222k59703l03055k46758j95516j50771j07167n2434j0258
$$ 16844430 16544832 16273610 16013907 15710852 15464094 15268578 15117807 15010640 14958206 14947948
5874A4947948r613L7783J4940j2563m3907j47216k68018l99919n39314n63680
$$ 14947948 14938335 14976118 14991058 14978495 14934588 14787372 14519354 14119435 13580121 13016441
5864A3016441o36059n47343m23867l68118k82479j61132k44781l12153l56759
$$ 13016441 12380382 11833039 11409172 11041054 10758575 10597443 10352662 10040509 9683750
5855I683750l66121l93576l33703k91489k89637k02578k04804j91300j16843q5352
$$ 9683750 9317629 8924053 8590350 8298861 8009224 7806646 7601842 7410542 7293699 7208347
5845G208347j28070k24227k54147k79805l15276l38703l71510l05129l22800k25670
$$ 7208347 7080277 6856050 6601903 6322098 6006822 5668119 5296609 4991480 4668680 4443010
5835D443010j90103j57410o1400j5609l0356n2849n2427r7555j65468j77238k21499
$$ 4443010 4252907 4095497 4034097 4018488 3988132 3935283 3882856 3785301 3619833 3442595 3221096
5824C221096j59390j63260j86937r2733q6448r1111j15648m9518m2710q8986o9908
$$ 3221096 3061706 2898446 2711509 2618776 2532328 2441217 2325569 2276051 2233341 2144355 2074447
5813B074447o5432m5944l4449o7219j09291j2490n903l2190j4839j6824j4391
$$ 2074447 2009015 1963071 1928622 1861403 1752112 1739622 1733719 1701529 1686690 1669866 1655475
5802A655475m9880R52J2619m2303j8886L30k1847n484j2959K82l0939j5132l7924
$$ 1655475 1605595 1606547 1619166 1576863 1557977 1558307 1536460 1530976 1518017 1518299 1487360 1472228 1434304
5789A434304l3888J95j8412J2631j9541m012K6859j3673m8497K1797K3570l5327
$$ 1434304 1400416 1400611 1382199 1394830 1375289 1371277 1398136 1384463 1335966 1357763 1381333 1346006
5777A346006m6065K5302J722J9752j9972j1829j1750M797K9733l5588j0471l3127
$$ 1346006 1299941 1325243 1326965 1346717 1326745 1314916 1303166 1307963 1337696 1302108 1291637 1258510
5765A258510j1034k763K1125k458P300j5419l356l8091M4878J1086j4496p373
$$ 1258510 1247476 1244713 1265838 1263380 1270680 1255261 1251905 1213814 1258692 1269778 1255282 1247909
5753A247909m413R441j5588P855n763J2022p729J7042n845L0375k2224n158K8416
$$ 1247909 1243496 1252937 1237349 1245204 1239441 1251463 1243734 1260776 1254931 1285306 1263082 1257924 1286340
5740A286340O404q191j8287p185n591N767j0614m791j6803J2063J7642n157Q908
$$ 1286340 1292744 1284553 1266266 1259081 1253490 1259257 1248643 1243852 1227049 1239112 1256754 1251597 1260505
5727A260505L3470k0221j8069M6001K4303k3885J6772K4902Q559R687K1501K6816
$$ 1260505 1293975 1273754 1255685 1301686 1325989 1302104 1318876 1343778 1352337 1362024 1383525 1410341
5715A410341Q3267O3339O5018J24023J15409K23003L60205L40413J59946o5268
$$ 1410341 1493608 1556947 1621965 1745988 1861397 2084400 2444605 2785018 2944964 2879696
5705B879696j41123j79641j86948j98114j11392j02286j15177o3612o4628m0448
$$ 2879696 2738573 2558932 2371984 2173870 2062478 1960192 1845015 1781403 1716775 1676327
5695A676327k9042j5210Q005L8865p416L909L0002M778P1829N4549O5687P9997
$$ 1676327 1647285 1632075 1640080 1678945 1671529 1675438 1705440 1710218 1782047 1836596 1902283 1982280
5683A982280R4060J58959J60952K55872M37115P01659R91035R96396L44842m15037
$$ 1982280 2076340 2235299 2396251 2652123 3089238 3790897 4781932 5778328 6123170 5708133
5673E708133o72774p11054o68789n01845l64786l10768k08533j49599j64503l0491
$$ 5708133 5035359 4324305 3655516 3153671 2788885 2478117 2269584 2119985 1955482 1924991
5663A924991l1895o8746l5628J9003K9288J5662J9520Q716M3599L9773P975J17317
$$ 1924991 1893096 1824350 1788722 1807725 1837013 1852675 1872195 1880911 1924510 1964283 1972258 2089575
5651B089575R8021J23339J93916K49020M13752P39262J007899Q78404K24539m52934
$$ 2089575 2187596 2310935 2504851 2753871 3167623 3906885 4914784 5793188 6017727 5564793
5641E564793o99756p26596o52008m80703l49057l01609j96417j78526j40055m8051
$$ 5564793 4865037 4138441 3486433 3005730 2656673 2355064 2158647 1980121 1840066 1792015
5631A792015p1756l8404k6460j7643j41l6854k6009L7467K4255K4075L5726M2673
$$ 1792015 1720259 1681855 1655395 1637752 1637611 1600757 1574748 1612215 1636470 1660545 1696271 1738944
5619A738944P2276Q3409Q0121O4738O7554K43710L10875K27647J539j95908k31413
$$ 1738944 1811220 1894629 1974750 2039488 2107042 2350752 2661627 2889274 2890813 2694905 2463492
5608B463492k53083k12239j90441j39138j13133o5457o2012k0855q300k7172n4772
$$ 2463492 2210409 1998170 1807729 1668591 1555458 1490001 1427989 1407134 1398834 1371662 1316890
5597A316890P179Q307j7538L3289N196k1228j3683K5643L9199L9217K8049j7299
$$ 1316890 1324069 1332376 1314838 1348127 1353323 1332095 1318412 1344055 1383254 1422471 1450520 1433221
5585A433221j286o649j7092k0075k2354j6944n827r592k6476m6446o111M4865
$$ 1433221 1431935 1425286 1408194 1388119 1365765 1348821 1342994 1333402 1306926 1260480 1254369 1299234
5573A299234J7664k4760n003r849N970M1886n3979j1370n592J8554N244l1649
$$ 1299234 1316898 1292138 1287135 1277286 1283256 1325142 1271163 1259793 1254201 1272755 1277999 1246350
5561A246350j716j9434J8377K2859M133k2194j0675j8108K7936K175L054j2447
$$ 1246350 1244634 1225200 1243577 1266436 1270569 1248375 1237700 1219592 1247528 1249703 1252757 1240310
5549A240310j7055p314J1698N575L738l630n502k7938j3346j6944k0748o819L5453
$$ 1240310 1223255 1215941 1227639 1233214 1236952 1233322 1227820 1199882 1186536 1169592 1148844 1142025 1177478
5536A177478L543j4508k7373J0770j2867K014J6478J80K5960k0055k2475l581
$$ 1177478 1181021 1166513 1139140 1149910 1137043 1139057 1155535 1155715 1181675 1161620 1139145 1135564
5524A135564J7917K0797n547Q745K2211k086q884l8551L16j9054M3630K5840l476
$$ 1135564 1153481 1174278 1168731 1177476 1199687 1197601 1188717 1150166 1150482 1131428 1175058 1200898 1197422
5511A197422k5010j1940K1107l162Q405J3308J1575j5661K3507j2408j5537L9234
$$ 1197422 1172412 1160472 1181579 1178417 1186822 1200130 1211705 1196044 1219551 1207143 1191606 1230840
5499A230840J4271l1139j966J6474k7010m909J0819j343l2469K6778j1564J5884
$$ 1230840 1245111 1213972 1212006 1228480 1201470 1196561 1207380 1206037 1173568 1200346 1188782 1204666
5487A204666J4493J3208P571q893K6049m2641j1074J830R715N189R235J1623J018
$$ 1204666 1219159 1232367 1239938 1231045 1257094 1214453 1203379 1205209 1214924 1220113 1229348 1240971 1241989
5474A241989K6712P271l967j7665J6082k3568q207j1123k2018j901J95j1455J5479
$$ 1241989 1268701 1275972 1272005 1254340 1270422 1246854 1238647 1227524 1205506 1203605 1203800 1192345 1207824
5461A207824J0477M524k6599K941K0388K6280L7322j135k1728k5082J7250p638
$$ 1207824 1218301 1222825 1196226 1199167 1219555 1245835 1283157 1282022 1260294 1235212 1252462 1244824
5449A244824M521j262K2277M4074k8076j5296J4272K6193K1424N441k8539q890
$$ 1244824 1249345 1248083 1270360 1314434 1286358 1271062 1285334 1311527 1332951 1338392 1309853 1300963
5437A300963J7870J0673K0896Q391j9736k2953Q216n096j9745O103L4102J6719
$$ 1300963 1318833 1329506 1350402 1358793 1339057 1316104 1324320 1319224 1299479 1305582 1339684 1356403
5425A356403M111J808k2275j2921K852j4556P848n582J4146K4355j1970Q179l4837
$$ 1356403 1360514 1362322 1340047 1327126 1329978 1315422 1323270 1317688 1331834 1356189 1344219 1352398 1317561
5412A317561n5676k1236M9023M633M925Q516J7213J2233r742K5956K3922j5416
$$ 1317561 1261885 1240649 1289672 1294305 1299230 1307746 1324959 1337192 1327450 1353406 1377328 1361912
5400A361912L967K7500k5912o901N0382M4621l866n3357J8919j9261k3977L1230
$$ 1361912 1365879 1393379 1367467 1360566 1410948 1455569 1451703 1398346 1417265 1398004 1374027 1405257
5388A405257k5026J9326p359k6887K9164J8627k8487K2268j220j6150l0404J2450
$$ 1405257 1380231 1399557 1392198 1365311 1394475 1413102 1384615 1406883 1405663 1389513 1359109 1371559
5376A371559j0206M7810l8827L1315R593k098L6295j8129K2881j7027j9013L1204
$$ 1371559 1361353 1409163 1370336 1401651 1411244 1409146 1445441 1427312 1450193 1433166 1414153 1445357
5364A445357M0716J6022r472j1168L2555N122r357p070R218R772K1007L0881j1263
$$ 1445357 1486073 1502095 1492623 1481455 1514010 1519132 1509775 1502705 1511923 1521695 1542702 1573583 1562320
5351A562320j8541J4681P246l1265N734q485o300L30K1609Q228l8137j5423l726
$$ 1562320 1543779 1558460 1565706 1534441 1540175 1531690 1525390 1525720 1547329 1555557 1517420 1501997 1498271
5338A498271j9084l432M38M605L5013m676k2715K1208j1676N748M6843l3363k9708
$$ 1498271 1479187 1475755 1476193 1480798 1515811 1511135 1488420 1509628 1497952 1503700 1550543 1517180 1487472
5325A487472K6090M24m708J1115n972j357r307J9942J5784o21l716L2681k023
$$ 1487472 1513562 1513986 1509278 1520393 1514421 1513064 1503757 1523699 1539483 1538862 1535146 1567827 1565804
5312A565804k0929M8601J8482l3797l2854j7308J4466K0417R211j3672R458l6234
$$ 1565804 1544875 1593476 1611958 1578161 1545307 1527999 1542465 1562882 1572093 1558421 1567879 1531645
5300A531645m914K7976j1883k7009j5151J611k2556M9556L063j6087l591K2074
$$ 1531645 1526731 1554707 1542824 1515815 1500664 1502275 1479719 1529275 1532338 1516251 1512660 1534734
5288A534734R833k0940k600l249J3277J4518K006R249k555m4703j650l3554M0423
$$ 1534734 1544567 1523627 1521027 1517778 1531055 1545573 1547579 1556828 1554273 1509570 1507920 1474366 1514789
5275A514789R311R76J8773K7274o9j0397j1934j8549m2066K3489k8577M0568K7167
$$ 1514789 1524100 1525076 1543849 1571123 1571054 1560657 1548723 1530174 1488108 1511597 1483020 1523588 1550755
5262A550755Q347o246J2410j8864N205K4325j0892K071k1776J9834l3790j3088
$$ 1550755 1559102 1552856 1565266 1546402 1551607 1575932 1565040 1567111 1545335 1565169 1531379 1518291
5250A518291J9180L0579l4726J1356J8466K7592L6504j4681l805J4762r391q71
$$ 1518291 1537471 1568050 1533324 1544680 1563146 1590738 1627242 1612561 1608756 1623518 1614127 1613256
5238A613256N281J7622j4265m234j0181Q420L3972m8909j9114J0943j8583M2513
$$ 1613256 1618537 1636159 1621894 1617660 1607479 1615899 1649871 1600962 1581848 1592791 1574208 1616721
5226A616721j909K9573p424J156J3720K3782J3208Q574j7445m1508P435J9805
$$ 1616721 1614812 1644385 1636961 1638117 1651837 1675619 1688827 1697401 1679956 1638448 1645883 1665688
5214A665688L4637j9520l4760K0367M365K1426K2719j0388K2704J6200O812K5711
$$ 1665688 1700325 1680805 1646045 1666412 1670777 1692203 1714922 1704534 1727238 1743438 1750250 1775961
5202A775961l25j7316K6264K9570k5869l3190J8780N8709l7316J0253J2521J695
$$ 1775961 1775636 1758320 1784584 1814154 1788285 1755095 1773875 1832584 1795268 1805521 1818042 1819737
5190A819737j3270k740N2126O928r211N627J1599J4145k544L913J5028K646o909
$$ 1819737 1806467 1803727 1855853 1862781 1853570 1859197 1870796 1884941 1882397 1886310 1901338 1903984 1897075
5177A897075M112J5667K3151K6310j8905j0277k0159J0804N1470K8172J2278j4051
$$ 1897075 1901187 1916854 1940005 1966315 1947410 1937133 1916974 1927778 1979248 2007420 2019698 2005647
5165B005647m445J4241L2955Q363K4882K0277L4084M3216l41K1186J3726L2156
$$ 2005647 2001202 2015443 2048398 2056761 2081643 2101920 2136004 2179220 2178879 2200065 2213791 2245947
5153B245947j3864N2386L5008K6394j6013K5092J7935L9704L5775J3173K5551
$$ 2245947 2232083 2284469 2319477 2345871 2329858 2354950 2372885 2412589 2448364 2461537 2487088
5142B487088j8970K81r659P124l204J8322J8445M14K8890K1928q390l1896M4322
$$ 2487088 2468118 2468399 2458740 2465864 2462660 2480982 2499427 2499841 2528731 2550659 2542269 2510373 2554695
5129B554695J0982J2791R762Q304R84j8120J9378P692k817j9003L025K4780K9080
$$ 2554695 2565677 2578468 2588230 2596534 2597518 2579398 2598776 2606468 2603651 2584648 2587673 2612453 2641533
5116B641533J3683K4010K4782P681k8815o405J4227J9189j0989J7056O99r400
$$ 2641533 2655216 2679226 2704008 2711689 2682874 2676469 2690696 2709885 2698896 2715952 2716651 2707251
5104B707251P73k9796j8505j4569O493k4762Q375j31q920N949m1460M1723L0069
$$ 2707251 2708024 2678228 2659723 2645154 2651647 2626885 2635260 2635129 2626209 2632158 2590698 2632421 2662490
5091B662490j4027J7562J5758J8945L8925j0929J2930J7219L9345J3678N3657
$$ 2662490 2648463 2666025 2681783 2700728 2739653 2728724 2741654 2758873 2798218 2811896 2865553
5080B865553k4047L4784L4805J7682M3782J5702K0486j2981K2085l91r893N462
$$ 2865553 2841506 2876290 2911095 2928777 2972559 2988261 3008747 2995766 3017851 3017460 3007567 3013029
5068C013029K8415j3521M5114K926J6746K4392m099N2712N2780K4305M2612L1476
$$ 3013029 3041444 3027923 3073037 3075963 3092709 3117101 3113002 3165714 3218494 3242799 3285411 3316887
5056C316887N5592O0500r666J6137Q688l3736j0512j2550n847p765l0219k8006
$$ 3316887 3372479 3432979 3423313 3439450 3448138 3414402 3403890 3391340 3385493 3377728 3347509 3319503
5044C319503J7988N8825r376o969L7095j2497M6753M1780N8203N1163M8788P7498
$$ 3319503 3337491 3396316 3386940 3379971 3417066 3404569 3451322 3493102 3551305 3602468 3651256 3728754
5032C728754M4968N1408M8530J8153M4996K6325l828j7931l9682l2458k9617k5104
$$ 3728754 3773722 3825130 3873660 3891813 3936809 3963134 3959306 3941375 3901693 3869235 3839618 3814514
5020C814514q049k8193k6205m201l5j3975k3172k7508Q241q457L9686L2055P163
$$ 3814514 3806465 3778272 3752067 3747866 3747831 3733856 3710684 3683176 3691417 3682960 3722646 3754701 3761864
5007C761864M0173k1734J8151J1788M2153N6523N1107l897L2389L6671K6846L4054
$$ 3761864 3802037 3780303 3798454 3810242 3852395 3908918 3960025 3956128 3988517 4025188 4052034 4086088
4995D086088J0745K3043J9507k5311o083l068J6043P9407Q926N6441M9973K2927
$$ 4086088 4096833 4119876 4139383 4114072 4107989 4104921 4120964 4200371 4209297 4265738 4315711 4338638
4983D338638Q1793J09711J57377J45638J30697J21570J8863n3392r0253j14616
$$ 4338638 4420431 4530142 4687519 4833157 4963854 5085424 5104287 5050895 4960642 4846026
4973D846026o8595o7471j4622r203p582L2704K3376L4164J1686P3754O3604L7464
$$ 4846026 4777431 4709960 4695338 4686135 4678553 4711257 4734633 4768797 4780483 4854237 4917841 4955305
4961D955305K7906K8613O0428L3949K0968P0518L6944L5248P5205J10135O5012
$$ 4955305 4983211 5011824 5072252 5106201 5127169 5197687 5234631 5269879 5345084 5455219 5520231
4950E520231R5201J11235J49013J15845Q6077J01173P6278J05135Q9605R7180
$$ 5520231 5615432 5726667 5875680 5991525 6077602 6178775 6255053 6360188 6449793 6546973
4940F546973P0480Q4120L8415Q0531J05008O2502N5950J10594Q6176J29789J38209
$$ 6546973 6617453 6701573 6739988 6820519 6925527 6988029 7043979 7154573 7240749 7370538 7508747
4929G508747J13152J58570J63663J23856J19451J27732J62899J83629J78977K21751
$$ 7508747 7621899 7780469 7944132 8067988 8187439 8315171 8478070 8661699 8840676 9062427
4919I062427K61351L18447K82453K77375K88866K93106K41469J77733K50996K63321
$$ 9062427 9323778 9642225 9924678 10202053 10490919 10784025 11025494 11203227 11454223 11717544
4909A1717544L52437M84403O51436P75120R99626J232583J279040J058343O17748
$$ 11717544 12069981 12554384 13205820 13980940 14980566 16213149 17492189 18550532 19168280
4900A9168280J27451l65526n86635n96290n98606m42330l45172j38740O5887K74688
$$ 19168280 19295731 18930205 18343570 17747280 17148674 16706344 16361172 16222432 16288319 16563007
4890A6563007M64925O68388R37396J178357J311379J137461P66828K38708j89825
$$ 16563007 17027932 17696320 18633716 19812073 21123452 22260913 23027741 23266449 23076624
4881B3076624m39826m91418l68830k02758p588K13961L79075N60549O86464Q16220
$$ 23076624 22636798 22145380 21776550 21573792 21566204 21780165 22159240 22719789 23406253 24222473
4871B4222473Q63612R21296R53820J004139R95138R66699R24718Q55365Q34186
$$ 24222473 25086085 26007381 26961201 27965340 28960478 29927177 30851895 31707260 32541446
4862C2541446P84882Q09029Q86502R17624J107166J269161J520533J810556K094819
$$ 32541446 33326328 34135357 35021859 35939483 37046649 38315810 39836343 41646899 43741718
4853D3741718K431586K666254K798159K956510L081563L055154K797425K328511
$$ 43741718 46173304 48839558 51637717 54594227 57675790 60730944 63528369 65856880
4845F5856880J751157J211706P37627L84905K13659J88374J81450K22061L61736
$$ 65856880 67608037 68819743 69557370 69942275 70155934 70344308 70525758 70747819 71109555
4836G1109555M49933N70279O51992O28463N10549K20802k12694o14873r52206
$$ 71109555 71559488 72129767 72781759 73410222 73920771 74141573 73928879 73314006 72361800
4827G2361800j145942j168951j167309j212749j402694j696121j862297j857791
$$ 72361800 71215858 70046907 68879598 67666849 66264155 64568034 62705737 60847946
4819F0847946j722790j522323j386519j239219j017154p51902n11709j67895J69544
$$ 60847946 59125156 57602833 56216314 54977095 53959941 53208039 52696330 52528435 52697979
4810E2697979M98806Q17734R29342R24924O31543K40946j58010m20135m25870
$$ 52697979 53196785 54014519 54943861 55868785 56500328 56741274 56583264 56163129 55737259
4801E5737259k67342J9899K76344L78925L32883K36763J57229J23809J11183R6173
$$ 55737259 55469917 55489816 55766160 56145085 56477968 56714731 56871960 56995769 57106952 57203125
4791E7203125M9321o0843j97789l16237m73377o15870o28457n94662n00349l44665
$$ 57203125 57252446 57191603 56993814 56677577 56204200 55588330 54959873 54365211 53864862 53520197
4781E3520197k11261o4218J25680K58134M65213P34133J140889J694988K180257
$$ 53520197 53308936 53244718 53370398 53628532 54093745 54827878 55968767 57663755 59844012
4772E9844012K620788K972531L154499L064819K655489J978778J106869K27595
$$ 59844012 62464800 65437331 68591830 71656649 74312138 76290916 77397785 77625380
4764G7625380o29868j425528k174570k711529k973527l025868k869294k652027
$$ 77625380 76995512 75569984 73395414 70683885 67710358 64684490 61815196 59163169
4756E9163169k275082j850215j345516r24362p87395q31150j031891j299859j415664
$$ 59163169 56888087 55037872 53692356 52767994 51980599 51149449 50117558 48817699 47402035
4747D7402035j303324j194014j053450r44317q34853p33054p54594q11482r23946
$$ 47402035 46098711 44904697 43851247 42906930 42072077 41339023 40584429 39772947 38849001
4738C8849001j097516j296223j533493j736885j830535j863461j831962j720137
$$ 38849001 37751485 36455262 34921769 33184884 31354349 29490888 27658926 25938789
4730B5938789j616875j527019j456661j332126j198108j059319r55369q60119
$$ 25938789 24321914 22794895 21338234 20006108 18808000 17748681 16793312 15933193
4722A5933193p67569o75943o38679o23148n08621m22792l67501l18862l27237
$$ 15933193 15165624 14489681 13851002 13227854 12719233 12296441 11928940 11610078 11282841
4713A1282841k95054k08061j82028j93223j19295p0599n9942m227K6056l8815
$$ 11282841 10987787 10779726 10597698 10404475 10285180 10214581 10154639 10150412 10176468 10137653
4703A0137653K1104L5708K8480k499o2090l0436l5755o1191m7419M226K4121j0474
$$ 10137653 10158757 10194465 10222945 10220446 10158356 10127920 10092165 10030974 9983555 9987781 10011902 10001428
4691A0001428N583K526L3135J03000R6494J88636K46626K84634L39587M63203
$$ 10001428 10007011 10009537 10042672 10145672 10242166 10430802 10677428 10962062 11301649 11764852
4681A1764852N73843P23517R18903J115152J185070J073940O52378J29875l68502
$$ 11764852 12338695 13062212 13981115 15096267 16281337 17355277 18007655 18137530 17769028
4672A7769028p73755r48942r64738r13824q06912p04174o08555n02322l55038
$$ 17769028 16995273 16046331 15081593 14167769 13360857 12656683 12048128 11545806 11190768
4663A1190768k47373j81299j10040k7787M7684R9890Q3805J49345K08231K78852
$$ 11190768 10943395 10762096 10652056 10624269 10671953 10771843 10855648 11004993 11213224 11492076
4653A1492076L58336M22470N09654P11791Q70998J041047J414132J725828J913029
$$ 11492076 11850412 12272882 12782536 13494327 14365325 15406372 16820504 18546332 20459361
4644B0459361J814741J446478R39059M28843P081l54532p67509j142243j463712
$$ 20459361 22274102 23720580 24659639 25088482 25095563 24741031 23973522 22831279 21367567
4635B1367567j633169j635541j495239j250471j038330q20241o46554n17478l47396
$$ 21367567 19734398 18098857 16603618 15353147 14314817 13494576 12848022 12330544 11983148
4626A1983148j70912O6365K20224M06521N16004M90431L28485O6600j38890j94660
$$ 11983148 11812236 11878601 12098825 12505346 13021350 13511781 13840266 13906866 13767976 13573316
4616A3573316j68140r172J58995M50805P97630J083758J294178J188258P67104
$$ 13573316 13405176 13396004 13554999 14005804 14803434 15887192 17181370 18369628 19136732
4607A9136732J26795n01729j025695j229574j190348j095815r49070o99774m72282
$$ 19136732 19263527 18761798 17736103 16506529 15316181 14220366 13271296 12571522 12099240
4598A2099240k91208j69582N9726K14569M34370N78842P45368Q84570R50404Q87703
$$ 12099240 11808032 11638450 11698176 11912745 12347115 12925957 13671325 14555895 15506299 16394002
4588A6394002O87093M14855R6884j18402m23735o92369r25622j122002j206923
$$ 16394002 17081095 17495950 17592834 17474432 17050697 16358328 15432706 14310704 13103781
4579A3103781j113131j034445q64803p11898o09466m87753l72133l34265k75217
$$ 13103781 11990650 10956205 10091402 9379504 8770038 8282285 7910152 7575887 7300670
4570G300670j87125j35313n7091k5161l3578J7974P2763J14967J88986K95437
$$ 7300670 7113545 6978232 6921141 6895980 6862402 6880376 6953139 7068106 7257092 7552529
4560G552529L76509N22550O48821P58999P80317P26363M99718J43996k39744n82879
$$ 7552529 7929038 8451588 9100409 9859408 10639725 11366088 11865806 12009802 11770058 11187179
4550A1187179p42012q05637q20256p25837o50652n53731m29310l64999k79512
$$ 11187179 10445167 9639530 8819274 8093437 7442785 6889054 6459744 6094745 5815233
4541E815233k47714j95199j56895j77288j32782q9157p0985l2780n5782l972M0147
$$ 5815233 5567519 5372320 5215425 5038137 4905355 4816198 4745213 4712433 4656651 4652679 4692826
4530D692826j7548m8064j9129j5437l4694p2230k2718j5324k5447M620J4501m2832
$$ 4692826 4675278 4627214 4608085 4592648 4557954 4485724 4463006 4447682 4422235 4426855 4441356 4398524
4518D398524j8770j8747k677n2192j15449o8866r8785p1353o6724p6529n1270
$$ 4398524 4379754 4361007 4358330 4306138 4190689 4121823 4023038 3951685 3884961 3808432 3757162
4507C757162k5094n4465m2510m2730k4516k5306l2091J0630l9540m5488j9055
$$ 3757162 3732068 3677603 3635093 3592363 3567847 3542541 3510450 3521080 3481540 3436052 3416997
4496C416997m4139k6455n3024p410j322n0899j1852J6882m332j9331m672P525
$$ 3416997 3372858 3346403 3293379 3285969 3284647 3233748 3221896 3238778 3234446 3215115 3210443 3217968
4484C217968P6j0939O631j8473j467Q11J7292K0620Q302O246M087J5783q542r115
$$ 3217968 3218044 3207105 3213736 3195263 3193796 3194607 3211899 3232519 3240821 3247067 3251154 3266937 3258395 3249280
4470C249280J8576J511l0054K439k3233m7693l1962k2554k3823j6021J050j217
$$ 3249280 3267856 3269367 3239313 3241752 3218519 3170826 3138864 3116310 3092487 3076466 3077516 3076299
4458C076299j3779j2875J7766m5537m506j1512j1417L6068k8494q5505M795R861
$$ 3076299 3062520 3049645 3067411 3021874 3017368 3005856 2994439 3030507 3002013 2916508 2921303 2931164
4446B931164p691K7895l912m3072m6018j4782R897J9444j2768J0783Q611J8073
$$ 2931164 2923473 2951368 2947456 2904384 2858366 2843584 2853481 2872925 2860157 2870940 2879551 2897624
4434B897624K6441L3926R025K0717J4525k763R90K693j5771J417K431J4164K7261
$$ 2897624 2924065 2957991 2967016 2987733 3002258 2999495 3000485 3003178 2987407 2988824 2991255 3005419 3032680
4421C032680J52O650P202L9321K9862K7007M9156P1056K2511M692N2972R1693
$$ 3032680 3032832 3039482 3046684 3086005 3115867 3142874 3192030 3263086 3285597 3290289 3343261 3434954
4409C434954J08165J28524Q6496k010n0473o4389m9770l9482j7412k9269K0358
$$ 3434954 3543119 3671643 3758139 3756129 3705656 3641267 3591497 3552015 3534603 3505334 3525692
4398C525692o926j8262o439Q004K0828K2216J4997n68N1316K1569K8979K7451
$$ 3525692 3518766 3500504 3494065 3502069 3522897 3545113 3560110 3559542 3610858 3632427 3661406 3688857
4386C688857K9694K8617L1247M4824J5441N5492J4005P0344M9740j1873L3925
$$ 3688857 3718551 3747168 3778415 3823239 3838680 3894172 3908177 3978521 4028261 4016388 4050313
4375D050313P0120N2102N749L1618L8620M3023L1224j545K5709K1733j0223L5344
$$ 4050313 4120433 4172535 4178284 4209902 4248522 4291545 4322769 4321224 4346933 4368666 4358443 4393787
4363D393787L7001O5291M7386Q6901O4391L6922N7719P5191L9316O8256L8302
$$ 4393787 4430788 4496079 4543465 4630366 4694757 4731679 4789398 4864589 4903905 4972161 5010463
4352E010463O0863J10821R1784R0848O3187R7337J29450P3198J20180J38489N8539
$$ 5010463 5071326 5182147 5273931 5364779 5427966 5525303 5654753 5727951 5848131 5986620 6045159
4341F045159J13360J52548J55037J85403K27230K11801L14325L87979M20158N16294
$$ 6045159 6158519 6311067 6466104 6651507 6878737 7090538 7404863 7792842 8213000 8729294
4331H729294N13498N56307M61877K88904J74517K1936o1956j21499n9106o219
$$ 8729294 9242792 9799099 10260976 10549880 10724397 10746333 10684377 10562878 10503772 10497553
4321A0497553M9085J31708K87140L47076M30634M68812M65487L92655L36359K01386
$$ 10497553 10546638 10678346 10965486 11312562 11743196 12212008 12677495 13070150 13406509 13607895
4311A3607895J79383J68977J67696J74752N8719p1668k10015l70203l93414l93449
$$ 13607895 13787278 13956255 14123951 14298703 14357422 14285754 14075739 13705536 13312122 12918673
4301A2918673l70004j99542j05473K6797J43932K87133L59680L64683K33552Q5153
$$ 12918673 12548669 12349127 12243654 12270451 12414383 12701516 13061196 13425879 13659431 13744584
4291A3744584o9464j36880k24539j50525j00360J8014R0822J08103J04336J0365
$$ 13744584 13675120 13538240 13313701 13163176 13062816 13080830 13171652 13279755 13384091 13394456
4281A3394456l8875l5721k5017J5330J24532K55836L65166N70211P35392P50210
$$ 13394456 13355581 13319860 13294843 13310173 13434705 13690541 14055707 14625918 15361310 16111520
4271A6111520P80015O41319L92310J48001j7376q4577q6182n3534Q1328P6318
$$ 16111520 16891535 17532854 17925164 18073165 18055789 17971212 17885030 17831496 17912824 17989142
4261A7989142J40761J43591P3159Q4742J07516O4887k974q403l338J03483J99630
$$ 17989142 18129903 18273494 18346653 18431395 18538911 18603798 18600824 18592421 18589083 18692566 18892196
4250A8892196K14317J68407m5755l12921n83465p31925p60617p85623o80677n23889
$$ 18892196 19106513 19274920 19229165 18916244 18332779 17600854 16840237 16054614 15373937 14850048
4240A4850048l10272j47617m433O1309O8358M2865o3628j94888l44258l38225
$$ 14850048 14539776 14392159 14387726 14449035 14517393 14560258 14496630 14301742 13957484 13619259
4230A3619259k48697j84215j00172J0618J5136l6669j56771j87585k74118k88812
$$ 13619259 13370562 13186347 13086175 13096793 13111929 13075260 12918489 12730904 12456786 12167974
4220A2167974l09250k49348j31008k1483N7262J10647K53342L18651L49180L10246
$$ 12167974 11858724 11609376 11478368 11456885 11514147 11624794 11878136 12196787 12545967 12856213
4210A2856213K71075J54175M2136j6340N3353J8921n9006j48628k42236l66409
$$ 12856213 13127288 13281463 13323599 13307259 13360612 13379533 13320527 13171899 12929663 12563254
4200A2563254l69921m16132l95939k60003j88524k7332K5463J08541J53896J66127
$$ 12563254 12193333 11777201 11381262 11121259 10932735 10905403 10930866 11039407 11193303 11359430
4190A1359430J12187m5990j77738l37909m36106m52930m41821l99742l68204l37324
$$ 11359430 11471617 11425627 11247889 10909980 10473874 10020944 9579123 9179381 8811177 8473853
4180H473853k51726k23679j21845j32537j13046l0424l380k5629M3590O7411Q5105
$$ 8473853 8222127 7998448 7876603 7744066 7631020 7600596 7597216 7571587 7615177 7682588 7767693
4169G767693P4884Q4309J10185J55765J84900J57925K19164K63374K81662L28533
$$ 7767693 7842577 7926886 8037071 8192836 8377736 8535661 8754825 9018199 9299861 9628394
4159I628394L61395L38516L76433L74261L91767L45530K85159L00983K37880K63252
$$ 9628394 9989789 10328305 10704738 11078999 11470766 11816296 12101455 12402438 12640318 12903570
4149A2903570K35970K07677K41980K07871L05437L72406M45960M67724N38133
$$ 12903570 13139540 13347217 13589197 13797068 14102505 14474911 14920871 15388595 15926728
4140A5926728N24114M69213M57148M04764L74611L60539L50088L70461L36601
$$ 15926728 16450842 16920055 17377203 17781967 18156578 18517117 18867205 19237666 19574267
4131A9574267L33588L67941L86477L68299L91471M15733M25544M61030M56364
$$ 19574267 19907855 20275796 20662273 21030572 21422043 21837776 22263320 22724350 23180714
4122B3180714M12684M23605M55336M92074N97657P10968Q31831R60917J024956
$$ 23180714 23593398 24017003 24472339 24964413 25562070 26273038 27104869 28065786 29090742
4113B9090742R81216Q41392O73640M83936K88061K17179J33685P6008J14295R7809
$$ 29090742 30071958 30913350 31586990 32070926 32358987 32576166 32709851 32785859 32900154 32997963
4103C2997963R0835J50743K39292K82146L25099L37662L86367L43050L13583L18135
$$ 32997963 33088798 33239541 33478833 33760979 34086078 34423740 34810107 35153157 35466740 35784875
4093C5784875K86465L88199N00146O74581J017734J232121J465249J618025J662572
$$ 35784875 36071340 36459539 36959685 37634266 38652000 39884121 41349370 42967395 44629967
4084D4629967J685354J491410J366591J208471J032302R14252Q25571P11843O10434
$$ 44629967 46315321 47806731 49173322 50381793 51414095 52328347 53153918 53865761 54476195
4075E4476195M71240L22426K00897K0675j34019k19012k60905k68351k33032j64810
$$ 54476195 54947435 55269861 55470758 55491433 55357414 55138402 54877497 54609146 54376114 54211304
4065E4211304j10436l8494o8292j14381j42738k00270j89877k11958j89190q3443
$$ 54211304 54100868 54062374 53994082 53879701 53736963 53536693 53346816 53134858 52945668 52862225
4055E2862225K0786J15466K62024L15879L38407K50851J50195P4395j11623k41624
$$ 52862225 52883011 52998477 53260501 53576380 53914787 54165638 54315833 54390228 54278605 54036981
4045E4036981m25644n95337p19879p95811q91583j023588j172693j428146j672321
$$ 54036981 53611337 53016000 52296121 51500310 50608727 49585139 48412446 46984300 45311979
4036D5311979j868687j858690j745000j501716j211034r36121o93240n25926l89479
$$ 45311979 43443292 41584602 39839602 38337886 37126852 36190731 35497491 34971565 34582086
4027C4582086k91391k82907k59679k56338k03324k61339l28957l42172m44678
$$ 34582086 34290695 34007788 33748109 33491771 33288447 33027108 32698151 32355979 31911301
4018C1911301m20152l57062l01008j91113k732Q5166P6830p5183l16863n96976
$$ 31911301 31491149 31134087 30833079 30641966 30639234 30724400 30801230 30726047 30409184 29812208
4008B9812208q32845j041899j071908j021528q54732p27972o49324n71509n26548
$$ 29812208 28979363 27937464 26865556 25844028 24989296 24261324 23612000 23040491 22513943
3999B2513943m96221n51066n26748m78434m97710m77219m66417m12830m07383
$$ 22513943 22017722 21466656 20939908 20461474 19963764 19486545 19020128 18607298 18199915
3990A8199915l43221l00557k45151k17846j78790k60286k85302l48824l75507
$$ 18199915 17856694 17556137 17310986 17093140 16914350 16654064 16368762 16019938 15644431
3981A5644431m20307m19558m62839m13553l60471l54687l25132l51386k56341
$$ 15644431 15224124 14804566 14341727 13928174 13567703 13213016 12887884 12536498 12280157
3972A2280157k24869k30881k05585j62504r9343l4606p2797p4766p3504j05786
$$ 12280157 12055288 11824407 11618822 11456318 11356975 11322369 11249572 11174806 11101302 10995516
3962A0995516j03060j84351k20752j45210j70227j59791j31399o8261o2434l4615
$$ 10995516 10892456 10708105 10487353 10342143 10171916 10012125 9880726 9812465 9750031 9715416
3952I715416j8263J01495J11208J56776J92215K23933K10754J97793J89885J59574
$$ 9715416 9697153 9798648 9909856 10066632 10258847 10482780 10693534 10891327 11081212 11240786
3942A1240786O8156k703q8647j19991j38354j21420j12042p4293p5O1604J81003
$$ 11240786 11308942 11306239 11217592 11097601 10959247 10837827 10725785 10651492 10651417 10713021 10894024
3931A0894024K29562K21169K48116K50374K15711J45204P0739L416n8789j38846
$$ 10894024 11123586 11344755 11592871 11843245 12058956 12204160 12274899 12278315 12219526 12080680
3921A2080680j69851j90257j74485j61276o5500M8885J49474K30840L53886M67648
$$ 12080680 11910829 11720572 11546087 11384811 11319311 11368196 11517670 11748510 12102396 12570044
3911A2570044L88695L44991K54736P3869o1511j44574k10742j76286j48897m4393
$$ 12570044 12958739 13303730 13558466 13632335 13570824 13426250 13215508 13039222 12890325 12845932
3901A2845932L8669K10708L14516M43679N77353O43785P07209O70783O85553O71682
$$ 12845932 12884601 13095309 13409825 13853504 14430857 15074642 15781851 16452634 17138187 17809869
3891A7809869N43643L32314J75645n0810k04599l79093l67874k79250k20064m9733
$$ 17809869 18353512 18685826 18861471 18810661 18606062 18226969 17859095 17579845 17359781 17310048
3881A7310048J03663K63568M68226O25540O39650O49922O15868N06660K97157
$$ 17310048 17413711 17677279 18145505 18771045 19410695 20060617 20676485 21183145 21480302
3872B1480302J67839j8179k76748m54636n84814o49474o51577n88752m40123k70514
$$ 21480302 21648141 21629962 21353214 20898578 20313764 19664290 19012713 18423961 17983838 17713324
3862A7713324j03674R4654K37962L90318M07659M00735K91138J48491m722j30256
$$ 17713324 17609650 17704304 17942266 18332584 18740243 19140978 19432116 19580607 19575885 19445629
3852A9445629j60489j14477l1051J8255P7111J27704K01546K06881L01005L84636
$$ 19445629 19285140 19170663 19139612 19157867 19234978 19362682 19564228 19771109 20072114 20456750
3842B0456750N50830O44485P16857O84046N79518L67502J52704J5692j42647k26816
$$ 20456750 21007580 21652065 22368922 23052968 23632486 23999988 24152692 24168384 24025737 23798921
3832B3798921k28069j82208j4977J63672L56608N70862Q44945J119623J468758
$$ 23798921 23570852 23388644 23373667 23537339 23893947 24464809 25309754 26429377 27898135
3823B7898135J812327K162289K506676K790239K954193K927135K678630K190305
$$ 27898135 29710462 31872751 34379427 37169666 40123859 43050994 45729624 47919929
3815D7919929J545074P73159j1178p22802j322236j811841k027247k004951j827673
$$ 47919929 49465003 50238162 50226984 49504182 48181946 46370105 44342858 42337907 40510234
3806D0510234j455890j005924m82744J10315O76679J243234J864669K382530K713768
$$ 40510234 39054344 38048420 37565676 37675991 38352670 39595904 41460573 43843103 46556871
3797D6556871K794545K561186J949673J052130j63251j385339k403451l209760
$$ 46556871 49351416 51912602 53862275 54914405 54751154 53365815 50962364 47752604
3789D7752604l567075l641566l427722k972101k449537j915292j250523p01217
$$ 47752604 44185529 40543963 37116241 34144140 31694603 29779311 28528788 27827571
3781B7827571j33247L08503O90569Q39456P59602N60509R5339l59221q54103j318435
$$ 27827571 27694324 28002827 28693396 29532852 30292454 30852963 30948302 30589081 29734978 28416543
3771B8416543j616301j742489j779438j603362j304743j033387p30752l55447
$$ 28416543 26800242 25057753 23278315 21674953 20370210 19336823 18606071 18250624
3763A8250624j10415J47701K75649L13084K77999K00442R5805Q360l7584m9215
$$ 18250624 18140209 18287910 18563559 18876643 19154642 19355084 19450889 19459249 19421665 19372450
3753A9372450j18150k81500m50131o55595p53129p82184p36034o03406m29571
$$ 19372450 19254300 18972800 18522669 17867074 17113945 16331761 15595727 14992321 14562750
3744A4562750k82506j60457o9296j9049n5667j7431l1058n3440j08590j64191
$$ 14562750 14280244 14119787 14050491 14031442 13975775 13958344 13927286 13873846 13765256 13601065
3734A3601065k60697l81269n23029n48990n86208o00957n09515l97284l24254
$$ 13601065 13340368 12959099 12436070 11887080 11300872 10699915 10190400 9793116 9468862
3725I468862k18799j58916M1853J91233K30445K70081K17817J66754O311j61552
$$ 9468862 9250063 9091147 9133000 9324233 9554678 9824759 10042576 10209330 10215641 10054089
3715A0054089k99937m04262m52210m48523m22062l56621k62386j62410j01295
$$ 10054089 9754152 9349890 8897680 8449157 8027095 7670474 7408088 7245678 7144383
3706G144383j0849Q6277J23298J86752J68555J30534P8442p040j42536k64165
$$ 7144383 7133534 7219811 7343109 7529861 7698416 7828950 7907392 7900352 7757816 7493651
3696G493651l90174m00191m12099l79771l32389l13614k35687k14963k10048j73152
$$ 7493651 7103477 6703286 6291187 5911416 5579027 5265413 5029726 4814763 4604715 4431563
3686D431563j30631j39971j03988q2669r5022j31870q2213o0209k2582m0422n7224
$$ 4431563 4300932 4160961 4056973 3974304 3879282 3747412 3665199 3604990 3582408 3541986 3484762
3675C484762J1555m1251n2754o605O173l4645m1821j7225J3345n787o610k1090
$$ 3484762 3496317 3455066 3402312 3395707 3401880 3367235 3325414 3308189 3321534 3315747 3309137 3288047
3663C288047j029l1101L447j1984j0865j3532J6122M4443K392J4722m3570L424
$$ 3288047 3287018 3255917 3259364 3247380 3236515 3222983 3239105 3283548 3285940 3300662 3257092 3260516
3651C260516m6836m2745k2268q272j8638J1449J2185o146m0023J094j9424K409
$$ 3260516 3213680 3170935 3148667 3140395 3121757 3133206 3145391 3139245 3099222 3100316 3080892 3083301
3639C083301J991m7823J356K6959K8449K5095p750J0421J1307L148K1098L8277
$$ 3083301 3085292 3037469 3038825 3065784 3094233 3119328 3111578 3121999 3133306 3136454 3157552 3195829
3627C195829K0228L8130M7605O6734N5446j561r520L6318j0469l4108K498p475
$$ 3195829 3216057 3254187 3301792 3368526 3423972 3422411 3412891 3449209 3438740 3404632 3407130 3399655
3615C399655k569o313l727K5112j3451L2772P253P8827M0192N6890M6693K4046
$$ 3399655 3397086 3390773 3387046 3412158 3398707 3431479 3438732 3517559 3557751 3614641 3661334 3685380
3603C685380J1579j0628L3676K3954K5014p534L0065J0670K9065o776m708L4030
$$ 3685380 3696959 3686331 3720007 3743961 3768975 3761441 3791506 3802176 3831241 3824465 3819757 3853787
3591C853787M9531K2896N8879P6201M9597O3525M1392P0286J5315N1056O8930
$$ 3853787 3903318 3926214 3985093 4061294 4110891 4174416 4215808 4286094 4301409 4352465 4421395
3580D421395M7694Q4380Q7122R5290R0715R9021O5732P1758J08513J14997R9529
$$ 4421395 4469089 4553469 4640591 4735881 4826596 4925617 4991349 5063107 5171620 5286617 5386146
3569E386146J52097J46683K07788K12247K10096K16715K06057K28437K34851J75180
$$ 5386146 5538243 5684926 5892714 6104961 6315057 6531772 6737829 6966266 7201117 7376297
3559G376297K43408K36670K41135K49254K26861K35419J93108J75347K13745J98342
$$ 7376297 7619705 7856375 8097510 8346764 8573625 8809044 9002152 9177499 9391244 9589586
3549I589586J64315K16202K12869K19307K11007K02370K45602K11354K97267L30069
$$ 9589586 9753901 9970103 10182972 10402279 10613286 10815656 11061258 11272612 11569879 11899948
3539A1899948L67929M21089M61430N42434N15271L82618L00590J31181M5338J3064
$$ 11899948 12267877 12688966 13150396 13692830 14208101 14590719 14891309 15022490 15067828 15080892
3529A5080892L3127R2729J48368J75112J42427Q2538J2005j42092k33597k51767
$$ 15080892 15114019 15206748 15355116 15530228 15672655 15755193 15767198 15625106 15391509 15139742
3519A5139742k70485k23212j74247j22602j00569n1226o683m8423o4435j2328
$$ 15139742 14869257 14646045 14471798 14349196 14248627 14197401 14190718 14142295 14077860 14065532
3509A4065532m0568Q806R382M6646O4119P3691O2184L5924M8155R3682J31511
$$ 14065532 14024964 14033770 14043152 14089798 14153917 14227608 14289792 14325716 14373871 14467553 14599064
3498A4599064J57196J87164J67364J93223J47343J26147Q9727Q7613J52120K03200
$$ 14599064 14756260 14943424 15110788 15304011 15451354 15577501 15667228 15754841 15906961 16110161
3488A6110161K28074K89179K97714L31980L39123L12299L35620L11658K50871
$$ 16110161 16338235 16627414 16925128 17257108 17596231 17908530 18244150 18555808 18806679
3479A8806679K35323K72826K38423K71107L40321L01065K98311M76187P60465
$$ 18806679 19042002 19314828 19553251 19824358 20164679 20465744 20764055 21240242 22000707
3470B2000707J048827R02897J10206p76081j142038j277518j197736j052369r50970
$$ 22000707 23049534 23952431 24062637 23286556 22144518 20867000 19669264 18616895 17665925
3461A7665925q75811p99944p29964p39295o39750n49646m89832m24909m23164
$$ 17665925 16790114 15990170 15260206 14520911 13881161 13331515 12841683 12416774 11993610
3452A1993610l96832l77573l60592k93304k05048k14699j98372j34453o7592J2475
$$ 11993610 11596778 11219205 10858613 10565309 10360261 10145562 9947190 9812737 9745145 9757620
3442I757620J74229L68328Q12309J624113K324714K024350M98531q26814j278719
$$ 9757620 9931849 10300177 11112486 12736599 15061313 17085663 17584194 16757380 15478661
3433A5478661j292639j030181p70678n00830k65432q0137m6831J2414P1140N3728
$$ 15478661 14186022 13155841 12385163 11884333 11618901 11538764 11491933 11504347 11575487 11629215
3423A1629215P3573Q8208R473K2492M3611Q0625J19871J72179J64239J81310J30230
$$ 11629215 11702788 11790996 11800469 11822961 11866572 11947197 12067068 12239247 12403486 12584796 12715026
3412A2715026R1849J17113R1442J45871L72958P60587J094261R74367L46936j83300
$$ 12715026 12806875 12923988 13015430 13161301 13534259 14294846 15389107 16363474 16710410 16527110
3402A6527110k90914j86588j4858J12011K00363J91937J31464J7945j67194k81024
$$ 16527110 16236196 16049608 16034750 16146761 16347124 16539061 16670525 16688470 16521276 16240252
3392A6240252m36618n10111n39464n53833m73422m06877l60074k68507k29232
$$ 16240252 15803634 15293523 14754059 14200226 13726804 13319927 12959853 12691346 12462114
3383A2462114j41005r7087M351J1685Q0181J51284J46374J75449K42448L01609
$$ 12462114 12321109 12224022 12228373 12240058 12320239 12471523 12617897 12793346 13035794 13337403
3373A3337403K95976L21063L15281K30124J53972K9792P653j18203j29383k36410
$$ 13337403 13633379 13954442 14269723 14499847 14653819 14683611 14691264 14573061 14443678 14207268
3363A4207268k50437r4201P62J11831K70324L98363L93586L21889K35983J20911
$$ 14207268 13956831 13862630 13863392 13975223 14245547 14643910 15037496 15359385 15595368 15716279
3353A5716279O2366k6118o4482m892L2625J17970K19892K07628J68339Q8627k7004
$$ 15716279 15778645 15752527 15688045 15683153 15715778 15833748 16053640 16261268 16429607 16518234 16491230
3342A6491230j87498k54362k96106k44973j69291m9566N4395J36482K15484K30254
$$ 16491230 16303732 16049370 15753264 15508291 15339000 15289434 15343829 15480311 15695795 15926049
3332A5926049K33312K59294K43601K76517L23118K04367J12632l394q8945k14890
$$ 15926049 16159361 16418655 16662256 16938773 17261891 17466258 17578890 17575496 17486551 17271661
3322A7271661l02119l64185l38251l36683l76182l87051m37352m50383m52771
$$ 17271661 16969542 16605357 16267106 15930423 15554241 15167190 14729838 14279455 13826684
3313A3826684m32436k94944j80498R05J17281K30722L26691L76854M25398L24427
$$ 13826684 13394248 13099304 12918806 12919711 13036992 13267714 13594405 13971259 14396657 14721084
3303A4721084K01244O4255p9693j81614k35825l26671m29445n31496o04154n89607
$$ 14721084 14922328 14986583 14906890 14725276 14489451 14162780 13733335 13201839 12597685 12008078
3293A2008078o16482n55778m93107l99549l18978k57147k29433j26541o9506L0109
$$ 12008078 11391596 10835818 10342711 9943162 9624184 9367037 9137604 9011063 8941557 8971666
3283H971666J17008J04774J85198K60756K48529K93104J84378J00811k5949j61588
$$ 8971666 9088674 9193448 9378646 9639402 9887931 10181035 10365413 10466224 10440275 10278687
3273A0278687k47268l05129l82246l51240l32720k99602k41597j48904j45315
$$ 10278687 10031419 9726290 9344044 8992804 8660084 8360482 8118885 7969981 7824666
3264G824666j02253k658R3910J60387K02577J72201J05603N3621l5318n5790j61906
$$ 7824666 7722413 7719755 7813665 7974052 8176629 8348830 8454433 8508054 8472736 8416946 8255040
3253H255040k19791j98048k32887j97901j27862j69237j02707p3270o8098o6607
$$ 8255040 8035249 7837201 7604314 7406413 7278551 7109314 7006607 6933337 6865239 6798632
3243F798632j04454l5603J9042M208J01954P5253J21007J19957J64359J03200
$$ 6798632 6694178 6658575 6677617 6681825 6783779 6859032 6980039 7099996 7264355 7367555
3233G367555P2513R6095N0588P1283l126k6829k4886k3756J5005m1126j7195K0731
$$ 7367555 7440068 7536163 7586751 7658034 7654908 7628079 7603193 7579437 7594442 7553316 7536121 7556852
3221G556852J0012M662O3928N2277O4284R7800J39319J36379J48448J67025J70502
$$ 7556852 7566864 7571526 7635454 7687731 7752015 7849815 7989134 8125513 8273961 8440986 8611488
3210H611488J85307K27827J90626J82709J48826J43637R1432Q7873J31846J43935
$$ 8611488 8796795 9024622 9215248 9397957 9546783 9690420 9781852 9869725 10001571 10145506
3200A0145506J81432K79159L31762K38956K15569J48004Q4660O4722P7287J33254
$$ 10145506 10326938 10606097 10937859 11176815 11392384 11540388 11625048 11689770 11767057 11900311
3190A1900311K44790K98106K95024J66623J06677J63258J52137K58687K64670
$$ 11900311 12145101 12443207 12738231 12904854 13011531 13174789 13326926 13585613 13850283
3181A3850283K95526K64384J81010J54233J59935K02810J87925K69430K88179
$$ 13850283 14145809 14410193 14591203 14745436 14905371 15108181 15296106 15565536 15853715
3172A5853715K94646L71193M60000N48162O65255P42404P87365P70513P93446
$$ 15853715 16148361 16519554 16979554 17527716 18192971 18935375 19722740 20493253 21286699
3163B1286699P36084O54612N90202N26512M83610L82099K58372K33305K91028
$$ 21286699 22022783 22677395 23267597 23794109 24277719 24659818 24918190 25151495 25442523
3154B5442523M78761N28104N48745N39136N91576O59569P37840Q87822J046902
$$ 25442523 25921284 26449388 26998133 27537269 28128845 28788414 29526254 30414076 31460978
3145C1460978J120160J201723J205181J230461J276142J370948J474359J642574
$$ 31460978 32581138 33782861 34988042 36218503 37494645 38865593 40339952 41982526
3137D1982526J902696K174301K490283K859413L126114L283134L475420L758439
$$ 41982526 43885222 46059523 48549806 51409219 54535333 57818467 61293887 65052326
3129F5052326M044012M484021N043989N754824O776225Q285331J0535063J3599313
$$ 65052326 69096338 73580359 78624348 84379172 91155397 99440728 109975791 123575104
3121A23575104J7664777K2648154K8306795L3827075L7641806L7774504L3014732
$$ 123575104 141239881 163888035 192194830 226021905 263663711 301438215 334452947
3114C34452947K3905786J2216434r1661j1014090j9858743k6481684l0600109
$$ 334452947 358358733 370575167 370483506 359469416 339610673 313128989 282528880
3107B82528880l1697624l0025471k6316664k1444917j6132508j0904395n668867
$$ 282528880 250831256 220805785 194489121 173044204 156911696 146007301 140338434
3100A40338434n65698M228455P923761R416864Q026176M054609q61923n163196
$$ 140338434 139772736 144001191 151924952 161341816 169367992 173422601 172560678 167397482
3092A67397482p350689o673969k958057L687753J2143175J9225805J9913326J1620485
$$ 167397482 160046793 153372824 150414767 154102520 166245695 185471500 205384826 217005311
3084B17005311k223022j4708539k1830026k3647515k2042675j8850262j5315449
$$ 217005311 214782289 200073750 178243724 154596209 132553534 113703272 98387823
3077I8387823j2057101r389233p282524n472079l914692k636185j589110o04554
$$ 98387823 86330722 76941489 69658965 64186886 60272194 57636009 56046899 55442345
3069E5442345M77034J814324L797092O901310J1215189J5792840J7965690J4892600
$$ 55442345 55919379 57733703 61530795 68432105 79647294 95440134 113405824 128298424
3061A28298424O431561l654341j1241586j4582365j4651939j2813125j0195162
$$ 128298424 134729985 131075644 119834058 105251693 90599754 77786629 67591467
3054F7591467p635878n447872l792081k744109k288794k224580k380783k569231
$$ 67591467 59955589 54507717 50715636 47971527 45682733 43458153 41077370 38508139
3046C8508139k651253k638640k539008k267979j915008j635654j321296j049059
$$ 38508139 35856886 33218246 30679238 28411259 26496251 24860597 23539301 22490242
3038B2490242p76748m53589j85004J66880M08984N86218O01360L86595k50m42018
$$ 22490242 21713494 21259905 21074901 21241781 21650765 22236983 22838343 23224938 23224688 22782670
3028B2782670q78071j173090j306027j318845j303930j224749j113827j000098
$$ 22782670 21904599 20731509 19425482 18106637 16802707 15577958 14464131 13464033
3020A3464033q60984o83142n52528m80797l37801k44820j51030o7948J20608J58984
$$ 13464033 12603049 11919907 11367379 10886582 10548781 10303961 10152931 10084983 10205591 10364575
3010A0364575J69330J41861O5104j1648P444J23871J90188L67912N95272Q17478
$$ 10364575 10533905 10675766 10740870 10729222 10736666 10860537 11050725 11418637 12013909 12831387
3000A2831387J067119J266315J450316J494466J501339J407583J128209Q01533
$$ 12831387 13898506 15164821 16615137 18109603 19610942 21018525 22146734 22948267
2992B2948267L34896k00775p33828j101632j305467j378999j254578r98490p52335
$$ 22948267 23283163 23082388 22348560 21246928 19941461 18562462 17307884 16309394 15557059
2983A5557059m68274j28648K28719N56446Q04379J024525J070794J040093P95319
$$ 15557059 15088785 14960137 15188856 15745302 16549681 17574206 18645000 19685093 20480412
2974B0480412M32725j16275o09827j126769j569320j728495j742880j656877j483072
$$ 20480412 20913137 20796862 20187035 19060266 17490946 15762451 14019571 12362694 10879622
2965A0879622j271504j067753q73912p10925n67786m70307l49408k48887k69345
$$ 10879622 9608118 8540365 7666453 6955528 6387742 5917435 5568027 5319140 5049795
2956E049795j99923j55057j32756o0826r2865j4751J9012N8399M6225Q1563J59241
$$ 5049795 4849872 4694815 4562059 4501233 4408368 4393617 4412629 4471028 4517253 4598816 4758057
2945D758057K26486K52063M28792N44327O71034P83746P92250O10261M01802J39199
$$ 4758057 4984543 5236606 5665398 6209725 6880759 7664505 8456755 9067016 9468818 9608017
2935I608017j99308m20177o29326o53618o28120n98655m52886l22346j75197k8677
$$ 9608017 9408709 8988532 8359206 7705588 7077468 6478813 6025927 5703581 5528384 5499707
2925E499707R6336K73203M46765N89629O70499N68386L65559J69368j78543n29081
$$ 5499707 5596043 5869246 6316011 6905640 7576139 8144525 8510084 8679452 8500909 7971828
2915G971828p13514q12179q40287p94653o81392n76844m69545l63383k53898k72988
$$ 7971828 7258314 6446135 5605848 4811195 4129803 3552959 3083414 2720031 2466133 2193145
2905B193145k54694j65130j53169j73785j07277q2912r3412o4458n6710o8897
$$ 2193145 1938451 1773321 1620152 1446367 1339090 1256178 1162766 1098308 1041598 972701
2895I72701j8549m2162l4576l1490k2562n6166o4901j7170r282L771J4953j6309
$$ 972701 954152 911990 877414 845924 823362 767196 702295 685125 675843 679614 694567 678258
2883F78258n8012l7691k2344n2870l5475l9712j5003o570n546o340j9990K6636
$$ 678258 620246 582555 560211 507341 471866 432154 417151 410581 405035 398695 378705 405341
2871D05341k0059J5912l2986O997l0747J1172j017J2678k229m5445l3772n3094
$$ 405341 385282 401194 368208 375205 344458 355630 354613 367291 365062 319617 285845 232751
2859B32751P381L067l4587j098K3824K0054k6053l053N901K6752L9805j6805l069
$$ 232751 240132 243199 208612 207514 231338 251392 225339 222286 228187 254939 294744 277939 274870
2846B74870J2418J7291K0270L0860N5277L8008P1703P2805O1951R5655J24015
$$ 274870 287288 304579 324849 355709 410986 448994 520697 593502 655453 751108 875123
2835H75123J23993J66860J42673J49386Q7951Q5994M8331n003n9826j21221r5641
$$ 875123 999116 1165976 1308649 1458035 1545986 1631980 1680311 1675308 1615482 1494261 1398620
2824A398620j65523j46417j74510j47545j32912p7240L849k4932j2618K0015N3589
$$ 1398620 1233097 1086680 912170 764625 631713 554473 558322 533390 520772 540787 594376
2813E94376N5452M9691K4693o204k4133l7412m5780J0679L5987P4725N6548K8032
$$ 594376 649828 699519 724212 718008 693875 656463 610683 621362 657349 732074 788622 816654
2801H16654l3630n9048r7704j45719j05578j05140j04518l1265o1748n8056K6506
$$ 816654 783024 723976 626272 480553 374975 269835 165317 134052 72304 14248 40754
2790D0754p5960j8122L0022J3063p976K36K2067L1081M4038P1429O8872N7632
$$ 40754 -35206 -53328 -23306 -10243 -18219 -17983 4084 35165 79203 150632 219504 277136
2778B77136M7999J8108l8981q5838j08434n9435o1869m1472o6493N442L57j3291
$$ 277136 325135 343243 304262 218424 109990 50555 -11314 -52786 -119279 -113837 -113480 -126771
2766a26771l0705j2617p460N10o0963K153M685k1706M820O628J5264J0075M275
$$ -126771 -157476 -170093 -177553 -177043 -238006 -235853 -231168 -252874 -248054 -241426 -226162 -216087 -211812
2753b11812l163K4533J5052J0715l4511l8900q621J3339j003L0471P623l8397
$$ -211812 -214975 -190442 -175390 -164675 -199186 -238086 -246707 -233368 -234371 -203900 -196277 -234674
2741b34674j6816p090p287k1666M294K5748k977r390K2052L8202j0700j5235J215
$$ -234674 -251490 -258580 -265867 -287533 -283239 -257491 -260468 -269858 -247806 -209604 -220304 -235539 -234324
2728b34324m165K3103j9661j2117l276p727J7904j2723r139k3027M2161J6332
$$ -234324 -238489 -215386 -235047 -247164 -250440 -258167 -240263 -252986 -262125 -285152 -242991 -226659
2716b26659j216j4689k336j3312j8504J2525R542K3650j8974o115J3624n977J5438
$$ -226659 -227875 -242564 -244900 -258212 -276716 -264191 -254649 -230999 -249973 -256088 -242464 -248441 -233003
2703b33003k3149K0546K7134j3697j4904K3624l022k260J4554K1962r285o3496
$$ -233003 -256152 -235606 -208472 -222169 -237073 -213449 -216471 -218731 -204177 -182215 -191500 -254996
2691b54996O919M2416m562k4794m0836K7033J7185j1709J1574K638j2256J5586
$$ -254996 -248077 -205661 -210223 -235017 -275853 -248820 -231635 -243344 -231770 -229132 -241388 -225802
2679b25802o822m340M1168k663k3158l853O832J1076K560j0238r314Q390k9121
$$ -225802 -232624 -236964 -195796 -198459 -221617 -225470 -218638 -207562 -205002 -215240 -224554 -216164 -245285
2666b45285j7679q153k0721N01K1547j6436l640Q852p189r898J0182j0880K2349
$$ -245285 -262964 -271117 -291838 -291337 -269790 -286226 -289866 -281014 -288203 -298101 -287919 -298799 -276450
2653b76450o568j948j3810q004M421K9749O945K6315L8304j6364J7679m0000L1824
$$ -276450 -283018 -284966 -298776 -306780 -302359 -272610 -265665 -239350 -201046 -217410 -199731 -239731 -207907
2640b07907M522n525J489J2007O5222M0678M1963J3181o8451l4476k0321l8976
$$ -207907 -203385 -208910 -207421 -195414 -130192 -89514 -47551 -34370 -102821 -137297 -157618 -196594
2628a96594k5764k3972L6528k2300l3820L717k5238K4121k1188L866O024n412
$$ -196594 -222358 -246330 -209802 -232102 -265922 -262205 -287443 -263322 -284510 -280644 -274620 -280032
2616b80032l4661r791J6678N332m5214k4659J0986O824J8171P551q150l275j1697
$$ -280032 -314693 -324484 -307806 -302474 -347688 -372347 -361361 -354537 -336366 -328815 -336965 -340240 -351937
2603c51937R197J5100j1442l3718R808n908J53M1749J9119k1814r673O207l629
$$ -351937 -342740 -327640 -339082 -372800 -362992 -368900 -368747 -326998 -307879 -329693 -339366 -333159 -336788
2590c36788j2834L611m556J1634O714K9456J0167j8341j2526l489o725P921O819
$$ -336788 -349622 -346011 -350567 -338933 -332219 -302763 -292596 -310937 -323463 -326952 -333677 -325756 -318937
2577c18937K6958j7247M565M5942m3169l3273K9052l543k5398q71l41m509M1700
$$ -318937 -291979 -309226 -304661 -258719 -301888 -335161 -306109 -309652 -335050 -335921 -336262 -340771 -299071
2564b99071Q775k7551j3445J7841L8144j9665J1772L023o992k1900j6369J0300
$$ -299071 -290296 -317847 -331292 -313451 -275307 -294972 -283200 -280177 -287169 -309069 -325438 -315138
2552c15138J339R580K2230k4353k2767k9026O484R100J2649L6221K7644J5962
$$ -315138 -313799 -304219 -281989 -306342 -329109 -358135 -351651 -342551 -329902 -293681 -266037 -250075
2540b50075j3639j5067J7192J5915J267o8550k0452J1330J5797K6249O484j0344
$$ -250075 -263714 -278781 -261589 -245674 -244407 -312957 -333409 -322079 -306282 -280033 -273549 -283893
2528b83893J1788p421j6851R942J7442J4645J2804j4641L044l5755O539K1295
$$ -283893 -272105 -279526 -296377 -286435 -268993 -254348 -241544 -256185 -253141 -288896 -282357 -261062
2516b61062K389j4129J1642J5562K5807K1878j3810n3735q261L3493K1291n729
$$ -261062 -258673 -272802 -261160 -245598 -219791 -197913 -211723 -265458 -273719 -240226 -218935 -224664
2504b24664Q95P890N671J8445j5741k524j5935K1075J8010M477k2045J0939J9942
$$ -224664 -223769 -215879 -210208 -191763 -207504 -210028 -225963 -204888 -186878 -182401 -204446 -193507 -173565
2491a73565l3857k3867J3036J4963j3949P087K1646J6588l6509m545L104Q953
$$ -173565 -207422 -231289 -218253 -203290 -217239 -210152 -188506 -171918 -208427 -212972 -209868 -200915
2479b00915K1402j2443p853k2441j4807J4439N9974n383J3705r313j4528p622
$$ -200915 -179513 -191956 -199809 -222250 -237057 -222618 -162644 -168027 -154322 -163635 -178163 -185785
2467a85785K8794N518J9812K8887O690k0674J5909k36k104j7328l7697M0812J4549
$$ -185785 -156991 -151473 -131661 -102774 -96084 -116758 -100849 -101085 -103189 -120517 -158214 -117402 -102853
2454a02853n961L2220k3063k9236K3998o4852K9528O6093J5706K3429Q951K0459
$$ -102853 -108814 -76594 -99657 -128893 -104895 -169747 -140219 -74126 -58420 -34991 -26040 -5581
2442e581l2911J4674L5214l1631P150q958J8524M4520j3676r34j2204L8663J952
$$ -5581 -38492 -23818 11396 -20235 -13085 -22043 -3519 41001 27325 26391 14187 52850 54802
2429E4802K9107M6455N386j4346k1971K2119L5945j1141j5940j5127k4958J5625
$$ 54802 83909 130364 135750 121404 99433 121552 157497 146356 130416 115289 90331 105956
2417A05956L2903K8935R860Q352J8437O1845M3944K2120L9234l765L4153m481
$$ 105956 138859 167794 177654 186006 204443 266288 310232 332352 371586 367821 401974 397493
2405C97493K4546P0280L4297J5089J8096M1812K9223Q5827L0389M8009M4360O8039
$$ 397493 422039 492319 526616 541705 559801 601613 630836 716663 747052 795061 839421 907460
2393I07460N7856N3854M7780J12737J37475J46000J40920J94852K98907M54554
$$ 907460 965316 1019170 1066950 1179687 1317162 1463162 1604082 1798934 2097841 2552395
2383B552395M81924L31717J77656R1656J13372J66585K24300L85901O36639Q95612
$$ 2552395 3034319 3366036 3543692 3635348 3748720 3915305 4139605 4525506 5162145 6057757
2373F057757J118614J696269L045700O648303J1037123J2124306N430678l910822
$$ 6057757 7176371 8872640 11918340 18566643 29603766 41728072 47158750 43247928
2365D3247928p665507p962217o597869n002003l796317k822921k087145j607285
$$ 43247928 35582421 27620204 21022335 16020332 12224015 9401094 7313949 5706664
2357E706664j258464q22075m06020k02118k0175j71663l11717l50384k70283k33674
$$ 5706664 4448200 3626125 3220105 3017987 2997812 2826149 2514432 2164048 1893765 1660091
2347A660091k13294j48422j63958j44958j18084o5480o2977p5443r8964n1543
$$ 1660091 1446797 1298375 1134417 989459 871375 805895 742918 667475 568511 516968
2337E16968k4071n8683n6332K850k9263j4495k3928m6562j2805j6200k6892k7129
$$ 516968 492897 434214 377882 380732 351469 336974 313046 266484 253679 237479 210587 183458
2325A83458N472J1724l7680j7468m37k8122j5860K1078j4087m554m2400m1955
$$ 183458 188930 200654 162974 145506 145069 116947 101087 122165 108078 103524 61124 19169
2313A9169k4250J4053k6991l4180k7918k6499l4510K2324j1152O93J0233k742
$$ 19169 -5081 8972 -18019 -52199 -80117 -106616 -141126 -118802 -129954 -129261 -119028 -121770
2301a21770j1335j0980R816K7844j0811r566n2536j1374j0519K195n231l3343
$$ -121770 -133105 -144085 -134269 -106425 -117236 -126802 -179338 -190712 -201231 -199036 -204267 -237610
2289b37610M1042k972p085j8439K3579k512L024j9388N865j0771L2967J6773n9855
$$ -237610 -196568 -199540 -206625 -225064 -201485 -203997 -200973 -220361 -214496 -225267 -192300 -175527 -235382
2276b35382j5565r668P99L6060r979m5088r223j1240J5218K5570l0935R91K6578
$$ -235382 -250947 -260615 -259816 -223756 -233735 -278823 -288046 -299286 -284068 -258498 -289433 -288442 -261864
2263b61864J0487j182j606l719j5247j5818J0596j2694j3401J5249j7696J1260
$$ -261864 -251377 -252559 -254165 -257884 -273131 -288949 -278353 -291047 -304448 -289199 -306895 -295635
2251b95635k054J1652j1084j1722R87l4505J5985l714M261M2602m176R234k3716
$$ -295635 -297689 -286037 -297121 -308843 -307856 -342361 -326376 -330090 -325829 -283227 -287403 -278169 -301885
2238c01885m3593J2193n273r690J6601j1511L0779L1823j3233j4910Q153r064
$$ -301885 -345478 -333285 -338558 -348248 -331647 -343158 -312379 -280556 -293789 -308699 -300546 -309610
2226c09610O482M928k5640j5939k3557L031K8114K7518J2740J9084j2674l0552
$$ -309610 -303128 -298200 -323840 -339779 -363336 -360305 -332191 -304673 -291933 -272849 -285523 -316075
2214c16075j5284L4500j5163q438l8428Q596P0925j6538m1796r242J4545L7620
$$ -316075 -331359 -296859 -312022 -320460 -358888 -350292 -279367 -295905 -337701 -346943 -332398 -294778
2202b94778j9554j6580p852K2972r02l5134j4262K0212K729j4427K6791P54L1425
$$ -294778 -314332 -330912 -338764 -315792 -316694 -351828 -366090 -345878 -343149 -357576 -330785 -330031 -298606
2189b98606k397M767k334j7784K0222j5333k4585j9835P23N6448J5717l3038M338
$$ -298606 -301003 -296236 -298570 -316354 -296132 -311465 -336050 -355885 -355162 -298714 -282997 -316035 -311697
2176c11697l3404l3684K4481K0843L6023k6301o195p210L458K6675l4013J7844
$$ -311697 -345101 -378785 -354304 -333461 -297438 -323739 -329934 -337144 -333686 -307011 -341024 -323180
2164c23180K1060l5610l683K1346n815k2855j3198M527o658K4603J4808o179L1363
$$ -323180 -302120 -337730 -341413 -320067 -325882 -348737 -361935 -357408 -364066 -339463 -324655 -330834 -299471
2151b99471o762K2199j5999m1599j116J5826k1924N294L9828j8350K5356O723
$$ -299471 -306233 -284034 -300033 -341632 -342748 -326922 -348846 -343552 -303724 -322074 -296718 -289995
2139b89995k8819j6231n019j267j6021k5722Q834K2945K0300N358k1896J4318
$$ -289995 -318814 -335045 -340064 -341331 -357352 -383074 -374240 -351295 -330995 -325637 -347533 -333215
2127c33215K0813l6080j9134M4332j0110j4401o436L2722J0961J913q730k1061
$$ -333215 -312402 -348482 -367616 -323284 -333394 -347795 -354231 -321509 -310548 -308635 -317365 -338426
2115c38426m326j7008N00j7462K8148K1830j0185j1028J6992p700J882N6328l2795
$$ -338426 -342752 -359760 -359260 -376722 -348574 -326744 -336929 -347957 -330965 -338665 -336783 -280455 -313250
2102c13250L6664L6637K2157L9042K0443o470l783j714n6894l7376l0102K565
$$ -313250 -276586 -239949 -217792 -178750 -158307 -164777 -168560 -170274 -227168 -264544 -294646 -292081
2090b92081K3545r760m4152q810J2140J113l8601K2100K8742p172k6965Q230J9453
$$ -292081 -268536 -278296 -322448 -331258 -319118 -318005 -356606 -334506 -305764 -312936 -339901 -331671 -312218
2077c12218j6144K10j8727k5102J7552N686l9623K4864K5374M447J1423n417j4521
$$ -312218 -328362 -328152 -346879 -371981 -354429 -348743 -388366 -363502 -338128 -333681 -322258 -327675 -342196
2064c42196j5169k48r753O580j769J2498j6486M3929j2228l3574J5415J4291j611
$$ -342196 -357365 -357613 -367366 -360786 -362555 -350057 -366543 -322614 -334842 -368416 -353001 -338710 -340321
2051c40321R29O728j1861K2392k4219J09K786k8274L4933J6973K725o96q005j353
$$ -340321 -339392 -332664 -344525 -322133 -346352 -346243 -343457 -371731 -336798 -319825 -317100 -317796 -325801 -327154
2037c27154M135q758J103j7013k0122L6789K597J1544l2691j2914L3675j5053
$$ -327154 -323019 -331777 -330674 -347687 -367809 -331020 -328423 -316879 -349570 -362484 -328809 -343862
2025c43862j1889K5023q044k755K1630J386j4975n588k592P887L4439o4049q29
$$ -343862 -355751 -330728 -338772 -341527 -319897 -318511 -333486 -339074 -341666 -333779 -299340 -363389 -364218
2012c64218J4600q452K5531J6626l774l3675n960k0269L0595R631J4732R567J393
$$ -364218 -349618 -358070 -332539 -315913 -319687 -353362 -359322 -379591 -348996 -339365 -324633 -315066 -313673
1999c13673P728k2037k9506L899J1551K5342k6552K4124n565k1994R38m518r508
$$ -313673 -305945 -327982 -357488 -353589 -342038 -316696 -343248 -319124 -324689 -346683 -345745 -350263 -359771
1986c59771L712j0659L873K6001J5870j2049n7683J6424K0169K4032j530j9241
$$ -359771 -356059 -366718 -362845 -336844 -320974 -333023 -390706 -374282 -354113 -330081 -331611 -350852
1974c50852K3054j879p042J0730k0862K0304K3660R332k8129k9157K0537k544
$$ -350852 -327798 -329677 -336719 -325989 -346851 -326547 -302887 -293555 -321684 -350841 -330304 -332848
1962c32848k0237m117k26L612J7088p046m5895J7350K838J9542K631j971N7332
$$ -332848 -353085 -357202 -357428 -353816 -336728 -343774 -389669 -372319 -369481 -349939 -347308 -349279 -291947
1949b91947J5158l7056l3458M587J68k1375J3712p904k535J7260j5319O5472j2497
$$ -291947 -276789 -313845 -347303 -342716 -342548 -363923 -350211 -358115 -360650 -343390 -358709 -293237 -305734
1936c05734J008K5346k0269k4555n681j3498j705M2197j4543j8065k3265L8140
$$ -305734 -304726 -279380 -299649 -324204 -329885 -343383 -345088 -302891 -317434 -335499 -358764 -320624
1924c20624L7324k405l3574m450j31k2708m693J6736R977r843J4848j262K3637
$$ -320624 -283300 -285705 -319279 -323729 -323860 -346568 -351261 -334525 -324548 -334391 -319543 -320805 -297168
1911b97168j1045k8663N132L94p508k1118L9691k712r357J50J9139J0855j2522
$$ -297168 -308213 -336876 -331744 -331350 -338858 -359976 -320285 -322997 -332354 -332204 -313065 -302210 -314732
1898c14732L492o597k8310k04K0720L1692l7715j7861J6227J7526K015n854r705
$$ -314732 -311240 -317837 -346147 -346351 -325631 -293939 -331654 -349515 -333288 -315762 -313747 -319601 -329306
1885c29306M105q592R461J4775P604m688j7129P933L836J0967j8799m321l1375
$$ -329306 -325201 -333793 -324332 -309557 -301953 -306641 -323770 -315837 -312001 -301034 -319833 -324154 -355529
1872c55529L2029q043K3794M770k3099K779L7577j4800l6459J7925n86J8394N912
$$ -355529 -323500 -331543 -307749 -302979 -326078 -323299 -285722 -300522 -336981 -319056 -319642 -301248 -295336
1859b95336o821j0722k3365l4584Q402J0467K318L4569k276o273j2726J2682K311
$$ -295336 -302157 -312879 -336244 -370828 -362426 -351959 -349641 -315072 -317348 -323621 -336347 -323665 -321354
1846c21354p920j1016L3246j8383P805j1185K5473k3639m142R044r191J7211j156
$$ -321354 -329274 -340290 -307044 -325427 -317622 -328807 -303334 -326973 -331115 -322071 -331262 -314051 -315207
1833c15207M370m1048l152O136K7248j4820k1221M95n766J0470M5597k8213J4348
$$ -315207 -310837 -351885 -355037 -348901 -321653 -336473 -357694 -357199 -362965 -352495 -306898 -335111 -320763
1820c20763J8921j4154r82j035n1351J3350M7015r537j8029O612M512l46L8547
$$ -320763 -301842 -315996 -316978 -318013 -369364 -356014 -308999 -318536 -336565 -329953 -325441 -325787 -287240
1807b87240j1668j7359j1589K344J5475m3151M867K7692N868j6820O335J396m4459
$$ -287240 -298908 -316267 -327856 -325512 -310037 -353188 -348321 -320629 -314761 -331581 -325246 -323850 -368309
1794c68309j4208L6055K1219k290k0170J5351N610m0542K7440J5194L506K9793
$$ -368309 -382517 -346462 -325243 -327533 -347703 -332352 -326742 -367284 -339844 -324650 -321144 -291351
1782b91351k7635M824K0386K0703j0735k8595k7854j113K1182L754l949k4946
$$ -291351 -318986 -314162 -293776 -273073 -283808 -312403 -340257 -341370 -320188 -316434 -320383 -345329
1770c45329L227L4282M313l0659L514J6511j3446J4783n272n865J7704l886k4066
$$ -345329 -342102 -307820 -303507 -334166 -330652 -314141 -327587 -312804 -318076 -323941 -306237 -310123 -334189
1757c34189J5666k0913J518Q055o478M1247j6553j7186M2015M1024Q18k4498l7111
$$ -334189 -318523 -339436 -337918 -329863 -336341 -295094 -311647 -328833 -286818 -245794 -244976 -269474 -306585
1744c06585J9848p30J5012l0603k1828N686K4791K0552r497N789j7581j9612J7528
$$ -306585 -286737 -287467 -272455 -303058 -324886 -319200 -294409 -273857 -283354 -277565 -295146 -314758 -297230
1731b97230k550O860K6771j9249k9025k2391l736O38K9410K3761l9016p454l6180
$$ -297230 -299780 -292920 -266149 -285398 -314423 -336814 -340550 -339912 -310502 -286741 -325757 -333211 -369391
1718c69391K1758j85j2390R443J6088J3806N686k156L0769r999l6011J3664K635
$$ -369391 -347633 -347818 -360208 -350765 -334677 -320871 -315185 -317341 -286572 -296571 -332582 -318918 -316283
1705c16283O230k756K2232K2609l6809K2944N1300n6278k6002J9435Q609k2397
$$ -316283 -310053 -312809 -290577 -267968 -304777 -281833 -230533 -286811 -312813 -293378 -284769 -307166
1693c07166j1017j0911J8196j1097j613J4693Q913M197L0777k9847p04m0120j2358
$$ -307166 -318183 -329094 -310898 -321995 -323608 -308915 -300002 -295805 -265028 -294875 -295579 -335699 -348057
1680c48057J9669K926L6739j1082l8321K1163J1872k2343J5472k3315m558J6696
$$ -348057 -328388 -325462 -288723 -299805 -338126 -316963 -305091 -327434 -311962 -335277 -339835 -323139
1668c23139J3453o591k6298k993K3234L4601P504k5254m482p2k5624O696M871
$$ -323139 -309686 -316277 -342575 -345568 -322334 -287733 -280229 -305483 -309965 -310037 -335661 -328965 -324094
1655c24094l1274M072J8321R111l682L804k7149L2870J6436k5677k953k355l834
$$ -324094 -355368 -351296 -332975 -323864 -327546 -323742 -350891 -318021 -301585 -327262 -330215 -332570 -336404
1642c36404j5869p773L1538J7591k0153l907J5374j4077j158J0479K2476J5884
$$ -336404 -352273 -360046 -328508 -310917 -331070 -334977 -319603 -333680 -334838 -324359 -301883 -285999
1630b85999M944k2339k6311j8487J6026K5853L8261j7048k1746K095j8395J6554
$$ -285999 -281055 -303394 -329705 -348192 -332166 -306313 -268052 -285100 -306846 -304751 -323146 -306592
1618c06592j81J8259n687K397k4553J651L329j1691k2616j1594K2064K4347j2378
$$ -306592 -306773 -288514 -294201 -291804 -316357 -314706 -311377 -323068 -345684 -357278 -335214 -310867 -323245
1605c23245j0734j5597K4921L296j0435P653J7564L9697l5987j2654k581P970
$$ -323245 -333979 -349576 -324655 -321359 -331794 -324141 -306577 -266880 -302867 -315521 -318102 -310132
1593c10132K4490p983J5297j0410l420L491l3200N1076n998m6858J1311r509j313
$$ -310132 -285642 -293625 -278328 -288738 -292158 -288667 -321867 -270791 -276789 -323647 -312336 -321845 -323158
1580c23158L7485J0844J2707j0155l0410j3771Q999j6754j3257J7936q690L5273
$$ -323158 -285673 -274829 -262122 -272277 -302687 -316458 -307459 -324213 -337470 -319534 -328224 -292951
1568b92951j7791M474l887j0337M1180j999j2448k2643l1134K6800P577k7465
$$ -292951 -310742 -306268 -310155 -320492 -279312 -281311 -293759 -316402 -347536 -320736 -313159 -340624
1556c40624L0786J6831j8181k0746K1501k7818j5590J4944R126j2760o354J9905
$$ -340624 -309838 -293007 -311188 -331934 -310433 -338251 -353841 -338897 -329771 -342531 -348885 -328980
1544c28980J8282L4108J247m9566j4357J6077J5250j4181j0740J3644m974R537
$$ -328980 -310698 -276590 -275343 -324909 -339266 -323189 -307939 -322120 -332860 -319216 -324190 -314653
1532c14653J014l581K9535r902n2251J6659L8051K611k4586j7999j1986N0311
$$ -314653 -313639 -317220 -287685 -297587 -349838 -333179 -295128 -292517 -317103 -335102 -347088 -296777
1520b96777K4134k1141j0499P939j8864k3424o380M6612j6940P050l6271j572
$$ -296777 -272643 -293784 -304283 -296344 -315208 -338632 -345012 -298400 -315340 -308290 -344561 -346133
1508c46133M3201J1548k5287k1167J0337n989r531K593M3157Q638j8886k8640
$$ -346133 -302932 -291384 -316671 -337838 -327501 -333490 -343021 -340428 -297271 -288633 -307519 -336159
1496c36159J4733J7295k380j1746K5684N133k0565M389K5493k4375j9035m1592
$$ -336159 -321426 -304131 -306511 -318257 -292573 -287440 -308005 -303616 -278123 -302498 -321533 -363125
1484c63125j7042P49M6830K628r543Q066J3654J2480j2499Q43J8384J466j2480
$$ -363125 -380167 -379418 -332588 -329960 -339503 -331437 -317783 -305303 -317802 -316959 -298575 -297109 -309589
1471c09589l932k166J8869m394J6423n81j8732O448k1857J1330N380j5726L4271
$$ -309589 -313521 -315687 -296818 -301212 -284789 -285370 -304102 -297654 -319511 -308181 -302801 -318527 -284256
1458b84256J3743N572K490j5305j3503J2272j1838k3193J4192K0304R971P368
$$ -284256 -270513 -264941 -262451 -277756 -291259 -278987 -290825 -314018 -299826 -279522 -269551 -262183
1446b62183j9521m7239m164L5436J844m0024J0436L2046P114j671k844j1615l6837
$$ -262183 -281704 -328943 -333107 -297671 -295827 -335851 -325415 -293369 -286255 -287926 -290770 -302385 -339222
1433c39222J6585J9035k1882J5971k3040M558P799n338J7026K2405K796k5881
$$ -339222 -322637 -303602 -325484 -309513 -332553 -327995 -320196 -325534 -308508 -286103 -283307 -309188
1421c09188k664l33k089j9032M479R113r563K2821n1343L884K8793K3671j2696
$$ -309188 -311852 -312185 -314274 -333306 -328827 -319714 -329277 -306456 -357799 -353915 -325122 -301451 -314147
1408c14147k0506k3002j0867K2538l292P247L7921M1402l2343j643k3876N332
$$ -314147 -334653 -357655 -368522 -345984 -349276 -342029 -304108 -262706 -295049 -296692 -320568 -315236
1396c15236M3132M274N109j1385l4765M385R172L8322k0748p941k9762j4618l274
$$ -315236 -272104 -267830 -262721 -274106 -308871 -304486 -295314 -256992 -277740 -285681 -315443 -330061 -333335
1383c33335O644J3260Q071L9690m146l4174l2806J77N422K1990L5103K1740k6051
$$ -333335 -326691 -313431 -305360 -265670 -269816 -303990 -336796 -336619 -331197 -309207 -274104 -252364 -278415
1370b78415m3501J9250J0696r275k0359l1085K1898L3621J4142n619k3532j5202
$$ -278415 -321916 -302666 -291970 -301245 -321604 -352689 -330791 -297170 -283028 -288647 -312179 -327381
1358c27381J6197N8680L228k2516j8168K0761M859k4817O460J6539k0551k2029
$$ -327381 -311184 -252504 -249276 -271792 -289960 -269199 -264340 -289157 -282697 -266158 -286709 -308738
1346c08738J8796M516j3567J5724r285l5356J7016q583j3260L9628k1620j3388
$$ -308738 -289942 -285426 -298993 -283269 -292554 -327910 -310894 -319477 -332737 -293109 -314729 -328117
1334c28117J1164K9084p785m6520L675K1780j7835m167N0666J4622k4579l5832
$$ -328117 -316953 -287869 -295654 -342174 -338499 -316719 -334554 -338721 -288055 -273433 -298012 -333844
1322c33844O483J724L161j6948K0118Q695r852J66q155J8111j0338l609r287J3257
$$ -333844 -327361 -325637 -322476 -339424 -319306 -310611 -320463 -320297 -328452 -310341 -320679 -324288 -333575 -320318
1308c20318N851l5688L5139J2286O482O449l9794n659K4370J2344K7185l037m5442
$$ -320318 -314467 -350155 -315016 -302730 -296248 -289799 -329593 -335252 -310882 -298538 -271353 -274390 -319832
1295c19832O62L4421j4846k672j0201L9227Q49j8257K697j4115K215L817L507
$$ -319832 -319170 -284749 -299595 -302267 -312468 -273241 -272392 -290649 -287952 -302067 -299852 -296035 -292528
1282b92528J3334J0980l9961K2232O740L513j0885J2689k0818K8567K8501n5709
$$ -292528 -279194 -268214 -308175 -285943 -279203 -275690 -286575 -273886 -294704 -266137 -237636 -293345
1270b93345j9060j0185P6J310K9273J2059q670N260j214k91K116J639J5302J9285
$$ -293345 -312405 -322590 -322514 -321204 -291931 -279872 -288542 -283282 -284496 -284787 -282671 -281032 -265730 -246445
1256b46445k875l6287N395J1733k5070j3148J0567j0148j9952J859M3883l7761
$$ -246445 -249320 -285607 -280212 -268479 -293549 -306697 -296130 -306278 -326230 -324371 -280488 -318249
1244c18249o420m774J5962K3586m861o375M1097k9257r143Q550J8496j9789m0527
$$ -318249 -324669 -329443 -313481 -289895 -294756 -301131 -260034 -289291 -298434 -289884 -271388 -291177 -331704
1231c31704L0681M497K0545o991p589k2446J4328j5663J3153M697o915j3924o736
$$ -331704 -301023 -296526 -275981 -282972 -290561 -313007 -298679 -314342 -301189 -296492 -303407 -317331 -324067
1218c24067L7545P174K1047k0310k6319P067K210o464K999K5820J0964l9741N446
$$ -324067 -286522 -279348 -258301 -278611 -304930 -297863 -295653 -302117 -299118 -273298 -262334 -302075 -296629
1205b96629J9966J794k5461O747j012j4622J4080m875n257J7995L6433k9521p365
$$ -296629 -276663 -274869 -300330 -293583 -294595 -309217 -295137 -300012 -305269 -287274 -250841 -280362 -287727
1192b87727j0948N545K8143j7183j5794p674j0953k3324R500L4068J3457J0618
$$ -287727 -298675 -293130 -264987 -282170 -297964 -305638 -316591 -339915 -330415 -296347 -282890 -272272
1180b72272M86L09k0607O154m046k3620j9063K5545N388K0429J145O074J2329
$$ -272272 -271786 -271477 -292084 -285930 -289976 -313596 -332659 -307114 -301726 -281297 -280152 -274078 -261749
1167b61749j8822Q314n984j1099L177q968O441o742p658n0001Q409L3897p946
$$ -261749 -280571 -272257 -278241 -289340 -286163 -295131 -288690 -295432 -303090 -353091 -344682 -310785 -318731
1154c18731P064M4967r643J8098M182j5330j0398K6902J6519l3323l3941j348
$$ -318731 -311667 -266700 -276343 -258245 -254063 -269393 -279791 -252889 -236370 -269693 -303634 -304982
1142c04982m266N53J2559J2853k6823p922L5853j9905j285K1836k1389K2338j2561
$$ -304982 -309248 -308695 -296136 -283283 -310106 -318028 -282175 -302080 -303365 -281529 -302918 -280580 -293141
1129b93141j1744K5968k5599P955p388j149j0260M551J1073J3360k3703L104K4251
$$ -293141 -304885 -278917 -304516 -296561 -303949 -305098 -315358 -310807 -299734 -286374 -310077 -306973 -282722
1116b82722j9735K5874m917q732J903p671o94o195L9832l3999m1604L4046K2864
$$ -282722 -302457 -276583 -281500 -290232 -288329 -296000 -296694 -302889 -263057 -297056 -338660 -304614 -281750
1103b81750J8584R303n5433k7664K0162q039j28L2618N040l959l995j1359M003
$$ -281750 -263166 -253863 -309296 -336960 -316798 -324837 -324965 -292347 -287307 -291266 -295261 -306620 -302617
1090c02617J5861j9768J8694J1868j5367k4680J8065k336J9106N693q707k2133
$$ -302617 -286756 -306524 -287830 -275962 -291329 -316009 -297944 -300280 -281174 -275481 -284188 -306321
1078c06321j860j4795K5768J2404P297k7459j2282J324J8990K4758L742k68R143
$$ -306321 -308181 -322976 -297208 -284804 -277507 -304966 -317248 -315924 -296934 -272176 -268434 -268702 -259559
1065b59559k4870j3982p149m27K822j0169K5020K8698o196l1439p028k295J8054
$$ -259559 -284429 -298411 -305560 -305987 -303165 -313334 -288314 -259616 -265812 -297251 -304279 -306574 -288520
1052b88520j1985J2424k4188K3580J9333j6574j678j1614l682q1J9593m4349j4308
$$ -288520 -300505 -288081 -312269 -288689 -269356 -285930 -287608 -299222 -302904 -302985 -283392 -327741 -342049
1039c42049L1584J4744L2358j4111J8203l256L465r201j5977j2010J9074O1J462
$$ -342049 -310465 -295721 -263363 -277474 -259271 -262527 -259062 -268263 -284240 -296250 -277176 -277115 -275653
1026b75653J0365k2797k335J2465k5817m6765N1581K6480k1145R334O629j1371
$$ -275653 -265288 -288085 -290420 -277955 -303772 -350537 -298956 -272476 -293621 -284287 -277658 -289029
1014b89029l1179J316K511K969L6409j636j043j2341m2709o065R617R126L0300
$$ -289029 -320208 -318892 -316381 -313412 -277003 -278639 -279682 -292023 -334732 -340797 -331180 -322054 -291754
1001b91754J2768l2139J4131J8886p960j4734K971J0599n3695O004J3858K0210
$$ -291754 -278986 -311125 -296994 -278108 -286068 -300802 -297831 -287232 -340927 -334923 -321065 -300855
989c00855R991J6790k1756m7J3853k3160K624R57M0535l0282k3059O74j2962J2709
$$ -300855 -290864 -274074 -295830 -295877 -282024 -305184 -302560 -301603 -261068 -291350 -314409 -313735 -326697 -313988
975c13988N352J6281n730R27j9866k9442L2287M20K918o331K6443K0387p916m640
$$ -313988 -308636 -292355 -298085 -297158 -317024 -346466 -314179 -313759 -310841 -317172 -290729 -270342 -278258 -282898
961b82898J8194L969l5117L5721K9137j8290K385j1222k8263m4561J2339O781
$$ -282898 -264704 -260735 -295852 -260131 -230994 -249284 -246899 -258121 -286384 -330945 -318606 -311825
949c11825N2816j5405l128J5666n214l5201k0545j3263J6244K4141j537j1764
$$ -311825 -259009 -274414 -277542 -261876 -267090 -302291 -322836 -336099 -319855 -295714 -297251 -309015
937c09015J2321Q69j5829l337N4712j931m8631k3922K081O0038P198J519n238
$$ -309015 -296694 -295825 -311654 -314991 -260279 -262210 -310841 -334763 -332682 -272644 -265446 -263927 -269165
924b69165J1451Q886j1725k3455k134k1014M925J9711j7707L5157j0806j0654
$$ -269165 -257714 -248828 -260553 -284008 -286142 -307156 -302231 -282520 -300227 -265070 -275876 -286530
912b86530L3566k625k4489K3936J189J3102L982n2743K1832R755N412n5316l65
$$ -286530 -252964 -255589 -280078 -256142 -254953 -241851 -237869 -290612 -268780 -259025 -253613 -308929 -309294
899c09294K820L9554j0952r186k0449l2611R440K8435K2020j8871J1924m088p267
$$ -309294 -306474 -266920 -277872 -287058 -307507 -340118 -330678 -302243 -280223 -299094 -287170 -291258 -298525
886b98525J1795P034j0994m895j5311M698M623K5835j0172j7447K0079l7923J5815
$$ -298525 -286730 -279696 -290690 -295585 -310896 -306198 -301575 -275740 -285912 -303359 -283280 -321203 -305388
873c05388k2685j4734K0033N1181L2067R160k1693J0037j5032k1944k1393r826
$$ -305388 -328073 -342807 -322774 -271593 -239526 -230366 -252059 -242022 -257054 -278998 -300391 -310217
861c10217O817k1094Q86L9497l615k5199R475k0996K881M7818q882r113M1325
$$ -310217 -303400 -324494 -323608 -284111 -287726 -312925 -303450 -324446 -321565 -273747 -282629 -291742 -250417
848b50417m000K4256j1447j6453j322k281o859r380J1521J4285k5048j277j416
$$ -250417 -254417 -230161 -241608 -258061 -259383 -261664 -268523 -277903 -266382 -252097 -277145 -278422 -279838
835b79838N06L7121l9820m8063k4742J2212K988L9598p403Q65m089J2515L3826
$$ -279838 -279332 -242211 -282031 -330094 -354836 -342624 -339636 -300038 -307441 -306576 -310665 -298150 -264324
822b64324l4226J1567J7174j268J0870R609K410j3938J0171j6155o832J6924j7061
$$ -264324 -298550 -286983 -269809 -271077 -260207 -250598 -248188 -262126 -251955 -268110 -274942 -258018 -275079
809b75079J1130m6103K1023K2734J3789m951j5229k794L2q126p04l3982J1651
$$ -275079 -263949 -310052 -289029 -266295 -252506 -257457 -272686 -275480 -275448 -283574 -284278 -318260 -306609
796c06609P4832l3087k5796K680J2048r089N352j4134J6772J5409j7716m658l4691
$$ -306609 -231777 -264864 -290660 -287980 -275932 -285021 -279669 -293803 -277031 -261622 -279338 -283996 -318687
783c18687M089K6191J6237n0289L0718J4630k5736o270K3253N47r534J9646L5803
$$ -318687 -314598 -288407 -272170 -322459 -291741 -277111 -302847 -309117 -285864 -285317 -294851 -275205 -239402
770b39402K818j5931o472p704o670L2829l2365k6449J0576P884R358j5226R318
$$ -239402 -236584 -252515 -258987 -266691 -273361 -240532 -272897 -299346 -288770 -280886 -271528 -286754 -277436
757b77436n142J480q718J4793o077k033J1805o552j4986J9828Q455l0456O770
$$ -277436 -282578 -281098 -289816 -275023 -281100 -283133 -271328 -277880 -292866 -273038 -264583 -295039 -288269
744b88269L3335l2491j0019L4672j6045R008l7279J5763Q137J0134J9673L026
$$ -288269 -254934 -287425 -297444 -262772 -278817 -269809 -307088 -291325 -283188 -273054 -253381 -250355
732b50355j9231l4613K1689j9327R562k553r065J8932J3259k3851j4587Q632r070
$$ -250355 -269586 -304199 -282510 -301837 -292275 -294828 -303893 -284961 -271702 -295553 -310140 -301508 -310578
719c10578j4330j7024N3305L2615j3793j6536m802K6348L935m5388l6792J1403
$$ -310578 -324908 -341932 -288627 -256012 -269805 -286341 -291143 -264795 -260860 -306248 -343040 -331637
707c31637N7999K8653k8537j439j6306n39k046o490J6498j8910J3084L0163k1825
$$ -331637 -273638 -244985 -273522 -274961 -291267 -291806 -293852 -300342 -283844 -302754 -289670 -259507 -281332
694b81332k5006L2737l20j2443N3094N235k5961k1431j1420J3225p445o619q343
$$ -281332 -306338 -273601 -273921 -286364 -233270 -228035 -253996 -275427 -286847 -273622 -281067 -287686 -296029
681b96029j1411J0362J9571K2240q486j7392m325l202j1498l007j139J3515J5203
$$ -296029 -307440 -297078 -277507 -255267 -263753 -281145 -285470 -288672 -300170 -303177 -304316 -290801 -275598
668b75598j4976j047J5641J5176R609N258k5671j9415L0297j311R030k7867o840
$$ -275598 -290574 -291621 -275980 -260804 -251195 -245937 -271608 -291023 -260726 -262037 -253007 -280874 -287714
655b87714p287j8272j0214r789o404K7711J8512J6780k008j288l358Q752J5480
$$ -287714 -295001 -313273 -323487 -333276 -339680 -311969 -293457 -276677 -278685 -279973 -283331 -274579 -259099
642b59099k357M15p225l8861o019P581K1019P037K1767k7590N805M2184l2456
$$ -259099 -261456 -261041 -268266 -307127 -313146 -305565 -284546 -277509 -255742 -283332 -277527 -235343 -267799
629b67799k3322J6483J2612k3190J9032K573j975r159M6800j9471O279J6516k5291
$$ -267799 -291121 -274638 -262026 -285216 -266184 -263611 -265586 -274745 -227945 -247416 -241137 -224621 -249912
616b49912k6573j98j7152j2000J6092p213J0587j1424L7469K7375K140p783n1737
$$ -249912 -276485 -276683 -293835 -305835 -289743 -296956 -286369 -297793 -260324 -232949 -230809 -238592 -290329
603b90329l40P461M421k9171l767J0899k5682M3824J8184j3190j497n501n203
$$ -290329 -290669 -283208 -278787 -307958 -311725 -300826 -326508 -282684 -264500 -277690 -279187 -284688 -289891
590b89891K4117k0101J741j689R730l8304K0079L0187j0268k3588k4925K4100
$$ -289891 -265774 -285875 -284134 -285823 -276093 -314397 -294318 -264131 -274399 -297987 -322912 -298812
578b98812K8633j4800J792p059K521M1810K1314n2609k4916J3687l4454M4429
$$ -298812 -270179 -284979 -283187 -290246 -287725 -245915 -224601 -277210 -302126 -288439 -322893 -278464
566b78464J8067J6600j4243j0395j6209o849J1025j4058j0046j3749k9886K7821
$$ -278464 -260397 -243797 -258040 -268435 -284644 -291493 -280468 -294526 -304572 -318321 -348207 -320386
554c20386K9958K9492p080K653Q277l2366K3066M0844j9320m5824j5701L5780
$$ -320386 -290428 -260936 -268016 -265363 -257086 -289452 -266386 -225542 -244862 -290686 -306387 -270607
542b70607j5151K2171j5124J2317j8427J3992j046K2647L483l8610l372K3646
$$ -270607 -285758 -263587 -278711 -266394 -284821 -270829 -271875 -249228 -245745 -284355 -287727 -264081
530b64081p588p1775K3985K2217J2913j3334k1144J5762L2687k3194j46P577K5553
$$ -264081 -271669 -343444 -319459 -297242 -284329 -297663 -318807 -303045 -270358 -293552 -293698 -286121 -260568
517b60568J2202j8399J4320L834n780j6065L7602j8903J325j4995J6914J2123
$$ -260568 -248366 -266765 -252445 -248611 -254391 -270456 -232854 -251757 -250432 -265427 -248513 -236390
505b36390n0249j982Q508J4422j8095j7806O473P505j4308P78o083L4644m0326
$$ -236390 -286639 -288621 -280113 -265691 -283786 -301592 -295119 -287614 -301922 -301144 -307227 -272583 -312909
492c12909j1535O3417l706k2650K7650L916k048J038J5669k502k0695k8388J7764
$$ -312909 -324444 -261027 -264733 -287383 -259733 -255817 -257865 -256827 -241158 -243660 -264355 -292743 -274979
479b74979J8059m3899J0883K1245K882j0587K2179j9455k9143j0424P226J2686
$$ -274979 -256920 -300819 -289936 -268691 -265809 -276396 -254217 -273672 -302815 -313239 -306013 -293327
467b93327J3998R801k1657K4855J4886r08m6506n434K1404l0589k213J7288l294
$$ -293327 -279329 -269528 -291185 -266330 -251444 -252352 -298858 -304292 -282888 -313477 -315690 -298402 -301696
454c01696J5594j5137n845j1357J7411K9204N420K724K0908L063m5038O465R753
$$ -301696 -286102 -301239 -307084 -318441 -301030 -271826 -266406 -263682 -242774 -239711 -284749 -278284 -268531
441b68531k9478L0555J7957k6207j8147Q135K630J0760j9681J724k0164J6776
$$ -268531 -298009 -267454 -249497 -275704 -293851 -285716 -283086 -272326 -292007 -290283 -310447 -293671
429b93671j881k4039K3586K0144j335n756N246k2176K8235j2131L778K0808J8235
$$ -293671 -295552 -319591 -296005 -275861 -277196 -282952 -277706 -299882 -271647 -283778 -280000 -259192 -240957
416b40957j5029j3723k7732j3194J782J401P642j3338M163K2878k47k8403p011
$$ -240957 -255986 -269709 -297441 -310635 -308853 -307452 -299810 -313148 -308985 -286107 -286354 -314757 -321768
403c21768J4501N145n47L5614M669k0624Q35J9219M772k6848n058J5784k7446
$$ -321768 -307267 -302122 -302669 -267055 -262386 -283010 -282175 -262956 -258184 -285032 -290090 -274306 -301752
390c01752j6247M4167J5233k6499l786L8962K661m1505j6777L6928L6166l8727
$$ -301752 -317999 -273832 -258599 -285098 -288884 -249922 -247261 -288766 -305543 -268615 -232449 -271176
378b71176j3626k4802K8984L3669P754j0621k4628L002P824j3803J1411n513j2967
$$ -271176 -284802 -309604 -280620 -246951 -239197 -249818 -274446 -271444 -263620 -277423 -266012 -271525 -284492
365b84492R276m544J689q779j0959Q295m4528j8449K5265J5958L9153J2659k4281
$$ -284492 -275216 -279760 -278071 -286850 -297809 -289514 -334042 -352491 -327226 -311268 -272115 -259456 -283737
352b83737k8692K1989M234N218j6631Q42J3973K9585k849j2569m782m420k916
$$ -283737 -312429 -290440 -286206 -280988 -297619 -296777 -282804 -253219 -256068 -268637 -273419 -277839 -280755
339b80755J2725o217l3022J390J9604n33k774k5124j1946Q344N1005j3873m354
$$ -280755 -268030 -274247 -307269 -305879 -286275 -286808 -289582 -314706 -326652 -318308 -267303 -281176 -285530
326b85530K7010J1562R182l7070N66O180j813J2929K3605j7040n4186J4971J8305
$$ -285530 -258520 -246958 -237776 -274846 -274280 -268100 -269913 -256984 -233379 -250419 -304605 -289634 -271329
313b71329L8573j9554k0356O591k5546L760M3618j6456k1737K3704J5037q148
$$ -271329 -232756 -252310 -272666 -266075 -291621 -287861 -244243 -260699 -282436 -258732 -243695 -251843
301b51843l657o145K4708j8204P166N949j5342P286k1501J5408M720M919j3250
$$ -251843 -255500 -261645 -236937 -255141 -247975 -242026 -257368 -250082 -271583 -256175 -251455 -246536 -259786
288b59786m181j2901k17K106j276L7237p663n960j0880k9788J7475j6584J4863
$$ -259786 -263967 -276868 -277085 -274979 -276255 -239018 -246681 -252641 -263521 -293309 -275834 -292418 -277555
275b77555j5238j9681K360K5992N759J6200q840k7213Q420J1974k4473m268J2834
$$ -277555 -292793 -312474 -310114 -284122 -278363 -262163 -271003 -298216 -289796 -277822 -302295 -306563 -293729
262b93729k1601R468J1123j8466K3298J3660j2469K069K8595J2498j2921n36k8694
$$ -293729 -315330 -305862 -294739 -313205 -289907 -276247 -288716 -286647 -258052 -245554 -258475 -259011 -287705
249b87705J4708R548k2165l1939O850K4874R828m099j0673J9409K7207k8126o997
$$ -287705 -272997 -263449 -285614 -317553 -310703 -285829 -276001 -280100 -290773 -271364 -244157 -272283 -279280
236b79280j0313K9127K4163j9127l228r121j6060O204J5228m3893L0846K4936
$$ -279280 -289593 -260466 -236303 -255430 -258658 -267779 -283839 -277635 -262407 -306300 -275454 -250518
224b50518q858L571k3762m549K3068j1045j0556P429J613J3954j6840m2736O816
$$ -250518 -259376 -255805 -279567 -284116 -261048 -272093 -282649 -275220 -273607 -259653 -276493 -319229 -312413
211c12413J3719j121k5430K6353p006J3963J9984p362m756j6214P337J6479l819
$$ -312413 -298694 -299815 -325245 -298892 -305898 -291935 -271951 -279313 -284069 -300283 -292946 -276467 -280286
198b80286J5229l0612L7758M248k0922K5793K743l9633Q942J7519k6959J6415
$$ -280286 -265057 -295669 -257911 -253663 -274585 -248792 -246049 -285682 -276740 -259221 -286180 -269765
186b69765P617K0509j5496J4873o862l0668L1505j9920k0588P891j4543P766r074
$$ -269765 -262148 -241639 -257135 -242262 -249124 -279792 -248287 -268207 -288795 -280904 -295447 -287681 -296755
173b96755K4451J247o589J248O218p831j3369k8785j4973O223j1007N2173j1643
$$ -296755 -272304 -271057 -277646 -276398 -270180 -278011 -291380 -320165 -335138 -328915 -339922 -287749 -299392
160b99392R551Q109j6211J3061l2740M220M2156l741q013M663k1752Q114J7766
$$ -299392 -289841 -281732 -297943 -284882 -317622 -313402 -271246 -274987 -283000 -278337 -300089 -291975 -274209
147b74209q37K487l233j4200l046r855l816Q05n417L21N577R043J6046n099j839
$$ -274209 -275046 -272559 -275792 -289992 -293038 -302893 -306709 -305904 -311321 -311000 -305423 -296380 -280334 -285433 -287272
132b87272r878R035n345Q806j0185j4979K2789p362j3397Q907j3241p409l237
$$ -287272 -297150 -288115 -293460 -284654 -294839 -309818 -287029 -294391 -307788 -298881 -312122 -319531 -322768
119c22768J4030k203J9077r056j7015j4407k97K5645N467J8588J1218k2447K83
$$ -322768 -308738 -310941 -291864 -300920 -317935 -332342 -332639 -306994 -301527 -282939 -271721 -294168 -293885
106b93885j5114o288Q246j3969k2141J8368j5775J4017K0318j2843O636j3841
$$ -293885 -308999 -315287 -307041 -321010 -343151 -324783 -340558 -326541 -306223 -319066 -312430 -326271
94c26271j1231L791q349l341J7270K4378k944k7394j730O827k363o551k424K0449
$$ -326271 -337502 -333711 -342060 -345401 -328131 -303753 -306697 -334091 -335821 -328994 -331357 -337908 -340332 -319883
80c19883J1601K791p903r456j1862r905k0240J550K3598l280R26N649p044J895
$$ -319883 -308282 -305491 -313394 -322850 -334712 -344617 -364857 -363307 -339709 -342989 -342063 -336414 -343458 -341563
66c41563L5933j2680j087Q951k8793p767J4804M63m6047J1066L039j00K3614k8364
$$ -341563 -305630 -318310 -319397 -310446 -339239 -347006 -332202 -331739 -377786 -366720 -363681 -363781 -340167 -368531
52c68531K3721j6268o102K2484R303k1376j6312j140J4851J7232l62j1515j5477
$$ -368531 -344810 -361078 -367180 -344696 -335393 -356769 -373081 -374221 -359370 -342138 -342500 -354015 -369492
39c69492j2673J5041l498j4064J8551j6388j2770L0518r516m260L701J6952n191
$$ -369492 -382165 -367124 -370622 -384686 -366135 -382523 -395293 -364775 -374291 -378551 -374850 -357898 -363089
26c63089p489n173p907k2849J3212R342M026k1015K1614Q818J1841j6167n456
$$ -363089 -370578 -375751 -383658 -406507 -393295 -383953 -379927 -400942 -379328 -370510 -358669 -374836 -380292
13c80292j968k272L678j3079J1168O558q639l925J5502j816j210j7805J8361
$$ -380292 -382260 -384532 -380854 -393933 -382765 -376207 -384846 -388771 -373269 -375085 -376295 -394100 -375739
0c75739
$$ -375739
$$ Imaginary data points
##PAGE= N=2
##DATA TABLE= (X++(I..I)), XYDATA
16383a470258L7945L7651L5335M52K0064L2895J245J5968L5746M2697M574L1993
$$ -1470258 -1432313 -1394662 -1359327 -1358875 -1338811 -1305916 -1304671 -1288703 -1252957 -1210260 -1205686 -1173693
16371a173693o989R199M7980K4156j2256L2772L3710J0414J6031L1806N172L3015
$$ -1173693 -1180682 -1171483 -1123503 -1099347 -1111603 -1078831 -1045121 -1034707 -1018676 -986870 -981698 -948683
16359i48683L2130J8177L3846q737l548K6793J8578O05L2677L5511j1543K2269
$$ -948683 -916553 -898376 -864530 -873267 -876815 -850022 -831444 -830839 -798162 -762651 -774194 -751925
16347g51925L8845L0662j773L2360K2579L0619K2574M322N0865K407j2303M4808
$$ -751925 -713080 -682418 -684191 -651831 -629252 -598633 -576059 -571737 -520872 -518465 -530768 -485960
16335d85960K4083N3651j242j3272K9996K0251J4137K7142M0067j0663J6770R562
$$ -485960 -461877 -408226 -409468 -422740 -392744 -372493 -358356 -331214 -291147 -301810 -285040 -275478
16323b75478j962L706J6964K2512N5637K3941K7552j2548P471J6487K9340J11
$$ -275478 -277440 -273734 -256770 -234258 -178621 -154680 -127128 -139676 -132205 -115718 -86378 -86267
16311h6267K2961M4923J8938j417K3571M756J7676J7803K9974J9294K473K5549
$$ -86267 -63306 -18383 555 -862 22709 27465 45141 62944 92918 112212 114685 140234
16299A40234L6414K9187j0095J2383K0948J4296J4204r833K8812M1446K3790J5825
$$ 140234 176648 205835 195740 208123 229071 243367 257571 247738 276550 317996 341786 357611
16287C57611M922K6083r570J6278P019J1006L1042J4879K9325J1752L8818J7453
$$ 357611 362533 388616 379046 395324 402343 413349 444391 459270 488595 500347 539165 556618
16275E56618k260J9967j5933O10K3969K9739J7653R000J9587K2494l001K4966
$$ 556618 554358 574325 558392 559002 582971 612710 630363 639363 658950 681444 678443 703409
16263G03409j8163o123K8121J2826k0376L4592P6671l4390P488j6820j7076N1624
$$ 703409 685246 679123 707244 720070 699694 734286 810957 776567 784055 767235 750159 801783
$$ [...]
##END NTUPLES=NMR SPECTRUM
##END=
