##TITLE=1H_DE-80H_X3
 200.13MHz, d2o
 8 sc
 
 19ns.26.2.2025
##JCAMPDX= 6.0         $$ Bruker NMR JCAMP-DX V2.0
##DATA TYPE= NMR SPECTRUM
##DATA CLASS= NTUPLES
##ORIGIN= UXNMR, Bruker Analytische Messtechnik GmbH
##OWNER= pz
$$ XWIN-NMR		Version 3.5
$$ Tue Mar 17 10:01:29 2026 Russian Standard Time (UT+4h)  Yarkov@DPX200
##.OBSERVE FREQUENCY= 200.1313
##.OBSERVE NUCLEUS= ^1H
##.ACQUISITION MODE= SIMULTANEOUS
##.ACQUISITION SCHEME= undefined
##.AVERAGES= 8
##.DIGITISER RES= 18
##SPECTROMETER/DATA SYSTEM= spect
##.PULSE SEQUENCE= zg30
##.SOLVENT NAME= CDCl3
##.SHIFT REFERENCE= (INTERNAL, CDCl3, 0, 15.4307)
##AUDIT TRAIL= $$ (NUMBER, WHEN, WHO, WHERE, WHAT)
$$ ##TITLE= Audit trail, XWIN-NMR		Version 3.5
$$ ##JCAMPDX= 5.01
$$ ##ORIGIN= Bruker BioSpin GmbH
$$ ##OWNER= Yarkov
$$ C:/Bruker/XWIN-NMR/data/yarkov2/nmr/H-C/1/pdata/1/auditp.txt
$$ ##AUDIT TRAIL=  $$ (NUMBER, WHEN, WHO, WHERE, WHAT)
(   1,<2026-03-17 10:00:42.81 +0400>,<Yarkov>,<DPX200>,
      <created by zg, POWCHK disabled, PULCHK disabled
       configuration hash MD5:
       00 E9 B6 7A A2 85 ED C7 34 08 36 98 17 FE 4E 26
       data hash MD5: 16K
       1A FD 20 6A 6F 36 7F 74 8C 7D EB 4E 5C 07 EA 55>)
(   2,<2026-03-17 10:00:46.73 +0400>,<Yarkov>,<DPX200>,
      <Start of raw data processing
       efp BC_mod = 2 LB = 0.25 FT_mod = 6 PKNL = 1 PHC0 = -5299.148 PHC1 = 6.821927 SI = 16K 
       data hash MD5: 16K
       6C 3C E3 BA E0 C9 49 00 81 E6 02 6A 85 0E E5 CA>)
$$ ##END=
$$ 
$$ hash MD5
$$ A8 2B 69 BD 2C 54 E1 55 B0 2E 31 58 B4 84 D0 04
##$RELAX= 
##$RELAX= 
##$RELAX= 
##$RELAX= 
##$RELAX= 
##$RELAX= 
$$ Bruker specific parameters
$$ --------------------------
##$DU= <C:/Bruker/XWIN-NMR>
##$EXPNO= 1
##$NAME= <H-C>
##$PROCNO= 1
##$TYPE= <nmr>
##$USER= <yarkov2>
##$AMP= (0..31)
100 100 100 100 100 100 100 100 100 100 100 100 100 100 100 100 100 100 
100 100 100 100 100 100 100 100 100 100 100 100 100 100 
##$AQSEQ= 0
##$AQ_mod= 1
##$AUNM= <au_zg>
##$AUTOPOS= <>
##$BF1= 200.13
##$BF2= 200.13
##$BF3= 200.13
##$BF4= 200.13
##$BF5= 200.13
##$BF6= 200.13
##$BF7= 200.13
##$BF8= 200.13
##$BYTORDA= 1
##$CFDGTYP= 0
##$CFRGTYP= 5
##$CHEMSTR= <none>
##$CNST= (0..31)
1 1 145 1 1 1 1 1 1 1 1 1 1 1 1 1 1 1 1 1 1 1 1 1 1 1 1 1 1 1 1 1 
##$CPDPRG= <>
##$CPDPRG1= <>
##$CPDPRG2= <>
##$CPDPRG3= <>
##$CPDPRG4= <mlev>
##$CPDPRG5= <mlev>
##$CPDPRG6= <mlev>
##$CPDPRG7= <mlev>
##$CPDPRG8= <mlev>
##$CPDPRGB= <>
##$CPDPRGT= <>
##$D= (0..31)
0 0.7 0 0 0 0 0 0 0 0 0 0.03 0 0 0 0 0 0 0 0 0 0 0 0 0 0 0 0 0 0 0 0 
##$DATE= 1773727242
##$DBL= (0..7)
120 120 120 120 120 120 120 120 
##$DBP= (0..7)
150 150 150 150 150 150 150 150 
##$DBP07= 0
##$DBPNAM0= <>
##$DBPNAM1= <>
##$DBPNAM2= <>
##$DBPNAM3= <>
##$DBPNAM4= <>
##$DBPNAM5= <>
##$DBPNAM6= <>
##$DBPNAM7= <>
##$DBPOAL= (0..7)
0.5 0.5 0.5 0.5 0.5 0.5 0.5 0.5 
##$DBPOFFS= (0..7)
0 0 0 0 0 0 0 0 
##$DE= 6
##$DECBNUC= <off>
##$DECIM= 32
##$DECNUC= <off>
##$DECSTAT= 4
##$DIGMOD= 1
##$DIGTYP= 9
##$DL= (0..7)
0 120 120 120 120 120 120 120 
##$DP= (0..7)
$$ [...]
##$SUBNAM2= <"">
##$SUBNAM3= <"">
##$SUBNAM4= <"">
##$SUBNAM5= <"">
##$SUBNAM6= <"">
##$SUBNAM7= <"">
##$SUBNAM8= <"">
##$SUBNAM9= <"">
##$SW= 18.0517328524113
##$SWIBOX= (0..15)
0 0 2 0 0 0 0 0 0 0 0 0 0 0 0 0 
##$SW_h= 3612.71676300578
##$TD= 16384
##$TD0= 1
##$TE= 0
##$TE2= 300
##$TE3= 300
##$TEG= 300
##$TL= (0..7)
0 120 120 120 120 120 120 120 
##$TP= (0..7)
150 150 150 150 150 150 150 150 
##$TP07= 0
##$TPNAME0= <>
##$TPNAME1= <>
##$TPNAME2= <>
##$TPNAME3= <>
##$TPNAME4= <>
##$TPNAME5= <>
##$TPNAME6= <>
##$TPNAME7= <>
##$TPOAL= (0..7)
0.5 0.5 0.5 0.5 0.5 0.5 0.5 0.5 
##$TPOFFS= (0..7)
0 0 0 0 0 0 0 0 
##$TUNHIN= 0
##$TUNHOUT= 0
##$TUNXOUT= 0
##$USERA1= <user>
##$USERA2= <user>
##$USERA3= <user>
##$USERA4= <user>
##$USERA5= <user>
##$V9= 5
##$VALIST= <valist>
##$VCLIST= <CCCCCCCCCCCCCCC>
##$VD= 0
##$VDLIST= <DDDDDDDDDDDDDDD>
##$VPLIST= <PPPPPPPPPPPPPPP>
##$VTLIST= <TTTTTTTTTTTTTTT>
##$WBST= 1024
##$WBSW= 4
##$XGAIN= (0..3)
0 0 0 0 
##$XL= 0
##$YL= 0
##$YMAX_a= 668857
##$YMIN_a= -628997
##$ZGOPTNS= <>
##$ZL1= 120
##$ZL2= 120
##$ZL3= 120
##$ZL4= 120
##$ABSF1= 0
##$ABSF2= 0
##$ABSG= 0
##$ABSL= 0
##$ALPHA= 0
##$AQORDER= 0
##$ASSFAC= 0
##$ASSFACI= 0
##$ASSFACX= 0
##$ASSWID= 0
##$AUNMP= <proc_1d>
##$AZFE= 0.1
##$AZFW= 0.1
##$BCFW= 0
##$BC_mod= 2
##$BYTORDP= 0
##$COROFFS= 0
##$CY= -3
##$DATMOD= 1
##$DC= 0
##$DFILT= <>
##$DTYPP= 0
##$F1P= 0
##$F2P= 0
##$FCOR= 1
##$FTSIZE= 16384
##$FT_mod= 6
##$GAMMA= 0
##$GB= 0
##$INTBC= 1
##$INTSCL= 3.241238e-09
##$ISEN= 128
##$LB= 0.25
##$LEV0= 0
##$LPBIN= 0
##$MAXI= 10000
##$MC2= 0
##$MEAN= 0
##$ME_mod= 0
##$MI= 1.114404
##$NCOEF= 0
##$NC_proc= -5
##$NLEV= 6
##$NOISF1= 3.799351
##$NOISF2= 2.8
##$NSP= 0
##$NTH_PI= 0
##$NZP= 0
##$OFFSET= 15.43067
##$PC= 1
##$PHC0= -5299.148
##$PHC1= 6.821927
##$PH_mod= 1
##$PKNL= yes
##$PPARMOD= 0
##$PSCAL= 0
##$PSIGN= 0
##$REVERSE= no
##$SF= 200.130018217518
##$SI= 16384
##$SIGF1= 3
##$SIGF2= 2
##$SINO= 0.751879
##$SIOLD= 32768
##$SREGLST= <19F.Aceton>
##$SSB= 0
##$STSI= 16384
##$STSR= 0
##$SW_p= 3612.71676300578
##$SYMM= 0
##$S_DEV= 0
##$TDeff= 16384
##$TDoff= 0
##$TI= <>
##$TILT= no
##$TM1= 0
##$TM2= 0
##$TOPLEV= 0
##$USERP1= <user>
##$USERP2= <user>
##$USERP3= <user>
##$USERP4= <user>
##$USERP5= <user>
##$WDW= 1
##$XDIM= 16384
##$YMAX_p= 382396014
##$YMIN_p= -786471
$$ End of Bruker specific parameters
$$ ---------------------------------
##NTUPLES= NMR SPECTRUM
##VAR_NAME=  FREQUENCY,     SPECTRUM/REAL,   SPECTRUM/IMAG
##SYMBOL=    X,             R,               I
##VAR_TYPE=  INDEPENDENT,   DEPENDENT,       DEPENDENT
##VAR_FORM=  AFFN,          ASDF,            ASDF
##VAR_DIM=   16384,         16384,           16384
##UNITS=     HZ,            ARBITRARY UNITS, ARBITRARY UNITS
##FACTOR=    0.220516191357247, 1,           1
##FIRST=     3088.14022508968, 0,            0
##LAST=      -524.576537916105, 0,           0
##MIN=       -524.576537916105, -786471,     0
##MAX=       3088.14022508968, 382396014,    0
$$ Real data points
##PAGE= N=1
##DATA TABLE= (X++(R..R)), XYDATA
$$ [...]
5945A0151680L71673N44935P24711Q31441R13231R18405P18588L99729J16048
5936A5690441j80510l92109m45577m18270k73734j43149Q53K00378L18267M50767
5926A4807357N85803O66249P34707P16891O71959N61188L91099K12285N493j47331
5916A9205700j73008k62273k58465k56185j73490o4440j132J30902K36198M11492
5906A8795299O32141P21334P37725O35377L26229q095k41167l69333l60806l43089
5896B0525615k45283k99577l56955l07883l08178k26674j90114j42501k7254m4332
5886A8376864m9196K1445J562J62965K30576K21421P2542j29302k65032l81026
5876A8262819l76672m74312n63603o26361o44933o32493o21016n22258l60711
$$ y = [10151680, 10523353, 11068288, 11792999, 12624440, 13537671, 14456076, 15174664, 15574393, 15690441, 15509931, 15117822, 14672245, 14253975, 13980241, 13837092, 13837945, 14038323, 14356590, 14807357, 15393160, 16059409, 16794116, 17511007, 18182966, 18744154, 19135253, 19347538, 19353031, 19205700, 19032692, 18770419, 18511954, 18255769, 18082279, 18017839, 18016707, 18147609, 18383807, 18795299, 19427440, 20148774, 20886499, 21521876, 21848105, 21840010, 21598843, 21229510, 20868704, 20525615, 20280332, 19980755, 19623800, 19315917, 19007739, 18781065, 18590951, 18448450, 18421196, 18376864, 18327668, 18349113, 18350675, 18513640, 18744216, 18965637, 19038179, 18908877, 18643845, 18262819, 17886147, 17411835, 16848232, 16221871, 15576938, 14944445, 14323429, 13801171, 13440460]
5867A3440460k82857j54662j05243r5407j62669k47917l06853l35343l11954k52144
5857A1185411k72320k75367k10487k45754k77555l40121m14023m81304n91236
5848H077244n65319n26840m77597l68796l18813j99030j16663q8854j3728k863
5838E398741K2755P1795J293j02374j79830k44053l02939k82891k84746l26675
5828C771076k29686j99718j67309j57367j41393j00431r5165q1890j23856n3001
5818B421260l6843k9427j03313m0174l5628n9937k1483k7455j3928k1390n4935
5807A976747K2272n436l8536o2844j7251j7589l3447l1262m9048p271n806P309
5795A737838k5102l1502p943J0859R268j7632k9955q35J3239o243m0946j2814
$$ y = [13440460, 13157603, 13002941, 12897698, 12802291, 12639622, 12391705, 12084852, 11749509, 11437555, 11185411, 10913091, 10637724, 10427237, 10181483, 9903928, 9563807, 9149784, 8668480, 8077244, 7511925, 6985085, 6507488, 6138692, 5819879, 5620849, 5504186, 5415332, 5401604, 5398741, 5421496, 5493291, 5494584, 5392210, 5212380, 4968327, 4665388, 4382497, 4097751, 3771076, 3541390, 3341672, 3174363, 3016996, 2875603, 2775172, 2680007, 2598117, 2474261, 2421260, 2384417, 2354990, 2251677, 2211503, 2175875, 2115938, 2094455, 2067000, 2053072, 2031682, 1976747, 1999019, 1993583, 1955047, 1892203, 1874952, 1857363, 1823916, 1792654, 1743606, 1736335, 1730529, 1737838, 1712736, 1681234, 1673291, 1684150, 1693418, 1675786, 1645831, 1644996, 1658235, 1651992, 1611046, 1598232]
5783A598232J4293k7801m8583O990j652P254l0279j7952m942l2151K2491K2781
5771A508681L5004P565j4934l6882N475j3699l22q650J1083P902m912L22j6502
5758A480131L623O77M339k0831j0384R484k925k7266K7582J4479l1433J6618k3254
5745A440840J1309J7433q689n142R947J5472p811j0775R01k0337L0244M176J7449
5732A495017L5799M1074q718K772J9287o70K6881J2073N9290l393K6271J1018
5720A716701N1253K5390J5863k3035K6869J7377j6422L683j189j1903N059k2850
5708A786796n5296k2009K9068o5581K2170J2300m2320j0493K6783M7499K4149
5697A753066K8177L8743O1446J5349L9282Q8937J9635l808l7676m6571p8330q7105
$$ y = [1598232, 1612525, 1584724, 1536141, 1543131, 1541479, 1548733, 1518454, 1500502, 1495560, 1463409, 1485900, 1508681, 1543685, 1551250, 1536316, 1499434, 1504909, 1491210, 1490888, 1482238, 1493321, 1501223, 1496311, 1496633, 1480131, 1483754, 1484431, 1488770, 1467939, 1457555, 1467039, 1464114, 1436848, 1464430, 1478909, 1447476, 1464094, 1440840, 1452149, 1469582, 1460893, 1455751, 1465698, 1481170, 1473359, 1462584, 1463485, 1443148, 1473392, 1477568, 1495017, 1530816, 1571890, 1563172, 1565944, 1585231, 1584561, 1611442, 1623515, 1682805, 1679412, 1705683, 1716701, 1767954, 1793344, 1809207, 1786172, 1813041, 1830418, 1813996, 1817679, 1816490, 1804587, 1809646, 1786796, 1731500, 1709491, 1738559, 1672978, 1695148, 1707448, 1665128, 1654635, 1681418, 1728917, 1753066, 1781243, 1819986, 1881432, 1896781, 1936063, 2025000, 2044635, 2040827, 2003151, 1956580, 1878250, 1791145]
5685A791145k4120j3995n1997l1983n621k170n7420k0793J6801p7391j199k536
5673A518721j6472L551L7676R808k3029K5489o029k3082j3818J5936M1257P8142
5661A648150P3826N7051J1366n6028n2620R366k3799r0066n7916m1542m831l3466
5649A439491Q631K9058L2606p670n095m834O859k5602J5441K9625n230j5510P180
5636A504950J9099K6207j0656l2751k4505J5747L9543N6271J5308K2398r632j7496
5624A604483k6547m5751j2547L267K9512m6955l4998K509L8833K0465k5474J382
5612A508179J4808j7413r807M017J0862N1061j6896j7828q39j2136R421K6684
5600A550113m8J6344k436K87J5920L187O369L532j3683k4636q36l158Q669q092
$$ y = [1791145, 1767025, 1753030, 1701033, 1669050, 1663429, 1661259, 1603839, 1583046, 1599847, 1522456, 1521257, 1518721, 1502249, 1505800, 1543476, 1553284, 1530255, 1555744, 1549715, 1526633, 1512815, 1528751, 1570008, 1648150, 1721976, 1779027, 1790393, 1734365, 1681745, 1691111, 1667312, 1577246, 1519330, 1477788, 1472957, 1439491, 1448122, 1477180, 1509786, 1502116, 1497021, 1492187, 1499046, 1473444, 1488885, 1518510, 1513280, 1497770, 1504950, 1524049, 1550256, 1539600, 1506849, 1482344, 1498091, 1537634, 1593905, 1609213, 1631611, 1621979, 1604483, 1577936, 1532185, 1519638, 1522905, 1552417, 1505462, 1470464, 1472973, 1511806, 1532271, 1506797, 1508179, 1522987, 1505574, 1495767, 1499784, 1510646, 1561707, 1544811, 1526983, 1526144, 1514008, 1523429, 1550113, 1550065, 1566409, 1563973, 1564260, 1580180, 1583367, 1589736, 1593268, 1579585, 1554949, 1554113, 1550955, 1559624, 1551532]
5586A551532K3081j5972N315J0147q845n48m183j4193n682J9174J9094K4479j5551
5573A587848o154M4683M160q383k7866j1532Q307j1352k8716J8663L7314m3170
5561A563802k651J9364J5620j6021R363L1017l7922n996Q852N217J2057k4252
5549A578450p394Q574K7535J1860l2996l6050m153J9607o5068J7053J0787P932
5537A536137K2723R381q184K1050K8337m5306j6532L182J5280L794l1300J8762
5525A557324n865k8008j4575k3422K2617J3148R25r94k0571j490J3568K0731j5772
5512A517616j1121K3431k6193k9659n86J3204J7177L74J8353J9469j9697j7091
5500A505277j8533K7567k7273J028L056o736q299K489M645J1831l1104k7028N4306
$$ y = [1551532, 1574613, 1558641, 1563956, 1574103, 1565258, 1564710, 1560527, 1546334, 1540652, 1559826, 1578920, 1603399, 1587848, 1581694, 1626377, 1630537, 1622154, 1594288, 1582756, 1591063, 1579711, 1550995, 1569658, 1606972, 1563802, 1561151, 1580515, 1596135, 1580114, 1589477, 1620494, 1582572, 1576576, 1585428, 1590645, 1602702, 1578450, 1571056, 1579630, 1607165, 1619025, 1586029, 1549979, 1545826, 1565433, 1500365, 1517418, 1528205, 1536137, 1558860, 1568241, 1560057, 1581107, 1609444, 1564138, 1547606, 1550788, 1566068, 1569862, 1538562, 1557324, 1551459, 1523451, 1508876, 1485454, 1508071, 1521219, 1522144, 1521150, 1500579, 1499089, 1512657, 1533388, 1517616, 1506495, 1529926, 1503733, 1474074, 1473488, 1486692, 1503869, 1504243, 1522596, 1542065, 1522368, 1505277, 1486744, 1514311, 1487038, 1488066, 1491122, 1484386, 1476087, 1478576, 1483221, 1495052, 1463948, 1436920, 1491226]
5487A491226M679l0932N712K2149r56n232j3888K625k945j8318j4047N915l3201
5474A412787J9300M9826R668K7687K6464l7297n3699M783J9030J2588Q787k6590
5462A473334k0296m23K1871K3863M4538j2011k3141j1478R873j1342k5966R798
5450A478620j3840N121r635o833j1872J0654N81p093p507M400J3588J4373j0207
5437A460350n418K959j810J994J3330p241n149j3804J9216J0972J864j0794m4578
5424A421891K9056O115n0973M1968K0067l67K0498n0136j3220M3706j6030j6683
5412A435892J3276j2315J5140K5765K9729k7589l7866J1129J114j9716L2786R257
5400A476602j5651k3005P252j4788m580L4220k353m1291J5748K4115M438k1074
$$ y = [1491226, 1495905, 1464973, 1470685, 1492834, 1491878, 1486646, 1472758, 1475383, 1472438, 1454120, 1440073, 1445988, 1412787, 1432087, 1481913, 1491581, 1519268, 1545732, 1508435, 1454736, 1459519, 1478549, 1491137, 1499924, 1473334, 1453038, 1452615, 1474486, 1498349, 1542887, 1530876, 1507735, 1496257, 1506130, 1494788, 1468822, 1478620, 1464780, 1469901, 1460266, 1453433, 1441561, 1452215, 1452796, 1445703, 1438196, 1442596, 1456184, 1470557, 1460350, 1454932, 1457891, 1456081, 1458075, 1471405, 1464164, 1459015, 1445211, 1464427, 1475399, 1477263, 1466469, 1421891, 1450947, 1457062, 1406089, 1448057, 1468124, 1467757, 1488255, 1438119, 1424899, 1468605, 1452575, 1435892, 1449168, 1436853, 1451993, 1477758, 1507487, 1479898, 1442032, 1453161, 1454275, 1434559, 1467345, 1476602, 1460951, 1437946, 1445198, 1430410, 1425830, 1460050, 1457697, 1416406, 1432154, 1456269, 1460707, 1439633]
5388A439633O775p74j2515J5068K1107J3468k3621l1796J6235k1155J6649J8968
5376A458042J1831J5154j7268O897k3854j7098J5416n676J1695N3970j4529K85
5364A494865J4580K2202K1393k4548l1419Q131k895J0751l1919k0355r725J8779
5352A469840j9866o596J3867J3232j5765K2229L0097j2836J2901k086J4633k0299
5340A499351O316M2301m5394k2703j2516J4992K1040J187q599k5777j6747K5259
5328A478710K9126p881k1365J1124R122N176n065l1821j995J4999K7941L523J458
5315A513052K6278m4095k6598k5494k0381N2456J9601J4403k9390l820n392K635
5303A473255J2892K529q030j621k5632k1186Q302M5598q969j2470j5204q276k7116
$$ y = [1439633, 1446408, 1445634, 1433119, 1448187, 1469294, 1482762, 1459141, 1427345, 1443580, 1422425, 1439074, 1458042, 1469873, 1485027, 1467759, 1474656, 1450802, 1433704, 1449120, 1443444, 1455139, 1509109, 1494580, 1494865, 1509445, 1531647, 1553040, 1528492, 1497073, 1505204, 1502309, 1513060, 1481141, 1460786, 1451061, 1469840, 1449974, 1443378, 1457245, 1470477, 1454712, 1476941, 1507038, 1494202, 1507103, 1505017, 1519650, 1499351, 1505667, 1547968, 1502574, 1479871, 1467355, 1482347, 1503387, 1504574, 1495975, 1470198, 1453451, 1478710, 1507836, 1499955, 1478590, 1489714, 1498836, 1504012, 1498947, 1467126, 1465131, 1480130, 1508071, 1511594, 1513052, 1539330, 1495235, 1468637, 1443143, 1422762, 1475218, 1494819, 1509222, 1479832, 1476012, 1470620, 1473255, 1486147, 1488676, 1480646, 1479025, 1453393, 1432207, 1440509, 1486107, 1477138, 1464668, 1449464, 1441188, 1414072]
5290A414072J7852j4960r175K0746J1469J1571J695J2904Q497J4971k7740q314
5278A453588m625Q2J0378j0262j5577j7748l1464N779M9205Q307k6208L0051p324
5265A444182j7667K0996n335J454K4822n409q700j8719J9829L2942k1721N360
5253A472034j3334k1678k41P199n935j7099m245L1712K9577K2077O703J218k991
5240A504997n4860r068k6214K0858M2717l636j1402J612k9417j4505K1494J7935
5228A460511J4125r250J6395j1896r39J5102j5486j4936p97J8560q37M3649j7091
5215A497110Q687N7145k8170l3012J4566N460j7063l2610J0108K1618J7014l6473
5203A484380P167P760K0395M0414q34j1024P409M165k6426n36k209k2483k6417
$$ y = [1414072, 1431924, 1416964, 1407789, 1428535, 1440004, 1451575, 1453270, 1466174, 1474671, 1489642, 1461902, 1453588, 1448963, 1449045, 1459423, 1449161, 1433584, 1415836, 1384372, 1390151, 1439356, 1447663, 1421455, 1451506, 1444182, 1426515, 1447511, 1442176, 1443630, 1468452, 1463043, 1454343, 1435624, 1455453, 1488395, 1466674, 1472034, 1458700, 1437022, 1436781, 1443980, 1438045, 1420946, 1416701, 1448413, 1477990, 1500067, 1506770, 1507988, 1504997, 1450137, 1441069, 1414855, 1435713, 1478430, 1474794, 1463392, 1465004, 1435587, 1421082, 1442576, 1460511, 1474636, 1465386, 1481781, 1469885, 1468946, 1484048, 1468562, 1453626, 1452829, 1471389, 1470552, 1514201, 1497110, 1505797, 1562942, 1534772, 1501760, 1516326, 1521786, 1504723, 1472113, 1482221, 1503839, 1520853, 1484380, 1491547, 1499307, 1519702, 1560116, 1559282, 1548258, 1555667, 1559832, 1533406, 1532870, 1530661, 1508178, 1481761]
5190A481761J8576R529m176j4972N724k1686K5474Q796K8850j2686J7325K9240
5178A571755m922j6382J0346J2545J4136K77K1805N7118J5107O993K447J2931
5166A704156K345L4782n373L5280J8373L9295j2373j3277J1153m827L6761K62
5154A846557r295O351L2307o581r4J9505K0973p986J5323k1536J9206J9585l7108
5141A897207L971K9926J6629R718m340J9980j1173l254j2353j9565m3955q966
5129A873825k779J175l5844J4258J3608N681N3929k2841M707r352P607P111J1235
5116A922320J0909n641p433l407L40Q622k530P634K6734K7646j5764j1188L247
5103A961489L997K5845L3024j9589n753l040N0984j3092M615K658J8936M2863
$$ y = [1481761, 1500337, 1509866, 1505690, 1490718, 1496442, 1474756, 1500230, 1509026, 1537876, 1525190, 1542515, 1571755, 1566833, 1550451, 1560797, 1573342, 1587478, 1587755, 1609560, 1666678, 1681785, 1688778, 1691225, 1704156, 1706501, 1741283, 1735910, 1771190, 1789563, 1828858, 1816485, 1803208, 1814361, 1809534, 1846295, 1846557, 1837262, 1843613, 1875920, 1869339, 1869245, 1888750, 1909723, 1901737, 1917060, 1895524, 1914730, 1934315, 1897207, 1901178, 1931104, 1947733, 1957451, 1953111, 1973091, 1961918, 1958664, 1946311, 1926746, 1882791, 1873825, 1871046, 1872221, 1836377, 1850635, 1864243, 1869924, 1923853, 1901012, 1905719, 1896367, 1903974, 1911085, 1922320, 1933229, 1927588, 1920155, 1916748, 1917088, 1925710, 1923180, 1930814, 1957548, 1985194, 1969430, 1958242, 1961489, 1965486, 1991331, 2024355, 2004766, 1999013, 1995973, 2046957, 2033865, 2038480, 2041138, 2060074, 2102937]
5091B102937M878K1456M94R188J8339M8377q462n2140j878J6853L3656m402j4488
5078B174808l244M0921N511p073N6799J6753M099L5841L9447J2820J6064O0239
5066B452985O003Q750L5557k987l8524k3456L441k7763k6703k5523o966k0247
5054B334567J9650J2326J2712k0576k1574J1074K0600k7490k5108J7533n52K6396
5042B359558K7508n310L423L8673L1516j3905k416K2269R18K888k0199K0564l3389
5029B432098l7159j0227K7665n3029l6966J0492k3878K7446K5316p171r343K7540
5017B372784L621J6496N0780K3151j2730J5367K9532K2383M8475k02K4501M1097
5005B635255j3915j5561J3035J3502J9185J1437l4889O4288N9357K268J5041J9240
$$ y = [2102937, 2107815, 2129271, 2129765, 2138953, 2157292, 2205669, 2197207, 2145067, 2143189, 2160042, 2193698, 2189296, 2174808, 2171564, 2212485, 2217996, 2210923, 2267722, 2284475, 2288574, 2324415, 2363862, 2376682, 2392746, 2452985, 2458988, 2467738, 2503295, 2500308, 2461784, 2438328, 2441769, 2414006, 2387303, 2361780, 2354814, 2334567, 2354217, 2366543, 2379255, 2358679, 2337105, 2348179, 2368779, 2341289, 2316181, 2333714, 2333162, 2359558, 2387066, 2381756, 2385179, 2423852, 2455368, 2441463, 2439047, 2461316, 2462234, 2465122, 2444923, 2465487, 2432098, 2394939, 2384712, 2412377, 2359348, 2322382, 2332874, 2308996, 2336442, 2361758, 2354587, 2345244, 2372784, 2376405, 2392901, 2443681, 2466832, 2454102, 2469469, 2499001, 2521384, 2569859, 2569657, 2594158, 2635255, 2621340, 2605779, 2618814, 2632316, 2651501, 2662938, 2628049, 2692337, 2751694, 2753962, 2769003, 2788243]
4993B788243j223K7600K0645M3565L2448K7611N5867P846j3822L7750L5112K6443
4981C088085l2408K9670M4454K8762J3322K6507N2763O0807M6033L7815J9749
4970C415559L6333O6226M3815O9443L0831M7784R7877O1339O8152P2044N5246
4959D064649Q8888J22410Q2607P8745P0299J07241R2839R1937O0185R7513J01301
4948E058614M4990R0460R5339J04599R1043O7871J07711J24701Q8879J08441J05570
4937F088218J39912J77161K07998J63917J58253K00750K23858J77842K30313K47566
4927H015788K49600K64878K89526L34174L95403M51188N68165O85529Q96102J026077
4917A3176430J073364R56351O07000J88458j87463m54972n48835m84468l68646
$$ y = [2788243, 2787020, 2814620, 2835265, 2878830, 2911278, 2938889, 2994756, 3002602, 2988780, 3026530, 3061642, 3088085, 3055677, 3085347, 3129801, 3158563, 3171885, 3198392, 3251155, 3311962, 3357995, 3395810, 3415559, 3451892, 3518118, 3561933, 3631376, 3662207, 3709991, 3807868, 3869207, 3937359, 4009403, 4064649, 4153537, 4275947, 4358554, 4437299, 4507598, 4614839, 4707678, 4799615, 4859800, 4957313, 5058614, 5103604, 5194064, 5289403, 5394002, 5485045, 5552916, 5660627, 5785328, 5874207, 5982648, 6088218, 6228130, 6405291, 6613289, 6777206, 6935459, 7136209, 7360067, 7537909, 7768222, 8015788, 8265388, 8530266, 8819792, 9153966, 9549369, 10000557, 10568722, 11254251, 12150353, 13176430, 14249794, 15206145, 15813145, 16001603, 15814140, 15359168, 14810333, 14325865, 13957219]
4908A3957219k36179j05237O7272K28017M22601O55441Q68573J065521J207362
4899A8130590J138531Q19187M26718N9030j94201j75114j20464J0704K36058M35733
4889B0766772O17349Q45161R67529J109822J176030J237181J260087J254890J266536
4880C0501357J157303J101415J034228R86273Q57744Q46435Q65979Q63578R26510
4871C9140822J060862J260919J451630J748469K072542K476511K870508L173444
4863E5255707L446999L466802L219102K841102K385522J864957J513430J332958
4855G5326579J144820R66888Q95741P64569N86768M09008K45046K05093J40409
4846H0684921J23466l5821l14852o29097r27358j021845j001627p77875o73565
$$ y = [13957219, 13721040, 13615803, 13683075, 13911092, 14333693, 14989134, 15857707, 16923228, 18130590, 19269121, 20088308, 20515026, 20574056, 20379855, 20204741, 20084277, 20094981, 20331039, 20766772, 21384121, 22229282, 23196811, 24306633, 25482663, 26719844, 27979931, 29234821, 30501357, 31658660, 32760075, 33794303, 34780576, 35638320, 36484755, 37350734, 38214312, 39140822, 40201684, 41462603, 42914233, 44662702, 46735244, 49211755, 52082263, 55255707, 58702706, 62169508, 65388610, 68229712, 70615234, 72480191, 73993621, 75326579, 76471399, 77438287, 78334028, 79098597, 79685365, 80094373, 80339419, 80544512, 80684921, 80808387, 80772566, 80457714, 79828617, 78901259, 77879414, 76877787, 76099912, 75426347]
4837G5426347o28266q96356j280574j490716j562783j476731j317039j171263
4829F5602619j064178r35820o97305m10948k9719L60294O57279Q62000R04180
4820F5248402O01434P2243l80838p48260r08602p92516n63241k43445R4769L63889
4810F2743835O05537O61464O94935O09893M25346J97435j7016l24666n10174n70953
4800F4515636n35248m13335l19443k39925j97665j21082M1855K53894O54874J088163
4790F4727724J645481K301420K883043L506030M096444M423056M635263M324137
4782I2542598L631302K479858J108636j92052j437062k397319l189971l828726
4774H8717264m096923m067470l856730l416463k777110k027105j385924q37374
$$ y = [75426347, 74798081, 73901725, 72621151, 71130435, 69567652, 68090921, 66773882, 65602619, 64538441, 63602621, 62905316, 62494368, 62464649, 62824943, 63482222, 64344222, 65248402, 65849836, 65922079, 65541241, 64792981, 63884379, 63091863, 62528622, 62285177, 62379946, 62743835, 63349372, 64010836, 64705771, 65315664, 65741010, 65938445, 65921429, 65596763, 65086589, 64515636, 63980388, 63567053, 63247610, 63007685, 62810020, 62688938, 62730793, 62984687, 63639561, 64727724, 66373205, 68674625, 71557668, 75063698, 79160142, 83583198, 88218461, 92542598, 96173900, 98653758, 99762394, 99570342, 98133280, 95735961, 92545990, 88717264, 84620341, 80552871, 76696141, 73279678, 70502568, 68475463, 67089539, 66252165]
4766F6252165o24636q73852j318712j793180k118686k179755k001323j737851
4758E3604170j537871j353177j211779j130176j192546j331499j575738j805154
4750D2466230k101407k255753k380349k423499k405183k277068k103767j992281
4742B4526923j855467j638733j501702j367235j142637j017302r14626p81019
4734A4308202o82533n67151m84968m53057m10861m35782l93094l83295l64732
4725A0132729l56206l08264k63789k53862j93354j76532k05182j05322o5879o2987
4715H141352K395n2650j19235q9968j33250j06030j05544r3059o6199p0103j04927
4704G202782o7950k7105m857M9698N0448P8482J25052K09721K53314K84665L65329
$$ y = [66252165, 65627529, 64753677, 63434965, 61641785, 59523099, 57343344, 55342021, 53604170, 52066299, 50713122, 49501343, 48371167, 47178621, 45847122, 44271384, 42466230, 40364823, 38109070, 35728721, 33305222, 30900039, 28622971, 26519204, 24526923, 22671456, 21032723, 19531021, 18163786, 17021149, 16003847, 15089221, 14308202, 13625669, 13058518, 12573550, 12120493, 11709632, 11273850, 10880756, 10497461, 10132729, 9776523, 9468259, 9204470, 8950608, 8757254, 8580722, 8375540, 8270218, 8204339, 8141352, 8143747, 8091097, 7971862, 7881894, 7748644, 7642614, 7537070, 7444011, 7377812, 7307709, 7202782, 7134832, 7107727, 7102870, 7152568, 7203016, 7281498, 7406550, 7616271, 7869585, 8154250, 8519579]
4693H519579M28405N24180P07351Q78289J128230J411210J701676J812656J665884
4684A8777460J203154M17078m03648j070351j490538j574081j506731j331826
4676A3020517j126293r63528p84145o22920m86555l73036l12880j63869p5397
4667H111894l7607L0843R0747J67179K18019K91471M20541N22076N88629P40413
4657A1144205R62920J219998J552852J853882K147437K277377K144866J792491
4649B5096028J352523Q34305J63240n53895j222634j771113j997340j987514j835983
4640A8077617j632311j301869r52197o93880m41622j29091J44405M27023O85359
4631A4183434P85406P25450L98336j5422m00817o64265p54588p15630n13547k15164
$$ y = [8519579, 8947984, 9472164, 10179515, 11057804, 12186034, 13597244, 15298920, 17111576, 18777460, 19980614, 20397692, 19994044, 18923693, 17433155, 15859074, 14352343, 13020517, 11894224, 10930696, 10146551, 9523631, 9037076, 8664040, 8351160, 8187291, 8111894, 8074287, 8105130, 8195877, 8363056, 8581075, 8872546, 9293087, 9815163, 10403792, 11144205, 12107125, 13327123, 14879975, 16733857, 18881294, 21158671, 23303537, 25096028, 26448551, 27282856, 27446096, 26892201, 25669567, 23898454, 21901114, 19913600, 18077617, 16445306, 15143437, 14191240, 13497360, 13055738, 12926647, 13071052, 13498075, 14183434, 14968840, 15694290, 16092626, 16077204, 15676387, 15012122, 14257534, 13541904, 13028357, 12813193]
4621A2813193O0213L46346O59702Q62768Q55292O53236K19458k77061o89043r42318
4611A4561786r52419q70116p44270n28761l75071k06492p9037M3061K01690L60517
4601A1410888N47160P48804R59374J125676J194128J099514Q52674N83724J61785
4592A8683727l40527q38030j204815j413281j497393j391803j242371j079948
4584I675559r04181p71016n68218m32218l67355k51567j69441j66963q2694l0443
4574E931463Q249L0237M6168J03012J61643K15800L18877L71246N48011O60486
4564H395192O63090O43294M72986J90207j62387m80337o68808p26054o91586o17878
4554G017719n60952n00605m21693l70676l53057l07034k44829k35619j84282j12987
$$ y = [12813193, 12873406, 13219752, 13879454, 14742222, 15597514, 16250750, 16470208, 16193147, 15504104, 14561786, 13609367, 12739251, 11994981, 11466220, 11091149, 10884657, 10805620, 10848681, 11050371, 11410888, 11958048, 12706852, 13666226, 14791902, 15986030, 17085544, 17938218, 18521942, 18683727, 18343200, 17505170, 16300355, 14887074, 13389681, 11997878, 10755507, 9675559, 8771378, 8000362, 7432144, 6999926, 6632571, 6381004, 6211563, 6044600, 5961906, 5931463, 5939712, 5969949, 6016117, 6119129, 6280772, 6496572, 6815449, 7186695, 7734706, 8395192, 9058282, 9701576, 10174562, 10364769, 10202382, 9722045, 9053237, 8327183, 7635597, 7017719, 6456767, 5956162, 5534469, 5163793, 4810736, 4503702, 4258873, 4023254, 3838972, 3725985]
4544C725985r7513q6244j18129j32828q9351o3389o6532r1912r6043j1180j6658
4533B856206j7110m2717n0137j1046q703l2896r2221o3631n3686m1933l2744r0250
4521B319132p1989k9931q557k7149n5907k8198l2027k0648l6467j4644j1207k8710
4509A953698o159o7916J3303k154j1887K0827j4748m8312K3999N344J3697J548
4497A881240o108k6878K8232J046J2003M7382k4248J8081k1175N642j8557k7070
4485A869590J3124m927R370n541k0575j217M3167k9057k0628j1710m6813p148
4473A787635R038k7924m0058j2974L0577k0909m131L751m9509K5279J9452J3447
4461A733674l2420j5731J201k2721j2970k7802l7586k5217j7330l6223q924J4780
$$ y = [3725985, 3628472, 3542228, 3424099, 3291271, 3201920, 3138531, 3071999, 2980087, 2884044, 2872864, 2856206, 2839096, 2796379, 2746242, 2735196, 2726493, 2693597, 2601376, 2537745, 2484059, 2442126, 2409382, 2319132, 2247143, 2217212, 2208655, 2181506, 2125599, 2097401, 2065374, 2044726, 2008259, 1993615, 1982408, 1953698, 1947539, 1879623, 1892926, 1890772, 1878885, 1899712, 1884964, 1836652, 1860651, 1865995, 1879692, 1881240, 1875132, 1848254, 1876486, 1877532, 1889535, 1936917, 1912669, 1930750, 1909575, 1915217, 1896660, 1869590, 1882714, 1877787, 1887157, 1881616, 1861041, 1859824, 1902991, 1873934, 1853306, 1841596, 1794783, 1787635, 1796673, 1768749, 1728691, 1715717, 1746294, 1725385, 1721254, 1725005, 1675496, 1700775, 1720227, 1733674, 1701254, 1685523, 1686724, 1664003, 1651033, 1623231, 1585645, 1560428, 1543098, 1506875, 1497951, 1512731]
4449A512731J0660P695J4936J1097q805n147J1161K2524j5197l036J1158l999
4437A565778j4401N3175L437J3623k1656J4148K3440J5586P995L0552q684L4701
4425A717694K1931O083M5395P4795O5621Q8230Q1783N1513O5412n7450m2658o7544
4413B050805p2873q5879n263J1704j8655k0569j5065N176K1578J7452O593K1172
4401A916176J8343l1036J0384J0178k1000L6947J4538k79j7941j393M7991L4918
4389B017826M0319L3670N077q569L3227K8741K7574L2909O4415Q668j2289M2723
4377B314291J3541K7746N8861L7157K2502J4731J372K4518M5415M7515M7855N2685
4365B708189N7272M6697Q1701P4916M7553O3516Q1529M9581P6539J13335J38856
$$ y = [1512731, 1523391, 1531086, 1546022, 1557119, 1548314, 1543167, 1554328, 1576852, 1561655, 1558619, 1569777, 1565778, 1551377, 1604552, 1607989, 1621612, 1599956, 1614104, 1637544, 1653130, 1661125, 1691677, 1682993, 1717694, 1739625, 1745708, 1791103, 1865898, 1931519, 2019749, 2101532, 2153045, 2218457, 2161007, 2118349, 2050805, 1977932, 1892053, 1886790, 1898494, 1879839, 1859270, 1844205, 1849381, 1870959, 1888411, 1895004, 1916176, 1934519, 1903483, 1913867, 1924045, 1903045, 1939992, 1954530, 1954251, 1936310, 1934917, 1982908, 2017826, 2058145, 2091815, 2096892, 2088323, 2121550, 2150291, 2177865, 2210774, 2275189, 2283857, 2271568, 2314291, 2327832, 2355578, 2414439, 2451596, 2474098, 2488829, 2490201, 2514719, 2560134, 2607649, 2655504, 2708189, 2765461, 2812158, 2893859, 2968775, 3016328, 3079844, 3161373, 3210954, 3287493, 3400828, 3539684]
4354C539684J35603J67162K15914K34316K85434L20356L67010M60505N80475O33080
4344F939539N75639M80683M13563K45839O8092m2313p0661j23681j00494l0921
4334H355285J06825K03705K73699M39333M83657N23217M77356L49757L14749K17082
4324A1744665J78913J51027R7138L9780j11512j67667k42518l70505m09754l78137
4314A0531430k88429j88811p9797R6470K54813L25413L72590K96639K28149O5541
4304A1614008p2317j46467j75664j37625p3629M7296O2382N4216M8923K6754j0669
4293A1237208l7007O8190J65658L17704M70213N98845Q23846Q61361Q27642P53904
4283A6087564N54292K90256J22743k8562o1321l4232J1242R3310J64760J55245
$$ y = [3539684, 3675287, 3842449, 4058363, 4292679, 4578113, 4898469, 5265479, 5725984, 6306459, 6939539, 7515178, 7995861, 8409424, 8655263, 8723355, 8681042, 8610381, 8486700, 8386206, 8355285, 8462110, 8665815, 8939514, 9378847, 9862504, 10385721, 10863077, 11212834, 11527583, 11744665, 11923578, 12074605, 12171743, 12211523, 12100011, 11932344, 11689826, 11319321, 10909567, 10531430, 10243001, 10054190, 9974393, 10070863, 10325676, 10651089, 11023679, 11320318, 11548467, 11614008, 11541691, 11395224, 11219560, 11081935, 11008306, 11055602, 11117984, 11172200, 11221123, 11247877, 11237208, 11200201, 11268391, 11434049, 11751753, 12221966, 12820811, 13644657, 14506018, 15333660, 16087564, 16641856, 16932112, 17054855, 17026293, 16964972, 16930740, 16941982, 17035292, 17200052, 17355297]
4273A7355297J73358J66695Q0982O4500J7623k7342J6209R7866K23860J83733
4263A8352781J22564k2824k23035m73661o86671q06488q62273q32030p32574n00906
4253A3334883k95376j47500k3592R0418Q7462K7141j33032k74490k88789k13336
4243A2163789k54230j27235p5299j9930j02277j59069j50554k49967k66847k80801
4233A0477580k92290j80734j08548L3119K01197K58809L68211L71145L39645L14117
4223A1782251K16833J37573J21908J00403o537r2635j03596k10267l68821m29433
4213A1147679m15349l96027l35637k37478j24097k1071J32336J96269J65667J63342
4203A0275634L7183r7731k41869l78984m68817n44515m84243m25936m04267l18592
$$ y = [17355297, 17528655, 17695350, 17776332, 17840832, 17858455, 17831113, 17847322, 17945188, 18169048, 18352781, 18475345, 18452521, 18229486, 17755825, 17069154, 16262666, 15400393, 14568363, 13835789, 13334883, 13039507, 12892007, 12868415, 12958833, 13046295, 13073436, 12940404, 12665914, 12377125, 12163789, 11909559, 11782324, 11707025, 11687095, 11584818, 11425749, 11275195, 11025228, 10758381, 10477580, 10185290, 10004556, 9896008, 9929127, 10130324, 10389133, 10757344, 11128489, 11468134, 11782251, 11999084, 12136657, 12258565, 12358968, 12352431, 12259796, 12156200, 11945933, 11577112, 11147679, 10732330, 10336303, 10000666, 9763188, 9639091, 9618020, 9750356, 9946625, 10112292, 10275634, 10312817, 10215086, 9973217, 9594233, 9125416, 8580901, 8096658, 7670722, 7266455, 6947863]
4193F947863k33798k38689j52581j40701k6110l9760O593J2041N7890Q4986O7460
4182F345194J01807J33549J84672J44762K35969K50663K53246L05786L46495M04990
4172H707133M38374M66061M36388M14340L81830L99340L41951K87437K96300K40800
4162A2409954K70154K49436K81604L30828M09811M38024N37689N72855N91582
4153A6091937N98300N21995M73621M42703L94732M28300M21969M79087N41024
4144B0393668M93830M97723N25757N16436N45234N62541N52307N41864N36236
4135B5165596N41858N14795N44593O71402P81187R34421J172770J272010J259058
4126C2857690J161924R67467P15691N14342K97711K40200J26488Q5690P1955J20800
$$ y = [6947863, 6714065, 6475376, 6322795, 6182094, 6155984, 6116224, 6122817, 6134858, 6192748, 6277734, 6345194, 6447001, 6580550, 6765222, 6909984, 7145953, 7396616, 7649862, 7955648, 8302143, 8707133, 9145507, 9611568, 10047956, 10462296, 10844126, 11243466, 11585417, 11872854, 12169154, 12409954, 12680108, 12929544, 13211148, 13541976, 13951787, 14389811, 14927500, 15500355, 16091937, 16690237, 17212232, 17685853, 18128556, 18523288, 18951588, 19373557, 19852644, 20393668, 20887498, 21385221, 21910978, 22427414, 22972648, 23535189, 24087496, 24629360, 25165596, 25707454, 26222249, 26766842, 27438244, 28219431, 29153852, 30326622, 31598632, 32857690, 34019614, 34987081, 35702772, 36217114, 36514825, 36755025, 36881513, 36967203, 37039158, 37159958]
4116C7159958J73950J93342K53551L19794L74030M05247M07626L71781L05016
4107C9964295K86689L33655M36442O98127R44868J352359J712859J965499K070147
4098D9764940K064990J992705J753432J566830J369973J205659J058452R32363
4090F1709344P85642O49475N03669L46597J65237m4984k02541k95736l71512k83731
4080F2961460k10688j57776o3474p6940r1043j65180k15047k40726k56116k33023
4070F1251447j46320J8371J06770L11464M27566M57866M50492L52500K42818L4277
4060F3507251j97309m17257o34703q33395r49841j083005j215437j385044j618929
4051E5172331j934830k195025k328084k253847k073981j725431j357664r96894
$$ y = [37159958, 37333908, 37527250, 37780801, 38100595, 38474625, 38879872, 39287498, 39659279, 39964295, 40250984, 40584639, 41021081, 41719208, 42664076, 44016435, 45729294, 47694793, 49764940, 51829930, 53822635, 55576067, 57142897, 58512870, 59718529, 60776981, 61709344, 62494986, 63144461, 63648130, 63994727, 64159964, 64114980, 63912439, 63616703, 63245191, 62961460, 62750772, 62592996, 62529522, 62452582, 62361539, 62196359, 61981312, 61740586, 61484470, 61251447, 61105127, 61123498, 61230268, 61541732, 61969298, 62427164, 62877656, 63230156, 63472974, 63507251, 63309942, 62892685, 62257982, 61424587, 60474746, 59391741, 58176304, 56791260, 55172331, 53237501, 51042476, 48714392, 46460545, 44386564, 42661133, 41303469, 40306575]
4043D0306575p05640n16412m32460k97277k56723k56564k77441k97841l75011
4034C6891206m18242m98097n19896n24350m22029l32770j48264L6736J12516N2534
4024C4229344k11112n61848q91660j158129j335167j291157j180559r92068q21265
4015B5786379p49243o89572o41490o63258o01699o31995o50986n95722n45582
4006B0016832m73595m73401m63120l92539l26461k48291k67040k38027k76779
3997A6857579l40081m23513n09336n67324n67085n20056n07902m50228m04417
3988A2567637l98089l77406l30437k84407k89183k37745j73243j55994j00568
3979A0220565r8223j14988j31456j51683j16141j78349j67290j97302k10236k44858
$$ y = [40306575, 39600935, 39084523, 38652063, 38354786, 38098063, 37841499, 37564058, 37266217, 36891206, 36472964, 35974867, 35454971, 34930621, 34508592, 34175822, 34027558, 34064294, 34176810, 34229344, 34018232, 33456384, 32564724, 31406595, 30071428, 28780271, 27599712, 26607644, 25786379, 25037136, 24347564, 23706074, 23042816, 22441117, 21809122, 21158136, 20562414, 20016832, 19543237, 19069836, 18606716, 18214177, 17887716, 17639425, 17372385, 17134358, 16857579, 16517498, 16093985, 15584649, 15017325, 14450240, 13930184, 13422282, 12972054, 12567637, 12169548, 11792142, 11461705, 11177298, 10888115, 10650370, 10477127, 10321133, 10220565, 10122342, 10007354, 9875898, 9724215, 9608074, 9429725, 9262435, 9065133, 8854897, 8610039]
3969H610039j71696j54804j55372j07099N2644M2846Q2628J53234K10831K44740
3959H807991K74826L24735K71402K55850K15143J40719O2972l7296j51599j73901
3949I990842j89167j79299p6346k4198P380J09892K31033K95187L03165K80787
3939A0749276K84969K31656J43068P0584m1028j24652k27254k50644k65095k21539
3929A0349341j83132l8337Q5234K01297L27909N11938N03313M56874M17215K41844
3919A2873496Q8880j35812k07975k54667k58645j06534J4281J31349K42774M81091
3909A2868238N85626P06645Q61212R00244Q47197Q33137Q07809O08922M23139
3900A9442169J51729j66283l76116m81133m83800l74179k17808J9645J91726M47880
$$ y = [8610039, 8438343, 8283539, 8128167, 8021068, 8073712, 8116558, 8199186, 8352420, 8563251, 8807991, 9082817, 9407552, 9678954, 9934804, 10149947, 10290666, 10353638, 10316342, 10164743, 9990842, 9801675, 9622376, 9546030, 9521832, 9529212, 9639104, 9870137, 10165324, 10468489, 10749276, 11034245, 11265901, 11408969, 11479553, 11438525, 11313873, 11086619, 10835975, 10570880, 10349341, 10166209, 10127872, 10213106, 10414403, 10742312, 11254250, 11757563, 12214437, 12631652, 12873496, 12962376, 12826564, 12618589, 12363922, 12105277, 11998743, 12013024, 12144373, 12387147, 12868238, 13453864, 14160509, 15021721, 15921965, 16769162, 17602299, 18410108, 19019030, 19442169, 19593898, 19427615, 19051499, 18570366, 18086566, 17712387, 17494579, 17514224, 17705950, 18153830]
3890A8153830O48471P89684Q67019Q26234P19931N05835L16622O3092j70607m28065
3880B2292046o87823q33664q80421r25771q01872o05250m09145j86772O8649K38332
3870A7268309L69582M23276L69102K02652N671k26241l71275l72800l87696k89075
3860A6991505j29973m6980L9104J18064J80724K39294L58953M70750O26394P30693
3850A9578528P52348P20429O56778N17327L31976J38942M2176M9099P7654J97244
3840B3062501M02057O79419R63801J329961J672041K229341K724097L133173L468379
3831C9664770L611261L504900L111220K434922J616203O23796k93168j000708
3823E3273196j559606j975727k178790k192407k094677j807754j333040p40172
$$ y = [18153830, 18802301, 19591985, 20459004, 21285238, 22005169, 22511004, 22827626, 22890718, 22720111, 22292046, 21604223, 20770559, 19890138, 18964367, 18162495, 17557245, 17148100, 16961328, 17029977, 17268309, 17637891, 18061167, 18430269, 18632921, 18638592, 18412351, 18041076, 17668276, 17280580, 16991505, 16861532, 16814552, 16853656, 16971720, 17152444, 17391738, 17750691, 18221441, 18847835, 19578528, 20330876, 21051305, 21708083, 22225410, 22557386, 22696328, 22738504, 22787603, 22865257, 23062501, 23464558, 24143977, 25107778, 26437739, 28109780, 30339121, 33063218, 36196391, 39664770, 43276031, 46780931, 49892151, 52327073, 53943276, 54567072, 54273904, 53273196, 51713590, 49737863, 47559073, 45366666, 43271989, 41464235, 40131195, 39391023]
3815C9391023j59054N26305J204805J862008K380024K719237K790102K551846
3807E3266296K024222J204103J01069r61486j979472k788209l345390l637875
3799D3883258l512114l142351k581581j960346j262140n79722O6202N80887Q53125
3790C2345218R43271Q12576M61207N4528m47067q92523j322597j620151j780118
3781B8554344j814293j655496j382470r89366m92483o5871K44253M57550M50863
3772B3307031K63708J9917l40373n71347p03725o85035n52460m02368k04525p9445
3762B0051378m8718q6366j69695j92146k07178k47242k18112k22674k93340l73217
3752A7992690m50150n48890o01779m95429l81718k95970k05641k00153k08948
$$ y = [39391023, 39231969, 39758274, 40963079, 42825087, 45205111, 47924348, 50714450, 53266296, 55290518, 56494621, 56595690, 55634204, 53654732, 50866523, 47521133, 43883258, 40371144, 37228793, 34647212, 32686866, 31424726, 30845004, 30911206, 31492093, 32345218, 33288489, 34101065, 34562272, 34616800, 34169733, 33277210, 31954613, 30334462, 28554344, 26740051, 25084555, 23702085, 22712719, 22220236, 22154365, 22398618, 22856168, 23307031, 23570739, 23590656, 23250283, 22678936, 21975211, 21290176, 20737716, 20335348, 20130823, 20051378, 20002660, 19916294, 19746599, 19554453, 19347275, 19100033, 18881921, 18659247, 18365907, 17992690, 17542540, 16993650, 16391871, 15896442, 15514724, 15218754, 15013113, 14812960, 14604012]
3743A4604012k74461l38036l52482l04134k86839j61367l8173J70440L12822M48644
3733A3780426N13966M67444L07570J5793k16644m97814o99238p91032p98004p09797
3723A1372670o00563m53401k88038j63296j9203O1722J60431K69554K80041K73513
3713A0893430J57688j1079k46176m40439n77919o99555o95570o30680n93285n56059
3703F600356m22161l72429l22662k75852k78103k27392j63551j42761j00621j29307
3693D165517q6320p6827q1695r0544o1297q2846p3549m0493q4771o5823l085L4423
3681C452690k7602j5090n0860m5541j7204l2088k6867k8736m7148n745j5878k4608
3669C115323k2724J5174o945m9756m7176l1280m1031o8453p9777k6343M774o4734
$$ y = [14604012, 14329551, 13991515, 13639033, 13334899, 13048060, 12886693, 12848520, 13018960, 13331782, 13780426, 14294392, 14761836, 15069406, 15085199, 14868555, 14370741, 13671503, 12880471, 12082467, 11372670, 10772107, 10318706, 10030668, 9867372, 9848169, 9909891, 10070322, 10339876, 10619917, 10893430, 11051118, 11040039, 10793863, 10353424, 9775505, 9075950, 8380380, 7749700, 7156415, 6600356, 6178195, 5805766, 5483104, 5207252, 4929149, 4701757, 4538206, 4395445, 4294824, 4165517, 4079197, 4002370, 3920675, 3830131, 3768834, 3685988, 3612439, 3571946, 3487175, 3421352, 3418267, 3452690, 3425088, 3409998, 3359138, 3313597, 3296393, 3264305, 3237438, 3208702, 3161554, 3155809, 3139931, 3115323, 3092599, 3107773, 3100828, 3051072, 3003896, 2972616, 2931585, 2863132, 2783355, 2757012, 2761786, 2697052]
3657B697052n7636k037J0518l1822m9247j5046l5896M781J4289o662p4828j9667
3645B433799K0031J8187L6045J2138O02m2306K655J2132K0277m109j4274J8411
3633B513588L5556j430o083K8277L5777J081Q906l81p670P573j4943j0506K7592
3620B617337N5228j0478J269N3163l3234R143J8200K1277J4439N4709J1909k0589
3608B792373q83L7426L6912j1825P5854M8152K4339K8290L0778N2601J7512K8425
3596C159954N6117N3878O0698M4183N8929O1310R0642P1428N4053O3356P0682
3585C845230Q7006J48393J44113J09449J05097J43523J42419J54321J35526J78098
3575E193175J89347K08720K31776K16271J76773K17944K37451J99751K39015K21738
$$ y = [2697052, 2639416, 2637379, 2647897, 2616075, 2566828, 2551782, 2515886, 2520667, 2534956, 2528294, 2453466, 2433799, 2453830, 2472017, 2508062, 2520200, 2520802, 2478496, 2481151, 2493283, 2513560, 2509451, 2495177, 2513588, 2549144, 2547714, 2541631, 2569908, 2605685, 2606766, 2615672, 2615291, 2607621, 2615194, 2600251, 2589745, 2617337, 2672565, 2662087, 2663356, 2716519, 2683285, 2692428, 2710628, 2731905, 2746344, 2801053, 2812962, 2792373, 2791490, 2828916, 2865828, 2854003, 2929857, 2978009, 3002348, 3030638, 3061416, 3114017, 3131529, 3159954, 3216071, 3269949, 3330647, 3374830, 3433759, 3495069, 3585711, 3657139, 3711192, 3774548, 3845230, 3932236, 4080629, 4224742, 4334191, 4439288, 4582811, 4725230, 4879551, 5015077, 5193175, 5382522, 5591242, 5823018, 6039289, 6216062, 6434006, 6671457, 6871208, 7110223, 7331961]
3565G331961K58782K57509K21224K74091K91521K56810K97601L36310L79503L28191
3555A0233503L64084L08457L40232L11771L21673M26229M80842N44990N12929
3546A3844710M64890L59132J99867J06745K3724J6328J11049K31045K66705L36938
3536A5961133L01767J30211P787j54895l10126l45262l29616k72293j80755q7705
3526A4720246q5787j18993k14741k66208k83686k96799k37391j80131q9134o3894
3516A2883482m9759n0428O146L020Q7179J49449K41274K66763L19104L00866K93516
3505A4450612K96618K36435K72191L06804L54262L95397L99145L87260L97843
3496A7496567L68440L37342L43306K86363K17470J89243J97745J62558K11770
$$ y = [7331961, 7590743, 7848252, 8069476, 8343567, 8635088, 8891898, 9189499, 9525809, 9905312, 10233503, 10597587, 10906044, 11246276, 11558047, 11879720, 12305949, 12786791, 13331781, 13844710, 14309600, 14668732, 14868599, 14975344, 14999068, 15015396, 15126445, 15357490, 15624195, 15961133, 16262900, 16393111, 16400898, 16246003, 15935877, 15590615, 15260999, 14988706, 14807951, 14720246, 14634459, 14515466, 14300725, 14034517, 13750831, 13454032, 13216641, 13036510, 12947376, 12883482, 12833723, 12783295, 12789441, 12792461, 12879640, 13029089, 13270363, 13537126, 13856230, 14157096, 14450612, 14747230, 14983665, 15255856, 15562660, 15916922, 16312319, 16711464, 17098724, 17496567, 17865007, 18202349, 18545655, 18832018, 19049488, 19238731, 19436476, 19599034, 19810804]
3487A9810804K63837L32513L20757K20467L9216j52438k23783l45929l08530k45558
3477A9711356k55278k39969l15187l76001m98836o23683p16041p47314p14291
3468A5224756o81305o72438o61125o63697o98983p00822o93355o07177n71309
3459I274545m56002l62662k74969k12535n2098L2915K0319M1048j8183p4778j01678
3448G815922R675M4554N0738N7811M6753J03962J26526J88031J76993K05991K57047
3437I084003K96592K70966K26922K19029J70157R6828N8574R4818J74421J97263
3427A0889573K60698L08706L12454L05237K12793J20240O3718k3162j17353j03101
3417A2229803o9747j7100P3775J54573K02979K62018K66926K79123K89360L09297
$$ y = [19810804, 20074641, 20407154, 20727911, 20948378, 20987594, 20835156, 20611373, 20265444, 19956914, 19711356, 19456078, 19216109, 18900922, 18524921, 18026085, 17402402, 16686361, 15939047, 15224756, 14543451, 13871013, 13209888, 12546191, 11847208, 11146386, 10453031, 9845854, 9274545, 8818543, 8455881, 8180912, 7968377, 7916279, 7949194, 7969513, 8010561, 7992378, 7917600, 7815922, 7825597, 7870151, 7920889, 7978700, 8025453, 8129415, 8255941, 8443972, 8620965, 8826956, 9084003, 9380595, 9651561, 9878483, 10097512, 10267669, 10364497, 10423071, 10517889, 10692310, 10889573, 11150271, 11458977, 11771431, 12076668, 12289461, 12409701, 12473419, 12450257, 12332904, 12229803, 12160056, 12142956, 12216731, 12371304, 12574283, 12836301, 13103227, 13382350, 13671710, 13981007]
3407A3981007L20735J93834O7980j35724l02476m49087n29381n59683n96139n28635
3397A1462431m25598l18696j74973L243J10762K54284L06744L70850M30012M77852
3387A2496911N42129N86566N77930N59153N88240M92206L14641R8220r2303l08103
3377A5855590m14020m57996m46305l97956k96745j76012P354J48733L36927M32172
3367A4591742M28801M45880M01311K91744J13564P1498N0968M7541P5681J47118
3357A6665848J92713K26806K02547N0804r8527k34167l77040l81831k98469j67146
3347A5781538M5462K43028M15881N53325N85836O32933N76963M18440K19479J26076
3337A9598961j0338m1319j20111j71041j86758j58499j28468j02494j62208k25106
$$ y = [13981007, 14301742, 14495576, 14563556, 14427832, 14125356, 13676269, 13146888, 12587205, 11991066, 11462431, 11036833, 10718137, 10543164, 10546407, 10657169, 10911453, 11218197, 11589047, 12019059, 12496911, 13039040, 13625606, 14203536, 14762689, 15350929, 15843135, 16157776, 16255996, 16163693, 15855590, 15441570, 14983574, 14537269, 14139313, 13842568, 13666556, 13673910, 13822643, 14159570, 14591742, 15020543, 15466423, 15867734, 16159478, 16273042, 16344540, 16395508, 16443049, 16518730, 16665848, 16858561, 17085367, 17287914, 17338718, 17240191, 17006024, 16628984, 16247153, 15948684, 15781538, 15827000, 16070028, 16485909, 17039234, 17625070, 18258003, 18834966, 19253406, 19472885, 19598961, 19588623, 19547304, 19427193, 19256152, 19069394, 18910895, 18782427, 18679933, 18517725, 18292619]
3327A8292619l07961l10465l34362l05944j54790l8520R4803K28784K61210K80964
3317A7706338K75072K51215K20781Q0392j9057o4762j32902k28293l41819m82853
3307A7264112o26914p76621q57146q98801q37652p71427n98828n35800l72400
3298A0988523k58804j98140q2595K9540J06552K39265M28791N25575N16301N86047
3288A2881055N40047L69606J86819J9728j83991k71415m02951m72088m07296l92735
3278A1866779l77175l04361k63488j81448j33138p4440l2368n0634l5778o4562
3268A0349387j17918k19130k88583k84365l34917l64825l15764k91040k21524
3259G911321j95910j78125j77529j76773j11400p5606p2879q4036o8767o4491
$$ y = [18292619, 17984658, 17674193, 17339831, 17033887, 16879097, 16840577, 16935380, 17164164, 17425374, 17706338, 17981410, 18232625, 18453406, 18533798, 18514741, 18449979, 18317077, 18088784, 17746965, 17264112, 16637198, 15860577, 15003431, 14104630, 13266978, 12495551, 11896723, 11360923, 10988523, 10729719, 10531579, 10448984, 10478524, 10585076, 10824341, 11253132, 11778707, 12295008, 12881055, 13421102, 13790708, 13977527, 13997255, 13813264, 13541849, 13138898, 12666810, 12259514, 11866779, 11489604, 11185243, 10921755, 10740307, 10607169, 10532729, 10500361, 10449727, 10413949, 10349387, 10231469, 10012339, 9723756, 9439391, 9104474, 8739649, 8423885, 8132845, 7911321, 7715411, 7537286, 7359757, 7182984, 7071584, 6995978, 6923099, 6839063, 6770296, 6705805]
3249F705805o3228k3411j9582j4301r960K0301J9293M6556P1746P7192M9744R1482
3237F951637P4642J12962J02638K7841O8393J24672J00257P8882J07643R6401
3227G845968J22978J64489J93736J86751K33382K62057K80630L73681M37864N42909
3217A0644445P29862R36837J049799J171643J110712Q79914N55507K17854N1165
3208A7347738J8188P7628J43812Q8316p8848l21388n90357p98751q77414q12976
3198A4195948o92477n71709m13297k42549j90079j16682o5192n1402M9254J04746
3188A2006561R4749Q9540J40009J60231K11757K34285K59155K97527L24948L19839
3178A4138601K58404K26769K05662K15922K02283J74039K48020K19727K26756
$$ y = [6705805, 6642577, 6619166, 6599584, 6585283, 6575323, 6595624, 6614917, 6661473, 6733219, 6810411, 6860155, 6951637, 7026279, 7139241, 7241879, 7269720, 7338113, 7462785, 7563042, 7641924, 7749567, 7845968, 7968946, 8133435, 8327171, 8513922, 8747304, 9009361, 9289991, 9663672, 10101536, 10644445, 11374307, 12311144, 13360943, 14532586, 15643298, 16523212, 17078719, 17296573, 17347738, 17365926, 17443554, 17587366, 17675682, 17596834, 17275446, 16685089, 15886338, 15008924, 14195948, 13503471, 12931762, 12518465, 12275916, 12085837, 11969155, 11903963, 11852561, 11901815, 12006561, 12101310, 12190850, 12330859, 12491090, 12702847, 12937132, 13196287, 13493814, 13818762, 14138601, 14397005, 14623774, 14829436, 15045358, 15247641, 15421680, 15669700, 15889427, 16116183]
3169A6116183K91905L02351L81386M06037M45483M46481M85547N65363N98575
3160B0039311N92913O17064O64594P51607Q14077Q47438R57135J133499J221350
3151B7638988J295281J391786J481694J519054J706282J898190K086720K365857
3143D1383852K702769L124180L560461M176774M825673N599429O639168P966574
3135G9978880R757897J2180583J5478589J9701567K5025107L0963734L6349707
3128B29436064L9585744L9006777L3860466K4884809J3725160J896994r421409
3121C72974605j9474848k7497651l2327296l3327319l0655077k5305974j8514942
3114A85871498j0963136l009155N010497J2023122J6523227J6652918J1766089
$$ y = [16116183, 16408088, 16710439, 17091825, 17497862, 17943345, 18389826, 18875373, 19440736, 20039311, 20632224, 21249288, 21913882, 22665489, 23479566, 24327004, 25284139, 26417638, 27638988, 28934269, 30326055, 31807749, 33326803, 35033085, 36931275, 39017995, 41383852, 44086621, 47210801, 50771262, 54948036, 59773709, 65373138, 72012306, 79978880, 89736777, 101917360, 117395949, 137097516, 162122623, 193086357, 229436064, 269021808, 308028585, 341889051, 366773860, 380499020, 382396014, 372974605, 353499757, 326002106, 293674810, 260347491, 229692414, 204386440, 185871498, 174908362, 171899207, 176909704, 188932826, 205456053, 222108971, 233875060]
3107B33875060L241604o385931j4215995j8382852j8498549j5256096r763321
3100A54613920k657018N247491J2203455J5483908J2514572L381917q076998j6991993
3092A75719254k0774205k0089231j7044932j3406839j0177802p497503n238430
3085H1490312l388088j854756n17817P69784K321957M687722Q509835J4289055
3077A06308004K1460601K7371693K7820439K0040563N344111j0598257k1870006
3070A75877148k6092144k4753997k0655253j6181488j2376623r496680p258853
3063E9062110n541487m158594l122984k447393k132829k105938k219178k378071
3055C4955636k316695k235163k047806j791772j539750j303456j028381p75493
$$ y = [233875060, 237116664, 230730733, 216514738, 198131886, 179633337, 164377241, 154613920, 151956902, 157204393, 169407848, 184891756, 197406328, 200788245, 192711247, 175719254, 154945049, 134855818, 117810886, 104404047, 94226245, 86728742, 81490312, 78102224, 76247468, 75729651, 76499435, 78821392, 83509114, 92018949, 106308004, 127768605, 155140298, 182960737, 203001300, 208345411, 197747154, 175877148, 149785004, 125031007, 104375754, 88194266, 75817643, 66320963, 59062110, 53520623, 49362029, 46239045, 43791652, 41658823, 39552885, 37333707, 34955636, 32638941, 30403778, 28355972, 26564200, 25024450, 23720994, 22692613, 21917120]
3047B1917120m63101j99844Q8281L55883M92346M03908K63457j03881m95292r28740
3037B1330137j186780j309418j371526j218251j105235r94747q31703o96474n31692
3028A2084311m31323l09528k08117k33643r4953o2865q3730k0467k242N6614J11336
3017A0805393J28035K32810L35293M37726O05177Q30289J148140J428190J770653
3008A7721706J975023K019830J876092J518351J070185N26145j00810o97428j087494
2999B4821600j387075j515580j481287j267395r44841n51761j14923L49081P91554
2990A8699373J078480J329939J368445J169631Q39251L02111k35040o91398j189878
2981B2670914j646193j875206j994219j956606j831465j599795j309924j083597
$$ y = [21917120, 21454019, 21254175, 21342456, 21698339, 22190685, 22594593, 22858050, 22754169, 22258877, 21330137, 20143357, 18833939, 17462413, 16244162, 15138927, 14144180, 13312477, 12616003, 12084311, 11652988, 11343460, 11135343, 10901700, 10806747, 10743882, 10660152, 10639685, 10637443, 10694057, 10805393, 10933428, 11166238, 11501531, 11939257, 12544434, 13374723, 14522863, 15951053, 17721706, 19696729, 21716559, 23592651, 25111002, 26181187, 26707332, 26606522, 25909094, 24821600, 23434525, 21918945, 20437658, 19170263, 18225422, 17673661, 17558738, 17907819, 18699373, 19777853, 21107792, 22476237, 23645868, 24485119, 24787230, 24552190, 23860792, 22670914, 21024721, 19149515, 17155296, 15198690, 13367225, 11767430, 10457506, 9373909]
2973I373909q62556p04848n24424m17380l70706k49044j61286j76579r0595j3631
2963E802860l0746j0871O3208J09600J45866K26258K84837M12337N17323P11789
2953H232461Q94949J139196J261362J312511J208305Q25538M00149j92372o10979
2944A4471120r42392j086822j036428r30390q17614n70830l40440j50037K00260
2935H796427M35881P36998R59845J095720J066800Q62843M19101j60056o92950
2926A3520609j117283j369969j403262j338863j170335r51742q07703o47224n27818
2917D186410m21074l31815l05333k31816k06993j89414j57134j58721j08302o4521
2907B011287m2410o8206o0515n0120m6835q4582q0140m5448p7664k1367k3062
$$ y = [9373909, 8511353, 7806505, 7282081, 6864701, 6493995, 6244951, 6083665, 5907086, 5816491, 5802860, 5772114, 5761243, 5824451, 5934051, 6079917, 6306175, 6591012, 7003349, 7520672, 8232461, 9127410, 10266606, 11527968, 12840479, 14048784, 14874322, 15274471, 15082099, 14471120, 13528728, 12441906, 11405478, 10475088, 9657474, 9086644, 8746204, 8596167, 8796427, 9232308, 9969306, 10929151, 12024871, 13091671, 13954514, 14373615, 14213559, 13520609, 12403326, 11033357, 9630095, 8291232, 7120897, 6169155, 5361452, 4714228, 4186410, 3765336, 3433521, 3128188, 2896372, 2689379, 2499965, 2342831, 2184110, 2075808, 2011287, 1968877, 1900671, 1840156, 1790036, 1743201, 1658619, 1578479, 1533031, 1455367, 1434000, 1410938]
2896A410938m9738o1141n3851k4675n0980k4272j6119K845j7016k5511k325J4322
2884A102477L6571K808j4515k0732j3883k9950m7575o8910o8100l6681k5091m2903
2872G73516n9456j3225l1536K6613j6775l1679R198j174m845k3431k8655m8999
2860E49552L5598M7166j2769L1405L3611J7500Q791K5204M2040N6682R1479R4639
2848A020898R3975J48206J72809J69222J41717J32077J34468J13249R1740l982
2838B214379o4014j09562j47102j62882j99130j71987j25338m8007k9027j4043
2828A143287J3396O7829P1034Q7853N2446j7418l0600j33726j19880p3038p6411
2817I84772j3648L0754L9760M9226K5378k2820l3554p9580j05706j21805j03706
$$ y = [1410938, 1361200, 1300059, 1246208, 1221533, 1170553, 1146281, 1130162, 1133007, 1115991, 1090480, 1088155, 1102477, 1139048, 1141856, 1127341, 1106609, 1092726, 1062776, 1015201, 946291, 878191, 841510, 816419, 773516, 714060, 700835, 669299, 695912, 679137, 647458, 656656, 655482, 650637, 627206, 598551, 549552, 585150, 632316, 619547, 650952, 684563, 702063, 710854, 736058, 778098, 834780, 926259, 1020898, 1114873, 1263079, 1435888, 1605110, 1746827, 1878904, 2013372, 2126621, 2218361, 2214379, 2150365, 2040803, 1893701, 1730819, 1531689, 1359702, 1234364, 1186357, 1157330, 1143287, 1156683, 1224512, 1295546, 1383399, 1435845, 1418427, 1387827, 1254101, 1134221, 1061183, 984772, 971124, 1001878, 1041638, 1090864, 1116242, 1093422, 1059868, 980288, 874582, 752777, 649071]
2806F49071m2841o4768l4037r44j3975r562k0950q846N0929N7839M4006R0489
2794F96411J00328R5865R1797O3147L2917o8155j08200j16014r2469j26226j05205
2783D64196p0522k8822l9137R992l6626o2131J5847k2806k6690m4050P127m3388
2771A22990l3184J1462j3388j0365k5118K786k5621j9685l0547P545M5391L2482
2759F4748l2328j5478r934k1615j1911j0600K0487r644j0966j4817L762M969M421
2746c8906K935m464m247l0279j0499K7338j6661k147k0937j5622J0260Q198m7294
2733a42325q2407L5680M7210J1234J3981o7060j6840r618O505J9928K6544P130
2721a50038o121Q113l4806K1089O917K6071K4907j3943J4671o954k7608L239M0234
$$ y = [649071, 606230, 541462, 507425, 506481, 492506, 482944, 461994, 453148, 504077, 561916, 605922, 696411, 796739, 892604, 984401, 1047548, 1080465, 1012310, 904110, 788096, 695627, 569401, 464196, 393674, 364852, 325715, 335707, 299081, 236950, 252797, 229991, 203301, 159251, 166378, 122990, 89806, 101268, 87880, 77515, 52397, 55183, 29562, 9877, -20670, -13125, 32266, 64748, 32420, 16942, 7008, -14607, -26518, -37118, -16631, -26275, -37241, -52058, -48296, -43327, -38906, -35971, -40435, -44682, -74961, -85460, -58122, -74783, -76930, -97867, -113489, -103229, -95031, -142325, -224732, -189052, -141842, -130608, -116627, -183687, -200527, -210145, -203640, -183712, -157168, -150038, -156159, -148046, -182852, -161763, -154846, -128775, -103868, -117811, -103140, -110094, -137702, -134463, -94229]
2708i4229K9407j5028q604j1552l1633j2473j5385O327j55k1127M241p470J4501
2695a63180K1191O247J1387k8319m2r023M2817r320l9261M1000M814j861n2811
2682a76361l5606K7077J2406K783j8086j051l8013r931K4788l0359k799J9359
2670b25793L0541j2529P320L567J1413j5369N212L1592K3626J081K305R975j0479
2657a37538K1813K696k0889j5883J8832L1494N397L9032M0129M0536K2836O871
2645E5326O856m8395n2774p2344j4137k2090r675J9875l406K380K2146k2628l1328
2632a70194K38O1225M0185p7830k9065l739j0134j006l0202m350K0357p132J0806
2619b00841j7873n2332K3499K0104K3274k1P80O204k8975M2496K0493J293l0418
$$ y = [-94229, -64822, -79850, -88454, -100006, -131639, -144112, -159497, -153170, -153325, -174452, -170211, -177681, -163180, -141989, -135742, -124355, -152674, -152716, -161739, -118922, -128242, -167503, -126503, -121689, -123550, -176361, -211967, -184890, -172484, -169701, -187787, -188838, -226851, -236782, -211994, -242353, -245152, -225793, -195252, -207781, -200461, -196894, -185481, -200850, -195638, -164046, -140420, -139339, -137034, -127059, -137538, -115725, -113029, -133918, -149801, -130969, -99475, -94078, -55046, -14917, 25619, 48455, 55326, 62182, 13787, -38987, -111331, -125468, -147558, -157233, -137358, -140764, -138384, -116238, -138866, -170194, -169956, -108731, -68546, -146376, -175441, -179180, -189314, -190320, -220522, -224872, -204515, -211647, -200841, -218714, -271046, -247547, -227443, -204169, -204190, -203410, -197206, -226181, -183685, -163192, -161899, -192317]
2606a92317J7812l0951m892M681k434j3322m1303K0989K8846K1326K56J0694k2899
2593b03514O449k0596p760M760M550q245k5891O192q774L3128Q91J713j9980L3364
2579b03713k867l0985K4052M5332P026k4377j9803l201r424l5942k2205O052K0983
2566b49072n245j7840M8392N6973l9521M095k1529l7444k2582O0422k1790l3969
2554b79110l728J0188K6561N468l3471J0306k5777J2210K2462k597J9840K815
2542b34833K6227j153j6294J7429j0655k0269k370l148J2022j3135R648K2570
2530b13961K8384k485k9071O817l341K868N768j0706K0809R259M464q097m7017
2517b36309J3073K1201j3637K8677j7298P733j7643k2225J5649K5719L4764m1444
$$ y = [-192317, -174505, -205456, -210348, -205667, -208101, -221423, -262726, -241737, -212891, -191565, -191309, -180615, -203514, -197065, -217661, -225421, -220661, -216111, -224356, -250247, -244055, -252829, -219701, -218810, -217097, -237077, -203713, -206580, -237565, -213513, -168181, -161155, -185532, -205335, -208536, -217960, -253902, -276107, -270055, -249072, -254317, -272157, -223765, -166792, -206313, -202218, -223747, -261191, -283773, -223351, -245141, -279110, -282838, -272650, -246089, -240621, -274092, -263786, -289563, -277353, -254891, -257488, -237648, -234833, -208606, -209759, -226053, -208624, -219279, -239548, -241918, -245066, -233044, -246179, -236531, -213961, -185577, -188062, -217133, -210316, -213657, -210789, -205021, -215727, -194918, -185659, -181195, -189292, -236309, -223236, -202035, -215672, -186995, -204293, -196560, -214203, -236428, -220779, -195060, -160296, -201740]
2505b01740j7262O132J558J2701k0718j3373p976J8574J9311J7594k5160J5789
2493a94570J3875J8453j5313K632m131k6283L8767J0790j4421n284J7289k3675
2481a81871K3388J2735j4398N3141k6294k3925J6961J3299R375L9053Q747j8477
2469h8266l5285K6494L0366k7640R08P69J9602K3620L0535j5445N667J104o732
2456c4303J1834l480Q20J1419j9546P562R679K654j4573p523K236K1455L089L8311
2442B9634j1834K7653K5479j6334K843k7168N708j064L4462K6615J1829J8266
2430A26089J7865k073p152K974J8054R1483M712k8119K0200m444K2598K0905M1307
2417C24399O2164M5836j2445P08j079N0633J0440J3546N4285R9119O2696L1311
$$ y = [-201740, -219002, -212870, -211312, -198611, -219329, -232702, -240678, -222104, -202793, -185199, -210359, -194570, -180695, -162242, -177555, -174923, -179054, -205337, -166570, -155780, -170201, -175485, -158196, -181871, -158483, -145748, -160146, -107005, -133299, -157224, -140263, -126964, -117589, -78536, -69789, -88266, -123551, -97057, -66691, -94331, -93423, -92654, -73052, -49432, -18897, -34342, -28675, -27571, -34303, -22469, -25949, -25129, -13710, -33256, -25694, -16015, -13361, -27934, -35457, -33221, -11766, -8677, 29634, 17800, 45453, 70932, 54598, 57441, 30273, 35981, 34917, 69379, 95994, 107823, 126089, 143954, 141881, 134729, 137703, 155757, 247240, 251952, 223833, 244033, 239589, 262187, 283092, 324399, 386563, 432399, 419954, 420662, 419583, 470216, 480656, 494202, 548487, 647606, 710302, 741613]
2405G41613O8999J17072R2219J08975J12088Q7192J43067J97799K96740M03484
2395B369248M72751L86553J69016J11719J64184J52406K44938M11430O18954Q93718
2385E994917J383606K286535M600782Q149025J0362707J0041886M459075m529102
2377D2749431q331661q054107o905933m876276l352613k404434j909575j515460
2369E399372j161276p13968l54599j11595J7610n1480k36710l58576l21449k90270
2359A817059k20101k02463j58150j07281j05914r9653r0943n6036k5592l9297
2349G11629n3408p482j2340p7616m3947p0165p0492j4837R879k8249m2188j6026
2337B84758k3654p29k3069k2675Q882r093L040m4753m1529J6151p759j5822K52
$$ y = [741613, 810612, 927684, 1019903, 1128878, 1240966, 1328158, 1471225, 1669024, 1965764, 2369248, 2841999, 3228552, 3397568, 3509287, 3673471, 3825877, 4070815, 4482245, 5101199, 5994917, 7378523, 9665058, 14265840, 22414865, 32777572, 42819458, 47278533, 42749431, 34417770, 26363663, 19457730, 14581454, 11228841, 8824407, 6914832, 5399372, 4238096, 3524128, 3169529, 3057934, 3075544, 3024064, 2787354, 2428778, 2107329, 1817059, 1596958, 1394495, 1236345, 1129064, 1023150, 923497, 832554, 776518, 750926, 711629, 658221, 650739, 638399, 560783, 516836, 446671, 376179, 361342, 371221, 342972, 300784, 284758, 261104, 260375, 237306, 214631, 223513, 214420, 217460, 172707, 131178, 147329, 139570, 123748, 124000]
2324A24000l5423m0642j3698L899J5558j3453n799k5135q358L324m7679k9476
2312g2882L5549j7647k5389j7059l2440J9595Q044j4930m468k5564j7216Q489
2300a55918j5467M330L113j9294L833l578n606J4959n597k4275P317L318j9227
2287b12092p404K088k760l8074J8272K4576j85o496K9294k865k1315m100K4846
2274a96215K3708n7209j1674K1681m910l4666l8651J268K1124r881L361K1264
2262b60800Q8k5043O293K5302J4567L1850l8890o0817l1221M1428L1501L616n594
2249b67720q005P310k463j2168m0109J7727k8906K6283J2577J3006r611j3865
2237c05944L852j858J2708j3273K0850k6399n490J0695o859j1120N275J0853q751
$$ y = [124000, 88577, 47935, 34237, 38136, 53694, 40241, 34442, 9307, 949, 4273, -43406, -72882, -37333, -54980, -80369, -97428, -129868, -110273, -102229, -117159, -121627, -147191, -164407, -155918, -171385, -167055, -163942, -183236, -179403, -182981, -188587, -173628, -179225, -203500, -196183, -192865, -212092, -219496, -217408, -220168, -258242, -239970, -215394, -215579, -222075, -192781, -195646, -216961, -221061, -196215, -172507, -229716, -241390, -219709, -224619, -259285, -297936, -296668, -275544, -285425, -282064, -260800, -260712, -285755, -279462, -254160, -239593, -207743, -246633, -307450, -338671, -297243, -265742, -262126, -267720, -275725, -268415, -270878, -283046, -323155, -305428, -334334, -308051, -295474, -282468, -292079, -305944, -302092, -303950, -291242, -304515, -283665, -310064, -315554, -304859, -311718, -322838, -317563, -306710, -315461]
2224c15461r460p199j9403K3307L7554k2594j9823r118K3384L2866L15K866p170
2211b89936j4605J2002k7496J5718j0831j1534L0113m6627k9572K4171J0084R763
2199c28750j0925K3441K81j2866j102l2789K5450L169k915j1932J305n504o277
2186c59414J9041l5773l6368J1989R092j5093K5988J1442J5416M901L7420j0951
2174c22310k5980L9436j3224j8862J6266p530Q341j8622m0129J1209J0114K008
2162c59283j4126J155L2871J6760k1986k5086j2307K9311o378l1799p037J8319
2150c79586M541K8891K1356j4422n2438j0838L4633K6893Q630k2291N823L188
2138c45620n2312K3946K2342r221L370j6629K6520m831J1146r090q230K68j8364
$$ y = [-315461, -324921, -332120, -351523, -328216, -290662, -313256, -333079, -342197, -318813, -285947, -285632, -282766, -289936, -304541, -292539, -320035, -304317, -315148, -326682, -296569, -343196, -372768, -348597, -338513, -328750, -339675, -316234, -315953, -328819, -329921, -362710, -337260, -334091, -337006, -348938, -347633, -353137, -359414, -340373, -376146, -412514, -400525, -391433, -406526, -380538, -369096, -353680, -348779, -311359, -322310, -348290, -308854, -322078, -340940, -324674, -332204, -323863, -342485, -382614, -371405, -361291, -359283, -373409, -372254, -339383, -322623, -344609, -369695, -382002, -352691, -359069, -390868, -397905, -379586, -375045, -346154, -324798, -339220, -391658, -402496, -367863, -340970, -332340, -354631, -348808, -345620, -397932, -373986, -351644, -360865, -357495, -374124, -347604, -352435, -341289, -350379, -358609, -358341, -376705]
2125c76705J0731K0628J9588k6791k0725M082n635J8357K1587J4700m223N429
2113c18977N1890N5760L7248j27K2581l4789K7070m3035p6216p322m0462L985
2101c22394K0805l7505q94J5461j6171l7186r748O4289J4207j9726P043j2023
2089c33842L042K1336j7668j5978J5831K0879l7925j4286L0788n640k9117R201
2077c53379J2766O456j8600j1599p629l204q58o042m831j246k5598J7637L2588
2064c63539m260k6444j5757K45K7931M595L396L0031Q459Q06k3193j5281l4654
2051d07665L1004K7047k4039J3078J9681k7772l361J2411j167m368J1145k0714
2039c74720m0977M139L7825R729R663K2148j4199k8177J1506J5328J3110J4114
$$ y = [-376705, -365974, -345346, -325758, -352549, -373274, -369192, -374827, -356470, -334883, -320183, -324406, -318977, -267087, -211327, -174079, -174206, -151625, -186414, -159344, -202379, -278595, -285917, -326379, -322394, -301589, -339094, -339988, -324527, -340698, -377884, -387632, -323343, -309136, -328862, -321819, -333842, -330800, -309464, -327132, -343110, -327279, -306400, -344325, -358611, -327823, -333463, -362580, -353379, -340613, -334157, -352757, -364356, -371985, -375189, -376047, -382089, -386920, -388166, -413764, -396127, -363539, -367799, -394243, -410000, -409755, -381824, -377229, -373833, -343802, -335343, -334537, -357730, -373011, -407665, -376661, -349614, -373653, -360575, -340894, -368666, -372027, -359616, -360783, -365151, -354006, -374720, -415697, -411558, -373733, -364004, -354341, -332193, -346392, -374569, -363063, -347735, -334625, -320511]
2027c20511m2385l148J4069J8860k236j9620J0802m2644M368N282P302K3282l0906
2014c77485K1124Q341m100p115L738l704j5481m0637K0749J7709J1958L1662j0413
2001c43654m4914k2248l32L1926o534J7982k4218J7195J7572k0965j5369j8812
1989d12371R711J5868O28l665K6182Q050k5555P467R127J702O604J2204k4143
1976c68191j5687J4761j0752K827r674r148J2467K7968J336l600n927j711J11
1963c65220L883j6478j7737k6765K3942R888N856j5375L7838R935R487j2698j2407
1950c65851k8564J6929j6765M841l406K1218J0473k8076J4647k6069J6644j216
1938c85195J5769J9514L8465j286j8706m1133J5486j4679l2475l38m847j443m627
$$ y = [-320511, -362896, -366044, -351975, -333115, -335351, -354971, -344169, -386813, -382445, -377163, -369861, -346579, -377485, -356361, -348020, -352120, -359235, -355497, -359201, -374682, -415319, -394570, -376861, -364903, -333241, -343654, -388568, -410816, -411148, -379222, -385756, -367774, -391992, -374797, -357225, -378190, -393559, -412371, -402660, -386792, -386164, -389829, -363647, -355597, -381152, -373685, -364558, -362856, -356252, -344048, -368191, -383878, -369117, -379869, -377042, -386716, -395864, -383397, -355429, -354093, -357693, -363620, -365331, -365220, -361337, -377815, -395552, -422317, -398375, -388487, -382631, -398006, -360168, -350233, -340746, -353444, -365851, -394415, -377486, -394251, -389410, -392816, -371598, -361125, -389201, -374554, -400623, -383979, -385195, -369426, -349912, -311447, -312733, -331439, -372572, -357086, -371765, -404240, -404578, -409425, -410868, -415495]
1925d15495m740K3444K8574P772n190o295J0586p80p851N334n982j7133K9209
1912c58547K6779r52j0317k0625j2424J6984o33N411L8249o370j8535p402m4973
1899c93355J8922o3J1878J2961j2396k9235M9333k0731n3435K6722L2695Q247
1887c48457k8194l274j5878l8481K2629J9532J9619j4705J8102J2003k954K0738
1875c39320m2435J8338N12J1078j4283k2356J1879N0101j9392k2062j0491J9407
1863c59024N715L8064J6725o225j4756n287m3811j1634K7057q381l870L009j5517
1850c77935k9883M2385J5545r499J6434j3685J4939k597m4520r293L193o91L9308
1837c56299J4726j1563L0238j9724J6123j3190M996l760J5995j997l9156j5073
$$ y = [-415495, -420235, -396791, -368217, -360445, -365635, -371930, -361344, -362124, -369975, -364641, -370623, -387756, -358547, -331768, -332720, -343037, -363662, -376086, -359102, -359735, -354324, -316075, -322445, -340980, -348382, -393355, -374433, -374496, -362618, -349657, -362053, -391288, -341955, -362686, -416121, -389399, -356704, -348457, -376651, -379925, -395803, -434284, -411655, -392123, -372504, -387209, -369107, -357104, -360058, -339320, -381755, -363417, -362905, -351827, -366110, -388466, -376587, -326486, -345878, -367940, -378431, -359024, -353309, -315245, -298520, -304745, -319501, -324788, -368599, -380233, -353176, -361557, -365427, -362418, -377935, -407818, -365433, -349888, -359387, -342953, -356638, -341699, -344296, -388816, -398109, -394916, -395607, -356299, -341573, -353136, -322898, -342622, -326499, -339689, -334693, -338453, -322458, -324455, -363611, -378684]
1825c78684j781K2765K4842j5301j9784j8003Q925J1813n382K3339N780j2154
1813c53625l5979j9843J8812L5927J290P245j2588L491m2046Q509M1314J8068
1801c29425P825m2099k3085J3640R228k1211j4649K7376L686R242L842n31L2967
1788c23194m5889J1377K6930q792n557R005J1827l6011j0308N8959l183o1144
1776c75980N580L3216J8582j6043k5499K0037K6711o1159k579J4148q536l2504
1764d04026N149O3056r173m8114J097P004J761M5661M179o593j025k4109m202
1751c69335J6732K1926J1456k0159r53o109M4641l7591l0856j2679K1953k3724
1739c84698R140j516J3411l825J1315Q444m9587K6394m783j1284K0571J9148j4623
$$ y = [-378684, -380465, -357700, -332858, -348159, -367943, -385946, -377021, -365208, -370590, -347251, -341471, -353625, -389604, -409447, -390635, -354708, -353418, -346173, -358761, -355270, -397316, -388807, -347493, -329425, -321600, -363699, -386784, -373144, -363916, -385127, -399776, -372400, -368714, -359472, -355630, -356161, -323194, -369083, -357706, -330776, -339568, -345125, -336120, -324293, -360304, -370612, -311653, -314836, -375980, -370400, -337184, -318602, -334645, -360144, -340107, -313396, -374555, -377134, -362986, -371522, -404026, -398877, -335821, -344994, -393108, -392011, -385007, -383246, -337585, -333406, -339999, -341024, -365133, -369335, -352603, -330677, -319221, -339380, -340333, -346442, -301801, -339392, -370248, -382927, -360974, -384698, -375558, -377074, -363663, -367488, -356173, -347729, -397316, -370922, -375705, -386989, -366418, -347270, -361893]
1726c61893n12o09K4298k0079J887j5569K1140L742k7410L421q600J4140K7774
1713c38270j3849r619r973J8374J0167j5312j8017l2705J0843L5911J094k0672
1701c82028J1381L6815O001k2704k9398N009O198k3727J1456M446J6559K252l1216
1688c88956K3346J1592L4587m5624k7844L4875L3126J6228k1416J7590j5549l1446
1676c59491n324J8296J825m0226N371Q579L4080J2798m1908J1896P151r273q922
1663c65148L636J681J4685J4139L462j6134m4691J9057l79n69P067J8666O970
1650c37558K9890J323l3319o499n474P130k1806j745j0679L1304l0035l2J0840
1637c66660k2788l491M2409j5580J7366k5201j8959R829J8387P412j56J7165m7
$$ y = [-361893, -362405, -363014, -338716, -358795, -356908, -372477, -351337, -347595, -375005, -371584, -380184, -366044, -338270, -352119, -361738, -371711, -353337, -343170, -358482, -376499, -409204, -398361, -362450, -361356, -382028, -370647, -333832, -327831, -350535, -379933, -374924, -368726, -392453, -380997, -376551, -359992, -357740, -388956, -365610, -354018, -319431, -365055, -392899, -358024, -324898, -308670, -330086, -312496, -328045, -359491, -364815, -346519, -344694, -384920, -379549, -370970, -336890, -324092, -366000, -354104, -346953, -356226, -365148, -361512, -359831, -345146, -331007, -327545, -343679, -388370, -369313, -369692, -370261, -363194, -344528, -337558, -307668, -306345, -339664, -346163, -351637, -344507, -366313, -368058, -378737, -347433, -377468, -377500, -366660, -389448, -392939, -350530, -366110, -348744, -373945, -392904, -383075, -364688, -357276, -357432, -340267, -340314]
1624c40314j9038O878l06j0221K5562n234j0437k5763K2207J0114k6791j8860
1612c92203M3241l4087R767K0851m0723p81K8608k7027p857K6974J6662n579j0914
1599c73068J6070j6813q008J4221M3144k7915k2574j4024J1231J7556J1841K383
1587c45956J3083j3446l3737q706O061L6058K5180l4549k4104L9265J9980J3760
1575c07111J2405j1480j8325K541Q257l2916J4823K7891l8848q329j3832K419
1563c62505K9226k335l4037N603M7890l0090k7580N602l4105j5857K1874N2342
1551c43972P692M819k6535M542J801K0992l441j3351J6120l0699k8690N6879l5215
1538c69058o072K2283m947R37K9284L587j9608o184J3122l6980J0791K9290m3487
$$ y = [-340314, -359352, -352474, -352780, -363001, -337439, -342673, -353110, -378873, -356666, -346552, -373343, -392203, -348962, -383049, -373282, -352431, -393154, -393935, -365327, -392354, -400211, -373237, -356575, -362154, -373068, -356998, -373811, -381819, -367598, -324454, -352369, -374943, -388967, -377736, -360180, -348339, -345956, -332873, -346319, -380056, -388762, -382701, -346643, -321463, -356012, -380116, -340851, -320871, -307111, -294706, -306186, -324511, -321970, -313713, -346629, -331806, -303915, -342763, -351092, -364924, -362505, -333279, -335614, -369651, -364048, -316158, -346248, -373828, -368226, -402331, -418188, -396314, -343972, -336280, -331461, -357996, -353454, -351653, -330661, -334102, -347453, -331333, -362032, -390722, -333843, -369058, -375130, -352847, -357794, -356857, -327573, -323986, -343594, -349778, -336656, -373636, -362845, -333555, -377042]
1525c77042K9711O829k4165O26j3424o558N7730Q46l3049p645K738n558J7982
1512c50979K3574k9772J4736M702m2849O638K7822L0641j1602j5298j326O002
1500c37711k8932j1141J4489J6409O620J5885j1028o341K3157j1065r740R715
1488c29683k5323r287J558J4880J7205l219l2088l492K5358K079m993n059n150
1475c57214N207Q031M417k9910M1554M1219k2767l7801j5947J5702M0885k3461
1463c30085j5264K8278k9775j9334M2059J5450R530J4900j6945l2431k1271N792
1451c49096j4743k076M7833k2873k5099M157j818R004m540j5448o873K7247O591
1438c47734L2964l4057j6314N343Q093Q423r24j5009j3821J9423N94j688k9581
$$ y = [-377042, -347331, -340502, -364667, -364041, -377465, -384023, -326293, -325447, -358496, -366141, -363403, -368961, -350979, -327405, -357177, -342441, -337739, -380588, -373950, -346128, -315487, -327089, -342387, -343713, -337711, -366643, -377784, -363295, -346886, -340266, -324381, -335409, -341750, -318593, -329658, -339398, -329683, -355006, -364293, -362735, -347855, -330650, -333869, -365957, -369449, -344091, -342012, -347005, -352064, -357214, -352007, -343976, -339559, -369469, -327915, -286696, -309463, -347264, -363211, -347509, -306624, -330085, -345349, -317071, -346846, -366180, -324121, -308671, -299141, -284241, -301186, -333617, -354888, -349096, -363839, -365915, -318082, -340955, -366054, -361897, -363715, -354711, -359251, -374699, -381572, -354325, -347734, -314770, -348827, -365141, -359798, -351705, -343282, -344206, -359215, -373036, -353613, -353019, -354707, -384288]
1425c84288p748Q551J7654J9646J5022J8057j559J3492j3628j5655N040k3327
1413c48743L2055j7333k2283K0329l7757L6133Q943k0395j3421j3692O107K6408
1401c43649M1553j875j4837l525j5278o927P599J7626k336j8637r498J4605J9420
1388c15759k3684K419k6710k0925J0172N014j516K0443K4934p682L4596l5470
1376c34168j8242n166j1355K9382l403N61J6485J3628j9937m8064M0202Q857l2376
1363c63596J3759K5913O445l1027n163K690m150J2095K917j8965J2709L4103Q255
1350c04015k0131j835J3246P840k6918m784J0401R312o303j8352N079j3409R754
1337c40115L7339m407m1014J8369J2797M164q597L249l7207J073k349j5852O252
$$ y = [-384288, -392036, -383485, -365831, -346185, -331163, -313106, -314665, -301173, -314801, -330456, -325416, -348743, -316688, -334021, -356304, -335975, -373732, -337599, -328656, -349051, -362472, -376164, -370057, -343649, -302096, -303971, -318808, -322333, -337611, -344538, -336939, -319313, -321649, -340286, -349784, -335179, -315759, -339443, -337024, -363734, -384659, -374487, -369473, -370989, -350546, -325612, -333294, -298698, -334168, -352410, -357576, -368931, -339549, -342952, -342391, -325906, -312278, -332215, -380279, -340077, -331220, -363596, -349837, -323924, -317479, -348506, -353669, -350979, -355129, -343034, -340117, -359082, -346373, -312270, -304015, -324146, -325981, -312735, -304895, -331813, -336597, -326196, -316884, -323187, -341539, -336460, -349869, -340115, -302776, -307183, -348197, -329828, -317031, -312867, -321464, -318215, -355422, -354349, -356698, -372550, -366298]
1324c66298K1956K7853j4072l5851K8102K5046P50R665r463q751o697k5321k2384
1311c75465L1924J9257l3811j6893L3941Q259M9629n5764k1772L3823J7971l3293
1299c42194n252K5176k0958j7362K5197j3090j0193O932N125J2366j7685K696
1287c49242J5764k2170Q834L7378m2464j8853k23q902Q144J8453L882M2512k8605
1274c35492m9882L4388M3591l3844J3153j1089j0157K8929p805k767J1802K3358
1262b95815m9034j5839J9759J4125j5304n865J4013J3091J0116P143n6610P301
1250c52919m477k817j0071N614J1958j1382L1119K6573l3054l0740K3862J9177
1238c27157P773M016j0959j8159M810J8980j3846R532J67l6628L126J5394M862
$$ y = [-366298, -344342, -316489, -330561, -366412, -338310, -313264, -312514, -302849, -312312, -321063, -327760, -353081, -375465, -343541, -324284, -358095, -374988, -341047, -332788, -283159, -338923, -360695, -326872, -308901, -342194, -347446, -322270, -343228, -360590, -335393, -348483, -358676, -351744, -346619, -334253, -351938, -349242, -333478, -355648, -346814, -309436, -351900, -370753, -370976, -379878, -371734, -353281, -349399, -306887, -335492, -385374, -350986, -307395, -341239, -328086, -339175, -349332, -320403, -328208, -330975, -319173, -295815, -344849, -360688, -340929, -326804, -342108, -347973, -333960, -320869, -310753, -303610, -360220, -352919, -357396, -360213, -370284, -364670, -352712, -364094, -332975, -306402, -339456, -370196, -346334, -327157, -319384, -315368, -326327, -344486, -339676, -320696, -334542, -325010, -324843, -361471, -358345, -342951, -338089]
1225c38089j3351k5905r518N849K3279K8780j5472j2744n451N034J0865K6307
1213c20416j6845K5937J5142j534m1956k0919k3291M1476R955p428j3712K3346
1201c30245L4202n4717M372J0004J394k1981k623J9432j0168J5053K4971k6587
1189c36893K8069M6960l1345j1051j6252L628J2162m4556J2746L2287j6512k2726
1177c43483M454j2297o891q806J1391J7019j6980L1340J4827N037j9286o848m4342
1164c74865Q166M4874l9616J9250j836M923l4874L2566j599k1293K3056J89l2905
1151c73964p598L4139j6552J289J8068J5442N805k6501J1082J4672J504J1017
1139c11597m0576j5366K7045J7822J4838k8973R479K1478K992l215J9882k808
$$ y = [-338089, -351440, -377345, -386863, -381014, -357735, -328955, -344427, -357171, -362622, -357588, -346723, -320416, -337261, -311324, -296182, -297716, -339672, -360591, -383882, -342406, -332451, -339879, -353591, -330245, -296043, -350760, -346388, -336384, -334990, -356971, -359594, -340162, -350330, -335277, -310306, -336893, -308824, -261864, -293209, -304260, -320512, -316884, -304722, -349278, -336532, -304245, -320757, -343483, -339029, -351326, -358217, -367023, -355632, -338613, -355593, -324253, -309426, -304389, -323675, -330523, -374865, -366699, -321825, -361441, -342191, -344027, -339104, -373978, -341412, -343011, -364304, -341248, -341059, -373964, -381562, -347423, -363975, -362686, -344618, -329176, -323371, -349872, -338790, -324118, -322614, -311597, -352173, -367539, -340494, -322672, -307834, -336807, -327328, -305850, -302858, -306073, -286191, -288999]
1127b88999k2198J7484n313l889J0985j1385j852l1849j8814P131l13j7188J2677
1114c53523P474j0641j526O389M836k2622L2453Q660L6263L1746k1521k5590K9535
1101b78067j9068k9061j281L355j3434Q962r987P328j6295k4003R284L3399K2608
1088c06260m741j5278j8320K0789k1002k7401Q852K4862r53k450L1831K40j9048
1075c28879j0163J3533J1156J5864K0558R165L64k9386k6727L3630m2377L947
1063c29315J3385J8145j2782m4195K0501k6384l798K8006K4359k2667n487r511
1051c49743K410N2649l1481k5360J0097j8391J2303J5405M1262k3976j936j4884
1039c31645J6672K08Q91N574J2412k0914K0363j9161N37J3961m6818J771K4627
$$ y = [-288999, -311197, -293713, -299026, -302915, -291930, -303315, -305167, -337016, -355830, -348699, -349012, -366200, -353523, -346049, -356690, -358216, -351827, -346991, -369613, -337160, -328500, -292237, -260491, -282012, -307602, -278067, -297135, -326196, -327477, -324122, -337556, -328594, -338581, -331253, -347548, -371551, -362267, -328868, -306260, -311001, -326279, -344599, -323810, -344812, -372213, -363361, -338499, -339452, -341902, -310071, -309831, -328879, -339042, -325509, -314353, -298489, -277931, -268766, -268402, -297788, -324515, -290885, -333262, -329315, -315930, -297785, -310567, -354762, -334261, -360645, -364443, -336437, -312078, -334745, -340232, -349743, -347333, -294684, -326165, -351525, -341428, -359819, -347516, -332111, -290849, -314825, -316761, -331645, -314973, -314765, -313874, -308300, -295888, -316802, -296439, -315600, -315063, -301102, -347920, -346149, -321522]
1026c21522J112j4879r155Q754P428p607N074J0583l52n104o147k3453K4912N696
1012c24660l02O386J2440k3590k5397j3225K8188m8981Q565M4657K1346J0006
1000c04567k7457k9841R060J4964J1092K6392n1362r305J8444Q968j7688K0486
988c30814J7773l7053j05K3441l3651K2432J6995o176j5311J9382j209l0895j9380
975c74571J8899J7352o297K686O3039K0741l5212j6747k3255j3579K2635M935
963c19374q35J8149o469j6810j7060n308M2963K0153m0053r362J578m113l70n813
949c42724Q40M4935p307K6628m3314j3527L35J4189j9383j5526L161J6051J4004
936c21638R407j8935O053J4592k188o77O391j4194j7491j6286J6423K3465j3205
$$ y = [-321522, -320410, -335289, -344444, -335690, -328262, -335869, -330795, -320212, -320564, -325668, -331815, -355268, -330356, -324660, -324962, -318576, -306136, -329726, -355123, -368348, -340160, -389141, -380576, -335919, -314573, -304567, -332024, -361865, -352805, -337841, -326749, -300357, -351719, -361024, -342580, -333612, -351300, -330814, -313041, -350094, -350199, -326758, -360409, -337977, -320982, -327158, -342469, -323087, -324296, -355191, -374571, -355672, -338320, -344617, -341931, -278892, -258151, -293363, -310110, -333365, -346944, -324309, -319374, -320209, -302060, -308529, -325339, -342399, -347707, -304744, -284591, -324644, -334006, -332428, -336541, -336911, -342724, -341884, -296949, -304256, -277628, -320942, -334469, -334134, -319945, -339328, -354854, -351693, -335642, -321638, -312231, -331166, -325113, -310521, -312709, -313386, -306995, -321189, -338680, -354966, -338543, -315078, -328283]
923c28283K2635L852k5997M749K6599Q232k3072j2024j1895K138j3304K367N116
910c38887p011Q768k4340Q018r545L6238N668k5434M5410k2481L837o874j6058
897c42691K5978J1969K0625j2078J3659k8325P426k266J8192j1307J686J009P022
884b89101j5780J5292k9260o974J1976j4237O345J3599N835q29K0457m5108K2893
871c04892l8852l266M5585j9656P207j7069j2588J2190O452K0666R71j2935P543
858c08644k5736K982J4269o525J5255l506j5132o683K2953J8096K162k8919k7292
845c46720J7685K0277M707j3623j6139J9982J1016j2130J1852j3533K8012Q970
833b79644k346j5507r46k1962j1523K0328J569l8082j0483O2916J9844J8225K2687
$$ y = [-328283, -305648, -301796, -327793, -323044, -296445, -288213, -311285, -323309, -335204, -333066, -346370, -344003, -338887, -345898, -337130, -361470, -353452, -362997, -326759, -321091, -346525, -301115, -323596, -319759, -326633, -342691, -316713, -304744, -284119, -296197, -282538, -310863, -303437, -305703, -287511, -298818, -297132, -296123, -289101, -304881, -289589, -318849, -325823, -313847, -328084, -321739, -308140, -302305, -303134, -282677, -327785, -304892, -343744, -347010, -301425, -321081, -313874, -330943, -343531, -331341, -324889, -304223, -303252, -316187, -308644, -334380, -331398, -317129, -323654, -308399, -311905, -327037, -333720, -310767, -292671, -290509, -319428, -346720, -329035, -308758, -304051, -317674, -333813, -313831, -302815, -314945, -303093, -316626, -288614, -279644, -281990, -297497, -298443, -320405, -331928, -311600, -310031, -348113, -358596, -295680, -275836, -257611, -234924]
820b34924k2483q029m297j1376J381r680P18j1991l0199l1402Q802K405K2222
807c28853j6629K6993l594O988k888k0066J4263j3639O071r682P523L1353k0513
794c22673j9663k4254K6457K6740K5994p519j5012k507j5764K3639q569k222M5861
781b69492j6469l129q611l0733N644r757j536k3130K4054K7827r641l2696L7309
768c10360K2405j3567k1568m047P523K751K0782q39l6276J1462Q828o785L2660
755b87031L2285l9642p344J7625J5572j4404J1703j3810j1830M756j848n831m4490
742c44289Q392J553K3042m351L7289j0694o1753K1300P165k2683N2359l811o883
729c03364J4627J8265j0582k387k4359m5465J4600j3854K1888L7951J797m4486
$$ y = [-234924, -257407, -265436, -269733, -281109, -279728, -289408, -288690, -300681, -330880, -362282, -353480, -351075, -328853, -345482, -318489, -322083, -315095, -317983, -338049, -323786, -337425, -331354, -341036, -333513, -302160, -322673, -342336, -366590, -340133, -313393, -287399, -294918, -309930, -312437, -328201, -304562, -313131, -315353, -269492, -285961, -289090, -297701, -328434, -322790, -332547, -334083, -357213, -333159, -305332, -314973, -347669, -310360, -287955, -301522, -323090, -327137, -319614, -316863, -296081, -296920, -333196, -321734, -312906, -319691, -287031, -254746, -294388, -301732, -284107, -268535, -282939, -271236, -285046, -296876, -292120, -293968, -299799, -344289, -335897, -334344, -311302, -315653, -278364, -289058, -350811, -329511, -322346, -345029, -292670, -296481, -303364, -288737, -270472, -281054, -283441, -307800, -353265, -338665, -352519, -330631, -292680, -290883, -335369]
717c35369K8186M2670k5197l219m2395k4382K9273j2463K5035j083J2539J03k0241
704c26543J7058m3184L0169K7869k3166j5521j6059J8748K1442j100J8312J908
692b90067l7645k2871L1073j2880J6014L4335m096j2232m505K9125k3115P119
680b89745k4349o031L7683j1325N657j2931j8459j8540j7316N6398j0745p142
668c16845K5949j1565j2601J7907j4541J4858m204o130J084l2610K3066O803k470
655c11299J686r37q133p501K4285K0324l9458k2830J5241K099J9042O577j8026
642c18930J0872n4236J7889M0118K8755L594j4702M481k4625K482K355J9383R835
629b72729n6065P254M742K1496n894j1047l480j5859K6680J7949P806J7505k8951
$$ y = [-335369, -307183, -264513, -289710, -292929, -335324, -359706, -330433, -342896, -317861, -318944, -306405, -306302, -326543, -309485, -352669, -322500, -294631, -317797, -333318, -349377, -330629, -309187, -310287, -291975, -290067, -327712, -350583, -319510, -332390, -316376, -282041, -286137, -298369, -302874, -273749, -296864, -289745, -314094, -320125, -282442, -293767, -288110, -301041, -319500, -338040, -355356, -298958, -309703, -316845, -290896, -302461, -315062, -297155, -311696, -296838, -301042, -307172, -306088, -338698, -315632, -308829, -311299, -309613, -310550, -318683, -326184, -301899, -281575, -321033, -343863, -328622, -326523, -307481, -300904, -318930, -308058, -362294, -344405, -304287, -275532, -271938, -286640, -282159, -306784, -304302, -301947, -282564, -272729, -328794, -321540, -316798, -295302, -301196, -312243, -315723, -331582, -304902, -286953, -279147, -261642, -290593]
616b90593k8342q253k4006R024K363K8040k0299K0641l395L193J9626l3332m08
603c25741Q757k67r006l305L5538k487J37J1968J0665j8133O926L659n2044n376
589c38709k193k1030K4149J5069k3952r810J6514J1876J2025r029J4404L090j1082
576c18678p265l1344N14K7079K9079J3441Q512Q502J343k7923k866K0791k8429
563c07244k5601J2787K5875l666J9599L1822n0778k6526L883k5018j5598M593
551c55872K0989q59M99J5798L2569N581r811n0563J3262K0767p093Q30p22L688
537c10937k2477J8132l539K402N281L621k5442L5244m562p571K9579j6560k4610
524c21439Q386j4763m772J4680M518q306K1293N85p293j5879j4685N757k7294
$$ y = [-290593, -318935, -327188, -351194, -342170, -339807, -311767, -332066, -311425, -314820, -311627, -292001, -325333, -325741, -316984, -317251, -326257, -329562, -294024, -296511, -296374, -284406, -273741, -291874, -284948, -281289, -333333, -338709, -340902, -361932, -337783, -322714, -346666, -356476, -339962, -328086, -316061, -325090, -310686, -307596, -318678, -325943, -357287, -356773, -329694, -300615, -287174, -278662, -270160, -268817, -296740, -299606, -278815, -307244, -332845, -320058, -294183, -297849, -278250, -246428, -297206, -323732, -319849, -344867, -360465, -355872, -334883, -335742, -335243, -319445, -286876, -281295, -291106, -341669, -328407, -307640, -314733, -313903, -314625, -310937, -333414, -315282, -318821, -316419, -311138, -307517, -332959, -297715, -302277, -309848, -280269, -296829, -321439, -313053, -327816, -332588, -317908, -313390, -321696, -300403, -299818, -307111, -322990, -337675, -331918, -359212]
511c59212j1189L245O153L8097L7850p636k40j2671k7603J2988L3585m134m656
498b95423J4813J2230q020n3910j1910L6316m815o58j5464J3664O840j2422q353
485c27112k8402q812J7113L8660O124M297m449k4557j3129l6096L9520M1488m3097
472c38452J2640K8798J4436l473p879k4584n0279K0704K0030L0906J8721k3590
460c02022L659j0029j081j5898k3292o746m2579K0580R371L4464L8054k1394J0617
447c06296q957j6653J0350j8400k0478j2361K3360L9204j9781k946K5421j831
435c09368k411J0337J6446L0220l6417k3715Q266L323P468n55k5554j0521k509
422c34990L7416j239p56J7020j001m826r399j1262k4785l306J1499L7739j2486
$$ y = [-359212, -370401, -367156, -361003, -322906, -285056, -292692, -292932, -305603, -333206, -320218, -286633, -290767, -295423, -280610, -268380, -276400, -330310, -342220, -305904, -310719, -311377, -326841, -313177, -306337, -318759, -327112, -355514, -364326, -347213, -308553, -302429, -298132, -302581, -327138, -340267, -376363, -336843, -295355, -338452, -325812, -297014, -282578, -286051, -293930, -318514, -368793, -348089, -328059, -297153, -278432, -302022, -298363, -308392, -309473, -325371, -348663, -355409, -397988, -377408, -368037, -333573, -295519, -316913, -306296, -315253, -331906, -321556, -339956, -360434, -372795, -349435, -310231, -330012, -332958, -307537, -309368, -311779, -301442, -284996, -254776, -291193, -314908, -306642, -303319, -295851, -296406, -321960, -332481, -334990, -297574, -298813, -299569, -282549, -283550, -288376, -297775, -309037, -333822, -337128, -325629, -287890, -300376]
409c00376r461k8806J3516j4663O441j8498P01k3600O268J9375P170J1857j5507
396c45583Q343n77K5514l7076L530J0746j4749j1351L4981Q141K4183n891j6136
383c15925o070J5896K1511l2586M909j197K7627m332r458j1536m752k0549O082
370c30380K7310l7342K6940o307K1404j2123j5257L742k6666N666L9384K7435
358b76194r684o432j1009N690p826j8801K1775R934r333O737J3520Q044j1875
345b85454k6196J96J5889J0912k4644k0717K3947J4155p355K1976k4935p008j152
332c10386j1300O917P58k2921n934J6830J4724Q762k5453J4526K633n314l573
319c19731k211l807L6065J729L530K8114J8941l8282k4786q093J9035j8391k9952
$$ y = [-300376, -309837, -338643, -325127, -339790, -333349, -351847, -351146, -374746, -368478, -349103, -341933, -330076, -345583, -337240, -337817, -312303, -349379, -345849, -335103, -349852, -361203, -326222, -318081, -293898, -299789, -315925, -321995, -306099, -284588, -317174, -312265, -313462, -285835, -290167, -299625, -311161, -315913, -336462, -330380, -303070, -340412, -313472, -319779, -298375, -310498, -325755, -322013, -348679, -343013, -303629, -276194, -285878, -292310, -303319, -297629, -305455, -324256, -302481, -292547, -301880, -295143, -281623, -273579, -285454, -311650, -311454, -295565, -284653, -309297, -330014, -306067, -291912, -299267, -277291, -302226, -309234, -310386, -321686, -314769, -314011, -336932, -342866, -326036, -311312, -302550, -328003, -313477, -310844, -316158, -319731, -321942, -325749, -289684, -287955, -284425, -256311, -237370, -275652, -300438, -308531, -289496, -307887, -337839]
306c37839K2616L6981l8142J8432J0469k7286J7953J9677m348k7486J3444L5017
294b60512J4707l4316m8799L9904k6282O893p339j1002P409q210J4386k9530M4321
281b98370n621m45L2143j1602j5773Q891N151j0438K889J230j3765j4743J632
268c18821K6498k4632P439J4462o397p735q32K110L7740l4776k9162k9871J7119
255c46858J1909K0495J7662Q556k3545j2578r837J3599m21k41R097K1635j4872
242c05399k7515Q229L2829J8816N445k2307l2166l789j0603M376L0792R545k7513
229c19260L3026J0399J3036j6881N565J704o329l8999M05J8992l3970l4437K7117
216c39632M1972k2257j7242L1361q92k2932j6477J5010J8515R542L072m718Q133
$$ y = [-337839, -315223, -278242, -316384, -297952, -287483, -314769, -296816, -277139, -281487, -308973, -295529, -260512, -245805, -280121, -328920, -289016, -315298, -308405, -315744, -326746, -319337, -327547, -313161, -342691, -298370, -303991, -304436, -272293, -283895, -299668, -290777, -285626, -296064, -293175, -291945, -305710, -320453, -318821, -292323, -316955, -309516, -295054, -301451, -309186, -310018, -307908, -270168, -304944, -334106, -363977, -346858, -334949, -314454, -296792, -288236, -311781, -324359, -334196, -320597, -321018, -321259, -312162, -290527, -305399, -332914, -324685, -291856, -273040, -267595, -289902, -322068, -325857, -336460, -332084, -301292, -291747, -319260, -286234, -275835, -262799, -279680, -274115, -272411, -278740, -317739, -317334, -298342, -332312, -366749, -339632, -297660, -319917, -337159, -305798, -306690, -329622, -346099, -331089, -312574, -303032, -299960, -304678, -296545]
203b96545o767j6805P220R16m4587K0451O0382l2170j0175N845k657Q136j1929
190c18685j3094o795M290J680j0077J8941k8476M110J3187J1633j7218j2162J3818
177c38848N045M505K1060J7523j9050q083l944j6114m8K2529K8739l4195k0772
164c41653N2839L358j2325l0731k0953N777r5o009o61l333R096L2730j9423j9146
150c50529J3556K226k480N864N301k959R052k3910N429j0954K7925J2739m0572
137c49312P22J3887r697J0676J1472r133j3733k498J6542J2766j1714k5280K068
124c53234J5637q817L614K1070p414N253k0778j6718j0453K7693j5144j2389j0703
111c82383Q69L2962o243n224P864J1620O805J2600O819P010k3880k3383q838J3824
$$ y = [-296545, -303312, -320117, -312897, -311981, -356568, -336117, -275735, -307905, -318080, -312235, -314892, -306756, -318685, -331779, -338574, -334284, -332604, -342681, -323740, -352216, -348106, -334919, -323286, -340504, -352666, -338848, -333803, -329298, -308238, -290715, -309765, -317848, -321792, -337906, -337954, -315425, -286686, -320881, -341653, -288814, -285456, -297781, -328512, -349465, -343688, -343783, -349792, -350453, -353786, -344690, -311960, -331383, -350529, -336973, -334747, -337227, -331363, -326062, -329021, -319969, -343879, -338450, -349404, -321479, -308740, -349312, -348590, -334703, -344400, -333724, -322252, -331385, -345118, -347616, -331074, -318308, -330022, -355302, -353234, -337597, -346414, -342800, -321730, -329144, -323891, -344669, -361387, -371840, -344147, -359291, -371680, -382383, -381514, -348552, -354795, -360019, -352155, -340535, -333730, -321130, -314311, -307301, -331181, -354564, -363402, -349578]
97c49578j3963N400j3281J9519J3018N12j0331k3285r958J626L5597r800p721
84c62245k2074J6462J3644l93N125p51j5316j6710K1653k520N413k1781o144L119
70c82518k0077j9403Q296R985J8272p462O187m355P978M854l102J3900j0168R457
56c68156k7567J9998K7567k4429l317l6558m561K7487P443j7636L013N838j8442
43d09320j0490P354J0376Q928K3553k5138j4384j0781k973P933J5209J4475J120
30c84138J5756k1374j0156P291l0599P199j040K6108J4410M02k5097j5696o434
17d23368Q746j9907p863J8811l584J0065J8096m691Q856j9721p990J0113l3179
4d45616j3991J228K504J9612
$$ y = [-349578, -363541, -358141, -371422, -351903, -338885, -338373, -348704, -371989, -381947, -380321, -344724, -354524, -362245, -384319, -367857, -354213, -354606, -349481, -350232, -365548, -382258, -360605, -363125, -357712, -379493, -385637, -382518, -402595, -421998, -413702, -403717, -385445, -392907, -386720, -391075, -383097, -378243, -381345, -367445, -377613, -368156, -395723, -375725, -348158, -372587, -375904, -412462, -417023, -389536, -382093, -399729, -396716, -390878, -409320, -419810, -412456, -402080, -393152, -369599, -394737, -409121, -419902, -422875, -414942, -399733, -385258, -384138, -368382, -389756, -399912, -392621, -423220, -416021, -417061, -390953, -376543, -376141, -401238, -416934, -423368, -414622, -434529, -442392, -423581, -427165, -417100, -399004, -403695, -394839, -414560, -422550, -412437, -445616, -459607, -458379, -455875, -436263]
0d36263
$$ y = [-436263]
$$ Imaginary data points
##PAGE= N=2
##DATA TABLE= (X++(I..I)), XYDATA
16383a519011K4459K9902P012p414N6273K2124P511J5800L8760M4780P722M126
16371a267956L2499J9298J7623J5813J2734N675L7345M9204L4097l693l795K8151
16359a023005L6688K8477J5154M4488K0433k5767K2202M7880L6067N606j1210
16348h02987J7340K5511K5467K8773L1781K0294L2727Q250L763R071K0482J1605
16336e67923K2807M1934K6797K4773P441J9339P11K6354L1324L335K6696K6936
16324c09476L3147K7346K4694J6721K095n932L6750j459L3489L5620j0526J2544
16312a04987L8995J1395l867K7456J6625M872K3016K3398M2573J6800J845M004
16300A02125J4833L6568K8359L5033J3380J0836q323J395M3420K1211J8305J5202
$$ y = [-1519011, -1494552, -1464650, -1457638, -1465052, -1408779, -1386655, -1379144, -1363344, -1324584, -1279804, -1272082, -1267956, -1235457, -1216159, -1198536, -1182723, -1169989, -1164314, -1126969, -1077765, -1043668, -1047361, -1051156, -1023005, -986317, -957840, -942686, -898198, -877765, -903532, -881330, -833450, -797383, -791777, -802987, -785647, -760136, -734669, -705896, -674115, -653821, -621094, -612844, -609081, -600010, -579528, -567923, -545116, -503182, -476385, -451612, -444171, -424832, -424121, -397767, -366443, -363108, -336412, -309476, -276329, -248983, -224289, -207568, -205473, -211405, -174655, -176114, -142625, -107005, -117531, -104987, -65992, -54597, -58464, -31008, -14383, -9511, 13505, 36903, 79476, 96276, 98121, 102125, 116958, 153526, 181885, 216918, 230298, 241134, 232811, 234206, 277626, 298837, 317142, 332344]
16288C32344O860K8956j532J2706L7458K5138p863j5609L4356J7730M0419k0284
16276D90679N049L0344M9147J6609m143J6427q176K3570M0655M0160J6559k3639
$$ y = [332344, 339204, 368160, 366628, 379334, 416792, 441930, 434067, 418458, 452814, 470544, 510963, 490679, 495728, 526072, 575219, 591828, 587685, 604112, 595936, 619506, 660161, 700321, 716880, 693241]
$$ [...]
##END NTUPLES=NMR SPECTRUM
##END=
