##TITLE=1H_DE-80H_X3
 200.13MHz, d2o
 8 sc
 
 19ns.26.2.2025
##JCAMPDX= 6.0         $$ Bruker NMR JCAMP-DX V2.0
##DATA TYPE= NMR SPECTRUM
##DATA CLASS= NTUPLES
##ORIGIN= UXNMR, Bruker Analytische Messtechnik GmbH
##OWNER= pz
$$ XWIN-NMR		Version 3.5
$$ Tue Mar 17 09:51:15 2026 Russian Standard Time (UT+4h)  Yarkov@DPX200
##.OBSERVE FREQUENCY= 200.1313
##.OBSERVE NUCLEUS= ^1H
##.ACQUISITION MODE= SIMULTANEOUS
##.ACQUISITION SCHEME= undefined
##.AVERAGES= 8
##.DIGITISER RES= 18
##SPECTROMETER/DATA SYSTEM= spect
##.PULSE SEQUENCE= zg30
##.SOLVENT NAME= CDCl3
##.SHIFT REFERENCE= (INTERNAL, CDCl3, 0, 15.4274)
##AUDIT TRAIL= $$ (NUMBER, WHEN, WHO, WHERE, WHAT)
$$ ##TITLE= Audit trail, XWIN-NMR		Version 3.5
$$ ##JCAMPDX= 5.01
$$ ##ORIGIN= Bruker BioSpin GmbH
$$ ##OWNER= Yarkov
$$ C:/Bruker/XWIN-NMR/data/yarkov2/nmr/H-C/1/pdata/1/auditp.txt
$$ ##AUDIT TRAIL=  $$ (NUMBER, WHEN, WHO, WHERE, WHAT)
(   1,<2026-03-17 09:50:19.32 +0400>,<Yarkov>,<DPX200>,
      <created by zg, POWCHK disabled, PULCHK disabled
       configuration hash MD5:
       00 E9 B6 7A A2 85 ED C7 34 08 36 98 17 FE 4E 26
       data hash MD5: 16K
       F4 28 E8 72 7D 50 92 07 32 57 11 A9 C0 D0 75 72>)
(   2,<2026-03-17 09:50:29.42 +0400>,<Yarkov>,<DPX200>,
      <Start of raw data processing
       efp BC_mod = 2 LB = 0.25 FT_mod = 6 PKNL = 1 PHC0 = -5299.148 PHC1 = 6.821927 SI = 16K 
       data hash MD5: 16K
       99 8E 75 C7 80 71 83 70 79 78 32 D1 36 BF 5A FD>)
(   3,<2026-03-17 09:50:34.07 +0400>,<Yarkov>,<DPX200>,
      <abs ABSG = 5 
       data hash MD5: 16K
       9A F9 70 F6 AB 23 0C FE 36 83 F2 7F 36 8E 37 0E>)
$$ ##END=
$$ 
$$ hash MD5
$$ 54 A3 FF 33 12 18 56 F9 2F AF 7F B7 99 61 51 25
##$RELAX= 
##$RELAX= 
##$RELAX= 
##$RELAX= 
##$RELAX= 
##$RELAX= 
$$ Bruker specific parameters
$$ --------------------------
##$DU= <C:/Bruker/XWIN-NMR>
##$EXPNO= 1
##$NAME= <H-C>
##$PROCNO= 1
##$TYPE= <nmr>
##$USER= <yarkov2>
##$AMP= (0..31)
100 100 100 100 100 100 100 100 100 100 100 100 100 100 100 100 100 100 
100 100 100 100 100 100 100 100 100 100 100 100 100 100 
##$AQSEQ= 0
##$AQ_mod= 1
##$AUNM= <au_zg>
##$AUTOPOS= <>
##$BF1= 200.13
##$BF2= 200.13
##$BF3= 200.13
##$BF4= 200.13
##$BF5= 200.13
##$BF6= 200.13
##$BF7= 200.13
##$BF8= 200.13
##$BYTORDA= 1
##$CFDGTYP= 0
##$CFRGTYP= 5
##$CHEMSTR= <none>
##$CNST= (0..31)
1 1 145 1 1 1 1 1 1 1 1 1 1 1 1 1 1 1 1 1 1 1 1 1 1 1 1 1 1 1 1 1 
##$CPDPRG= <>
##$CPDPRG1= <>
##$CPDPRG2= <>
##$CPDPRG3= <>
##$CPDPRG4= <mlev>
##$CPDPRG5= <mlev>
##$CPDPRG6= <mlev>
##$CPDPRG7= <mlev>
##$CPDPRG8= <mlev>
##$CPDPRGB= <>
##$CPDPRGT= <>
##$D= (0..31)
0 0.7 0 0 0 0 0 0 0 0 0 0.03 0 0 0 0 0 0 0 0 0 0 0 0 0 0 0 0 0 0 0 0 
##$DATE= 1773726618
##$DBL= (0..7)
120 120 120 120 120 120 120 120 
##$DBP= (0..7)
150 150 150 150 150 150 150 150 
##$DBP07= 0
##$DBPNAM0= <>
##$DBPNAM1= <>
##$DBPNAM2= <>
##$DBPNAM3= <>
##$DBPNAM4= <>
##$DBPNAM5= <>
##$DBPNAM6= <>
##$DBPNAM7= <>
##$DBPOAL= (0..7)
0.5 0.5 0.5 0.5 0.5 0.5 0.5 0.5 
##$DBPOFFS= (0..7)
0 0 0 0 0 0 0 0 
##$DE= 6
$$ [...]
##$SUBNAM3= <"">
##$SUBNAM4= <"">
##$SUBNAM5= <"">
##$SUBNAM6= <"">
##$SUBNAM7= <"">
##$SUBNAM8= <"">
##$SUBNAM9= <"">
##$SW= 18.0517328524113
##$SWIBOX= (0..15)
0 0 2 0 0 0 0 0 0 0 0 0 0 0 0 0 
##$SW_h= 3612.71676300578
##$TD= 16384
##$TD0= 1
##$TE= 0
##$TE2= 300
##$TE3= 300
##$TEG= 300
##$TL= (0..7)
0 120 120 120 120 120 120 120 
##$TP= (0..7)
150 150 150 150 150 150 150 150 
##$TP07= 0
##$TPNAME0= <>
##$TPNAME1= <>
##$TPNAME2= <>
##$TPNAME3= <>
##$TPNAME4= <>
##$TPNAME5= <>
##$TPNAME6= <>
##$TPNAME7= <>
##$TPOAL= (0..7)
0.5 0.5 0.5 0.5 0.5 0.5 0.5 0.5 
##$TPOFFS= (0..7)
0 0 0 0 0 0 0 0 
##$TUNHIN= 0
##$TUNHOUT= 0
##$TUNXOUT= 0
##$USERA1= <user>
##$USERA2= <user>
##$USERA3= <user>
##$USERA4= <user>
##$USERA5= <user>
##$V9= 5
##$VALIST= <valist>
##$VCLIST= <CCCCCCCCCCCCCCC>
##$VD= 0
##$VDLIST= <DDDDDDDDDDDDDDD>
##$VPLIST= <PPPPPPPPPPPPPPP>
##$VTLIST= <TTTTTTTTTTTTTTT>
##$WBST= 1024
##$WBSW= 4
##$XGAIN= (0..3)
0 0 0 0 
##$XL= 0
##$YL= 0
##$YMAX_a= 568954
##$YMIN_a= -540506
##$ZGOPTNS= <>
##$ZL1= 120
##$ZL2= 120
##$ZL3= 120
##$ZL4= 120
##$ABSF1= 15.48136
##$ABSF2= -2.570489
##$ABSG= 5
##$ABSL= 3
##$ALPHA= 0
##$AQORDER= 0
##$ASSFAC= 0
##$ASSFACI= 0
##$ASSFACX= 0
##$ASSWID= 0
##$AUNMP= <proc_1d>
##$AZFE= 0.1
##$AZFW= 0.1
##$BCFW= 0
##$BC_mod= 2
##$BYTORDP= 0
##$COROFFS= 0
##$CY= -3
##$DATMOD= 1
##$DC= 0
##$DFILT= <>
##$DTYPP= 0
##$F1P= 0
##$F2P= 0
##$FCOR= 1
##$FTSIZE= 16384
##$FT_mod= 6
##$GAMMA= 0
##$GB= 0
##$INTBC= 1
##$INTSCL= 3.241238e-09
##$ISEN= 128
##$LB= 0.25
##$LEV0= 0
##$LPBIN= 0
##$MAXI= 10000
##$MC2= 0
##$MEAN= 0
##$ME_mod= 0
##$MI= 1.114404
##$NCOEF= 0
##$NC_proc= -6
##$NLEV= 6
##$NOISF1= 3.799351
##$NOISF2= 2.8
##$NSP= 0
##$NTH_PI= 0
##$NZP= 0
##$OFFSET= 15.42737
##$PC= 1
##$PHC0= -5299.148
##$PHC1= 6.821927
##$PH_mod= 1
##$PKNL= yes
##$PPARMOD= 0
##$PSCAL= 0
##$PSIGN= 0
##$REVERSE= no
##$SF= 200.130018879344
##$SI= 16384
##$SIGF1= 3
##$SIGF2= 2
##$SINO= 0.751879
##$SIOLD= 32768
##$SREGLST= <19F.Aceton>
##$SSB= 0
##$STSI= 16384
##$STSR= 0
##$SW_p= 3612.71676300578
##$SYMM= 0
##$S_DEV= 0
##$TDeff= 16384
##$TDoff= 0
##$TI= <>
##$TILT= no
##$TM1= 0
##$TM2= 0
##$TOPLEV= 0
##$USERP1= <user>
##$USERP2= <user>
##$USERP3= <user>
##$USERP4= <user>
##$USERP5= <user>
##$WDW= 1
##$XDIM= 16384
##$YMAX_p= 295815389
##$YMIN_p= -695691
$$ End of Bruker specific parameters
$$ ---------------------------------
##NTUPLES= NMR SPECTRUM
##VAR_NAME=  FREQUENCY,     SPECTRUM/REAL,   SPECTRUM/IMAG
##SYMBOL=    X,             R,               I
##VAR_TYPE=  INDEPENDENT,   DEPENDENT,       DEPENDENT
##VAR_FORM=  AFFN,          ASDF,            ASDF
##VAR_DIM=   16384,         16384,           16384
##UNITS=     HZ,            ARBITRARY UNITS, ARBITRARY UNITS
##FACTOR=    0.220516191357247, 1,           1
##FIRST=     3087.47986365014, 0,            0
##LAST=      -525.236899355644, 0,           0
##MIN=       -525.236899355644, -695691,     0
##MAX=       3087.47986365014, 295815389,    0
$$ Real data points
##PAGE= N=1
##DATA TABLE= (X++(R..R)), XYDATA
$$ [...]
5848A6726677o22769n94150l82617l17580j85650j25712j60809j7569J43962K34922
5838A4698705K67619M2876k22338n09614p24639q24155r52685p95327p26404o61395
5828I592643n92125n68565n07446m35491l38502j66530n4643j66294k14498k08471
5818F340078j52997k08421k43407j85274j45933n7157m0075m4141j57286j40790
5808D964597k91620k26716k69345k91101k68545k32751j82293j44378r1139r6898
5798B869811j21964j06361J480j16040J480n7011k7081m6532J6305m3047j10685
5787B260355j25619O2059N12l8882j2341k9927Q980l1393n7378k8291K8714J1530
5775B048319q9894l1281n3838m166m2773l470L7148N1867K7558l371l5779M114
$$ plain form
5848 16726677 16103908 15509758 15127141 14809561 14623911 14498199 14337390 14319821 14463783 14698705
5838 14698705 14966324 15009200 14786862 14277248 13552609 12728454 11775769 10980442 10254038 9592643
5828 9592643 9000518 8431953 7924507 7489016 7150514 6983984 6929341 6763047 6548549 6340078
5818 6340078 6187081 5978660 5735253 5549979 5404046 5346889 5306814 5262673 5105387 4964597
5808 4964597 4672977 4446261 4176916 3885815 3617270 3384519 3202226 3057848 2966709 2869811
5798 2869811 2747847 2641486 2642966 2526926 2528406 2471395 2444314 2397782 2414087 2371040 2260355
5787 2260355 2134736 2196795 2197307 2158425 2146084 2116157 2125137 2093744 2036366 2008075 2036789 2048319
5775 2048319 1958425 1927144 1873306 1869140 1826367 1822897 1860045 1911912 1939470 1936099 1900320 1904434
5763A904434J9192l8431j5023M845q8674m7504J6622L035J9633L5563k149k6874
5751A784669M0519L6138K2723k0754L67n973k2914L4486K5830l5152k1697L657
5739A841899q001n5848L3630L5169J7305j9923M6129M8338K6763J4954k9264j3498
5727A937653L9712n6438N7820J6204m6668j6625L1864k9336J6650L6793J6774
5716B004403l9723P1715L9803M6536O2200K1438L8254l5551n0289l3110L4428
5705B160104l3949K3757j22647Q632N0060m2372o0818j8432P6974l3970p6283
5694A931056Q2258O6741J366j5127l6882k4572R870Q3328j6718q1276L6248N4424
5682B090716r1287K1212K9367o117l6827k770j830n6648L2431J8573j20817k5905
$$ plain form
5763 1904434 1923626 1885195 1870172 1875017 1786343 1738839 1755461 1758496 1778129 1813692 1811543 1784669
5751 1784669 1825188 1861326 1884049 1863295 1863662 1857689 1834775 1869261 1895091 1859939 1838242 1841899
5739 1841899 1833898 1778050 1811680 1846849 1864154 1844231 1890360 1938698 1965461 1980415 1951151 1937653
5727 1937653 1977365 1920927 1978747 1994951 1948283 1931658 1963522 1934186 1950836 1987629 2004403
5716 2004403 1964680 2036395 2076198 2122734 2184934 2206372 2244626 2209075 2158786 2125676 2160104
5705 2160104 2126155 2149912 2027265 2035897 2085957 2043585 1982767 1964335 2041309 2007339 1931056
5694 1931056 2013314 2080055 2081421 2066294 2029412 2004840 2014710 2098038 2081320 2000044 2036292 2090716
5682 2090716 1999429 2020641 2050008 2043891 2007064 2004294 2002464 1945816 1978247 1996820 1876003 1850098
5670A850098J3086Q1698R635K3109n5778j2598l5847K9333k178o7129k890m2136
5658A788403K8582J10684L4494n75L9778m966n6227j839K5254L0919j7714j7878
5646A958915L2518k5713j9576P926J0611N1502M1798l7395k816K8436N1316P2678
5634B170200j4768p9282m0920N9184L3610K0219j3033o9236k0381L0138P4416
5623B150147j3177j5317m2334L6192J846P7890o9634o6829M4717k3294O9366O5114
5611B214687p7107q3770j7537n5211k1782M0081J4579P7333j7814M2732k3827
5600B092364J3224j7517R523P9894j0816n1178l0772L331L2855L0086L9816M1490
5588B232300J8786M4671J11743O2406q302Q5224P5989M0008O6299l8429o9133
$$ plain form
5670 1850098 1863184 1944882 1954517 1977626 1921848 1909250 1873403 1902736 1900558 1833429 1830539 1788403
5658 1788403 1816985 1927669 1962163 1961588 2001366 1996400 1940173 1938334 1963588 1994507 1976793 1958915
5646 1958915 1991433 1965720 1946144 1954070 1964681 2016183 2057981 2020586 2017770 2046206 2097522 2170200
5634 2170200 2155432 2076150 2035230 2094414 2128024 2148243 2135210 2065974 2045593 2075731 2150147
5623 2150147 2136970 2121653 2079319 2115511 2117357 2195247 2125613 2058784 2103501 2080207 2149573 2214687
5611 2214687 2137580 2053810 2036273 1981062 1959280 1999361 2013940 2091273 2073459 2116191 2092364
5600 2092364 2105588 2088071 2097594 2177488 2166672 2115494 2084722 2088053 2120908 2150994 2190810 2232300
5588 2232300 2251086 2295757 2407500 2469906 2461604 2546828 2622817 2662825 2729124 2690695 2621562
5577B621562J3146R8260o9544p8654j9534K204L1023J2016k0579L295j9900K337
5565B575632M1314P9007M9374q4252l0532L5079p8401l4239o6866j1174P6978
5554B551920m6780q6181J3352N2593O2819k4300K2698J06847Q1703K1614m1627
5543B714658K4878Q483k9375k5480K9369l819J07689J7550q8257j4216K3095L1847
5531B796422M38j7291m4485m9942L099m757J1K2332j898j7460O6388o7257jq6109
5517B599490j2279O3745K1507k8494J5491P428J5277M2487J2446L9252O8091Q7677
5505B932118L0119J6780K9866n7822n999K544O797M9461J16781K2517j1812j0784
5493C120566P889k4397l752q461j095n277k2022J4602N1270o828l6016o9108o7043
$$ plain form
5577 2621562 2634708 2732968 2663424 2584770 2565236 2567440 2598463 2610479 2589900 2593195 2573295 2575632
5565 2575632 2616946 2695953 2745327 2661075 2630543 2665622 2587221 2552982 2486116 2474942 2551920
5554 2551920 2505140 2418959 2432311 2484904 2547723 2523423 2546121 2652968 2734671 2756285 2714658
5543 2714658 2739536 2748019 2718644 2693164 2722533 2718714 2826403 2843953 2755696 2741480 2764575 2796422
5531 2796422 2796860 2779569 2735084 2685142 2688241 2683484 2683495 2705827 2703929 2686469 2752857 2685600 2685599 2599490
5517 2599490 2587211 2650956 2672463 2643969 2659460 2666888 2682165 2724652 2737098 2776350 2844441 2932118
5505 2932118 2962237 2979017 3008883 2951061 2945062 2947606 2954403 3003864 3120645 3143162 3131350 3120566
5493 3120566 3128455 3104058 3100306 3091845 3090750 3085473 3063451 3078053 3129323 3122495 3086479 3017371 2950328
5480B950328M2291N9001J05605L5648r7664l3644k7198k0614k9561j6393n6876
5469B910923j1806k6124q682L4296l9115m419m7772J4026M0439J11588J18686
5458C092040M5782r321Q7201n5670n7622q9837N8388J2957L497O8670M0188l5112
5446C161161J3359l6008m6290m946m964M5736J00281J2913l4915j8256k0894J358
5434C168535K5285K0447J3250N3805k448k2951j04825k5184l6703j16286j40833
5423B832092r0397J4280j2636O138O6148P776m3821q463R696j381K6354p2901
5411B732885L2061J6419K4133m942j7087N7720r901n5211J5779L1477J1330J3389
5399B848052r6538J9841R1869O6756n0898k4869k983J11001J943n7606k7482j0568
$$ plain form
5480 2950328 2992619 3051620 3157225 3192873 3095209 3061565 3034367 3013753 2984192 2967799 2910923
5469 2910923 2899117 2872993 2864311 2898607 2859492 2855073 2807301 2821327 2861766 2973354 3092040
5458 3092040 3137822 3128501 3215702 3160032 3102410 3012573 3070961 3083918 3087415 3156085 3196273 3161161
5446 3161161 3174520 3138512 3092222 3087276 3082312 3128048 3228329 3241242 3206327 3188071 3167177 3168535
5434 3168535 3193820 3214267 3227517 3281322 3278874 3255923 3151098 3125914 3089211 2972925 2832092
5423 2832092 2741695 2755975 2743339 2749477 2815625 2823401 2779580 2771117 2780813 2779432 2805786 2732885
5411 2732885 2764946 2781365 2805498 2800556 2783469 2841189 2831288 2776077 2791856 2823333 2834663 2848052
5399 2848052 2751514 2771355 2863224 2929980 2879082 2854213 2851230 2962231 2964174 2906568 2879086 2868518
5387B868518N3933L5083K8440M3181K9913l5534j0063N3495N3011r2862K6532
5376C053647Q285N1964j6193J3175j1756p4519M761K6505N9547L4482l2168N1204
5364C168934K874M6413O6212l9113l85N0729L5866m455n3718o0810M4318O2721
5352C319586j2342K6001L7257q5744m8398J3912m11j0444O8911L4662j7987p601
5340C317402K546j1437P519K1719Q2283K6811l5493n5563M4038K5559J6010J4826
5328C456220M4360l4743R95L8102k0835k7815K9684M4540J2217N7764o3298N534
5316C542725P030k709P1169J0804M224l4236O4136J6530O143N4419K1182M4292
5304C805709R3838J3745J3464K0830p779L8181K735J05409K2310M6377k9030J2234
$$ plain form
5387 2868518 2922451 2957534 2985974 3029155 3059068 3023534 3013471 3066966 3119977 3027115 3053647
5376 3053647 3061932 3113896 3097703 3110878 3099122 3024603 3029364 3055869 3115416 3149898 3117730 3168934
5364 3168934 3171808 3218221 3284433 3245320 3244935 3295664 3331530 3327075 3273357 3212547 3256865 3319586
5352 3319586 3307244 3333245 3370502 3284758 3236360 3250272 3249861 3239417 3308328 3342990 3325003 3317402
5340 3317402 3319948 3308511 3316030 3337749 3420032 3446843 3411350 3355787 3399825 3425384 3441394 3456220
5328 3456220 3500580 3465837 3466832 3504934 3484099 3456284 3485968 3530508 3542725 3600489 3537191 3542725
5316 3542725 3549755 3547046 3618215 3629019 3633243 3599007 3663143 3679673 3685816 3740235 3761417 3805709
5304 3805709 3899547 3913292 3926756 3947586 3939807 3977988 3980723 4086132 4108442 4154819 4125789 4138023
5292D138023J25474K259K8916L8752L8630N1204J25438J45817R2094J19085L7693
5281D943385J09748J51762K26730K51121L32174N79327P02502P61354O00456K46416
5271H904975j28491l08591k73682k02107n2353J62028L56114P58152R66100J207504
5261A1389649J195348R17301O56144L87012K01849P9519K2845j04300L7629Q3999
5251A4866995K2636J9183J59847K28579L41019L35869L68713N23882O86172P07444
5241A8260339O69246L08093k9131m07595o84169p34023n36210l11175l23839l56542
5231A5854994m43552k31731k51265k99209l41171j46308K6215K1847R9846J42500
5221A4432166O0887j66566n34603q93271j168212j258963j107119q19985n75993
$$ plain form
5292 4138023 4263497 4265756 4294672 4333424 4372054 4423258 4548696 4694513 4786607 4905692 4943385
5281 4943385 5053133 5204895 5431625 5682746 6014920 6594247 7296749 8058103 8658559 8904975
5271 8904975 8776484 8467893 8194211 7992104 7939751 8101779 8457893 9216045 10182145 11389649
5261 11389649 12584997 13502298 14158442 14545454 14747303 14826822 14849667 14745367 14782996 14866995
5251 14866995 14889631 14908814 15068661 15297240 15638259 15974128 16342841 16866723 17552895 18260339
5241 18260339 18929585 19237678 19208547 18800952 18116783 17382760 16846550 16535375 16211536 15854994
5231 15854994 15411442 15179711 14928446 14629237 14288066 14141758 14167973 14189820 14289666 14432166
5221 14432166 14493053 14326487 13791884 12898613 11730401 10471438 9364319 8544334 7968341
5212G968341l71239j44828J95281L03777L23881K11616j60814l88789o41749o07102
5202F688375n46782m72364l59289l30190k37417j90479q7917o9237k0014l7859
5192D336827j9424o8707k4821o9342m0618p4959k182k939n3840Q805n3498J5251
5180C950553r5719k374l0116n04r181J3333O482R42M9863o8977L8489P7346j6682
5167C913455K1777R647K5366m9838m9241K2422J20185O3614P18J1236m6252k5834
5155D017255J3219k811K524o0739M5729K7320R538P9273j0669L2260l5100j3438
5143D104361n476o1308P527j3352m8968j3362m6796O6279O5251o2914m2502j2341
5131C936399R591J5875m9575l8198J06052J4658p1363k1718R8215K457j807N4060
$$ plain form
5212 7968341 7597102 7452274 7647555 7951332 8275213 8486829 8326015 7937226 7295477 6688375
5202 6688375 6141593 5669229 5309940 4979750 4742333 4551854 4463937 4394700 4374686 4336827
5192 4336827 4317403 4248696 4223875 4154533 4113915 4038956 4036774 4033835 3979995 3988800 3935302 3950553
5180 3950553 3854834 3852460 3822344 3821840 3812659 3825992 3832474 3833416 3883279 3814302 3852791 3930137 3913455
5167 3913455 3935232 3944879 3970245 3920407 3871166 3893588 4013773 4077387 4078105 4089341 4043089 4017255
5155 4017255 4030474 4027663 4030187 3969448 4015177 4042497 4052035 4131308 4120639 4152899 4117799 4104361
5143 4104361 4098885 4037577 4045104 4031752 3982784 3969422 3922626 3988905 4054156 3991242 3948740 3936399
5131 3936399 3945990 3961865 3912290 3874092 3980144 3994802 3923439 3901721 3999936 4002393 4000586 4054646
5119D054646K6080K4752j5882j1481Q627N0065k7137k3579K1550k1035L9853J21745
5107D248204R62p382O6522R438N7873J2773K1436N2656j2475N684M9371N9073
5095D564135k8202J6712k3225l2624J5586P736K635J2010o9011J4822m1280O2412
5083D501706O329m6731m0979J8499M3471K0104J7818J15476O9612O7467N0679
5072D823451L05L3682K1516R6698L4705k3712O7924Q9965m1243o7948p5355k5930
5060D934058j3255j2088l5218K0632M6899p6140l7744O6642M3399J4964K7466
5049D979615J9197J0358l4312j1989j7230M0762m2171k4772N5101P0270M6606
5038E091435J2313J9942O699q1145o1417M0539p0448j4563J942p207K4601k8094
$$ plain form
5119 4054646 4080726 4105478 4089596 4078115 4086742 4136807 4109670 4086091 4107641 4086606 4126459 4248204
5107 4248204 4249166 4241784 4308306 4317744 4375617 4388390 4409826 4462482 4450007 4455691 4505062 4564135
5095 4564135 4535933 4552645 4529420 4496796 4512382 4520118 4522753 4534763 4465752 4480574 4439294 4501706
5083 4501706 4508035 4461304 4420325 4438824 4482295 4502399 4520217 4635693 4705305 4772772 4823451
5072 4823451 4823756 4857438 4878954 4975652 5010357 4986645 5054569 5144534 5103291 5035343 4959988 4934058
5060 4934058 4920803 4908715 4873497 4894129 4941028 4864888 4827144 4893786 4937185 4952149 4979615
5049 4979615 4998812 5009170 4974858 4962869 4945639 4986401 4944230 4919458 4974559 5044829 5091435
5038 5091435 5103748 5123690 5130389 5049244 4987827 5028366 4957918 4943355 4945297 4938090 4962691 4934597
5026D934597N3038R676J1355j3823l0297R0877L7233N1918J3409N6159m295K3940
5014E233787J001L1619j9178P202n0388O4327M6644K0899N2894m9633N4147k0887
5002E372434L2371J9319L9284R9525j098M4595m2039j5989L4983R3318p904P9090
4990E747889P1710K6350K216M9225Q5531L3459O1453Q5475O264M134J05813O9584
4978F349103P3593R9234R4279j1127O4001J19184P9659J06792N6555M9163J04763
4967G185199J32756R3504Q1474J91292Q8330Q0036J62371J39614J85148J80703
4957H520427J65539K08805K20858J47793R2914J58047J55936Q2419R8306O4568
4947I915612R2760J07534R8311J08708J36874J68508K13166J76110K51161K66597
$$ plain form
5026 4934597 4987635 4997311 5008666 4994843 4964546 5055423 5092656 5144574 5157983 5214142 5209847 5233787
5014 5233787 5234788 5266407 5247229 5254431 5204043 5268370 5315014 5335913 5388807 5339174 5393321 5372434
5002 5372434 5404805 5424124 5463408 5562933 5561835 5606430 5564391 5548402 5583385 5676703 5668799 5747889
4990 5747889 5819599 5845949 5848165 5897390 5982921 6016380 6077833 6163308 6169572 6173706 6279519 6349103
4978 6349103 6422696 6521930 6616209 6605082 6669083 6788267 6867926 6974718 7031273 7080436 7185199
4967 7185199 7317955 7411459 7492933 7684225 7772555 7852591 8014962 8154576 8339724 8520427
4957 8520427 8685966 8894771 9115629 9263422 9356336 9514383 9670319 9752738 9851044 9915612
4947 9915612 10008372 10115906 10214217 10322925 10459799 10628307 10841473 11017583 11268744 11535341
4937A1535341K75153L42378M05283M74998M73101M89678M96772L15737J29625
4928A4938066l7344j41272p8149j36103m3532L1870N1628l5314O2924J38260K39194
4917A4990228K75805L28352L75141L77713K70265J54783Q8987J32452J22531J47195
4907A7263452O1387K06513K67673L58528M02637L80352M45239M67570O50101O56621
4897B1160073O40005P82814P90568Q59640J051061J075841J221559J314103J414183
4888C0309847J468869J443232J519258J584857J539899J554968J620197J686013
4880D2727140J791037K037583K363482K914849L813173M381684M158968K803991
4872F6991907Q99293m14085q23066m16627K86703J166888J901163K658546L361747
$$ plain form
4937 11535341 11810494 12152872 12558155 13033153 13506254 13995932 14492704 14808441 14938066
4928 14938066 14900722 14759450 14681301 14545198 14501666 14533536 14585164 14549850 14612774 14751034 14990228
4917 14990228 15266033 15594385 15969526 16347239 16617504 16772287 16861274 16993726 17116257 17263452
4907 17263452 17324839 17531352 17799025 18157553 18560190 18940542 19385781 19853351 20503452 21160073
4897 21160073 21800078 22582892 23373460 24233100 25284161 26360002 27581561 28895664 30309847
4888 30309847 31778716 33221948 34741206 36326063 37865962 39420930 41041127 42727140
4880 42727140 44518177 46555760 48919242 51834091 55647264 60028948 64187916 66991907
4872 66991907 67891200 67477115 66654049 66237422 66524125 67691013 69592176 72250722 75612469
4863G5612469L881778M213673M112311L950084L802760M040549M199381L846562
4855A07659567L025195K322319J830029J110458l53928j737896k626002k861142
4847A08368600k267925j441692n18273M50074J007986J092825Q49904N60492K50691
4838A08352682K58115R38597J895975K321447J693589q9832k221363l776333m371250
4829A05001627m183538l897836l103331k322629j373022n01880L40589J154509
4821I1114489J784732K251826K960175L625220M314086M980193N391106N605725
4813A22027552N313561M747276L937561L220025K725802J989090R68599m94751
4805A44434715k138706l551186m681756n038484m728415m026442k912769j540700
$$ plain form
4863 75612469 79494247 83707920 87820231 91770315 95573075 99613624 103813005 107659567
4855 107659567 110684762 113007081 114837110 115947568 115593640 113855744 111229742 108368600
4847 108368600 106100675 104658983 104140710 104590784 105598770 106691595 107541499 108101991 108352682
4838 108352682 108610797 109549394 111445369 113766816 115460405 115370573 113149210 109372877 105001627
4829 105001627 100818089 96920253 93816922 91494293 90121271 89619391 89959980 91114489
4821 91114489 92899221 95151047 98111222 101736442 106050528 111030721 116421827 122027552
4813 122027552 127341113 132088389 136025950 139245975 141971777 143960867 144929466 144434715
4805 144434715 142296009 138744823 134063067 129024583 124296168 120269726 117356957 115816257
4797A15816257k34228J012726K132233L048662L805678M511523N063236N454366
4789A40610453N646410N541020N249798M637840L990285L301051K468046J711408
4781A73156311R19554K54280l08505j008507k006505l482473m905139o360816
4773A56258200p408254p840943p538262o844222n970702n138310m299661l475246
4765A07742600k745313j850525j012493l74341J6981J94732K66573m6547m54621
4756A01737046r08473j612034k121387k602695k946886l286621l576196l914482
4748H0768272m251664m237099m176529l822469l379043k914102k413665j873429
4740E3700272j322328q56102n53028m62651r01604j560285k322867k817369k935182
$$ plain form
4797 115816257 115582029 116594755 118726988 121775650 125581328 130092851 135156087 140610453
4789 140610453 146256863 151797883 157047681 161685521 165675806 168976857 171444903 173156311
4781 173156311 174075865 174330145 174021640 173013133 171006628 167524155 162619016 156258200
4773 156258200 148849946 141009003 133470741 126626519 120655817 115517507 111217846 107742600
4765 107742600 104997287 103146762 102134269 101759928 101776909 101971641 102238214 102191667 101737046
4756 101737046 100828573 99216539 97095152 94492457 91545571 88258950 84682754 80768272
4748 80768272 76516608 72279509 68102980 64280511 60901468 57987366 55573701 53700272
4740 53700272 52377944 51521842 50968814 50506163 49604559 48044274 45721407 42904038 39968856
4731C9968856k755725k488386k037542j710065j300089p44433m37825Q9196N11288
4722B9095275Q34299P57387L28971m01335j177783j740652k003489k016307j791736
4713B1884630j576218j296626j176907q57645q02317o18110n18350l99906l69519
4704A4269032l47949k79814j92886j41080j37487r5280k9789j9331p6280O5617
4694A3014753J27877K97991L84092N04390O25167O68381O49077L92160m2924m47779
4684A6173185p35866q12093p61454p36558n60159m83524m15638l28734j92553
4675A1146606j69732k14024j25170o9380p2128L0800J40262P7181Q9703J29957
4665A0964075J35214K23335K75194L07948L97245M47425N03183O05747O91749
$$ plain form
4731 39968856 37213131 34724745 32687203 30977138 29677049 28932616 28494791 28583987 29095275
4722 29095275 29929574 30686961 31015932 30614597 29436814 27696162 25692673 23676366 21884630
4713 21884630 20308412 19011786 17834879 16977234 16174917 15556807 15038457 14638551 14269032
4704 14269032 13921083 13641269 13448383 13307303 13169816 13074536 13044747 13025416 12949136 13014753
4694 13014753 13142630 13440621 13824713 14329103 14954270 15622651 16271728 16663888 16620964 16173185
4684 16173185 15437319 14625226 13863772 13127214 12567055 12083531 11667893 11339159 11146606
4675 11146606 10976874 10762850 10637680 10568300 10496172 10526972 10667234 10744415 10834118 10964075
4665 10964075 11099289 11322624 11597818 11905766 12303011 12750436 13253619 13859366 14551115
4656A4551115R10943J077955J289382J558038J646629J593516J201392R76820
4648B4805790P76493O93542Q72421J082129J175880J046842Q82061M37964J25647
4639C1898769J91708N79141J135469J582727J698015J365568M98113p59642j670232
4630C6519636k391895k543732k503454k313798j961106j638084j216900q79310
4622B1071357n57160k07017N1552L19901N51041O54517Q95815R87907J090973
4613B4858886J297924J534841J795280K058168K275272K246836K169704K147541
4605D0384452J783762J391421J225020J141901J192718J114372P78046K18489
4597D9230181m90794r87030j393320j607600j314949j124663r48770q51816r40136
$$ plain form
4656 14551115 15462058 16540013 17829395 19387433 21034062 22627578 23828970 24805790
4648 24805790 25582283 26275825 27148246 28230375 29406255 30453097 31335158 31773122 31898769
4639 31898769 32090477 32669618 33805087 35387814 37085829 38451397 38949510 38189868 36519636
4630 36519636 34127741 31584009 29080555 26766757 24805651 23167567 21950667 21071357
4622 21071357 20514197 20307180 20358732 20678633 21229674 21884191 22780006 23767913 24858886
4613 24858886 26156810 27691651 29486931 31545099 33820371 36067207 38236911 40384452
4605 40384452 42168214 43559635 44784655 45926556 47119274 48233646 49011692 49230181
4597 49230181 48739387 47752357 46359037 44751437 43436488 42311825 41363055 40511239 39571103
4588C9571103j162100j400022j502831j353273j003984n18245P2356O91818J024451
4579C4419273J080453J128351J492391K205365K990917L237676K276430N15586
4571D9346442j269736k370389k555696j942196j157261n42742L01795J325924
4563D1136141K204340K271861J309247j56839j457108k151318j943453j132369
4555D0080502n7042J104890K019489K084903J011089p92441k256140k907854k735127
4546C7552269k182996j840287j287235p56861J37252P78022R40090J69746j255691
4537C2254309k127076k360887k124242j546351r84265p00904o10884q29474r86673
4528A9983553j216860j462118j471044j321961j237171j050288r19178q82868
$$ plain form
4588 39571103 38409003 37008981 35506150 34152877 33148893 32630648 32703004 33394822 34419273
4579 34419273 35499726 36628077 38120468 40325833 43316750 46554426 48830856 49346442
4571 49346442 48076706 45706317 43150621 41208425 40051164 39508422 39810217 41136141
4563 41136141 43340481 45612342 46921589 46764750 45307642 43156324 41212871 40080502
4555 40080502 40023460 41128350 43147839 45232742 46243831 45451390 43195250 40287396 37552269
4546 37552269 35369273 33528986 32241751 31484890 31622142 32400164 33340254 33510000 32254309
4537 32254309 30127233 27766346 25642104 24095753 23111488 22410584 21799700 20970226 19983553
4528 19983553 18766693 17304575 15833531 14511570 13274399 12224111 11304933 10422065
4520A0422065p32327n18512n30491l68367k74226l87028k73106j92457j70147
4511F975404j48549j66332j31466j20506j11039j47437j89624m4671j04131p5306
4501E736343j1856K0021L9854M1229j2029j07957r6959j06825o3788j02923j33547
4490E201563l5285p0619n8061n2157q6570m7776n8666o1163m8539Q279n6480n4502
4478D580024k0501m1233Q630K1088n9155Q6742N5465p6602k6537O389j06231q2135
4466D345944K8972K7688k0634l0845o1188n1533M0398J4979l5056J956J9614n6013
4454D224282n215J1312k8670k7746K2696m887N3461n6155o5255k9203M7475n7105
4442D084990m493O8647Q6403R0072O7114N1833j8785J04312J38687N4323P4753
$$ plain form
4520 10422065 9689738 9171226 8640735 8272368 7998142 7611114 7338008 7145551 6975404
4511 6975404 6826855 6660523 6529057 6408551 6297512 6150075 5960451 5915780 5811649 5736343
4501 5736343 5724487 5744508 5784362 5825591 5813562 5705605 5608646 5501821 5438033 5335110 5201563
4490 5201563 5166278 5095659 5037598 4985441 4898871 4851095 4792429 4731266 4682727 4691006 4634526 4580024
4478 4580024 4559523 4518290 4526920 4548008 4488853 4575595 4631060 4554458 4527921 4534310 4428079 4345944
4466 4345944 4374916 4402604 4381970 4351125 4289937 4238404 4278802 4293781 4258725 4260681 4280295 4224282
4454 4224282 4219067 4230379 4201709 4173963 4196659 4191772 4245233 4189078 4123823 4094620 4142095 4084990
4442 4084990 4080497 4149144 4235547 4325619 4392733 4444566 4425781 4530093 4668780 4723103 4797856
4431D797856J8663J00666J13512J56615K53418K19511M56940R11091J420996J593308
4421A0042576J069615O4794q06461j195771j243342j006144p06238m71145l54603
4412E393281j79886k11080j15919j06802j04038M4684M784K5073j4416L5134n2572
4401D718243n1438k5488N45k9544j9747j12814J93K0410p0089J7178M7670P6443
4389D571562K3435l1284M1536j9288j3337J3907p5245L676q7735p5602J9785L7790
4377D409200R197M2522J24967l1100N2797N2650p648j0380N577L0343P1466J6009
4365D765600O8601R4664Q2289P7821p744K28J24401J84863K08563K15984J81319
4354E996589K97891K10432J53436J81053J33754J30915J10974O4460L0452R7999
$$ plain form
4431 4797856 4816519 4917185 5030697 5187312 5440730 5660241 6117181 7028272 8449268 10042576
4421 10042576 11112191 11176985 10370524 9174753 7931411 6925267 6219029 5747884 5393281
4412 5393281 5213395 5002315 4886396 4779594 4675556 4720240 4725024 4750097 4735681 4770815 4718243
4401 4718243 4666805 4641317 4641862 4612318 4592571 4479757 4479950 4500360 4430271 4447449 4495119 4571562
4389 4571562 4594997 4563713 4605249 4585961 4572624 4586531 4511286 4514962 4427227 4351625 4371410 4409200
4377 4409200 4418397 4460919 4585886 4554786 4607583 4660233 4652585 4642205 4647782 4678125 4749591 4765600
4365 4765600 4834201 4928865 5011154 5088975 5081231 5081459 5205860 5390723 5599286 5815270 5996589
4354 5996589 6294480 6504912 6658348 6839401 6973155 7104070 7215044 7279504 7309956 7407955
4344G407955o1162k7897P5989R8114J27901J29240K33873K21601J82878J65375
4334H553867J81979J84618J20136M388J1754L60q926q2560j48021j92817j22218
4323H502560m2998j9950L2650M1480N6768Q0727J39640J10910R9553m9334O8905
4312I020911J12351p1984K5514l2508q0360j3763k8357j14905q7616p1125j4525
4301H643633N0556J29789J20423J62037K43106L03922K80358K21769J94594J80338
4291A0530525R0069R9861P1573J9892J58613J21484J22149J31516R7859J904J29744
4280A1575189J61019L8374J54691J230M0382J48131J55434J19161K6741k4645
4270A2395707j22163j02534k35630k55967j50089j21315j64825j25343q2183n3209
$$ plain form
4344 7407955 7346793 7318896 7394885 7492999 7620900 7750140 7984013 8205614 8388492 8553867
4334 8553867 8735846 8920464 9040600 9044988 9056742 9057102 9048176 8965616 8817595 8624778 8502560
4323 8502560 8459562 8439612 8472262 8513742 8570510 8651237 8790877 8901787 9001340 8952006 9020911
4312 9020911 9133262 9061278 9086792 9054284 8973924 8960161 8931804 8816899 8729283 8658158 8643633
4301 8643633 8694189 8823978 8944401 9106438 9349544 9653466 9933824 10155593 10350187 10530525
4291 10530525 10620594 10720455 10792028 10811920 10970533 11092017 11214166 11345682 11443541 11445445 11575189
4280 11575189 11736208 11774582 11929273 11930503 11970885 12119016 12274450 12393611 12420352 12395707
4270 12395707 12273544 12171010 11935380 11679413 11529324 11408009 11243184 11117841 11035658 10982449
4260A0982449O7325P6210J1128N8482J7363M093m697l7058o0217j04929o0563
4249A0949586N5828L1205l7552l5894p9786j37428R998l5700O707L2840K07601
4238A0967405K89167K19622L65391K30132J95406J48556J7933P5955K7675O547
4228A2543789M0868l662q662j30214j53244r8961r8926j01554j25334q5279K3832
4217A1802653l1758O417j2635J70048K18780J77023J29206L4720M2993O5110l0353
4206A2572204k0158m8847n3618r9408j3881N9143L6810Q6945J45786J69764J34868
4195A2969608J37526J39060J92618K38515K06731K36246L25411L38588L84491
4186A5168794M55063M81583N95493N73658N99287O31425O08636O69038P08864
$$ plain form
4260 10982449 11049774 11125984 11137112 11195594 11212957 11217050 11212353 11175295 11115078 11010149 10949586
4249 10949586 11005414 11036619 10999067 10963173 10883387 10745959 10755957 10720257 10726964 10759804 10967405
4238 10967405 11256572 11476194 11841585 12071717 12267123 12415679 12433612 12509567 12537242 12543789
4228 12543789 12584657 12580995 12572333 12442119 12288875 12189914 12090988 11989434 11864100 11778821 11802653
4217 11802653 11770895 11777312 11764677 11934725 12153505 12330528 12459734 12494454 12537447 12602557 12572204
4206 12572204 12552046 12503199 12449581 12350173 12336292 12395435 12432245 12519190 12664976 12834740 12969608
4195 12969608 13107134 13246194 13438812 13677327 13884058 14120304 14445715 14784303 15168794
4186 15168794 15623857 16105440 16700933 17274591 17873878 18505303 19113939 19782977 20491841
4177B0491841P69833P38767P46030P42444O95758M95446M33988L32528L86572
4168B5833207L81534M81320N13347M89727P24868P85811Q68665R54951R36104
4159C1969534R19654J016870J004398J024340R89107R57269R77744Q65318R46565
4150D0670799R20956R45679R41905J064810J101097J136524J150550J033954Q83225
4141D9849499Q54329Q70312Q66767J050636J479381J663122J855646J845743J568641
4132F1904076J424069J441635J454716J642128J834806J646275J449328R74928
4124G3771961P22288M94507L64045K96031K46342K49907K06547K05545K03538
4115G6760711K82434L67562M96432O95108P97189J000519J305837J515601J814479
$$ plain form
4177 20491841 21261674 22000441 22746471 23488915 24184673 24680119 25114107 25446635 25833207
4168 25833207 26214741 26696061 27209408 27699135 28424003 29209814 30078479 31033430 31969534
4159 31969534 32889188 33906058 34910456 35934796 36923903 37881172 38858916 39724234 40670799
4150 40670799 41591755 42537434 43479339 44544149 45645246 46781770 47932320 48966274 49849499
4141 49849499 50703828 51574140 52440907 53491543 54970924 56634046 58489692 60335435 61904076
4132 61904076 63328145 64769780 66224496 67866624 69701430 71347705 72797033 73771961
4124 73771961 74494249 74988756 75352801 75648832 75895174 76145081 76351628 76557173 76760711
4115 76760711 77043145 77410707 77907139 78602247 79399436 80399955 81705792 83221393 85035872
4106H5035872K040934K141144K308847K723687L210779L672939L922554L854107
4098A08910863L571948K968136K469825K151578J888953J483388J105132P46433
4090A25296256N57005L27108K98629K16914J63343J51824K88645N89577Q28130
4081A28717431J212883J384594J326874J031139M85013j67965o48448r50456q50067
4072A31540998m65525L4810N26321R53778J186798J181763R01292M17479j0194
4063A36267520k42126m42335o64691j048621j630638k219370k442409k463604
4055A25113726k644752k991709l676612m196192m337562l980601l687703l225813
4047I6372782k921838k568888k053847j542152j001418q15261o09374m68488m22506
$$ plain form
4106 85035872 87076806 89217950 91526797 94250484 97461263 101134202 105056756 108910863
4098 108910863 112482811 115450947 117920772 120072350 121961303 123444691 124549823 125296256
4090 125296256 125853261 126180369 126478998 126695912 126859255 127011079 127299724 127889301 128717431
4081 128717431 129930314 131314908 132641782 133672921 134157934 133989969 133341521 132391065 131540998
4072 131540998 131075473 131110283 131636604 132590382 133777180 134958943 135860235 136277714 136267520
4063 136267520 136025394 135583059 134918368 133869747 132239109 130019739 127577330 125113726
4055 125113726 122468974 119477265 115800653 111604461 107266899 103286298 99598595 96372782
4047 96372782 93450944 90882056 88828209 87286057 86284639 85469378 84860004 84391516 83969010
4038H3969010m27928o50140r62068j222419j529762j689556j619225j335548r15361
4029G3617003m33230L5037J19461m20745j175292k106097k817752l118075k953476
4020F0746834k590754k111514j741396j372830j213516j239281j268762j220934
4012D7987847j311827j251449j026835q88557p60440o23869m95230m54990m56370
4003D0718280m22815m90008n70997o86208r04749j085577j274903j459312j398453
3994C2425258j360429j222941j065714q29419o76578n91516n41373m97606l27805
3985B5311877l56857l47554m29908m05542n05549n61746o05958o97907o54040
3976B0746816o01953n46637m92914m28991k97553k58669l26641k75032j54870
$$ plain form
4038 83969010 83541082 82890942 81928874 80706455 79176693 77487137 75867912 74532364 73617003
4029 73617003 73183773 73218810 73338271 72917526 71742234 69636137 66818385 63700310 60746834
4020 60746834 58156080 56044566 54303170 52930340 51716824 50477543 49208781 47987847
4012 47987847 46676020 45424571 44397736 43509179 42748739 42124870 41629640 41174650 40718280
4003 40718280 40295465 39805457 39234460 38548252 37643503 36557926 35283023 33823711 32425258
3994 32425258 31064829 29841888 28776174 27946755 27270177 26678661 26137288 25639682 25311877
3985 25311877 24955020 24607466 24177558 23772016 23266467 22704721 22098763 21400856 20746816
3976 20746816 20144863 19598226 19105312 18676321 18378768 18120099 17793458 17518426 17363556
3967A7363556m9621l9269p5275J3724J5972P7835Q9275J88989J95428J72949Q8767
3956A8042330P0291R2631J25998P3820J4963O5295J03290J53911J49651K48340
3946A9140520K54604L36053K72951K48198L01474K90087L83471L97452M25413
3937B2050223L92219K88781K37410K25269J18128J85154K62053L57353N50843
3928B4667433N30923N43547O42693O12901O37266M98547L75041L34176L16337
3919B9158864L65215M19846M42303N29903N71945P00602P23738Q59647J040192
3910C4812255J078534J069448J182914J156097J176133J259953R97856J071566
3902D3804756J110775J079036J208446J299491J319301J334112J283386J246054
$$ plain form
3967 17363556 17313935 17274666 17199391 17213115 17229087 17306922 17396197 17585186 17780614 17953563 18042330
3956 18042330 18112621 18205252 18331250 18405070 18420033 18485328 18588618 18742529 18892180 19140520
3946 19140520 19395124 19731177 20004128 20252326 20553800 20843887 21227358 21624810 22050223
3937 22050223 22442442 22731223 22968633 23193902 23312030 23497184 23759237 24116590 24667433
3928 24667433 25198356 25741903 26384596 26997497 27634763 28133310 28508351 28842527 29158864
3919 29158864 29524079 29943925 30386228 30916131 31488076 32188678 32912416 33772063 34812255
3910 34812255 35890789 36960237 38143151 39299248 40475381 41735334 42733190 43804756
3902 43804756 44915531 45994567 47203013 48502504 49821805 51155917 52439303 53685357
3894E3685357J058810P37346N89413M58244N24143M79018M68764N22776N03717
3885E9027588N40483N01829L68841K50315J27932k05109o85312j033397j248577
3876E7644593j288090j198345r50381p45158n23700k37474j85931m58247p25748
3867E1331519r73806j251705j283094j302639j240584j120021r08917o85674l06691
3858D2258388r0282J47830K61682K89411K72764J76562j5733k05030l01730m05282
3848D2388580n54221n86946p28356p75488q55893q35244o41004l47931k27807
3839C6835690p433L67445O21984P34696O67032N08706L25689n8388l92297p24009
3829C8879115r38761r71641r76914q95998p13784n68092m28534j70187J47053
$$ plain form
3894 53685357 54744167 55481513 56070926 56529170 57053313 57532331 58001095 58523871 59027588
3885 59027588 59568071 60069900 60438741 60689056 60816988 60611879 59926567 58893170 57644593
3876 57644593 56356503 55158158 54207777 53462619 52938919 52701445 52515514 52057267 51331519
3867 51331519 50357713 49106008 47822914 46520275 45279691 44159670 43250753 42565079 42258388
3858 42258388 42168106 42315936 42577618 42867029 43139793 43316355 43300622 43095592 42793862 42388580
3848 42388580 41834359 41247413 40519057 39743569 38887676 38052432 37411428 37063497 36835690
3839 36835690 36828257 37195702 37817686 38552382 39219414 39728120 40053809 39995421 39603124 38879115
3829 38879115 37940354 36968713 35991799 35095801 34382017 33813925 33385391 33215204 33362257
3820C3362257L05711O12434J001885J211091J435154J570922J542723J386427
3812D2428604J085291O10621M5816l56433p16975r77866r23767q84736o17341
3803C9693214k31002K41166Q97015J643155K311079K779364K892059K845842K574367
3794E5646259J892045J215353J83321q68962j672771k349415k696907k822772
3786D8526151k624372k148761j599405r94151l02809L28651Q61284J190708J339013
3777D4576309J218953R62868O00353M80244L41199N57319Q72239J081096J346994
3768E2037574J680129J992914K515415L081827L442064L525256L169271K378879
3760G3823329J282140K25595p45923j481787k064698k407014k368162k432361
$$ plain form
3820 33362257 33667968 34280402 35282287 36493378 37928532 39499454 41042177 42428604
3812 42428604 43513895 44124516 44170332 43813899 43096924 42119058 41195291 40310555 39693214
3803 39693214 39462212 39703378 40600393 42243548 44554627 47333991 50226050 53071892 55646259
3794 55646259 57538304 58753657 58936978 58068016 56395245 54045830 51348923 48526151
3786 48526151 45901779 43753018 42153613 41159462 40856653 41185304 42046588 43237296 44576309
3777 44576309 45795262 46758130 47358483 47838727 48179926 48737245 49609484 50690580 52037574
3768 52037574 53717703 55710617 58226032 61307859 64749923 68275179 71444450 73823329
3760 73823329 75105469 75331064 74585141 73103354 71038656 68631642 66263480 63831119
3752F3831119k272872k194459k220549k102551j847661j609543j216449j003141
3744D9363894p12607k27275J93610P77837J187508J297770J102443O13480o0595
3735E3536065o13770j289122j874210k288886k375609k308145k064752j661151
3727C9060420j153083o00677l49664q6030j17101k83879o20253r87495j250442
3718C3611796j442678j544666j439833j326434j302612j228746j081916j044572
3710B3200339q97671n81372m34060k99529j87627j49624j58841k41879l12171
3701A9937565k71916l12573j44699O4660K17953L16705L12258K81740O5913j28698
3691B0338908k41498l99694l35532m40688m90683j88129j11626O3582K45292L74327
$$ plain form
3752 63831119 61558247 59363788 57143239 55040688 53193027 51583484 50367035 49363894
3744 49363894 48651287 48424012 48617622 49395459 50582967 51880737 52983180 53596660 53536065
3735 53536065 52922295 51633173 49758963 47470077 45094468 42786323 40721571 39060420
3727 39060420 37907337 37306660 36956996 36870966 36753865 36469986 35849733 34862238 33611796
3718 33611796 32169118 30624452 29184619 27858185 26555573 25326827 24244911 23200339
3710 23200339 22302668 21721296 21287236 20987707 20800080 20650456 20491615 20249736 19937565
3701 19937565 19665649 19353076 19208377 19273037 19490990 19807695 20119953 20401693 20467606 20338908
3691 20338908 20097410 19697716 19362184 18921496 18430813 18242684 18131058 18194640 18439932 18814259
3681A8814259M97314N09713L55062J45235M2684j20831j59960k57360k55451l59833
3671A9210832k20786m59537n35938n48141p13427p45778q10082q86301q09573
3662A3481269q15447q09346n86502m42108l82966l06096l15718k12160p2082o4624
3652I474220p4439r6214n5004n0780j68723p3548k5716j12716n691M9996q494
3641H852891K8394R3706O0521J70795J34429J51470J94602K417M4270J05090l3526
3630I805059j5685J6724L6687q2358l4625m2247j07282J9550N2873J47858P5004
3619I871558j9625J18831O2962P7814k9863j3381M3511k8017l4473o993K1843
3608A0064167Q8864Q4986M7158O1992J30172J15293K40410K55975J93420K05189
$$ plain form
3681 18814259 19311573 19821286 20176348 20321583 20364267 20243436 20083476 19826116 19570665 19210832
3671 19210832 18990046 18530509 17994571 17446430 16733003 15987225 15177143 14290842 13481269
3662 13481269 12665822 11856476 11269974 10827866 10444900 10138804 9823086 9610926 9538844 9474220
3652 9474220 9399781 9303567 9248563 9197783 9029060 8955512 8929796 8817080 8811389 8861385 8852891
3641 8852891 8881285 8974991 9035512 9206307 9340736 9492206 9686808 9689225 9733495 9838585 9805059
3630 9805059 9789374 9806098 9842785 9760427 9725802 9683555 9576273 9595823 9648696 9796554 9871558
3619 9871558 9851933 9970764 10033726 10111540 10081677 10068296 10111807 10083790 10049317 10042324 10064167
3608 10064167 10153031 10238017 10285175 10347167 10477339 10592632 10833042 11089017 11282437 11487626
3598A1487626J22110J09284M5547n6892K69N4336l6846k8131J3809Q4169M4866
3587A1840147k3646P3076J37152K35289K01745J95116K95915K67851L36634L27859
3577A3887138L33091L35802L41505K67792L90578K77793K49138K23292K85837
3568A6591966K64777K99314K95555K41489K73666K43761L34900L85166L55397
3559A9285991L51699L26719M04144L59550M15907M98177M61505N18917M73003
3550B3095612N38329N03831M37277L12701K95437L50645N01124N67197O86625
3541B7288778P47060Q11581Q95120J146862J124979J225357J373117J593117J694546
3532C7900517J769900J981032K016164J960608J873150J752122J689826J579078
$$ plain form
3598 11487626 11609736 11719020 11764567 11707675 11707944 11762280 11725434 11697303 11711112 11795281 11840147
3587 11840147 11816501 11889577 12026729 12262018 12463763 12658879 12954794 13222645 13559279 13887138
3577 13887138 14220229 14556031 14897536 15165328 15555906 15833699 16082837 16306129 16591966
3568 16591966 16856743 17156057 17451612 17693101 17966767 18210528 18545428 18930594 19285991
3559 19285991 19637690 19964409 20368553 20728103 21144010 21642187 22103692 22622609 23095612
3550 23095612 23633941 24137772 24575049 24887750 25183187 25533832 26034956 26602153 27288778
3541 27288778 28035838 28847419 29742539 30889401 32014380 33239737 34612854 36205971 37900517
3532 37900517 39670417 41651449 43667613 45628221 47501371 49253493 50943319 52522397
3524E2522397J472219J280322R62214N26794k1011q60483j678212k273235k647732
3515D9283273k734284k668501k435348k138863j877640j611373j358391j130893
3507C3327980j004488q46112p16788o23961n22787m98195m22722l30160k62022
3498B8100745k32954j61314j75870k57685k78673k31407k27120j50499l37524
3489B6047699k78068k17226m29078m05794l74576n33846n16580m23524l49355
3480B2519652l68355l90017m35050l99509l60675m03395m48005l02891k16554
3471A9195201k76946k88957k78896l47229m18860l11036l28825l23715k16864
3462A6403873l71516l77681l62453l71220k11521k74647k40286j80311j60466
$$ plain form
3524 52522397 53994616 55274938 56237152 56763946 56742935 55882452 54204240 51931005 49283273
3515 49283273 46548989 43880488 41445140 39306277 37428637 35817264 34458873 33327980
3507 33327980 32323492 31477380 30760592 30136631 29613844 29115649 28692927 28362767 28100745
3498 28100745 27867791 27706477 27530607 27272922 26994249 26762842 26535722 26385223 26047699
3489 26047699 25769631 25552405 25123327 24717533 24342957 23809111 23292531 22869007 22519652
3480 22519652 22151297 21761280 21326230 20926721 20566046 20162651 19714646 19411755 19195201
3471 19195201 18918255 18629298 18350402 18003173 17584313 17273277 16944452 16620737 16403873
3462 16403873 16032357 15654676 15292223 14921003 14709482 14434835 14194549 14014238 13853772
3453A3853772o8967o5759o1570k5327k5827l1491o4848K7187L0233K9641J12825
3442A3709869N5039J53685J03597L2219N4362M0708L9001K9469J37516J06384
3432A4461849Q3121J80111K24991K30363J45103R6800Q5799R0947K1577O5549
3422A5686210K4510j05091l4348K3499j72927q5947p3392p1570q0438m2304O2920
3411A5131122K5695N8001J0107p8798j51087k00271j43960j08332j24917l2062
3401A4385498q1136R1180Q4694M1450J33754J78482K06424K79382L02240L15568
3391A5937536L22542L25556L80478M06199L59329M15342L37306K25768J60081
3382A8870137J49018Q0653N8855J35764Q8823J92559K71623L48294M01777M49318
$$ plain form
3453 13853772 13784805 13719046 13657476 13632149 13606322 13574831 13509983 13537170 13567403 13597044 13709869
3442 13709869 13764908 13918593 14022190 14054409 14108771 14149479 14188480 14217949 14355465 14461849
3432 14461849 14544970 14725081 14950072 15180435 15325538 15422338 15508137 15599084 15620661 15686210
3422 15686210 15710720 15605629 15571281 15594780 15421853 15335906 15262514 15190944 15110506 15068202 15131122
3411 15131122 15156817 15214818 15224925 15146127 14995040 14794769 14650809 14542477 14417560 14385498
3401 14385498 14304362 14395542 14480236 14521686 14655440 14833922 15040346 15319728 15621968 15937536
3391 15937536 16260078 16585634 16966112 17372311 17731640 18146982 18484288 18710056 18870137
3382 18870137 19019155 19099808 19158663 19294427 19383250 19575809 19847432 20195726 20597503 21046821
3372B1046821L61983M72659M05397M08004M48777K66321K83425J01904L2557k4776
3362B3803072k2587m5878J52976J33196Q757j03038r9514j86661l46722l53606
3352B2939995l40943k35605j57692K6644K31299L77265N34322P04686O53705O33830
3342B5367506O02102N52035L39552L36867N14411N37764P04871R12696J265866
3333C1133670J608506J677765J893242K121517K404949K752121L276972L909647
3325E0778389M483573M891542N038809M574122L726247K409705Q69934o82072
3317G6090249k335885l558705m447101m919755m914987m711803m141502l670293
3309D3390218l167002k700927k074246j639070j363873r34212o28095k68613l6296
$$ plain form
3372 21046821 21408804 21881463 22286860 22694864 23143641 23409962 23693387 23795291 23827848 23803072
3362 23803072 23780485 23734607 23887583 24020779 24029536 23926498 23826984 23640323 23293601 22939995
3352 22939995 22599052 22363447 22205755 22232399 22463698 22840963 23375285 24079971 24733676 25367506
3342 25367506 25969608 26521643 26861195 27198062 27712473 28250237 28955108 29867804 31133670
3333 31133670 32742176 34419941 36313183 38434700 40839649 43591770 46868742 50778389
3325 50778389 55261962 60153504 65192313 69766435 73492682 75902387 76772321 76090249
3317 76090249 73754364 70195659 65748558 60828803 55913816 51202013 47060511 43390218
3309 43390218 40223216 37522289 35448043 33808973 32445100 31510888 30882793 30614180 30577884
3300C0577884K29385M21099P05475Q32357J077222J390881J773742K083337K267913
3291D1359295K552754K666506K802123K860795K903866L134293K977008K282311
3283F3538951J318961J16600j045568j848298k482787k687540k874586l123497
3275E0912236l222043l123742l068746k854519k534693k132911j751344j499159
3267C0725079j245321r77293o34928m24926j68954k0446N7689j3589J6401J10621
3257B7424333J52429J67329N2215P7138K04052J99656K16725L41821M58401M84147
3247B9778246O37341R90598J634203K424219K941797K743254J754473M89510n08374
3238D2885267o76579m65874M8313P28777J120418J233069J215254J073402J011953
$$ plain form
3300 30577884 30807269 31228368 31933843 32766200 33843422 35234303 37008045 39091382 41359295
3291 41359295 43912049 46578555 49380678 52241473 55145339 58279632 61256640 63538951
3283 63538951 64857912 64974512 63928944 62080646 59597859 56910319 54035733 50912236
3275 50912236 47690193 44566451 41497705 38643186 36108493 33975582 32224238 30725079
3267 30725079 29479758 28502465 27867537 27442611 27273657 27253211 27310900 27297311 27313712 27424333
3257 27424333 27576762 27744091 27796306 27873444 28077496 28277152 28493877 28835698 29294099 29778246
3247 29778246 30415587 31406185 33040388 35464607 38406404 41149658 42904131 43393641 42885267
3238 42885267 42208688 41742814 41791127 42519904 43640322 44873391 46088645 47162047 48174000
3229D8174000J133560J472140J895407K442776L138375L957163M960899O308040
3221G3482360Q236049J0901191J4429298J8437503K1830074K3218588K1394009
3214A91929072J6687170J0682820N364053K724656K408151K774176J990375j345369
3206B33215104p192209j3673776j8826714k1627389k1645163j9499118j6278123
3199A14472612j2715853r548842p190995n592576m712364m271812l936500l786291
3191F2717379l443165l025643k528819j810699j203988n16183J82042R27258J393745
3182E2691927J231013M88120m32997j069025j246479j112157p80855k25327R3829
3173D9638049L06171J35883l35732q93849j171180j384475j358276j040699p27061
$$ plain form
3229 48174000 49307560 50779700 52675107 55117883 58256258 62213421 67174320 73482360
3221 73482360 81718409 92619600 107048898 125486401 147316475 170535063 191929072
3214 191929072 208616242 219299062 224663115 227387771 229795922 232570098 234560473 233215104
3206 233215104 226022895 212349119 193522405 171895016 150249853 130750735 114472612
3199 114472612 101756759 92207917 85016922 79424346 74711982 70440170 66503670 62717379
3191 62717379 59274214 56248571 53719752 51909053 50705065 50188882 50370924 51298182 52691927
3182 52691927 53922940 54411060 53978063 52909038 51662559 50550402 49769547 49544220 49638049
3173 49638049 49944220 50080103 49744371 48850522 47679342 46294867 44936591 43895892 43168831
3164D3168831l92702j52889R7607L24662M19436N62785O46515P33891Q36506P83868
3154D7028510O79934O49187N37108L84031K68522K09784n863J38214K56040L49279
3144E0494746P79771J120180J390562J668625K289961K853657L626215M439084
3136F8662801N494487O712118Q176060R686492J1359076J2650016J3183929J2881885
3128A48806864J1322065Q693062N105072R67757l011781o025289p416697p056458
3120A51384595n147940k126338J711813O471156J1650031J7030765K2213842K6074789
3112B29262713K6836165K2318789J2207722k56831r896677j2607544p938819J527467
3104B61452985J0525724J3608222R412073Q16385p416547j1947470j1890145q241199
$$ plain form
3164 43168831 42776129 42623240 42720847 43045509 43464945 44027730 44674245 45408136 46244642 47028510
3154 47028510 47708444 48357631 48894739 49278770 49547292 49757076 49751213 49889427 50145467 50494746
3144 50494746 51274517 52394697 53785259 55453884 57743845 60597502 64223717 68662801
3136 68662801 74157288 80869406 89045466 98731958 110091034 122741050 135924979 148806864
3128 148806864 160128929 168821991 173927063 174894820 171883039 165857750 158441053 151384595
3120 151384595 146236655 144110317 145822130 152293286 163943317 180974082 203187924 229262713
3112 229262713 256098878 278417667 290625389 290368558 280471881 267864337 259925518 261452985
3104 261452985 271978709 285586931 294999004 295815389 288398842 276451372 264561227 256320028
3096B56320028l404123M39379J759491p6098l466667o074275o362172l941567
3088B35193996j88081K281763J826410j845655p560957j3110117j6332846j5778637
3080A84485876j1949983p146615m231676n206063r093821j3437483j5799079j5644157
3072A01976999j3871195j1424007r120917p275848n805127m765500l858319l216107
3064D2639979k807034k304842j832895j478252j220236r75424q12248q02057q49539
3055B9557452p77031q99040q08985q14666o60552m94237n08880l78955k30304
3046B3984802K8203K43197M21399N67382N50443P4355n89695j045710j557413
3037B2676963j917879j787003j591225j448069j148573q70739o25771n93857m56294
$$ plain form
3096 256320028 252915905 253355284 255114775 255038677 251572010 245497735 239135563 235193996
3088 235193996 235005915 237287678 239114088 237268433 229707476 216597359 200264513 184485876
3080 184485876 172535893 165389278 161157602 155951539 146857718 133420235 117621156 101976999
3072 101976999 88105804 76681797 67560880 60285032 54479905 49714405 45856086 42639979
3064 42639979 39832945 37528103 35695208 34216956 32996720 32021296 31209048 30406991 29557452
3055 29557452 28780421 27881381 27072396 26257730 25597178 25102941 24594061 24215106 23984802
3046 23984802 24013005 24256202 24677601 25244983 25795426 25869781 25280086 24234376 22676963
3037 22676963 20759084 18972081 17380856 15932787 14784214 13913475 13287704 12693847 12237553
3028A2237553l72868k42668k14180k65101m7172N9219Q3542O7726J64203L13111
3018A1783365L90074M56695O30201Q00059Q59453P13752M75638J77964j47456
3009A6139745n71025p66368p80911q28128p99648n21550l70696k68955j51110
3000A1081354O4165L68853N04739P29185Q35853P70089O27514M19093J44970J00065
2990A5645880K30838O71501J037694R13875L81718o11685j542487j993765k073464
2981A2660105j837746j524549j138274p56578o84751n46235k82805k50535k54967
2972E383665k08643r5806r7376m1429n7956j1326O7823J4642J05141J12218L6463
2961E207416N1643J94174L21575M58724N75768O32067N05201K02437k0250l41777
$$ plain form
3028 12237553 11864685 11622017 11407837 11142736 11095564 11154783 11238325 11306051 11470254 11783365
3018 11783365 12173439 12630134 13260335 14060394 14919847 15633599 16109237 16287201 16139745
3009 16139745 15568720 14802352 14021441 13193313 12393665 11872115 11501419 11232464 11081354
3000 11081354 11145519 11514372 12019111 12748296 13584149 14354238 14981752 15400845 15545815 15645880
2990 15645880 15876718 16548219 17585913 18499788 18881506 18269821 16727334 14733569 12660105
2981 12660105 10822359 9297810 8159536 7402958 6718207 6171972 5889167 5638632 5383665
2972 5383665 5175022 5079216 4981840 4940411 4882455 4871129 4938952 4953594 5058735 5170953 5207416
2961 5207416 5259059 5453233 5774808 6233532 6809300 7441367 7946568 8149005 8128755 7786978
2951G786978m86873n20211o11540n31380m43278k98370k76502r8767k9922J63992
2941D654127J50527K85814M78276M26522M11472K29459P2141j71152k86282m52630
2931E798274m33110m77764m06179m22780l65692k22317k48779j27472j80860k04540
2921B708781j75685j38961j30615j29925j51879j01425o8685K1201j8025l450
2911A811332P849k00887r2670r0663j44824n2836p0971m4246n6896l0074l0400
2900A004714j04170J9022o7039r6936M7355N0637q6032q7949k8467O2598m6698
2889F67035l4335j7839p9734J3195n0830k581J6402k0728p7258K005O8227n4074
2877D29485l3853L6848l180o3181K318J2724J0927J09561j5016n2546P7799N509
$$ plain form
2951 7786978 7300105 6779894 6168354 5636974 5193696 4895326 4618824 4520057 4490135 4654127
2941 4654127 4804654 5090468 5568744 5995266 6406738 6636197 6708338 6537186 6250904 5798274
2931 5798274 5365164 4887400 4481221 4058441 3692749 3470432 3221653 3094181 2913321 2708781
2921 2708781 2533096 2394135 2263520 2133595 1981716 1880291 1811606 1832807 1814782 1811332
2911 1811332 1819181 1618294 1525624 1434961 1290137 1237301 1166330 1122084 1065188 1035114 1004714
2900 1004714 900544 919566 852527 755591 802946 853583 767551 679602 651135 713733 667035
2889 667035 632700 614861 535127 548322 497492 494911 511313 490585 413327 415332 483559 429485
2877 429485 395632 432480 429300 366119 368437 381161 392088 501649 486633 434087 511886 517395
2865E17395l4956R5887J41006J76249J97827J29674J20495M0041O9932l9227j20758
2854A293565j47544j35483j21254j02152p9563l6142J7749p5168L4613M0684j1013
2843F78292j2784J1595O465o7121M8631n0511j02044k8239j9925P1730K5063N1721
2831F12873P8117J48444J73191J37770O1519J4077q7761l8533n2300n8667K5953
2820A014683J07914J11972N2211m1609m0550n9035o1896j33248n77k1471j8436
2809I09958J8002J081J929q5441k8616j6276m0520j193k292l9548l8297o9330
2797F09457o4490j15161J936m9279j18564j22340J0440p2081p6545l8781m1043
2786g6451k2599q7437l2991K947j2889R0570J1198l8530o8684p820J3217m1963
$$ plain form
2865 517395 482439 578326 719332 895581 1093408 1223082 1343577 1383618 1453550 1414323 1293565
2854 1293565 1146021 1010538 889284 787132 707569 671427 689176 614008 648621 689305 678292
2843 678292 665508 677103 683568 616447 665078 614567 512523 484284 464359 536089 561152 612873
2831 612873 690990 839434 1012625 1150395 1211914 1225991 1138230 1099697 1047397 988730 1014683
2820 1014683 1122597 1234569 1286780 1245171 1204621 1145586 1083690 950442 949865 928394 909958
2809 909958 927960 929041 930970 845529 816913 800637 760117 758924 756632 717084 678787 609457
2797 609457 544967 429806 431742 382463 263899 141559 151999 79918 3373 -35408 -76451
2786 -76451 -99050 -186487 -219478 -216531 -229420 -138850 -127652 -166182 -234866 -242686 -229469 -271432
2774b71432n6161K652K5454O518j6397p2911p8343l1454N9414r222K1195J5666
2762d05021r55J209k80J5461k0556m138M4636K5530L3593N73n0032n7993j7095
2749d35068j1195R131O876L6375j9532K1635j9139M9479j9929k1271M918K6084
2737c71636j9818l518L1209n6174o6895r356j5850j6457N2750K308L0816j2323
2725d54944o33m197L8328k4665k9168j8041l5133L7410O4463L97k9519o5667N237
2712e16132J8849l7806O6887l173J2821J4182j9250J6701k1475K9048k3842k8325
2700d91515M3881N121L3987Q8675M385j32962L9170J8631p1217m7102j9951L1785
2688d97112O892L6540k1105K6105m8852N8089n3769p1533k0774L0417K3427J9047
$$ plain form
2774 -271432 -327593 -324941 -299487 -292969 -309366 -382277 -460620 -492074 -432660 -441882 -420687 -405021
2762 -405021 -405976 -404767 -405047 -389586 -410142 -414280 -369644 -344114 -310521 -309948 -359980 -417973 -435068
2749 -435068 -446263 -437132 -430256 -393881 -413413 -391778 -410917 -361438 -381367 -402638 -397720 -371636
2737 -371636 -391454 -394972 -363763 -419937 -486832 -496188 -512038 -528495 -475745 -473437 -442621 -454944
2725 -454944 -455577 -459774 -421446 -446111 -475279 -493320 -528453 -491043 -426580 -426183 -455702 -521369 -516132
2712 -516132 -497283 -535089 -468202 -471375 -458554 -444372 -463622 -446921 -468396 -439348 -463190 -491515
2700 -491515 -447634 -442513 -408526 -319851 -315466 -448428 -409258 -390627 -461844 -508946 -528897 -497112
2688 -497112 -490220 -453680 -474785 -448680 -497532 -439443 -493212 -564745 -585519 -555102 -531675 -512628
2676e12628J5152M6234l8826l6787K7429m463N262K9341m1103N0088k0149l2831
2664e13281o0556K0910M6785k9992k1616p3808J1641L7104M6217j6568K0759R8414
2652d33991R2010J3069Q0285Q6778k0543p9807q5714r6344m2440k2047l7711L8486
2640e07969K574j30097M165R210o952O0997m7216P2243J8704j36460L4096J9851
2628f06854L0961K3053l1826j11025N3292R3537M653m2991L98M1005l9182n8525
2616f43504Q7093l1645n84M5674J3410K3522L5340n0768L1294j1081m0241q198
2604e49688L7931l3626k0777l7692n4076k4666P9856M044J9107r628N297J8761
2592e65157m889Q3066j7985n9390K950J7979j0695J4021l5024n1967m0837j1562
$$ plain form
2676 -512628 -497476 -451242 -490068 -526855 -499426 -503889 -498627 -469286 -510389 -460301 -480450 -513281
2664 -513281 -573837 -552927 -506142 -536134 -557750 -631558 -619917 -582813 -536596 -553164 -532405 -433991
2652 -433991 -341981 -328912 -248627 -161849 -182392 -262199 -347913 -444257 -486697 -508744 -546455 -507969
2640 -507969 -505395 -635492 -631327 -622117 -629069 -568072 -615288 -543045 -524341 -660801 -626705 -606854
2628 -606854 -575893 -552840 -584666 -695691 -642399 -548862 -544209 -587200 -586802 -545797 -584979 -643504
2616 -643504 -556411 -588056 -588640 -542966 -529556 -506034 -470694 -521462 -490168 -501249 -541490 -549688
2604 -549688 -511757 -545383 -566160 -603852 -657928 -682594 -602738 -598694 -579587 -589215 -583918 -565157
2592 -565157 -570046 -486980 -504965 -564355 -561405 -543426 -554121 -540100 -575124 -627091 -667928 -679490
2580f79490M4664R6329Q9046n8470o2978R6550K0104L9632J9253l954j19308q6544
2568f05166M7295n483M0490O6683k8887M0222k5613O3373r783l1755l1082l816
2556d83522k4425l358j4060N5568K0576M2693j8160L6001K7326J9138r395m0955
2544c92573l3736L8583J4682m7737O399k494k7415k4334j3333O1026L4203l3747
2532d20476K9537o570o2380R8475R58o6199L7836n9705J2608Q0980J4169m5076
2520c85843k3650Q685M4673m6174N2370J1633p2482L5418P0839k4134l526K1234
2508c10957n9576J4357r045l838L6841j878J1968N0932N5811m08K9733m310K940
2495a87430Q259L389j0150L9783m2712O0724l2028n9634J361k5172K3653J0231
$$ plain form
2580 -679490 -634826 -538497 -449451 -507921 -570899 -474349 -454245 -414613 -395360 -399314 -518622 -605166
2568 -605166 -557871 -563354 -522864 -456181 -485068 -444846 -470459 -407086 -416869 -448624 -479706 -483522
2556 -483522 -507947 -511305 -525365 -469797 -449221 -406528 -424688 -388687 -361361 -342223 -351618 -392573
2544 -392573 -426309 -387726 -373044 -420781 -414382 -416876 -444291 -468625 -481958 -420932 -386729 -420476
2532 -420476 -390939 -397509 -459889 -361414 -360456 -426655 -388819 -448524 -435916 -354936 -340767 -385843
2520 -385843 -409493 -400808 -356135 -402309 -349939 -338306 -410788 -375370 -304531 -328665 -332191 -310957
2508 -310957 -370533 -356176 -365221 -369059 -332218 -334096 -322128 -271196 -215385 -215793 -186060 -190370 -187430
2495 -187430 -179171 -175782 -185932 -146149 -188861 -128137 -160165 -219799 -218438 -243610 -219957 -209726
2483b09726J7222P309l684M6336p719R8342P387j6390J3739l5105l8060K0714
2471i9635P1126k1416M4144j9143m7291M1927J9193k0184N5091M9038L4747N6012
2459A63609l327m9648M3008J7219P738J7383l6843l0733l2471P0433K5625Q571
2447B00564M2002Q2591N3612J5538o788p0190l761R2155r432J7975Q2021K0445
2435E16732N2771J7566O1321K673m6161q108R7618L5191Q257J27752L2623l0128
2423H68107M8908P3470O3075J7768J14779P7096J3695R645L5761J26433J40883
2412A589620P0979J25806J79068R6886J50063J74451K34823J83762K85208L37784
2402C428450L77621M92457P16369R25715P63039N87000L83922K27820L25101O59199
$$ plain form
2483 -209726 -192504 -185195 -188879 -142543 -150262 -51920 -44533 -60923 -47184 -82289 -120349 -99635
2471 -99635 -28509 -49925 -5781 -24924 -72215 -30288 -11095 -31279 23812 72850 107597 163609
2459 163609 160282 110634 153642 170861 178599 195982 159139 128406 95935 166368 191993 200564
2447 200564 242566 325157 378769 394307 387519 317329 313568 405723 396291 414266 496287 516732
2435 516732 569503 587069 648390 651063 604902 596794 694412 729603 737860 865612 898235 868107
2423 868107 917015 990485 1053560 1071328 1186107 1263203 1276898 1286543 1322304 1448737 1589620
2412 1589620 1660599 1786405 1965473 2062359 2212422 2386873 2621696 2805458 3090666 3428450
2402 3428450 3806071 4298528 5014897 5940612 6703651 7290651 7674573 7902393 8227494 8886693
2392H886693Q97988J110380J511313K041137K609070M275784R118659J7675559
2384D8126583K2586983J6960987K237042j0864119j6658558j5928826j2173738
2377C4286354q875933o419033m965706l488376k577861j685955q11001k03358
2369E259131K8549Q7761l07564m76637n96208n95338n19551m01220k82342k53081
2359A943500j90479j03063j01062n0909o8235p5465o0755q5195q4039j39037j06866
2348H78395l6878n7422l106j8096o6119l4683m3813n1053p0369n1076j5889p9610
2336C50281R466k1696o2244n1259p0442K984M310L0679j4168j7308q2113n9318
2324A9172j1j824j4283j3359n3422j734J1939j6145R002m2873M111l8480n0445
$$ plain form
2392 8886693 9784681 10895061 12406374 14447511 17056581 21332365 30451024 48126583
2384 48126583 70713566 87674553 89911595 79047476 62388918 46460092 34286354
2377 34286354 25410421 18991388 14025682 10537306 7959445 6273490 5462489 5259131
2369 5259131 5287680 5375441 5067877 4591240 3995032 3399694 2880143 2478923 2196581 1943500
2359 1943500 1753021 1649958 1548896 1497987 1429752 1354287 1293532 1208337 1124298 985261 878395
2348 878395 841517 784095 780989 762893 696774 662091 618278 567225 496856 445780 429891 350281
2336 350281 359747 338051 275807 224548 154106 157090 161400 192079 177911 160603 78490 19172
2324 19172 19161 17337 3054 -10305 -63727 -65461 -53522 -69667 -60665 -103538 -99427 -137907 -188352
2311a88352M3643l1582K9237j07587n6790J257m8684O1286N1227j5477l2107K0144
2299b73785M316M8534l6289n0199l2942k4189l953m6422M6892l1701K2195N0054
2287c27489J3167J3571l4563m6149k5752O3944Q9048k1814q0538p485Q4684J5706
2275b63670k6618q290p2063m0025L5299j0881o7721O2404N2404m4671l0494l5580
2263d49906k2680Q8208M7798m5274j000L2329O640o071L4340n0263k5987m793
2251c96659j9988M4047p393K507K9120M981K8357q9186k1895M9100k9498o706
2239d13213R838m2556m0937p05j6921m1820n9697M9748K365K6459L0380K257P645
2226d87157j6313N0213o2901K8311j4228j4118R061l0413M8264j4712o4724N283
$$ plain form
2311 -188352 -144709 -176291 -147054 -254641 -311431 -310174 -358858 -297572 -246345 -261822 -293929 -273785
2299 -273785 -269469 -220935 -257224 -307423 -340365 -364554 -368507 -414929 -368037 -399738 -377543 -327489
2287 -327489 -314322 -300751 -335314 -381463 -407215 -343271 -254223 -276037 -356575 -364060 -279376 -263670
2275 -263670 -290288 -298578 -370641 -410666 -375367 -386248 -453969 -391565 -339161 -383832 -414326 -449906
2263 -449906 -472586 -384378 -336580 -381854 -382854 -350525 -343885 -349956 -315616 -365879 -391866 -396659
2251 -396659 -416647 -372600 -379993 -377486 -348366 -343385 -315028 -404214 -426109 -377009 -406507 -413213
2239 -413213 -403375 -445931 -486868 -487573 -504494 -546314 -606011 -556263 -553898 -527439 -497059 -494802 -487157
2226 -487157 -503470 -453257 -516158 -487847 -502075 -516193 -507132 -537545 -489281 -503993 -568717 -563434
2214e63434N6600n2355L7777o7688k879M9967k3328L9723M0954n8079j9050N4882
2202e06910L3513q408j0265j2668Q524O8068J9375l7456o5303J237L4976L0065
2190d45252l0615m6421J01588K6727n7858j8323K1164o9519j5154L2927Q605M0552
2178d51579j5043J975P019K7051o6210j7628N3381n6921l5548k8350M8951M5193
2166d87709k339P625M5906n8435J683J2354j4989J3175q8972K5536O5359R481
2154d71325J6959n984M193m3339p7894l0854o972R9234q005P109j1808N526M1648
2141d81512l3600M2315N6578j9064L2283m0834m086k8027O6030l4093m3603N6220
2129d31393J6867o008l49K2532q56l143r67l560m3079N1300K2350N9334m8669
$$ plain form
2214 -563434 -506834 -559189 -521412 -589100 -591979 -542012 -565340 -525617 -484663 -542742 -561792 -506910
2202 -506910 -473397 -481805 -492070 -504738 -496214 -428146 -408771 -446227 -511530 -510293 -475317 -445252
2190 -445252 -475867 -522288 -420700 -393973 -451831 -470154 -448990 -518509 -533663 -500736 -492131 -451579
2178 -451579 -466622 -464647 -457628 -430577 -496787 -514415 -461034 -517955 -553503 -581853 -532902 -487709
2166 -487709 -490048 -482423 -436517 -494952 -493269 -480915 -495904 -482729 -571701 -546165 -480806 -471325
2154 -471325 -454366 -460350 -456157 -499496 -577390 -608244 -615216 -515982 -523987 -516878 -528686 -523160 -481512
2141 -481512 -515112 -472797 -416219 -435283 -403000 -443834 -447920 -475947 -409917 -444010 -487613 -431393
2129 -431393 -414526 -420534 -420883 -398351 -399207 -402350 -403317 -406877 -449956 -398656 -376306 -316972 -365641
2116c65641M5670J00443J26400N1574q5729n5812m6529L3628j40052n3764n6326
2105d46138k0357K3410Q782m1951O150O441J1187j4309j3871M158J9040M16k2838
2092d79880j0157j2998Q295O3046k1757n9515M8083j5118k8988K8544J4435m6598
2080e12608J6400M5557L2157j8968q6606K6166P9825j8648J1792k305k0667j4114
2068d62019K4517l7150k1019J0313K1466j9539J3610J2228K2526J5708o8980k7455
2056e15794L0240l173j1352J7181N0911P5536P51m4756J7445m7235j1177j1940
2044d53363K9495j1070j0310n2610M0140J7053L6686l0041j0593l1231L8184K6266
2032d11394l7562m6911N1175M6268n7466K3857J2689J5925l0429m5423J1576N329
$$ plain form
2116 -365641 -319971 -219528 -93128 -41554 -127283 -183095 -229624 -195996 -336048 -389812 -446138
2105 -446138 -466495 -443085 -434303 -476254 -470104 -463663 -452476 -466785 -480656 -476498 -457458 -457042 -479880
2092 -479880 -490037 -503035 -494740 -431694 -453451 -512966 -464883 -480001 -508989 -480445 -466010 -512608
2080 -512608 -496208 -450651 -418494 -437462 -524068 -497902 -418077 -436725 -424933 -427238 -447905 -462019
2068 -462019 -437502 -474652 -495671 -485358 -463892 -483431 -469821 -457593 -435067 -419359 -488339 -515794
2056 -515794 -485554 -488727 -500079 -482898 -431987 -356451 -355700 -400456 -383011 -430246 -441423 -453363
2044 -453363 -423868 -434938 -445248 -497858 -457718 -440665 -403979 -434020 -444613 -475844 -437660 -411394
2032 -411394 -448956 -495867 -444692 -398424 -455890 -432033 -419344 -403419 -433848 -479271 -467695 -462366
2020d62366J6421M5678K6793j0080m6511p899q073M697l5363M3647J9215J6874
2008c96967P439p4591n525M5806J0050n3918k2634K9293K7599k5508o721J12654
1996c53023L50n3110n308N4055n1610l6238N203J0374n6873N1118N6361j3585
1984c92286J1277k8466Q184l393K0987j8236j1118J7745J4136k1041K4587m6070
1972d23694l570L6419J3389K23o0567M8369j0470k8214Q967K4227k220J7228q556
1959c88469K177l420J2445n4172J9692M231l35M555r420K5294J8550m7203J6003
1946d00072J4728k5377l6086M1081k6299o157N0206K9669o1776J6078m6767m2360
1934d93132K6766N6073j0792o2378J2586n3559L2806L0363J29679L3760K240L326
$$ plain form
2020 -462366 -445945 -400267 -373474 -383554 -430065 -437964 -446037 -441340 -476703 -433056 -413841 -396967
2008 -396967 -389528 -464119 -469644 -423838 -413788 -467706 -490340 -461047 -433448 -458956 -465677 -353023
1996 -353023 -352673 -405783 -411091 -357036 -408646 -444884 -439681 -429307 -486180 -435062 -378701 -392286
1984 -392286 -381009 -409475 -401291 -404684 -383697 -401933 -413051 -395306 -381170 -402211 -377624 -423694
1972 -423694 -427264 -390845 -377456 -377233 -437800 -389431 -399901 -428115 -419148 -394921 -397141 -379913 -388469
1959 -388469 -386292 -389712 -377267 -431439 -411747 -407516 -407851 -403296 -412716 -387422 -368872 -416075 -400072
1946 -400072 -385344 -410721 -446807 -405726 -432025 -438182 -387976 -358307 -420083 -404005 -450772 -493132
1934 -493132 -466366 -410293 -421085 -483463 -470877 -524436 -491630 -461267 -331588 -297828 -295588 -292262
1922b92262p4286K6237l3234R096m3000J1885O3167J6578m7338m1727L6076l8449
1910d07257r569J9248M4314j193o0459n2421n1264O2820J6095q770J2140k1714
1898d58030L5046o419M6684Q995l2333K3945K4154P139l5065K0462M5871n3643
1886c73194N2208p9895K100j6381M7624K393l20K3364k8103n8631M9185N6000
1874c23650o0353k1468L1828j1831M2033K9639j8646J110N018l4842N238m6460
1862d02384k5291O3980j2064j634M5883o6052N1515N0395j9589j6206j7271r670
1850c58388N2338k1012k9015j0871L3525K8137j6379j12095Q0158k6275p0219
1839d50096Q9382O225o9291M690O3067J5025p657n8823O0775m1774K396N029K6238
$$ plain form
1922 -292262 -366548 -340311 -373545 -364449 -407449 -395564 -332397 -315819 -363157 -404884 -368808 -407257
1910 -407257 -416826 -397578 -353264 -354457 -414916 -467337 -518601 -455781 -439686 -448456 -436316 -458030
1898 -458030 -422984 -429403 -382719 -373724 -406057 -382112 -357958 -350819 -385884 -365422 -319551 -373194
1886 -373194 -320986 -400881 -398781 -415162 -367538 -365145 -365465 -342101 -370204 -428835 -379650 -323650
1874 -323650 -384003 -405471 -373643 -385474 -343441 -313802 -332448 -331338 -326320 -361162 -355924 -402384
1862 -402384 -427675 -363695 -375759 -377393 -331510 -397562 -346047 -295652 -315241 -331447 -348718 -358388
1850 -358388 -306050 -327062 -356077 -366948 -333423 -305286 -321665 -433760 -353602 -379877 -450096
1839 -450096 -360714 -354489 -423780 -419090 -356023 -340998 -348655 -407478 -346703 -388477 -386081 -381052 -354814
1826c54814l3408K069K8662m8718N3028L6527L2059J3479P41N524m7079K6888
1814b85042k5220O4103j1118k5231l608j7640n726k2218m9735p223l1602O8873
1802c51387l4979M5411K8512m0778K0735m7681L215K0577L1507L2578j8257K0835
1790b89712q1345k3212K3702J7319k6977m0397N1422n032R637J7824j7640j5198
1778c79609j0325J0684P0752k5021J1133J4742j6041J5521J9156q238m2045R741
1766c29550K3954k1538O1861j7805p4969J3215P42N1511p8140m6486l476R5168
1754c25513J3835P0059j1191J0721n0322L8230j24453n867L7916l3947K0202N443
1742c54887k4504l089Q8259J9679k6929k0904N7668k7722j9370n4922J7839j8510
$$ plain form
1826 -354814 -388222 -386153 -357491 -406209 -353181 -316654 -284595 -271116 -270375 -264851 -311930 -285042
1814 -285042 -310262 -246159 -257277 -282508 -286116 -303756 -309482 -331700 -381435 -388658 -420260 -351387
1802 -351387 -386366 -340955 -312443 -353221 -332486 -380167 -376952 -356375 -324868 -292290 -310547 -289712
1790 -289712 -371057 -394269 -370567 -353248 -380225 -420622 -369200 -374232 -364595 -346771 -364411 -379609
1778 -379609 -389934 -379250 -308498 -333519 -322386 -307644 -323685 -308164 -289008 -297246 -339291 -329550
1766 -329550 -305596 -327134 -265273 -283078 -358047 -344832 -344090 -292579 -370719 -417205 -420681 -325513
1754 -325513 -311678 -241619 -252810 -242089 -292411 -254181 -378634 -384501 -346585 -380532 -360330 -354887
1742 -354887 -379391 -382480 -294221 -274542 -301471 -322375 -264707 -292429 -311799 -366721 -348882 -367392
1730c67392O4148l7013m8331m142L1763J3466J5398j6906J164L28P0250n5152
1718c32419j594p499L7759j439j0232J6012K530p10L3211P71n0461J6079K4786
1705b73206K7256K5800m3091k9937k3760j1101M0113k4002m1740M6879n1470K6659
1693c31600N8555q614j7754q1739J6027M1642r932P83O0969K9695K7057j3368
1681b28279j4344L1284p4161k5498J2455k5055J7220O436J1402l1137j3498q560
1669c41735J8117N5790J9923J4056q971k8495o0078j9O3498r79l1582J2745N887
1656b81843K458Q2627O8885p3077l0395O747r46N2697P884m1780k5934O4237j8646
1643a87086q0477j4529K6550q025L089N6391j3872J6479o1002k8632K8348L1267
$$ plain form
1730 -367392 -303244 -340257 -388588 -392730 -360967 -347501 -332103 -349009 -347845 -347517 -277267 -332419
1718 -332419 -334013 -341512 -303753 -305192 -315424 -299412 -296882 -297592 -264381 -263610 -314071 -297992 -273206
1705 -273206 -245950 -220150 -263241 -293178 -316938 -328039 -287926 -311928 -353668 -306789 -358259 -331600
1693 -331600 -273045 -281659 -299413 -381152 -365125 -323483 -333415 -332632 -271663 -241968 -214911 -228279
1681 -228279 -242623 -211339 -285500 -310998 -298543 -323598 -306378 -299942 -288540 -319677 -333175 -341735
1669 -341735 -323618 -267828 -247905 -233849 -242820 -271315 -331393 -331412 -267914 -268893 -300475 -287730 -281843
1656 -281843 -279385 -196758 -127873 -200950 -231345 -224598 -225544 -172847 -164963 -206743 -232677 -168440 -187086
1643 -187086 -267563 -282092 -255542 -263567 -260478 -204087 -217959 -201480 -262482 -291114 -262766 -231499
1631b31499J5126o7721K3943l3629K0173p8346M5211j0173J5001J07148l2724
1620b27490J4027j5811o596p31m1811K8831J9376o85M9070r512m4209k1842N1011
1607b06372K3960J513k7387m7952n2987P8506Q4095n893l9029l1315j5134j4973
1595b52968L1786J5760Q281N666n0647k9574N8949M5637n9067q5945o869J6004
1583c02987P0011n5044m4672K7574J2221m582J8562o227P826o806m3673l0756
1571c58553N603o402m5778M6154N9895L6397J5450J3704L6835j2455l955J7157
1559a95948n317j5942L3604j7603L7632k662m3525l5559r5523M0809J6115o513
1547b90432k7295O9443M4370k4578m3613N593O28J2072j4151K9727L3098j0714
$$ plain form
1631 -231499 -216373 -284094 -260151 -293780 -273607 -351953 -306742 -316915 -301914 -194766 -227490
1620 -227490 -213463 -229274 -235870 -236601 -278412 -249581 -230205 -230890 -181820 -191332 -235541 -257383 -206372
1607 -206372 -182412 -180899 -208286 -256238 -309225 -230719 -146624 -152517 -191546 -222861 -237995 -252968
1595 -252968 -221182 -205422 -197141 -191475 -242122 -271696 -212747 -167110 -226177 -312122 -318991 -302987
1583 -302987 -232976 -288020 -332692 -305118 -292897 -297479 -278917 -285144 -277318 -284124 -327797 -358553
1571 -358553 -352950 -359352 -405130 -358976 -299081 -262684 -247234 -233530 -196695 -209150 -213105 -195948
1559 -195948 -201265 -217207 -183603 -201206 -163574 -166236 -209761 -245320 -340843 -300034 -283919 -290432
1547 -290432 -317727 -248284 -203914 -228492 -272105 -266512 -265884 -253812 -267963 -238236 -205138 -215852
1535b15852M7827j1376J0431K490k6697P1273m0325p5000O685q734J1982l529
1523b30825K3235K0965L4460L7074j10655m3634J0044Q1257p256j3039J0470n5745
1511b43649J5462j8602j594M3625N0482l4873k1131k0226O2610n5892P7120j8034
1499a64702o4586l9962L4435j0695o8738J1239L8127L5004K2496m4134J5707Q813
1487b26996j9156K4593K5293k9911N3160K6210m1451k4929l9422l6489N1141O4805
1475a73152J68p236m9648K6120k6749L99J9373O3807r8562K0323k0629n579k984
1462b54349j5417O643M5623R566Q018j971N155o627M6986q102m8850j7938J7520
1449b13743Q2327m7525j4233L4284m1133M8639L2726o1535n9960P992j506R8611
$$ plain form
1535 -215852 -168025 -179401 -168970 -166480 -193177 -121904 -162229 -237229 -230544 -239278 -227296 -230825
1523 -230825 -207590 -186625 -152165 -115091 -225746 -269380 -259336 -178079 -185335 -198374 -187904 -243649
1511 -243649 -228187 -246789 -248383 -204758 -154276 -189149 -210280 -230506 -167896 -223788 -146668 -164702
1499 -164702 -229288 -269250 -234815 -245510 -314248 -303009 -264882 -229878 -207382 -251516 -235809 -226996
1487 -226996 -246152 -221559 -196266 -226177 -173017 -146807 -188258 -213187 -252609 -289098 -237957 -173152
1475 -173152 -172984 -180220 -229868 -203748 -230497 -230098 -210725 -146918 -245480 -225157 -245786 -251365 -254349
1462 -254349 -269766 -263123 -217500 -207934 -199916 -201887 -196732 -203359 -156373 -164475 -213325 -231263 -213743
1449 -213743 -131416 -178941 -193174 -158890 -200023 -151384 -118658 -180193 -240153 -232161 -233667 -135056
1437a35056K072n9748L2522k062K4351n8516o23m90J9459M9845m564L3158j2130
1424a11782l4902m5813j2822r642J8768N8121J622r844n2476N8347k4923m891
1412a70237J7106J8307R396J7022N664j5637m0105n7188K7370L0726L9762j387
1400a19201o3485J4664l585k089N0492o0386p6516O1693o475J614J289L4223j2455
1387a80217k3915M213N637p4308L0328Q5185k3146N4709n8769j0868L0719L292
1375a57140n514M6531P277k4191p3115K5451k123L4172m2886N8429k6370k4294
1363a83773J7266J999K0026J1945o347P995P121k3048k7408j316L9100m4157J5099
1350a65498K1096P222l9782J4505m6207K155K9144O628n6306M1936K3759J7123
$$ plain form
1437 -135056 -132984 -192732 -160210 -162272 -137921 -196437 -197060 -197550 -178091 -128246 -132810 -99652 -111782
1424 -111782 -146684 -192497 -205319 -214961 -196193 -138072 -136450 -146294 -198770 -140423 -165346 -170237
1412 -170237 -153131 -134824 -125428 -108406 -102742 -118379 -158484 -215672 -188302 -157576 -117814 -119201
1400 -119201 -182686 -168022 -171607 -173696 -123204 -183590 -260106 -198413 -204888 -203274 -201985 -167762 -180217
1387 -180217 -204132 -199919 -194282 -268590 -238262 -153077 -176223 -121514 -180283 -191151 -160432 -157140
1375 -157140 -162654 -116123 -108846 -133037 -206152 -180701 -182824 -148652 -191538 -133109 -159479 -183773
1363 -183773 -166507 -164508 -144482 -132537 -138884 -130889 -123768 -146816 -174224 -175540 -136440 -180597 -165498
1350 -165498 -144402 -137180 -176962 -162457 -208664 -206509 -177365 -170737 -227043 -185107 -161348 -144225
1338a44225M3418K4391j11183L8007p278m5269m9135L3619L2268J9903r180J5088
1326a59576J7070p290M1558l3800o977J4635L5422k9996j10795M1523P5796o3826
1314a86256K2429K1026q1349J213N6140J5684m7125n4023N5420O3904J0242J9418
1302a03277l1235j0849p855n5460Q210m4132l795L2637K2572J4011O2584M993
1290a11596l1978n8603P1138O412O70k3542j9499N4770j0440p0229L0289K2532
1278a40076K4283K7528j3195o1906J4689n235J5988L5961K759O572k9444Q968
1266a13108k5566M0454j5347n8812l4343R263O0546N7834o065l2041K7j9593m4207
1253a80958L4446P3064o827l3299K8569n5253l3440n319j5512m4748O8849O6390
$$ plain form
1338 -144225 -100807 -76416 -187599 -149592 -156870 -202139 -251274 -217655 -185387 -165484 -174664 -159576
1326 -159576 -142506 -149796 -108238 -142038 -149015 -134380 -98958 -128954 -239749 -198226 -122430 -186256
1314 -186256 -163827 -142801 -224150 -222937 -166797 -151113 -198238 -252261 -196841 -132937 -122695 -103277
1302 -103277 -134512 -145361 -153216 -208676 -200466 -244598 -248393 -215756 -193184 -179173 -116589 -111596
1290 -111596 -143574 -202177 -131039 -124627 -123957 -147499 -166998 -112228 -122668 -192897 -162608 -140076
1278 -140076 -115793 -88265 -101460 -163366 -148677 -153912 -137924 -101963 -99204 -92632 -122076 -113108
1266 -113108 -138674 -98220 -113567 -172379 -206722 -197459 -136913 -79079 -85144 -117185 -117158 -136751 -180958
1253 -180958 -146512 -73448 -80275 -113574 -85005 -140258 -173698 -179017 -194529 -239277 -170428 -104038
1241a04038N7229p6661o7537L2895K1376K2317j606n8268o0656M4659N9090l4385
1229a65585M8416M889K5860j1938m4258L0828k5967P2198J919m1297k9064j5947
1217a49946m3427N6264m9177K9015j080k6325J5732q898k6341J07633K076m660
1205i9134L8691j6026m2878J3990K2455m2073o529O2148j4643j1762K4404n7786
1193a29143K1386j6927L4778P389k8801J2647J2283l1453k6026j4590M1651P794
1181a09012L7510k0245l8132p493N2629m8618J14568k5867j11319p733P9228P046
1169g7438p1011j5L7571k4353R059Q5150p3857J3157k2390k4575L1705j225m669
1156a22891J9584l4867L5297q602o7014J5743n502L4851L2511q2506P6343j5432
$$ plain form
1241 -104038 -46809 -123470 -191007 -158112 -136736 -114419 -116025 -174293 -234949 -190290 -131200 -165585
1229 -165585 -117169 -112280 -86420 -98358 -142616 -111788 -137755 -65557 -63638 -104935 -133999 -149946
1217 -149946 -193373 -137109 -186286 -157271 -158351 -184676 -168944 -177842 -204183 -96550 -94474 -99134
1205 -99134 -60443 -76469 -119347 -105357 -82902 -124975 -131504 -69356 -83999 -95761 -71357 -129143
1193 -129143 -107757 -124684 -89906 -82517 -111318 -98671 -86388 -117841 -143867 -158457 -116806 -109012
1181 -109012 -71502 -91747 -129879 -137372 -84743 -133361 -18793 -44660 -155979 -163712 -84484 -77438
1169 -77438 -148449 -148464 -110893 -135246 -126187 -41037 -114894 -101737 -124127 -148702 -116997 -118222 -122891
1156 -122891 -103307 -138174 -102877 -111479 -178493 -162750 -168252 -133401 -100890 -183396 -107053 -122485
1144a22485L0187j7466L2033O858K8773k1614n9045m5712J2208M8319K3559j4418
1132i8803q6571K2041L4776J232K925N0007j579p4876L2446K8301Q093n01l0940
1119a13449M1106K916j6986r7781J5315M8946L6346J366l9135k9413L2496j9592
1107a37865M1981l9877J9623N0155K0137P4122r081p5763k4157J2044L0843p8762
1095a16600j7757J5160k2163O4293r972M378P707L9414Q513l1585P5833Q84l2339
1082a4234p4387m4728N6441l2478n3768J8290K350k3999O6387j2505l5841L8214
1070a10258j0361J3998M9345L5421k3569j9432K1269q704n5188J3202O3276m2739
1058g3740o5728K1288J917M4566J4071M8173p197k1543L2361m0078P542L7310
$$ plain form
1144 -122485 -92298 -109764 -77731 -70873 -42100 -63714 -122759 -168471 -156263 -107944 -84385 -98803
1132 -98803 -185374 -163333 -128557 -127325 -124400 -74393 -75972 -150848 -118402 -90101 -82008 -82509 -113449
1119 -113449 -72343 -69427 -86413 -184194 -168879 -119933 -83587 -82221 -121356 -150769 -118273 -137865
1107 -137865 -95884 -135761 -116138 -65983 -45846 28276 19195 -56568 -80725 -68681 -37838 -116600
1095 -116600 -134357 -119197 -141360 -77067 -87039 -82661 -74954 -35540 -27027 -58612 17221 18105 -14234
1082 -14234 -88621 -133349 -76908 -109386 -163154 -144864 -142514 -166513 -100126 -112631 -148472 -110258
1070 -110258 -120619 -106621 -57276 -21855 -45424 -64856 -43587 -52291 -107479 -94277 -31001 -73740
1058 -73740 -139468 -118180 -116263 -71697 -57626 -9453 -16650 -38193 -5832 -45910 -38368 -1058
1046a058l3025n8928l1441P5439K2420n5788n6015m430k7718N1979O8647o5946
1034a15864K4188K4441j8997L8367o662n7192j4001M6619J5438J5568R739o4141
1022a02497j5101J0202K0094L2291L5446l541j352K3687J7878r5213O3841J9278
1010E013P475n6289l6985N3588l9451k3667M931n469L6304K7399L2902k9226O081
997a7394k3734L2683j4877K3679J0276L8071l476m0692r803O8554n1490o2525
985e0728q18K2235l0557L0203J1315M524K1993k1323L4935n7432J5661l8698j775
972f0465J3659Q6780j4301m3715l839k8534L2271O751k0152K4672m3691m1433
960i1997j5752Q258Q9046Q6469m3414N990m1039J8546J0078j5878P945l8215l956
$$ plain form
1046 -1058 -34083 -93011 -124452 -49013 -26593 -82381 -138396 -142826 -170544 -118565 -49918 -115864
1034 -115864 -91676 -67235 -86232 -47865 -54527 -111719 -125720 -79101 -63663 -48095 -38356 -102497
1022 -102497 -117598 -107396 -87302 -55011 -19565 -23106 -24458 -771 17107 -78106 -14265 5013
1010 5013 12488 -43801 -80786 -27198 -66649 -90316 -85385 -90854 -54550 -27151 5751 -23475 -17394
997 -17394 -41128 -8445 -23322 357 10633 48704 45228 4536 -5267 63287 11797 -50728
985 -50728 -51546 -29311 -59868 -29665 -18350 -13826 8167 -13156 21779 -35653 -19992 -58690 -60465
972 -60465 -46806 39974 25673 -18042 -21881 -50415 -18144 -11393 -31545 -6873 -50564 -91997
960 -91997 -107749 -99491 -10445 76024 32610 38600 -2439 16107 26185 10307 18252 -19963 -23919
947b3919M0349j14240K0719O0231M1654l8398k1363k7875O2842J336j5968q578
935b3210j2008J6707m8866J4196Q382j6411l5801Q1268j4702j4282l7791J6020
923f6498L0311P797j4485M7741p902l7022n404N1866m8329k6118K1828l2286K6076
910e2425J09948j5674k4106j4919L3855M342M0991j9477p2526k7711j924J3129
898b6497l4259J0971L9700K2657n1478K6621L3931P5399l2088N868j02446O1630
886C0009O0546l1659k4713j0517m5585j7434J9145o4854n274M0354K5269m8866
874g3579L3947M3423k0927n0J7220l9236M9205L7608N674m4240o2912N4743m0609
861c9733j9390k6769R6687L248m7799k8865M9861l7030l3448J00344n95m1625
$$ plain form
947 -23919 16430 -97810 -77091 -16860 24794 -13604 -34967 -62842 0 1336 -14632 -23210
935 -23210 -35218 -18511 -67377 -53181 -44799 -61210 -97011 -15743 -30445 -44727 -82518 -66498
923 -66498 -36187 -28390 -42875 4866 -3036 -40058 -45462 6404 -41925 -68043 -46215 -78501 -52425
910 -52425 57523 41849 17743 2824 36679 41021 82012 62535 -9991 -37702 -39626 -26497
898 -26497 -60756 -49785 -10085 12572 -38906 -12285 21646 97045 64957 70825 -31621 30009
886 30009 90555 58896 34183 23666 -21919 -39353 -20208 -85062 -90336 -49982 -24713 -73579
874 -73579 -39632 3791 -17136 -17186 34 -39202 10003 47611 53285 9045 -53867 876 -39733
861 -39733 -59123 -85892 10795 14043 -33756 -62621 -12760 -49790 -83238 17106 16511 -25114
849b5114j1568r312k9991K7164J3547K3034N8329L7399L3230J783l2660K088n7744
836C0185l0872k6896K7646J0967P762M2806J8028r8822K9385K3100K220p0k5374
823A0065K3784m632J7616J6328Q420l4103J7645J1528k6285p8773J321J02743
811F5657n794l3678n491k9062q791M8716m5606P144M839J2207j7256k4883L4171
798B173R3549k4185k4239j895l4308L140p1301J0306O8933n9381j2287L5251M0749
785B6505l6937K3959j4089J1861L5597j6576K3452J263p49m7059K1765o1384j7548
772d9940N2359j357K0955j0122j3640j3427J2385O1968K2159j2367j2139m6869
760I965L7659k884Q228L1232r756m2157l6497N0911j3517p103l9692L2678m2717
$$ plain form
849 -25114 -36682 -45994 -75985 -48821 -35274 -12240 46089 83488 116718 118501 85841 87929 30185
836 30185 -687 -27583 63 11030 18792 61598 79626 -19196 10189 33289 35509 35439 10065
823 10065 33849 29217 46833 63161 71581 37478 55123 66651 40366 -38407 -37086 65657
811 65657 59863 26185 20694 -8368 -17159 31557 -14049 -6905 -2066 10141 -7115 -31998 2173
798 2173 95722 71537 47298 45403 11095 14235 -57066 -46760 22173 -37208 -49495 -14244 26505
785 26505 -10432 13527 -562 11299 46896 30320 53772 55035 54286 7227 28992 -32392 -49940
772 -49940 2419 1062 22017 11895 -1745 -15172 -2787 59181 81340 68973 56834 9965
760 9965 47624 44740 52968 84200 74444 32287 -4210 46701 33184 26081 -13611 19067 -23650
747b3650l5290O9105k6045q2554O5936N8448J026K5589l1885l5413K6185q067
735C385L1281N0017k8365L3031r5708k0606M2576L2845k4543M5249M4029n2338
723F0853M3474n9292K8501o1391O072j3470J548L6881M7077Q13j4927m9574R997
710C6562k3475l0679L0293J4382j9489j5117k3451m4759N7021K5889M5005j6630
698C5552J4515o248m1296N9986m512l9874M0129k4224n463j9111L8735J3669J7920
685G9778k4765q2099K6781L2181L8242K6143K9451l0395K312j0956m8009R590
673D8254k9073N7002q775k7767K4779m0992K9478l0961L9323O8225j4831m0735
661G3927k3983k0439K4537n5537l5561Q0161m8035L0240K5169O1754J8606L469
$$ plain form
747 -23650 -58940 10165 -15880 -98434 -32498 25950 26976 52565 20680 -14733 11452 3385
735 3385 34666 84683 56318 89349 -6359 -26965 15611 48456 23913 69162 113191 60853
723 60853 104327 45035 73536 12145 18217 4747 6295 43176 90253 91066 76139 26565 36562
710 36562 13087 -17592 12701 27083 7594 -7523 -30974 -75733 -18712 7177 52182 35552
698 35552 50067 43819 2523 62509 57997 18123 58252 34028 28565 9454 48189 61858 79778
685 79778 55013 -27086 -305 31876 70118 96261 125712 95317 97629 86673 38664 48254
673 48254 19181 76183 67408 39641 64420 23428 52906 21945 61268 129493 114662 73927
661 73927 49944 29505 54042 -1495 -37056 43105 -4930 25310 50479 112233 130839 134308
649A34308L8187l1612n3797j8519N6786J6568j8876n062K0477m2196K8355p6332
637D8287o5793R0552J4418K862k7251J9793J8709L973l8882L1711n5309l9920
625C150N6323J08o82Q75K6580j1045k9598K0329J7356l8156J6455n98K4386J9001
611A04484J9763L7167r6802l0408J498L1344L4048k0370l0459J5985k0315J171
599D7106J7120n6111L6351k2163J7284M1431L121O0461j4879l0484m8117k5500
587B5620J5180L1974N5760q91n5748M0726K3602p8809j255K559l010k3811J6401
574D8298q845O357Q4491n263m2880m4435P2983Q9632l8281j16820n5921K5402
562A4718K2920M4695m5170l2938N4663O8812l3434l8532N9403K4183j3497p7282
$$ plain form
649 134308 172495 140883 87086 68567 125353 141921 123045 117983 138460 96264 124619 48287
637 48287 -17506 73046 87464 90326 63075 82868 101577 105550 66668 98379 43070 3150
625 3150 59473 59581 58899 59774 86354 75309 45711 66040 83396 45240 61695 61097 85483 104484
611 104484 124247 161414 64612 34204 35702 67046 101094 80724 50265 66250 45935 47106
599 47106 64226 8115 44466 22303 39587 81018 84139 144600 129721 99237 51120 25620
587 25620 40800 72774 128534 127643 71895 112621 136223 57414 56159 58718 55708 31897 48298
574 48298 39453 45810 130301 125038 82158 37723 110706 200338 162057 45237 -10684 14718
562 14718 37638 82333 37163 4225 58888 127700 94266 55734 115137 139320 125823 48541
550D8541N6623M452n1851n3547N1072k8270L2062L5195n084R7785k5527l789m8514
537A09148l1017Q9670K490m9920l2796J7155J6438n4357O3426l0529m7604J817
525E3921l2888Q782N1520p6043j616O5270J6481l7906M3241Q8429p2081j8426
513H8684o519p7666n587m398L1030N8882J8404r171m0867n2506J41083j5941n4553
500G0875o2295j2221L5718MO836J7169L4649k9369R329j4873l8723p571N5069
487F4597N1238J8644k3341l4064L5746R387j4740R16L0644k4745j5674k9285L2016
474A01339N905l3687J9863K0745K5975J5638m9428m7844J8114M3203K2763P323
462A49909j2189m1964M4352M5948m4920p7257m0311L2559L3109M5423K0196j9945
$$ plain form
550 48541 105164 109616 57765 4218 55290 27020 59082 94277 89193 186978 161451 157662 109148
537 109148 78131 167801 170291 120371 87575 104730 121168 66811 130237 99708 52104 53921
525 53921 21033 29815 81335 5292 3676 68946 85427 47521 90762 179191 107110 88684
513 88684 82165 4499 -1088 -5486 25544 84426 102830 93659 52792 286 141369 125428 70875
500 70875 8580 -3641 32077 32081 38917 56086 90735 61366 70695 55822 17099 9528 64597
487 64597 115835 134479 111138 77074 112820 122207 107467 108383 139027 114282 98608 69323 101339
474 101339 107244 73557 93420 114165 140140 155778 106350 58506 76620 119823 142586 149909
462 149909 137720 95756 140108 186056 141136 63879 23568 56127 89236 134659 154855 134910
450A34910P959n0359M949j3087j8550n4262Q7353j2869m6728k051L3041K3395
438I3701K0478l8420m3J12052o0530l8372P132l0087J7845o0626O1344o68K036
425H5842L0682L3684J5190n4419L4534N2260p2622J4936p5576Q72P0836m2721
413I3498k2139N1226K634p6312M6675K9260k6112m052M4501L4446K6254o6100
401A33779J8659l1710L439M9104R44o3680m2163Q3834o642N57M5464p785L729
388A87529m3191j3357J7162o276o5528J3263j4939j9161M4671O1569L7984m3913
376A55813j7208N5878k5328k5541L8142p5074K2040J0412j0128j7799n9298M7415
364I9324L5211l5860M5622L4340j7945m8342l3342N2764Q6J7784m532L2458N0761
$$ plain form
450 134910 142869 92510 97459 84372 65822 11560 98913 86044 39316 37265 70306 93701
438 93701 114179 75759 75716 187768 127238 88866 95998 65911 83756 23130 84474 83806 85842
425 85842 116524 150208 165398 110979 145513 197773 125151 140087 64511 65383 136219 93498
413 93498 71359 122585 125219 48907 95582 124842 98730 94678 139179 173625 199879 133779
401 133779 152438 120728 124167 173271 174215 110535 68372 152206 145564 146121 191585 183800 187529
388 187529 144338 130981 148143 141867 76339 89602 74663 55502 100173 161742 199726 155813
376 155813 138605 194483 169155 143614 181756 106682 128722 139134 129006 111207 51909 99324
364 99324 134535 98675 144297 178637 160692 112350 79008 131772 131858 149642 145110 177568 228329
351B28329L4662j57197n4401K1761O3901P790k7118N6218n3708K6491k2953Q877
339A32652n2125J02512k881L288q201m1599M2837j1352m1127l4947J6306k1437
327H3926K7752k8757P6811P4320k8680m9882J1204N1589l1946k8416K0338l6370
315A41889L1306n2558J1884J0882j9507l6278k2644L5065k3688K2328k9944P2269
303A41004M3488m7409N2190L172p99k6732O2454m0254o7732L2778J9874k008j8754
290A51272n4693Q9563n914j7027j0271o0635k8595N6945O1269j8388J7308L2501
278B13335l4659Q090M2376l2394J0254l2683m4328K1001j6722m8806N0138j0219
266A25383m356J6613M0928L319n0469k3159L1946m5875M1324j6689N3162l4260
$$ plain form
351 228329 262991 105794 51393 73154 137055 144845 117727 173945 120237 146728 123775 132652
339 132652 80527 183039 180158 183446 175245 133646 176483 165131 124004 89057 105363 83926
327 83926 111678 82921 159732 234052 205372 155490 166694 218283 186337 157921 178259 141889
315 141889 173195 120637 132521 143403 123896 87618 64974 100039 76351 98679 68735 141004
303 141004 184492 137083 189273 192445 191646 164914 227368 187114 119382 152160 172034 170026 151272
290 151272 96579 186142 180228 163201 152930 92295 63700 120645 181914 163526 180834 213335
278 213335 178676 186766 229142 196748 207002 174319 129991 150992 134270 85464 135602 125383
266 125383 121027 137640 178568 181887 131418 108259 140205 94330 135654 118965 172127 137867
254A37867o3196J0980J0510L1316m163L0136N0628l6992k6478N1689m7714l0083
242A14500J6850J1341k9693m630M7184P8644k7460o0219J1772J2243O062q8635
230H7959M463J4893p555L4053q367Q591J7293L0207J0751l0998q595K4217j7261
217A59651R229L128Q13k0344q0988J8592K0457M476k4385P7167K0595M2436n7638
204A73189j7227k2607j8284j9547N0381o4262K6660J2463N349N7426o414j0489
192A66638n8687J0977k6507N3497K7469L9764o1821N8431L6671j5664M630j9204
180B16194J6231K9444k2618K9320n8143m3882m0428l8068L4560M143j3366n065
168A08322j0545O4680K0106L0125j0766l8388J0371K61p466J1789m063k1135J2980
$$ plain form
254 137867 74671 85651 96161 127477 123314 153450 204078 167086 140608 192297 144583 114500
242 114500 131350 142691 112998 108368 155552 234196 206736 146517 158289 170532 176594 87959
230 87959 92422 107315 99760 133813 125446 134037 151330 181537 192288 161290 152695 176912 159651
217 159651 168880 172008 172821 152477 71489 90081 110538 115014 90629 167796 188391 230827 173189
204 173189 155962 133355 115071 95524 145905 81643 108303 120766 126115 183541 177127 166638
192 166638 107951 118928 92421 145918 173387 213151 151330 209761 246432 230768 235398 216194
180 216194 232425 261869 239251 268571 210428 166546 126118 88050 122610 126753 113387 108322
168 108322 97777 162457 182563 212688 201922 163534 173905 174166 166700 178489 174426 153291 166271
155A66271M4257K3332q1485L1083Q56Q629Q691L100r870l0314N684n7105J4829
142A27958j559k2951q907J7547J3274O0358n809P520j1384N8641o6308o7231r919
129I1230m1194M3534M6428O1083m0394l6632O2902k9323K0472k2525j6219K513
117A41875m7852J5638N3497N7534l2736k2427N0881j7338j6573L577o2566r600
105A13910J0273M2538j4304J2280J4840n0047L720K9198l984l2128K7017q798
93A44515k2437J9375K3135K5491j9870L5342N076l8767l3420J0234l1566J1881
81A28989P2529J1507k5994j0506k7206o51N0607l1778J8958j5208l8947L6145
69A68445N140O144j487L7902k2395O393K4672m8585m7892J062M3124N1212L0720
$$ plain form
155 166271 210528 233860 152375 183458 184314 192943 201634 204734 194864 164550 170234 113129 127958
142 127958 126399 103448 94541 112088 125362 185720 179911 187431 176047 234688 168380 101149 91230
129 91230 50036 93570 139998 201081 160687 124055 186957 157634 178106 155581 139362 141875
117 141875 94023 109661 163158 220692 187956 165529 216410 199072 182499 186076 123510 113910
105 113910 124183 166721 152417 164697 179537 129490 133210 162408 158424 126296 153313 144515
93 144515 122078 141453 164588 190079 170209 205551 210627 171860 138440 148674 117108 128989
81 128989 201518 213025 187031 176525 149319 148668 199275 167497 186455 171247 132300 168445
69 168445 173585 179729 178242 216144 193749 200142 224814 176229 128337 129399 172523 223735 254455
56B54455m7108m8513J1063j8385L2754K05m9631J0969P6859l4862J4845j1844
44A90807o6497K1528j5342J8207j8274L4561K9018p824n2753k5467N6711L2330
32A97005l590m3510L3586J8567l2269m4891K2706j9234J5701J5542k8064K673
20A34222K7448K9247j568k6647j0516j811M3974K5694k1128m209k2795j3536J2759
7A71134O4584m6288j4419J7457J5329k9184p0165
0A08448
$$ plain form
56 254455 207347 158834 169897 151512 184266 184471 134840 145809 222668 187806 202651 190807
44 190807 124310 145838 130496 148703 130429 164990 194008 186184 133431 107964 164675 197005
32 197005 193415 149905 183491 202058 169789 124898 147604 128370 144071 159613 131549 134222
20 134222 161670 190917 189349 162702 152186 150375 194349 220043 198915 194706 171911 158375 171134
7 171134 235718 189430 175011 192468 207797 178613 108448
0 108448
$$ Imaginary data points
##PAGE= N=2
##DATA TABLE= (X++(I..I)), XYDATA
16383b504644K4753L4360N2327J529L6343J1368L3732J17991M8454L60p45O8228
16371b075944L9283Q423N7132K1615M3363K5169R655P0328M6800L6940J3939L4181
16359a669116N0950L6123L4832J0306L6156P8677j641L9290O3702K8516N7840
16348a234365P8318J599R563Q576L1429L7288J3440L3694P7192L0016J9440R3740
16336h00070K4074J9546K4364J3486L3579Q9071L0445J9470j0542R2341N1067
16325d13169J1312L5760J2466L4433m89M5942N1733J9319J1262l076K8186N2264
16313a14057K846M9835K3623M8553L8506K8863k0691O1746K4990q50Q3243Q2801
16301C09408L5590K4754J8014M4264K0962l222n401P8908M5277j5382N1197K8415
$$ plain form
16383 -2504644 -2479891 -2445531 -2393204 -2391675 -2355332 -2343964 -2310232 -2192241 -2143787 -2143427 -2144172 -2075944
16371 -2075944 -2036661 -2028238 -1971106 -1949491 -1906128 -1880959 -1871304 -1800976 -1754176 -1717236 -1703297 -1669116
16359 -1669116 -1618166 -1582043 -1547211 -1536905 -1500749 -1422072 -1423713 -1384423 -1320721 -1292205 -1234365
16348 -1234365 -1156047 -1154448 -1144885 -1136309 -1104880 -1067592 -1054152 -1020458 -943266 -913250 -893810 -800070
16336 -800070 -775996 -756450 -732086 -718600 -685021 -595950 -565505 -546035 -556577 -464236 -413169
16325 -413169 -401857 -366097 -353631 -319198 -319687 -273745 -222012 -202693 -191431 -194507 -166321 -114057
16313 -114057 -111211 -61376 -37753 10800 49306 78169 57478 119224 144214 143364 226607 309408
16301 309408 344998 369752 387766 432030 452992 449770 444369 523277 568554 553172 604369 632784
16289F32784j7386L2704R5076q605K7178K8345N2061M2419l18R5807K2288m4833
16277I57520N8194J8225j8688M800L9676J1454P7749R903k2311M5673N5370J01391
16265A338956j5744P945R5973O253j2533O235M0802P0290K6683O648l802L7512
16253A605218J067M0500l1741m4847L6118K5659K7446J5138O9878l196R693J3250
16241A764183R698K1698P0619K8009m0745J8861N4120L8472R774l962J7358L5826
16229B023911L0297J0689O2995o2594Q201M5628J8220K9302M7890k7831j5117
$$ plain form
16289 632784 615398 648102 743178 734573 761751 790096 842157 884576 884258 980065 1002353 957520
16277 957520 1015714 1033939 1015251 1020051 1059727 1071181 1148930 1158833 1136522 1182195 1237565 1338956
16265 1338956 1323212 1331157 1427130 1433383 1420850 1427085 1467887 1538177 1564860 1571508 1567706 1605218
16253 1605218 1606285 1646785 1615044 1570197 1606315 1631974 1659420 1674558 1744436 1741240 1750933 1764183
16241 1764183 1773881 1795579 1866198 1894207 1853462 1872323 1926443 1964915 1974689 1970727 1988085 2023911
16229 2023911 2054208 2064897 2127892 2065298 2073499 2119127 2137347 2166649 2214539 2186708 2171591
$$ [...]
##END NTUPLES=NMR SPECTRUM
##END=
