##TITLE=1H_DE-80H_X3
 200.13MHz, d2o
 8 sc
 
 19ns.26.2.2025
##JCAMPDX= 6.0         $$ Bruker NMR JCAMP-DX V2.0
##DATA TYPE= NMR SPECTRUM
##DATA CLASS= NTUPLES
##ORIGIN= UXNMR, Bruker Analytische Messtechnik GmbH
##OWNER= pz
$$ XWIN-NMR		Version 3.5
$$ Fri Mar 13 10:28:59 2026 Russian Standard Time (UT+4h)  Yarkov@DPX200
##.OBSERVE FREQUENCY= 200.1313
##.OBSERVE NUCLEUS= ^1H
##.ACQUISITION MODE= SIMULTANEOUS
##.ACQUISITION SCHEME= undefined
##.AVERAGES= 8
##.DIGITISER RES= 18
##SPECTROMETER/DATA SYSTEM= spect
##.PULSE SEQUENCE= zg30
##.SOLVENT NAME= CDCl3
##.SHIFT REFERENCE= (INTERNAL, CDCl3, 0, 15.4637)
##AUDIT TRAIL= $$ (NUMBER, WHEN, WHO, WHERE, WHAT)
$$ ##TITLE= Audit trail, XWIN-NMR		Version 3.5
$$ ##JCAMPDX= 5.01
$$ ##ORIGIN= Bruker BioSpin GmbH
$$ ##OWNER= Yarkov
$$ C:/Bruker/XWIN-NMR/data/yarkov2/nmr/H-C/1/pdata/1/auditp.txt
$$ ##AUDIT TRAIL=  $$ (NUMBER, WHEN, WHO, WHERE, WHAT)
(   1,<2026-03-13 10:28:07.84 +0400>,<Yarkov>,<DPX200>,
      <created by zg, POWCHK disabled, PULCHK disabled
       configuration hash MD5:
       00 E9 B6 7A A2 85 ED C7 34 08 36 98 17 FE 4E 26
       data hash MD5: 16K
       A2 06 15 EE E7 ED 4C D3 B4 29 08 BF D3 B2 BC 98>)
(   2,<2026-03-13 10:28:14.42 +0400>,<Yarkov>,<DPX200>,
      <Start of raw data processing
       efp BC_mod = 2 LB = 0.25 FT_mod = 6 PKNL = 1 PHC0 = -5299.148 PHC1 = 6.821927 SI = 16K 
       data hash MD5: 16K
       14 E1 96 46 F0 A0 FA 8C 44 9A CE 55 C7 ED AA 48>)
$$ ##END=
$$ 
$$ hash MD5
$$ 35 50 DE B9 AE B6 E3 0D 86 9A 56 E7 54 8C 79 3F
##$RELAX= 
##$RELAX= 
##$RELAX= 
##$RELAX= 
##$RELAX= 
##$RELAX= 
$$ Bruker specific parameters
$$ --------------------------
##$DU= <C:/Bruker/XWIN-NMR>
##$EXPNO= 1
##$NAME= <H-C>
##$PROCNO= 1
##$TYPE= <nmr>
##$USER= <yarkov2>
##$AMP= (0..31)
100 100 100 100 100 100 100 100 100 100 100 100 100 100 100 100 100 100 
100 100 100 100 100 100 100 100 100 100 100 100 100 100 
##$AQSEQ= 0
##$AQ_mod= 1
##$AUNM= <au_zg>
##$AUTOPOS= <>
##$BF1= 200.13
##$BF2= 200.13
##$BF3= 200.13
##$BF4= 200.13
##$BF5= 200.13
##$BF6= 200.13
##$BF7= 200.13
##$BF8= 200.13
##$BYTORDA= 1
##$CFDGTYP= 0
##$CFRGTYP= 5
##$CHEMSTR= <none>
##$CNST= (0..31)
1 1 145 1 1 1 1 1 1 1 1 1 1 1 1 1 1 1 1 1 1 1 1 1 1 1 1 1 1 1 1 1 
##$CPDPRG= <>
##$CPDPRG1= <>
##$CPDPRG2= <>
##$CPDPRG3= <>
##$CPDPRG4= <mlev>
##$CPDPRG5= <mlev>
##$CPDPRG6= <mlev>
##$CPDPRG7= <mlev>
##$CPDPRG8= <mlev>
##$CPDPRGB= <>
##$CPDPRGT= <>
##$D= (0..31)
0 0.7 0 0 0 0 0 0 0 0 0 0.03 0 0 0 0 0 0 0 0 0 0 0 0 0 0 0 0 0 0 0 0 
##$DATE= 1773383287
##$DBL= (0..7)
120 120 120 120 120 120 120 120 
##$DBP= (0..7)
150 150 150 150 150 150 150 150 
##$DBP07= 0
##$DBPNAM0= <>
##$DBPNAM1= <>
##$DBPNAM2= <>
##$DBPNAM3= <>
##$DBPNAM4= <>
##$DBPNAM5= <>
##$DBPNAM6= <>
##$DBPNAM7= <>
##$DBPOAL= (0..7)
0.5 0.5 0.5 0.5 0.5 0.5 0.5 0.5 
##$DBPOFFS= (0..7)
0 0 0 0 0 0 0 0 
##$DE= 6
##$DECBNUC= <off>
##$DECIM= 32
##$DECNUC= <off>
##$DECSTAT= 4
##$DIGMOD= 1
##$DIGTYP= 9
##$DL= (0..7)
0 120 120 120 120 120 120 120 
##$DP= (0..7)
$$ [...]
##$SUBNAM2= <"">
##$SUBNAM3= <"">
##$SUBNAM4= <"">
##$SUBNAM5= <"">
##$SUBNAM6= <"">
##$SUBNAM7= <"">
##$SUBNAM8= <"">
##$SUBNAM9= <"">
##$SW= 18.0517328524113
##$SWIBOX= (0..15)
0 0 2 0 0 0 0 0 0 0 0 0 0 0 0 0 
##$SW_h= 3612.71676300578
##$TD= 16384
##$TD0= 1
##$TE= 0
##$TE2= 300
##$TE3= 300
##$TEG= 300
##$TL= (0..7)
0 120 120 120 120 120 120 120 
##$TP= (0..7)
150 150 150 150 150 150 150 150 
##$TP07= 0
##$TPNAME0= <>
##$TPNAME1= <>
##$TPNAME2= <>
##$TPNAME3= <>
##$TPNAME4= <>
##$TPNAME5= <>
##$TPNAME6= <>
##$TPNAME7= <>
##$TPOAL= (0..7)
0.5 0.5 0.5 0.5 0.5 0.5 0.5 0.5 
##$TPOFFS= (0..7)
0 0 0 0 0 0 0 0 
##$TUNHIN= 0
##$TUNHOUT= 0
##$TUNXOUT= 0
##$USERA1= <user>
##$USERA2= <user>
##$USERA3= <user>
##$USERA4= <user>
##$USERA5= <user>
##$V9= 5
##$VALIST= <valist>
##$VCLIST= <CCCCCCCCCCCCCCC>
##$VD= 0
##$VDLIST= <DDDDDDDDDDDDDDD>
##$VPLIST= <PPPPPPPPPPPPPPP>
##$VTLIST= <TTTTTTTTTTTTTTT>
##$WBST= 1024
##$WBSW= 4
##$XGAIN= (0..3)
0 0 0 0 
##$XL= 0
##$YL= 0
##$YMAX_a= 339931
##$YMIN_a= -326625
##$ZGOPTNS= <>
##$ZL1= 120
##$ZL2= 120
##$ZL3= 120
##$ZL4= 120
##$ABSF1= 0
##$ABSF2= 0
##$ABSG= 0
##$ABSL= 0
##$ALPHA= 0
##$AQORDER= 0
##$ASSFAC= 0
##$ASSFACI= 0
##$ASSFACX= 0
##$ASSWID= 0
##$AUNMP= <proc_1d>
##$AZFE= 0.1
##$AZFW= 0.1
##$BCFW= 0
##$BC_mod= 2
##$BYTORDP= 0
##$COROFFS= 0
##$CY= -3
##$DATMOD= 1
##$DC= 0
##$DFILT= <>
##$DTYPP= 0
##$F1P= 0
##$F2P= 0
##$FCOR= 1
##$FTSIZE= 16384
##$FT_mod= 6
##$GAMMA= 0
##$GB= 0
##$INTBC= 1
##$INTSCL= 3.241238e-09
##$ISEN= 128
##$LB= 0.25
##$LEV0= 0
##$LPBIN= 0
##$MAXI= 10000
##$MC2= 0
##$MEAN= 0
##$ME_mod= 0
##$MI= 1.114404
##$NCOEF= 0
##$NC_proc= -6
##$NLEV= 6
##$NOISF1= 3.799351
##$NOISF2= 2.8
##$NSP= 0
##$NTH_PI= 0
##$NZP= 0
##$OFFSET= 15.46373
##$PC= 1
##$PHC0= -5299.148
##$PHC1= 6.821927
##$PH_mod= 1
##$PKNL= yes
##$PPARMOD= 0
##$PSCAL= 0
##$PSIGN= 0
##$REVERSE= no
##$SF= 200.130011601723
##$SI= 16384
##$SIGF1= 3
##$SIGF2= 2
##$SINO= 0.751879
##$SIOLD= 32768
##$SREGLST= <19F.Aceton>
##$SSB= 0
##$STSI= 16384
##$STSR= 0
##$SW_p= 3612.71676300578
##$SYMM= 0
##$S_DEV= 0
##$TDeff= 16384
##$TDoff= 0
##$TI= <>
##$TILT= no
##$TM1= 0
##$TM2= 0
##$TOPLEV= 0
##$USERP1= <user>
##$USERP2= <user>
##$USERP3= <user>
##$USERP4= <user>
##$USERP5= <user>
##$WDW= 1
##$XDIM= 16384
##$YMAX_p= 272584284
##$YMIN_p= -733804
$$ End of Bruker specific parameters
$$ ---------------------------------
##NTUPLES= NMR SPECTRUM
##VAR_NAME=  FREQUENCY,     SPECTRUM/REAL,   SPECTRUM/IMAG
##SYMBOL=    X,             R,               I
##VAR_TYPE=  INDEPENDENT,   DEPENDENT,       DEPENDENT
##VAR_FORM=  AFFN,          ASDF,            ASDF
##VAR_DIM=   16384,         16384,           16384
##UNITS=     HZ,            ARBITRARY UNITS, ARBITRARY UNITS
##FACTOR=    0.220516191357247, 1,           1
##FIRST=     3094.75643596719, 0,            0
##LAST=      -517.960327038591, 0,           0
##MIN=       -517.960327038591, -733804,     0
##MAX=       3094.75643596719, 272584284,    0
$$ Real data points
##PAGE= N=1
##DATA TABLE= (X++(R..R)), XYDATA
$$ [...]
5911A3172647m7415j10767n2826l536R5324j6388o5790M9458L9121J34544J91778
5900A3386150L19789M39951L42848K35249M6041j80283j39718k65671j53315j69705
5890A3861336o1228j5919J10308J28764J09342K7469j1997j7053j6796l6017j89112
5879A3889097p8349k6581j09596j57364k42651k39003j15342N878N8625J23786
5869A3108500o5067j32400k62643m66489l23617k42194j93207j76171j21143l7828
5859A1087741q4733j55058k31990k42150l86176m26034l40459j84472k28719k20527
5849H587423j01744q4607k05647k04567k59817l33423k83794l20966k81359j97855
5839F313644k90299k70267j48092j33149j10991m9676q329o186J9252j5932o0746
$$ plain form
5911 13172647 13125232 13014465 12961639 12958103 13053427 13037039 12971249 13020707 13059828 13194372 13386150
5900 13386150 13705939 14145890 14488738 14723987 14770028 14589745 14450027 14184356 14031041 13861336
5890 13861336 13800108 13784189 13894497 14023261 14132603 14160072 14148075 14131022 14114226 14078209 13889097
5879 13889097 13810748 13784167 13674571 13517207 13274556 13035553 12920211 12926089 12984714 13108500
5869 13108500 13043433 12911033 12648390 12181901 11858284 11616090 11422883 11246712 11125569 11087741
5859 11087741 11003008 10847950 10615960 10373810 9987634 9561600 9221141 9036669 8807950 8587423
5849 8587423 8485679 8401072 8195425 7990858 7731041 7397618 7113824 6792858 6511499 6313644
5839 6313644 6023345 5753078 5604986 5471837 5360846 5311170 5302841 5296655 5315907 5299975 5239229
5828E239229j20722k11804k25656l32047k57674k22718l06827k56324j56150j56437
5818B992870j34599j09380o0059p7446j33552m7549j2103J3373j07243n3460j253
5807B269599K9819j13043q370k8130J5601l470n0475r1674p9437l9381j14004
5796A787035j05277k8984k3763r4307j11237m6351o150O5314M7534k4773k8003
5785A431038k4803M1298k3511r3177O798P007L2379k1971j5893k1082j8059L535
5773A303559j3259j3024J5241n3954K5531L745k6548M7456o5783m1885K2213L8846
5761A242138p0103j6150N0611j0992m4165M9745J2833k9129j8595L7990J6940
5750A221123P8n4071J7954R2027l9784p4683J7201K9855n629l6826M7033o7350
$$ plain form
5828 5239229 5118507 4906703 4681047 4349000 4091326 3868608 3561781 3305457 3149307 2992870
5818 2992870 2858271 2748891 2688832 2611386 2477834 2430285 2418182 2431555 2324312 2270852 2269599
5807 2269599 2299418 2186375 2178005 2149875 2165476 2162006 2111531 2019857 1940420 1901039 1787035
5796 1787035 1681758 1652774 1629011 1534704 1423467 1377116 1370966 1436280 1483814 1459041 1431038
5785 1431038 1406235 1447533 1424022 1330845 1337643 1344650 1377029 1355058 1339165 1318083 1300024 1303559
5773 1303559 1290300 1277276 1292517 1238563 1264094 1267839 1241291 1288747 1222964 1181079 1203292 1242138
5761 1242138 1172035 1155885 1206496 1195504 1151339 1201084 1213917 1184788 1166193 1204183 1221123
5750 1221123 1221201 1167130 1185084 1277111 1237327 1162644 1179845 1209700 1204071 1167245 1214278 1146928
5738A146928j664K700K0662J7126n3512k2089N3482j3261l9382N3138O7560J6631
5726A248319l3721l3011q683K6690N185L5172L3607q012j5552o0521k1880Q3972
5714A251565K3230j7225K7605K9736j12964m3740Q3659l7311j6891O9143l9514
5703A217293K3297k6411j9119l7680J4655n798N86K4162o2435L5471J0232k5244
5691A149009L0264J0898K3980k108N6408J1891r2739n6668J6165K2726l1416K2521
5679A160931N6344J3862q0815l1946j6728j4395J3652O0013k0182l2125R5099
5668A203710o8044j9578M8152M9334k0606m8906j5845J2477m79m7359l5993M0291
5656A097154K6122J5412P4576o2545q6900o208L7203l915l7862K1384O3573j8253
$$ plain form
5738 1146928 1145264 1147964 1168626 1185752 1132240 1110151 1163633 1150372 1110990 1164128 1231688 1248319
5726 1248319 1214598 1181587 1172904 1199594 1204779 1239951 1273558 1265546 1249994 1189473 1167593 1251565
5714 1251565 1274795 1257570 1285175 1314911 1201947 1158207 1241866 1204555 1187664 1256807 1217293
5703 1217293 1240590 1214179 1195060 1157380 1172035 1166237 1166823 1190985 1128550 1164021 1174253 1149009
5691 1149009 1179273 1190171 1214151 1212043 1268451 1280342 1187603 1130935 1147100 1169826 1138410 1160931
5679 1160931 1217275 1231137 1150322 1118376 1101648 1087253 1100905 1160918 1140736 1108611 1203710
5668 1203710 1135666 1116088 1164240 1213574 1192968 1144062 1128217 1140694 1140215 1092856 1056863 1097154
5656 1097154 1123276 1138688 1213264 1150719 1063819 1057611 1094814 1090899 1053037 1074421 1137994 1119741
5644A119741N8185O4239r7169m1632K4034O49n8838R422N2074N8597K8649m3235
5632A174716m6798q7339K2885K5273m7297r004N6114K0464m459m6994k9630k033
5620A025898M6121l423q673j5594L2778n1828L2809J4887M5092O312p6009k6321
5608A022049J9886J6781O477l937Q171P1035J6478L6055j0042p723M691k2411
5596A157510L8478J1006L523l7430o1246M2988M2612k4002L1653N7057j8729K3512
5584A266932k0696L1050o4697m9133K7322K5643N7341k5031o7912L8534K3079
5573A242432n6267q013J7793n6392O156J4094N0018k5837J9432l9065J8822K6021
5561A209194k8100j9501K5757k0898l3070O817j3932J1166O8746l6450j9774P1431
$$ plain form
5644 1119741 1177926 1242165 1144996 1103364 1127398 1128047 1069209 1078631 1130705 1189302 1217951 1174716
5632 1174716 1127918 1040579 1063464 1088737 1041440 1032436 1088550 1109014 1104555 1057561 1027931 1025898
5620 1025898 1072019 1068596 1059923 1044329 1077107 1025279 1058088 1072975 1118067 1124379 1048370 1022049
5608 1022049 1041935 1058716 1065193 1061256 1069427 1140462 1156940 1192995 1182953 1175230 1179921 1157510
5596 1157510 1195988 1206994 1210517 1173087 1111841 1154829 1197441 1173439 1205092 1262149 1243420 1266932
5584 1266932 1246236 1277286 1212589 1163456 1190778 1216421 1273762 1248731 1180819 1219353 1242432
5573 1242432 1186165 1178152 1195945 1139553 1145709 1159803 1209821 1183984 1203416 1164351 1183173 1209194
5561 1209194 1181094 1161593 1187350 1166452 1133382 1140199 1126267 1137433 1206179 1169729 1149955 1221386
5549A221386m7397l6569J5381j4077m727L690k9455M7676j7518l0042j9540J1865
5537A100673o0413j8214P9380L3237J5666R0912n001l8971j5373L2232n9193r985
5525A144950p847j4916R812l4471l6008K8467P7008l7478k0709K7452J0343k0460
5513A126143n219J2440q7456l2314J03686N8519k1375l3728L4666k6608J4900
5502A143654k9209o8628J4357O263n0069o1059Q6719N4942l6003N0387L4402K0764
5490A166520R485j1508q8394o5422K9317K8620J8971q290K1518k9973L143M4013
5478A118000L1912J3021k5378l7387J7330l1747L4776P4192l2080J4368P6702
5467A253709m989R372R620p7348J9518k0229p965J2701O8052o6543K5329O967
$$ plain form
5549 1221386 1173989 1137420 1152801 1138724 1133997 1137687 1108232 1155908 1138390 1108348 1088808 1100673
5537 1100673 1040260 1022046 1101426 1134663 1150329 1241241 1236240 1197269 1181896 1214128 1154935 1144950
5525 1144950 1137103 1122187 1131999 1097528 1061520 1089987 1166995 1129517 1108808 1136260 1146603 1126143
5513 1126143 1120924 1133364 1045908 1013594 1117280 1175799 1154424 1120696 1155362 1128754 1143654
5502 1143654 1114445 1045817 1060174 1066437 1016368 955309 1042028 1096970 1060967 1111354 1145756 1166520
5490 1166520 1176005 1164497 1076103 1010681 1039998 1068618 1087589 1079299 1100817 1070844 1073987 1118000
5478 1118000 1149912 1162933 1137555 1100168 1117498 1085751 1120527 1194719 1162639 1177007 1253709
5467 1253709 1248720 1258092 1267712 1190364 1209882 1189653 1181688 1194389 1262441 1195898 1221227 1228194
5455A228194J7983J426l7552Q959L7638K3886r0616o796Q153M1254n9180n833
5443A167516Q3474k6194l5571m0450O5793N8255m1738p4829J8886r604m1759R6618
5431A220397m6522l3571m8837M9550O8512q441j9531l6573j0737M5215J3805J5998
5419A209265p9588N1714o267J2099O4056Q367m7053m2497j61K5831J8560k1355
5407A192971J4563M4327j9304m6835P4376l4787P0162K0325K0505O342m5411l1931
5395A265303m335m7950j8362L3578J7199J8680P5841q4726m2757K3070l436n9193
5383A172912m7620M7036j9595q306p873J5278K3217Q821K507J2389o8352k990
5371A127424K7901P3926L1473j1309N9567L5342m9727r697l7823J5949J8518L1487
$$ plain form
5455 1228194 1246177 1247603 1210051 1219010 1256648 1280534 1189918 1183122 1191275 1232529 1173349 1167516
5443 1167516 1250990 1224796 1189225 1148775 1214568 1272823 1231085 1156256 1175142 1165538 1123779 1220397
5431 1220397 1173875 1140304 1091467 1141017 1209529 1201088 1181557 1144984 1134247 1179462 1193267 1209265
5419 1209265 1129677 1181391 1175124 1187223 1251279 1259646 1212593 1170096 1169935 1195766 1214326 1192971
5407 1192971 1207534 1251861 1232557 1185722 1260098 1225311 1295473 1315798 1336303 1342645 1297234 1265303
5395 1265303 1260968 1213018 1194656 1228234 1245433 1264113 1339954 1255228 1212471 1235541 1232105 1172912
5383 1172912 1125292 1172328 1152733 1144427 1136554 1151832 1175049 1183870 1186377 1198766 1130414 1127424
5371 1127424 1155325 1229251 1260724 1249415 1308982 1344324 1294597 1284900 1247077 1263026 1281544 1313031
5359A313031J8753J558Q534J1991m0398L348L9002l2012J9253J8647l5026j2331
5347A314350J9574J3728l8634m3501o345R054M1609n1427J967J8070J8545N7748
5335A354738N954j3383L8977J9704n8707N2996N1325m0973K2957K94m9847N2983
5323A437018L4630L0272p2538q4613M638N070L9730K7053j3353K1824M7994o038
5311A471687J4638n5709o402n3096O4907J6272m8038j0024Q4614O336J500p1869
5299A414816j8026M127O1420q762L0530J800R716M8464n2037j622m7343L346J8280
5286A464709L5493O1392m4286K6801J37445k0183l4843L4044Q3061j924K0716
5275A762425K2759R6167J19194J89922J82631K02045J51429N6088m4959j15151
$$ plain form
5359 1313031 1331784 1333342 1341876 1353867 1313469 1316817 1355819 1323807 1343060 1361707 1326681 1314350
5347 1314350 1333924 1347652 1309018 1265517 1259172 1268226 1309835 1258408 1260375 1278445 1296990 1354738
5335 1354738 1360692 1347309 1386286 1405990 1347283 1400279 1451604 1410631 1433588 1433882 1384035 1437018
5323 1437018 1471648 1501920 1429382 1344769 1349407 1354477 1394207 1421260 1407907 1429731 1477725 1471687
5311 1471687 1486325 1430616 1424214 1371118 1436025 1452297 1404259 1394235 1478849 1485185 1486685 1414816
5299 1414816 1396790 1400917 1462337 1453575 1484105 1485905 1495621 1544085 1492048 1490426 1443083 1446429 1464709
5286 1464709 1500202 1561594 1517308 1544109 1681554 1661371 1626528 1660572 1743633 1741709 1762425
5275 1762425 1785184 1881351 2000545 2190467 2373098 2575143 2726572 2782660 2737701 2622550
5265B622550p5906n9930K136K0265O5750K48910L18259L71462K68034K16199K24594
5254D222323J28271R117N4693J9687K0688K7509k4439k4694p2762K6754J33609
5243D520756J20191J06865J16293J78685K40321K25028J73293M7576o460j56920
5233E565628j64931j61125j57338r2808j85849r2273p2468o0749j06011m2536
5223D429540O2794l6976l945P6429N0800k4352K2711j08698k66784j99600l20320
5212C681599k85136k64794k33030j63049o2394j7269P1243J58215R1640M3578
5202C020603o0777j30771j86811j18258j60983j79052n9374o8715r1651p5850
5192A888361k7257r338j5726l0942p2715L1780j330j4980q102j4854O1509K7224
$$ plain form
5265 2622550 2546644 2486714 2488850 2509115 2574865 2823775 3142034 3513496 3781530 3997729 4222323
5254 4222323 4350594 4359711 4414404 4434091 4454779 4482288 4457849 4433155 4360393 4387147 4520756
5243 4520756 4640947 4747812 4864105 5042790 5283111 5508139 5681432 5729008 5722548 5565628
5233 5565628 5400697 5239572 5082234 4989426 4803577 4711304 4638836 4578087 4472076 4429540
5223 4429540 4492334 4455358 4451413 4527842 4578642 4554290 4577001 4468303 4201519 4001919 3681599
5212 3681599 3396463 3131669 2898639 2735590 2673196 2655927 2727170 2885385 2977025 3020603
5202 3020603 2959826 2829055 2642244 2523986 2363003 2183951 2124577 2055862 1964211 1888361
5192 1888361 1861104 1851766 1836040 1805098 1732383 1764163 1762833 1747853 1739751 1724897 1786406 1813630
5180A813630q4890l4410L9247K9321q9454K4587M7183J4519p5044J8347O8839
5169A771875K2211J4701l7632L2200K6540K1727m7646N3102j1786n3704L7713
5158A829301J8399J717l2744J5300J8864L2980M1647L9205q1339m6927O7635N7712
5146A961750j9441p4962K4416M9547J03419j2428p9076P658J9177k575j7045K9021
5134A989461K9737Q03j3878M6045p13o9275N3877M2506N6910N4389j01535k1402
5122B066925L2784k5336k2491K5446P2850m826l4790q4795p70O1697j1607M480
5110B079567l4056k1031m645O7785L4916l9517j3146L4172k5372l4858Q1194K3424
5098B148433M8059j6973j7278K8843P7838l2660k7683K3153j3207Q076K3142K3326
$$ plain form
5180 1813630 1728740 1694330 1733577 1762898 1673444 1698031 1745214 1759733 1684689 1703036 1771875
5169 1771875 1794086 1808787 1771155 1803355 1829895 1851622 1803976 1857078 1845292 1791588 1829301
5158 1829301 1847700 1849417 1816673 1831973 1850837 1883817 1925464 1964669 1883330 1836403 1904038 1961750
5146 1961750 1942309 1867347 1891763 1941310 2044729 2032301 1953225 1960883 1980060 1977485 1960440 1989461
5134 1989461 2019198 2020001 2006123 2052168 2051455 1982180 2036057 2078563 2135473 2189862 2088327 2066925
5122 2066925 2099709 2074373 2051882 2077328 2150178 2145352 2110562 2025767 2024997 2086694 2075087 2079567
5110 2079567 2045511 2024480 2019835 2087620 2122536 2083019 2069873 2104045 2078673 2043815 2125009 2148433
5098 2148433 2196492 2179519 2162241 2191084 2268922 2236262 2208579 2231732 2218525 2226601 2249743 2273069
5086B273069m6373J4866k264J7894M6211L2277L977k6807n211K8486m236J7470
5074B349359k6950p909M8985k7730M695L5888L7399j1626m821M6436J08023L9288
5062B591037m344L3871N2702J3902K7636p036L091O4742j3534k0645k182N18K3892
5049B763650K8703j7281N2637j6850N0000N4635q835q371k1835K689m9212k181
5037B827749n7840K3256K3669K7441J6861j7655k8148M4438L814K1218M3928m4441
5025B884290q1915q864M8830J5250L6592J4015L6161K2151n3099m7344J3589L3592
5013B913248K0260r417M1835O7196P5469n50K9871K2550O3632n3367j4255P6854
5001C233326J170O8715j0327m5637K9955K4790Q6676l205O5886O3972J43063R0265
$$ plain form
5086 2273069 2226696 2241562 2239298 2257192 2303403 2335680 2339657 2312850 2307639 2336125 2331889 2349359
5074 2349359 2322409 2314500 2363485 2335755 2340450 2376338 2413737 2402111 2397290 2443726 2551749 2591037
5062 2591037 2586693 2620564 2673266 2687168 2714804 2707768 2710859 2775601 2762067 2741422 2739240 2739758 2763650
5049 2763650 2792353 2775072 2827709 2810859 2860859 2915494 2906659 2898288 2876453 2879142 2829930 2827749
5037 2827749 2769909 2793165 2816834 2844275 2861136 2843481 2815333 2859771 2863585 2884803 2928731 2884290
5025 2884290 2802375 2793511 2842341 2857591 2894183 2908198 2944359 2966510 2913411 2866067 2879656 2913248
5013 2913248 2933508 2924091 2965926 3033122 3108591 3108041 3137912 3160462 3224094 3170727 3156472 3233326
5001 3233326 3234496 3303211 3292884 3247247 3277202 3301992 3388668 3385463 3451349 3515321 3658384 3748649
4989C748649O340N7913O1941J78675K52214K86699M34022M98966L35656J46400
4979F007475N8375m1311r7557p2823O3092J60271K46564K23902J19876l2033k24829
4968F411002k18108j30666o5631j10267J37519K47851L66515M13122K99587J54765
4958G505689m4265q2143q7172p3464J43019K21021K01603Q5192k2310j61046k04349
4947G481775k42112j97362j70681j17990J2653p3941l5004J4341J52028J25731
4937F949438J66223K47330M67128N84438N87653M17359J93624J15598K6422O9867
4927I825080J51786L03832M81157N26749M34782M57502M04389M29527M39630O14244
4917A4068678N81961L75082J36927R3914j922j48646k93861l98369m06262l68351
$$ plain form
4989 3748649 3754989 3812902 3874843 4053518 4305732 4592431 5026453 5525419 5861075 6007475
4979 6007475 6065850 6024539 5926982 5854159 5917251 6077522 6324086 6547988 6667864 6635831 6411002
4968 6411002 6192894 6062228 5996597 5886330 6023849 6271700 6638215 7051337 7350924 7505689
4958 7505689 7461424 7379281 7292109 7218645 7361664 7582685 7784288 7869480 7847170 7686124 7481775
4947 7481775 7239663 7042301 6871620 6753630 6766283 6692342 6657338 6671679 6823707 6949438
4937 6949438 7115661 7362991 7830119 8414557 9002210 9419569 9613193 9728791 9755213 9825080
4927 9825080 9976866 10280698 10761855 11288604 11723386 12180888 12585277 13014804 13454434 14068678
4917 14068678 14650639 15025721 15162648 15256562 15254640 15105994 14812133 14413764 14007502 13639151
4907A3639151k12819l3794J64625M26102N89868O16627N35550K61173k9604k46999
4897A5709880n61207p38828p91349p19581n13387l99841k01704r9826j06726m1532
4887A1535899K3624N4999K36756K72730K21824K87961L09541M55272O34012O07652
4877A4640270P03598Q20714R26177J070392J114060J287847J505620J788391K207901
4868B6064970K093571J760373J505239J267184J164290J089990P75224L73933
4860C6094774J26804r2334j85183q4906K60147N64771J096992J475421J880801
4851D1137287K391918K680005K990629L332837L480605L075571K179245J145386
4843F2413483L46307l24812o06511o50201o52873o17655l02049j23970J72670
$$ plain form
4907 13639151 13426332 13392538 13557163 13983265 14573133 15189760 15725310 15986483 15956879 15709880
4897 15709880 15148673 14409845 13618496 12898915 12385528 11985687 11783983 11684157 11577431 11535899
4887 11535899 11559523 11614522 11851278 12124008 12345832 12633793 12943334 13398606 14032618 14640270
4877 14640270 15343868 16164582 17090759 18161151 19275211 20563058 22068678 23857069 26064970
4868 26064970 28158541 29918914 31424153 32691337 33855627 34945617 35720841 36094774
4860 36094774 36221578 36129244 35944061 35859155 36119302 36684073 37781065 39256486 41137287
4851 41137287 43529205 46209210 49199839 52532676 56013281 59088852 61268097 62413483
4843 62413483 62759790 62434978 61828467 61178266 60525393 59907738 59605689 59481719 59654389
4834E9654389K51351J35027k6699j86349j39332K5998j38310m30951o11431p96858
4824E7736835j079972j206590j182266r16903o64722l78558m9595J87962K60656
4815E2706847k8627k56245o29237q04815p79151o57385m81819l44971l03509k50133
4805D8170955j24193N6509K60602N20821Q49935R37074R22672R48804Q80641P63902
4795E4187722P14938P31459P99339R37567R50538J050684P75148N13228J17838
4786F0778461k63409l81487l96615l20269K0021M33934P31532P44034N27106M49
4776F1873757m44048n89191p46060m63618n7376K80183N06218Q60038J178763
4767F2398666J510666J811689K048431K403576K385633K146852J635709P13045
$$ plain form
4834 59654389 59905740 60040767 60014068 59827719 59688387 59714385 59576075 59145124 58533693 57736835
4824 57736835 56656863 55450273 54268007 53351104 52686382 52307824 52258229 52446191 52706847
4815 52706847 52678220 52421975 51792738 50987923 50208772 49551387 49069568 48724597 48421088 48170955
4805 48170955 48046762 48103271 48363873 48884694 49734629 50671703 51594375 52543179 53423820 54187722
4795 54187722 54902660 55634119 56433458 57371025 58321563 59372247 60147395 60660623 60778461
4786 60778461 60515052 60133565 59736950 59416681 59436702 59870636 60602168 61346202 61873308 61873757
4776 61873757 61429709 60840518 60094458 59630840 59573464 59853647 60359865 61219903 62398666
4767 62398666 63909332 65721021 67769452 70173028 72558661 74705513 76341222 77054267
4759G7054267k65666j101498j912653k464304k912694l239565l382841l366702
4751E8408344l167828k843414k494644k184962j830170j592512j164178r30730
4743D2199906o29645l50854k54343q755k8735r5430l9854j10223l01905n95143
4733C9785019q34839r74366j232731j450436j576619j808937j836786j883877
4725B8186428j777308j601561j482416j251308j091684j007121r76261r28932
4717A8069837r23468q88916r82891r65548p46566o68245o38082n13447l62040
4708A1380634k55285j63780j02081P7872p535j2270m0408k26429k60430l06091
4698A0084197l22522k67263k04101k38054r5312o5093J1737J31642J84832K63822
$$ plain form
4759 77054267 76788601 75687103 73774450 71310146 68397452 65157887 61775046 58408344
4751 58408344 55240516 52397102 49902458 47717496 45887326 44294814 43130636 42199906
4743 42199906 41570261 41219407 40965064 40956309 40927574 40832144 40792290 40682067 40380162 39785019
4733 39785019 38950180 37975814 36743083 35292647 33716028 31907091 30070305 28186428
4725 28186428 26409120 24807559 23325143 22073835 20982151 19975030 18998769 18069837
4717 18069837 17146369 16257453 15274562 14309014 13562448 12894203 12256121 11742674 11380634
4708 11380634 11125349 10961569 10859488 10937360 10929825 10917555 10877147 10650718 10390288 10084197
4698 10084197 9761675 9494412 9290311 9052257 8956945 8891852 8903589 9035231 9220063 9483885
4688I483885M01573N52875P96533J019416J099410R96233N76982M2234m48177
4679A4520964p25936r48710r52649q91681q31864o74074n78285m96613m21489
4670G999663k38659k08991j42972q5988j21707r5873l4345K9312P0760L5519J35618
4659G342337K38522K82491L72041M59793M97078N73548O99968P68254Q99381J260417
4649A3393830J603847J916599J963562J649639R92099O2272o86737j229836j563536
4640A8101739j529754j311620j179145p12541m32899k25113j4541J78496L04327
4631A3178949M79591N46784L67343K11414R9884k10737l55762m46732m00668k71804
4621A3198262k10346j24027j46918k0527Q1722K44848L95943O58505Q48654P81630
$$ plain form
4688 9483885 9885458 10438333 11234866 12254282 13353692 14349925 14926907 14969141 14520964
4679 14520964 13795028 12846318 11893669 11001988 10170124 9496050 8917765 8421152 7999663
4670 7999663 7761004 7552013 7409041 7323053 7201346 7105473 7071128 7100440 7171200 7206719 7342337
4659 7342337 7580859 7863350 8235391 8695184 9192262 9765810 10465778 11234032 12133413 13393830
4649 13393830 14997677 16914276 18877838 20527477 21519576 21581848 20895111 19665275 18101739
4640 18101739 16571985 15260365 14081220 13368679 12935780 12710667 12696126 12874622 13178949
4631 13178949 13658540 14205324 14572667 14784081 14883965 14673228 14317466 13870734 13470066 13198262
4621 13198262 12987916 12863889 12716971 12696444 12778166 13023014 13418957 14077462 14926116 15707746
4611A5707746N18192K09857k57184o26237q90967j025616r24221p54867o34538
4602A1322165m25888j47446L2578K37422N41857O54578Q91178J102674J358482
4593A5567600J619037J610092J125328N70922L6721n92179r60562j146721j223459
4584A6606779j170260r58462p98885o21939n20209l28084l77567m31512m30186
4575A0969675l84634m02122l19199k64950j84762J39473L77951O43819J028102
4566A1603353R89078N29139K35868r0244k68604j84851O0700M14192O09945R87246
4556A4885822R57199Q19456M95703n0658o02263r65399j132130j068606p54912
4547A2584212n12421L8873L40485L78991K21711j62970n16832p22901p41971p31195
$$ plain form
4611 15707746 16225938 16435795 16178611 15552374 14661407 13635791 12711570 11956703 11322165
4602 11322165 10896277 10748831 10781409 11018831 11560688 12215266 13106444 14209118 15567600
4593 15567600 17186637 18796729 19922057 20492979 20529700 19937521 18976959 17830238 16606779
4584 16606779 15436519 14478057 13679172 13057233 12537024 12208940 11831373 11399861 10969675
4575 10969675 10585041 10182919 9863720 9598770 9414008 9553481 9931432 10575251 11603353
4566 11603353 12592431 13121570 13357438 13267194 12998590 12813739 12874439 13288631 13898576 14885822
4556 14885822 15843021 16662477 17158180 17107522 16505259 15539860 14407730 13339124 12584212
4547 12584212 12071791 12110664 12451149 12830140 13051851 12888881 12372049 11649148 10907177 10175982
4537A0175982o24107k33765N501K29581M83821L84378q7577l90372o88149r65830
4527H289463q13917o64516n70100l57543k67620j95456j27372j8572O5453J9612
4517E359432r475P740j61643j87732j76545k37728k45735k66500j22840j81210
4507C777764j59201j50485j10332o0624k6710p6765j38270q590m183o0475j68574
4496B813555n6112j2847k5908l0983k7305J7630Q0422J1586r4937O945j6547j9094
4484B646405q13k890O2683J0271l0881j4008R340N8236n8964n6586J8081P396
4472B648270j8531o9895K7525m9767k3959O8129j6061N3478j5203m5662N4548
4461B612872M9727l3550n7286p2985o5079K2117j4768l7435j4000m2133m4825
$$ plain form
4537 10175982 9551875 9318110 9323611 9553192 10037013 10421391 10333814 9943442 9255293 8289463
4527 8289463 7475546 6811030 6240930 5883387 5615767 5420311 5292939 5274367 5339820 5359432
4517 5359432 5349957 5357697 5196054 5008322 4831777 4594049 4348314 4081814 3958974 3777764
4507 3777764 3618563 3468078 3357746 3297122 3270412 3193647 3055377 3046787 3042604 2982129 2813555
4496 2813555 2757443 2744596 2718688 2687705 2660400 2678030 2758452 2770038 2675101 2682046 2665499 2646405
4484 2646405 2645592 2642702 2705385 2715656 2684775 2670767 2680107 2738343 2679379 2622793 2640874 2648270
4472 2648270 2629739 2559844 2587369 2537602 2513643 2581772 2565711 2619189 2603986 2558324 2612872
4461 2612872 2662599 2629049 2571763 2498778 2433699 2455816 2441048 2403613 2389613 2347480 2302655
4450B302655K6931L0717P8584p4793j3476P3463j079o7623M5241o9463r6438O9380
4438B304099M4137M7603L704N494j1339J6037l7119o2987j5688J0510L7087L3732
4426B375270l0784K4240j0989M3332n557p167N3524N746m0031l176P384Q0872
4414B492664J2751n437N2451K5847L9695l639K4608K4165p1735l0635P4921R3788
4402B729444N3819J09591K33234J32135N4173j9506j27304p1826N211k3108m3171
4391C032692N0550K4103K2223O5058J4325N4930Q3227Q1299J20727K06923K43123
4380C999180J93594J23621O7524K6085o9285r0131p6822j26503J00J0125p1756
4369C985732N4491J56672K21926K31844J47287J57250J75110p590N7967P7939
$$ plain form
4450 2302655 2329586 2360303 2438887 2364094 2350618 2424081 2423002 2355379 2400620 2331157 2234719 2304099
4438 2304099 2348236 2395839 2399543 2405037 2393698 2409735 2372616 2309629 2293941 2304451 2341538 2375270
4426 2375270 2344486 2368726 2357737 2401069 2395512 2388345 2441869 2447615 2407584 2404408 2411792 2492664
4414 2492664 2505415 2499978 2552429 2578276 2617971 2614332 2638940 2663105 2591370 2560735 2635656 2729444
4402 2729444 2783263 2892854 3126088 3258223 3312396 3292890 3165586 3093760 3098971 3075863 3032692
4391 3032692 3083242 3107345 3129568 3194626 3208951 3263881 3347108 3428407 3549134 3756057 3999180
4380 3999180 4192774 4316395 4383919 4410004 4340719 4250588 4173766 4047263 4047363 4057488 3985732
4369 3985732 4040223 4196895 4418821 4650665 4797952 4955202 5130312 5122722 5180689 5258628
4359E258628R2564J56508P7893J1270j29249j70432r0390j04230q4316Q619J4819
4348E041684R6722O1700J05950K26624K17205J79982M7228J14110M636p3987l716
4337F018138k1774R7838J50564L27448L75204M80110M51135M10474K67621J78945
4327H735703J37845M6596l8178m7383M2628J21725J52980K22564L46556L60035
4317A0081071L41106L01234K89289J99788J86996J75182J57609K27238K67663
4308A2227176J71431J2668n1331j28973l06125l04127k80502k48680q4558j8766
4298A0988213J20213J46375J94873K11160l5892p153k2315j25210j84880j86195
4288A1099189j74267q1842L1184O5686J42557J06223m6654j35290j57803j35467
$$ plain form
4359 5258628 5351192 5507700 5585593 5596863 5467614 5297182 5206792 5102562 5018246 5026865 5041684
4348 5041684 5138406 5200106 5306056 5532680 5749885 5929867 5977095 6091205 6095841 6021854 6018138
4337 6018138 5996364 6094202 6244766 6572214 6947418 7427528 7878663 8289137 8556758 8735703
4327 8735703 8873548 8920144 8881966 8834583 8877211 8998936 9151916 9374480 9721036 10081071
4317 10081071 10422177 10723411 11012700 11212488 11399484 11574666 11732275 11959513 12227176
4308 12227176 12398607 12411275 12359944 12230971 11924846 11620719 11340217 11091537 11006979 10988213
4298 10988213 11108426 11254801 11449674 11660834 11624942 11617789 11595474 11470264 11285384 11099189
4288 11099189 10924922 10843080 10874264 10939950 11082507 11188730 11142076 11006786 10848983 10713516
4278A0713516j66842K914J31664K57162M56677N15285O21879O21023M08883K86780
4268A3848941P8750l9621j45208r7058j01943m7852j2583N0967J81795K20051
4258A3936239K78060K96982K12356O099m268N5862J61828P7479J30459L0674j87132
4247A4994638k79277m62933o09801n93449n34888m88032m25170k07380j15386
4238A1278322K1027J28858J63966J19083Q435j22808k10626l47942l17725k08463
4228A0512127k35107k00280q3029j43161j16589j29070k68805k84010j74702k20923
4218H656451j92233j9915k9908J14944J82941K28612K74258J90837J90235J17107
4208I713329P6946J34317L2953j06847j56082o8422j39608j87693j69744j82490
$$ plain form
4278 10713516 10546674 10549588 10681252 10938414 11395091 11910376 12532255 13153278 13562161 13848941
4268 13848941 13927691 13888070 13742862 13645804 13543861 13496009 13483426 13534393 13716188 13936239
4258 13936239 14214299 14511281 14723637 14729736 14725468 14781330 14943158 15020637 15151096 15181770 14994638
4247 14994638 14715361 14252428 13642627 13049178 12514290 12026258 11601088 11393708 11278322
4238 11278322 11299349 11428207 11592173 11711256 11719691 11596883 11386257 11038315 10720590 10512127
4228 10512127 10277020 10076740 9993711 9850550 9733961 9604891 9336086 9052076 8877374 8656451
4218 8656451 8464218 8444303 8414395 8529339 8712280 8940892 9215150 9405987 9596222 9713329
4208 9713329 9790275 9924592 9957545 9850698 9694616 9626194 9486586 9298893 9129149 8946659
4198H946659k01750j74365o2542p5759k3375m670Q7558J05587N8000P3662r0010
4187H638995q2358k28058k91448k36440j90335k46162l62724j97314o9414j65360
4177F569382j05084o3257m2692j6776J8583J9989J31966J10679P4915P1307K6896
4166F795908R4889J48851J23975J05237J51068J15228J99550J36578J46668K45762
4156H263714K88759K85190K88993L22531L87841M74251N41889L69814L18741K96493
4146A1838216L02034J67299J95782K59152K31129K57817J89416K83399J77929
4137A3902173L13131L89660N09383O34276M89805M81478M54373M14529L90726
4128A7979534L67012L92591M18687M59972L62432L53913M28271L88235L29748
$$ plain form
4198 8946659 8744909 8570544 8508002 8432243 8408868 8404198 8491756 8597343 8655343 8729005 8638995
4187 8638995 8556637 8328579 8037131 7800691 7610356 7364194 7001470 6804156 6734742 6569382
4177 6569382 6464298 6401041 6358349 6341573 6360156 6380145 6512111 6622790 6697705 6769012 6795908
4166 6795908 6890797 7039648 7163623 7268860 7419928 7535156 7734706 7871284 8017952 8263714
4156 8263714 8552473 8837663 9126656 9449187 9837028 10311279 10853168 11222982 11541723 11838216
4146 11838216 12140250 12307549 12503331 12762483 12993612 13251429 13440845 13724244 13902173
4137 13902173 14215304 14604964 15114347 15748623 16238428 16719906 17174279 17588808 17979534
4128 17979534 18346546 18739137 19157824 19617796 19980228 20334141 20762412 21150647 21480395
4119B1480395M02870N09745P01092P46084O39384O19908O01921M99277N21848
4110B6722524O06377P18792J006927J121133J013954Q56971P32463N19355L18087
4101C3616583K32300J61786R4577R251P3543m1454k1410O2746P7360K97719L04929
4090C4867930M02359M88652M78713N88592N64253M70736M82803O01500R17902
4081C9863440J168732J483166J591729J581313J619529J496387J369966J217090
4073E1391352J069844R42795P57618N94996N33231N19510L59600L02211L99977
4064E6871134K96532K36292K23155J46195J11971J61708J4918p3584k02438k91881
4054E7494002k97094k50431k66549k67969j80483p2040K07070K98771L76441M17828
$$ plain form
4119 21480395 21883265 22393010 23094102 23840186 24479570 25099478 25701399 26200676 26722524
4110 26722524 27328901 28047693 29054620 30175753 31189707 32046678 32779141 33298496 33616583
4101 33616583 33848883 34010669 34105246 34114497 34188040 34146586 34125176 34187922 34265282 34563001 34867930
4090 34867930 35270289 35758941 36237654 36826246 37390499 37861235 38344038 38945538 39863440
4081 39863440 41032172 42515338 44107067 45688380 47307909 48804296 50174262 51391352
4073 51391352 52461196 53403991 54161609 54756605 55289836 55809346 56168946 56471157 56871134
4064 56871134 57167666 57403958 57627113 57773308 57885279 58046987 58061905 57988321 57785883 57494002
4054 57494002 57196908 56946477 56679928 56411959 56231476 56159436 56366506 56665277 57041718 57459546
4044E7459546L28387K90714K46862Q5424K4332q8129l99783o44944o51299o99816
4034E5951294p76710r77513j188439j579317j894420k212323k326715k155115
4026D2840742j999230j495204j129047p14971m20647j91067j54341j39163j00333
4017C6496739j49487j65260l09666l22710l36312n14875o07932o16555n48310
4008C2925632l07025o6781N3838J41821m382l13636n68101r77585j160192j239073
3998B8484516j221044j110224q39405o47112n39260m12988m74287n13315n21646
3989B2205235n84499n29469n36113m94414m59736l88670l92051k95709j87490
3980A8337084k42871k94462j52469j84201m50079m18557m80679n35458n59182
$$ plain form
4044 57459546 57787933 58078647 58325509 58410933 58435265 58347136 57947353 57302409 56651110 55951294
4034 55951294 55174584 54197071 53008632 51429315 49534895 47322572 44995857 42840742
4026 42840742 40841512 39346308 38217261 37502290 37081643 36890576 36736235 36597072 36496739
4017 36496739 36347252 36181992 35872326 35549616 35213304 34698429 34090497 33473942 32925632
4008 32925632 32618607 32551826 32605664 32747485 32743103 32429467 31861366 30883781 29723589 28484516
3998 28484516 27263472 26153248 25313843 24666731 24127471 23714483 23240196 22726881 22205235
3989 22205235 21620736 21091267 20555154 20060740 19601004 19212334 18820283 18524574 18337084
3980 18337084 18094213 17799751 17647282 17463081 17013002 16594445 16113766 15578308 15019126
3971A5019126n47792l62007l98396m04447k24479l15903k38396j95679l03098
3962A2028929k26479j21328j10073j10889j31308j79388q8693j17406k38243k38403
3952A0466719j66847j58871j45608j00637j34905j46578j47404m9812P190k4698
3942I398549L2000J35175J06746J93998K25798K41047K89324K64088K25448J60836
3932A1273009P1629J03588M1698p4672p1820o1966o0213m2008Q4031J26835J04427
3921A1494538R5653K34450L12803J63831K03431K68234K38728R4829O2158O4125
3911A3232780k3388m1122O896K2410J58294K02908K19426K57687L36950L42757
3901A4715598K67889J50244J53148J29993N8823l7931m8700k2429l0261n0288
$$ plain form
3971 15019126 14471334 14109327 13710931 13306484 13082005 12766102 12527706 12332027 12028929
3962 12028929 11802450 11681122 11571049 11460160 11328852 11149464 11060771 10943365 10705122 10466719
3952 10466719 10299872 10141001 9995393 9894756 9759851 9613273 9465869 9416057 9423247 9398549
3942 9398549 9430549 9565724 9672470 9866468 10092266 10333313 10622637 10886725 11112173 11273009
3932 11273009 11344638 11448226 11489924 11415252 11343432 11281466 11221253 11179245 11263276 11390111 11494538
3921 11494538 11590191 11824641 12137444 12301275 12504706 12772940 13011668 13106497 13168655 13232780
3911 13232780 13209392 13168270 13175166 13197576 13355870 13558778 13778204 14035891 14372841 14715598
3901 14715598 14983487 15133731 15286879 15416872 15475695 15437764 15389064 15366635 15336374 15286086
3891A5286086Q9423K29875L16305M52853M74325N69482O73282P85229P50571Q35952
3881B0463383O48326M62968M68280L88259J92648J23714Q6698K3154R085J19002
3871B2985517K36477L87628N29567O43423P88654Q30352Q35296P65402O19081
3862B8621397N14772L41253R6363j39427k28822l66457m72429n26841n12616l28196
3852B6998997j40136N1182L03749N29932O69396O26027M82940L02048M6820j90793
3842B9680162m55700n87708q41292r91051p72025p53023o79462m05578k94963
3833B3899360r8231P0752J3835J50566J45985K86434L32688L07650M61643M53587
3823B6024269N51364N56726O92323Q19538R27409J092982J167736J147286J227710
$$ plain form
3891 15286086 15375509 15605384 15921689 16374542 16848867 17418349 18091631 18876860 19627431 20463383
3881 20463383 21111709 21574677 22042957 22431216 22623864 22747578 22834276 22857430 22866515 22985517
3871 22985517 23221994 23609622 24139189 24782612 25571266 26401618 27236914 28002316 28621397
3862 28621397 29136169 29477422 29573785 29434358 29205536 28839079 28366650 27839809 27327193 26998997
3852 26998997 26858861 26910043 27213792 27743724 28413120 29039147 29522087 29824135 29870955 29680162
3842 29680162 29224462 28636754 27795462 26804411 26032386 25279363 24599901 24194323 23899360
3833 23899360 23801129 23871881 23885716 24036282 24182267 24468701 24801389 25109039 25570682 26024269
3823 26024269 26575633 27132359 27824682 28644220 29571629 30664611 31832347 32979633 34207343
3814C4207343J265524J285021J367557J289238J092820P92228K11136l21865p74683
3805D0414319j113705j265207j205173j059071p67568n23403k60819J35K17239
3796C4436747N70100Q40449J255001J611304J949037J953875J793624J159824
3788D5569961M37290l47362j037514j941899k339619k445302k438646k087429
3780C3369480j952885j563366j162912p92582l63850J37789M35001P98385J100827
3771C0005887J247243J171967J023472O20951K28519k43800o52388r50879j071105
3762C1379867j083665j033785r50879q42253p95493p99841o95249o71080m85874
3753B4021748m05633k40504K1520J41123L87306N06501N10523P79324J076962
$$ plain form
3814 34207343 35472867 36757888 38125445 39414683 40507503 41299731 41510867 41189002 40414319
3805 40414319 39300614 38035407 36830234 35771163 35003595 34480192 34219373 34219508 34436747
3796 34436747 35006847 35847296 37102297 38713601 40662638 42616513 44410137 45569961
3788 45569961 46007251 45659889 44622375 42680476 40340857 37895555 35456909 33369480
3780 33369480 31416595 29853229 28690317 27897735 27533885 27671674 28106675 28905060 30005887
3771 30005887 31253130 32425097 33448569 34069520 34298039 34054239 33401851 32450972 31379867
3762 31379867 30296202 29262417 28311538 27469285 26673792 25873951 25178702 24507622 24021748
3753 24021748 23616115 23375611 23397131 23538254 23925560 24432061 24942584 25721908 26798870
3744B6798870J108240J096956J009979P16208L81451r6500n11280n81830o58558
3735B9263536o59792n20155l00180k69283k30731k45866l11842n74292p58423
3726B5392972p42106q22831q14687p71526p01623n38543n75187m80276m67858
3717A9478335m51807l83185l67784k95777r2878m4724o6931j23895k51002l30199
3707A7070153n59983n32504n25512n80365n95232n49851m28568l04244l36352
3698A2657542k76655k49276j40296n3913L3043P2784J51479J79014K60135J98277
3688A2832134r40k37101m34927n19730m59984l89099k86268j69695j9081l653
3678A0311656N5085N7073J83945J86469J50933K51365J57983K5167q5900l74230
$$ plain form
3744 26798870 27907110 29004066 30014045 30730253 31111704 31015204 30503924 29922094 29263536
3735 29263536 28603744 28083589 27783409 27514126 27283395 27037529 26725687 26151395 25392972
3726 25392972 24650866 23828035 23013348 22241822 21540199 21001656 20426469 19946193 19478335
3717 19478335 19026528 18643343 18275559 17979782 17886904 17842180 17775249 17651354 17400352 17070153
3707 17070153 16510170 15977666 15452154 14871789 14276557 13726706 13298138 12993894 12657542
3698 12657542 12380887 12131611 11991315 11937402 11970445 12043229 12194708 12373722 12633857 12832134
3688 12832134 12831194 12594093 12159166 11639436 11179452 10790353 10504085 10334390 10315309 10311656
3678 10311656 10366741 10423814 10607759 10794228 10945161 11196526 11354509 11379676 11293776 10919546
3668A0919546m97806m51610m52307l71886l03552k36705k11289k11470j71744
3659H011177p6609L8485L9168L6587M4189k6374p8765j85806j46267j74902r1741
3648G389142r5022r0880q2234j57184j40790j02229p8642n5558l4139o939Q4526
3637F630051K0691p9453j58009j20629k10143k00661p3606j43517j09344p3532
3627E481848O733O1788J1937j1205J20769L2584P0453N480J5854n3064n8943j21552
3615E562682o5686N1859l8353m8942j48575m9455o0376m0720L5349k6309o0705
3604E110769j1363M7293L0938J8043O284O1790O5948Q1729L3429L7537q5938p3875
3592E322584r1752j11554r7698p6224o4754k2908K4813L714N3521M1667R6232
$$ plain form
3668 10919546 10421740 9970130 9517823 9145937 8842385 8605680 8394391 8182921 8011177
3659 8011177 7934568 7973053 8012221 8048808 8092997 8066623 7987858 7802052 7655785 7480883 7389142
3648 7389142 7294120 7203240 7121006 6963822 6823032 6720803 6642161 6586603 6552464 6545525 6630051
3637 6630051 6650742 6571289 6413280 6292651 6082508 5881847 5808241 5664724 5555380 5481848
3627 5481848 5488581 5550369 5562306 5551101 5671870 5704454 5774907 5780387 5796241 5743177 5684234 5562682
3615 5562682 5496996 5548855 5510502 5461560 5312985 5263530 5203154 5162434 5197783 5171474 5110769
3604 5110769 5099406 5146699 5177637 5195680 5201964 5263754 5329702 5411431 5444860 5482397 5396459 5322584
3592 5322584 5230832 5119278 5021580 4945356 4880602 4857694 4882507 4886221 4939742 4981409 5077641
3581E077641J11012K5223L3274P6111L6729N42j6605n6229J7553M6215k8981K3308
3569E345793j2797m997o937N9289J03833J09328J16897J00976J6722J46177J25607
3558F099891J02829J73614J28165J74230J80055K33990K25400J87899J20474J14922
3548G741469K58323J99133J37040J19161J43234J17662J39991O9329K24556J55559
3538I305457J08612J35492J64450K04698J60955J28151J67771K47332K33017L11983
3528A1167918L35590L78987M08778K40964J69084J66405J28315J67292K56680
3519A3420013M15939M31563M97314L84037J89848l5755j96512k58306k76667j74511
3509A4396963m0980j4931P8753M1779p0022r7798j45562j46688L0345J10725K62774
$$ plain form
3581 5077641 5188653 5213876 5247150 5323261 5359990 5360532 5343927 5287698 5305251 5351466 5322485 5345793
3569 5345793 5332996 5327999 5321062 5380351 5484184 5593512 5710409 5811385 5828107 5974284 6099891
3558 6099891 6202720 6376334 6504499 6678729 6858784 7092774 7318174 7506073 7626547 7741469
3548 7741469 7999792 8198925 8335965 8455126 8598360 8716022 8856013 8925342 9149898 9305457
3538 9305457 9414069 9549561 9714011 9918709 10079664 10207815 10375586 10622918 10855935 11167918
3528 11167918 11503508 11882495 12291273 12532237 12701321 12867726 12996041 13163333 13420013
3519 13420013 13835952 14267515 14764829 15148866 15338714 15302959 15106447 14848141 14571474 14396963
3509 14396963 14355983 14341052 14419805 14461584 14391562 14293764 14148202 14001514 14031859 14142584 14405358
3498A4405358M72284N50802O31281O79278O55785N87525P65773Q64678R51866
3489B0564630R17218Q82896N85337K28589j23842m50611o54514q04804p42025
3480B0402874n62782m72991m35901k82805j09177m7832n9504o6001j11760n7162
3470A8196959k0804L5808N5640J63661K09702J12036L1010L9876j2857j05079
3460A8705952j21126l8665p9894p1574m5611j63278l25230m77973o24670n91334
3450A6166597m92220n30390m31407l34281l57942l34909k74797l45195l30065
3441A2735391l20316l41960k63607j32023k1521J17022J22266M8189k0487k1254
3431A1901700j15596j58957j43814q5537r8958o2563j42675k54401j92159k23319
$$ plain form
3498 14405358 14877642 15428444 16059725 16739003 17394788 17982313 18748086 19612764 20564630
3489 20564630 21481848 22364744 22950081 23178670 23054828 22604217 21949703 21144899 20402874
3480 20402874 19840092 19367101 18931200 18648395 18539218 18491386 18431882 18365881 18254121 18196959
3470 18196959 18176155 18211963 18267603 18431264 18640966 18753002 18784012 18823888 18811031 18705952
3460 18705952 18584826 18546161 18466267 18394693 18349082 18185804 17860574 17382601 16757931 16166597
3450 16166597 15674377 15143987 14712580 14378299 14020357 13685448 13410651 13065456 12735391
3441 12735391 12415075 12073115 11809508 11677485 11655964 11772986 11895252 11943441 11922954 11901700
3431 11901700 11786104 11627147 11483333 11397796 11298838 11236275 11093600 10839199 10647040 10423721
3421A0423721j39542r5598L1988n11P2166J08808J49059J64484J13179J09935
3411A0937689J63612K52327J93294K72630L46123J59928J61134K7319l9275j17626
3401A2357155K7639M3049K15947K63114K20291L63767M14006K54506J85206R3912
3391A4438592q1687l22886k58759k43365k90153j48225j47611r1724j2161r695
3381A2832326k08025j54324q0242Q4503O7083J52982J64787J32098J16085k627
3371A3104646J59010K54492L81806M65063N03500O86375N93378M55927K35203
3362A6839400N2609j81779k56345l04132k77226k47139k34481j96491k3074m548
3352A5166794j2513K2718N4594o9428N078R4752K18322L75058M14429L18436L48275
$$ plain form
3421 10423721 10284179 10188581 10220569 10220058 10292224 10401032 10550091 10714575 10827754 10937689
3411 10937689 11101301 11353628 11546922 11819552 12165675 12325603 12486737 12514056 12474781 12357155
3401 12357155 12384794 12427843 12643790 12906904 13127195 13490962 13904968 14159474 14344680 14438592
3391 14438592 14356905 14034019 13775260 13531895 13241742 13093517 12945906 12854182 12842021 12832326
3381 12832326 12624301 12469977 12389735 12474238 12541321 12694303 12859090 12991188 13107273 13104646
3371 13104646 13263656 13518148 13899954 14365017 14868517 15554892 16148270 16604197 16839400
3362 16839400 16892009 16710230 16453885 16149753 15872527 15625388 15390907 15194416 15171342 15166794
3352 15166794 15154281 15176999 15231593 15162165 15167243 15261995 15480317 15855375 16269804 16588240 16936515
3341A6936515K71195l1247r8678k04826l11199l29986l17573k59199j66577j15198
3331A5373227n2755l0693N2745K41303K33119N95698O70561P37388O75019M36044
3321A8931656K37948p8997l58799m34464m58871l50264j92235N403J54320J91037
3311A7646734J91121O9999J78376J17391J70371K50569L69142O40156R62064J124882
3301B1720805J109773R58042Q02420N51390K14755l3545j53772l28426m72114
3292B4369328o20380p35635q31935r70061j211063j276630j177231r58146r30595
3283A5657652p05528m86665l03495k03742j09347j100J04109J69988K36198K92173
3273A4650243M33314M26685N00678M07357L76362L15373K49816K02922J22251
$$ plain form
3341 16936515 17207710 17176463 17077785 16872959 16561760 16231774 15914201 15655002 15488425 15373227
3331 15373227 15320472 15289779 15342524 15583827 15816946 16412644 17083205 17820593 18495612 18931656
3321 18931656 19169604 19090607 18731808 18297344 17838473 17488209 17295974 17301377 17455697 17646734
3311 17646734 17837855 17907854 18086230 18203621 18373992 18624561 18993703 19633859 20595923 21720805
3301 21720805 22830578 23788620 24591040 25142430 25357185 25323640 25169868 24841442 24369328
3292 24369328 23748948 23013313 22181378 21211317 20000254 18723624 17546393 16588247 15657652
3283 15657652 14952124 14465459 14161964 13958222 13848875 13847775 13951884 14121872 14358070 14650243
3273 14650243 15083557 15510242 16010920 16418277 16794639 17110012 17359828 17562750 17685001
3264A7685001J49751J36042J23527M7563k4159j55747k89118l12082k90328k58191
3254A6812259k82589k87038l34516k98218k99588l55280k40807k43567m14817
3245A4055839m76084l10660l73043l99089l13783k21234j71790j06635k4972j14583
3235A1543966r9276j5239N6403K18737J45609J58400J18050k3113o7815P4566
3225A2110288o9620l2245o7763j28412n3300k8564j03182j58915k7895P6883J72537
3214A1689812K26043M35039M65634N34762M78261K89405J82453J04234J21279
3205A4526922K00303K96741M53488P20340R75698J175140J678035K356114L109074
3196B5491855L901367M429340M814014M645825L972487K890249J560809N3348
$$ plain form
3264 17685001 17834752 17970794 18094321 18141884 18117725 17961978 17672860 17360778 17070450 16812259
3254 16812259 16529670 16242632 15908116 15609898 15310310 14955030 14714223 14470656 14055839
3245 14055839 13579755 13269095 12896052 12496963 12183180 11961946 11790156 11683521 11658549 11543966
3235 11543966 11444690 11429451 11485854 11704591 11850200 12008600 12126650 12103537 12035722 12110288
3225 12110288 12040668 12008423 11940660 11812248 11758948 11730384 11627202 11468287 11440392 11517275 11689812
3214 11689812 11915855 12350894 12816528 13351290 13829551 14118956 14301409 14405643 14526922
3205 14526922 14727225 15023966 15477454 16197794 17173492 18348632 20026667 22382781 25491855
3196 25491855 29393222 33822562 38636576 43282401 47254888 50145137 51705946 51759294
3188E1759294j506553k895549l735809m070764m105929l720401l062171k623660
3180B6038458k011022j453324j125273p65832n01203l17185k09157P5985K24554
3171A9956001J74988J79389J22656K4640r8791k25807k87220k25890j44739N1298
3161A9526525Q1627K83010M00483M62615O36414Q22968J104196J528693K126348
3152B6972879K736223L341042L594656L240799K460055J301793j80739j225549
3144D2241159j854257k127335j995780j756980j472597j004886p38049m40539
3136C0850736k68469q0671J78291L31277M67905O94235R70937J213102J481955
3127C5839298J703621J941910K175178K380368K702506K963057L507204M518001
$$ plain form
3188 51759294 50252741 47357192 43621383 39550619 35444690 31724289 28662118 26038458
3180 26038458 24027436 22574112 21448839 20683007 20181804 19864619 19655462 19731447 19956001
3171 19956001 20130989 20310378 20433034 20457674 20358883 20133076 19845856 19619966 19475227 19526525
3161 19526525 19608152 19891162 20291645 20754260 21390674 22213642 23317838 24846531 26972879
3152 26972879 29709102 33050144 36644800 39885599 42345654 43647447 43466708 42241159
3144 42241159 40386902 38259567 36263787 34506807 33034210 32029324 31291275 30850736
3136 30850736 30582267 30501596 30679887 31011164 31479069 32173304 33144241 34357343 35839298
3127 35839298 37542919 39484829 41660007 44040375 46742881 49705938 53213142 57731143
3119E7731143N800531P545756R639806J1373275J2216894J1737829J0125252Q144637
3111A34315123P305383Q765388J3460896K0400806K6171620K6716150K1123467
3104B58258833J1854285K471166m708118r547790j2196415j3492527j3314228
3097B19325206j1679162q694334m733397n16573L100298N703594O444066M884730
3089B13834428J080641m077463r335581j2957377j3957279j2102917q213382l330567
3081A50940503J923199N933874P197934M172350j739497p971233j2439887j4368327
3073A33648916j3602405j1142138q222872n204258k906082j105949O01017K572885
3065I4639114M405188N780496O237541N643721M538545L667785L908582N657076
$$ plain form
3119 57731143 63531674 71077430 80717236 92090511 104307405 116045234 126170486 134315123
3111 134315123 141620506 150385894 163846790 184247596 210419216 237135366 258258833
3104 258258833 270113118 272584284 267876166 258328376 246131961 232639434 219325206
3097 219325206 207646044 198951710 194218313 193701740 196802038 202505632 208949698 213834428
3089 213834428 214915069 210837606 201502025 188544648 174587369 162484452 154271070 150940503
3081 150940503 152863702 158797576 165995510 170167860 168428363 160457130 148017243 133648916
3073 133648916 120046511 108904373 100681501 95477243 92571161 91465212 92066229 94639114
3065 94639114 99044302 104824798 111062339 116706060 121244605 124912390 128820972 134478048
3057A34478048P901178Q395478N102010j151417q015575j3516584j6231590j6497694
3049A00463854j4913328j2577430j0163301q028202o384502m994381l897574l133502
3041C6371634k470400j927687j353392r96794p53666n71571o22336p56423r86358
3032B5933007j115625j168331j181793j060102j061461j035444r43571p61503
3024A7605177o93862o43200n96516m87478l49112k05945j97653j31720q7742r224
3014A4202725k636P9679J04671J67045J74100J43167J74369K16917K66932K57192
3004A5784161O20862Q43641J183034J532772J838733K073495J960487J619779
2996B7456964J236094Q67181P53729J402142K945782N774941R299664J1255611
$$ plain form
3057 134478048 142379226 150774704 155876714 154725297 146709722 133193138 116961548 100463854
3049 100463854 85550526 72973096 62809795 54781593 48397091 43402710 39505136 36371634
3041 36371634 33901234 31973547 30620155 29623361 28869695 28298124 27675788 26919365 25933007
3032 25933007 24817382 23649051 22467258 21407156 20345695 19310251 18366680 17605177
3024 17605177 16911315 16268115 15671599 15184121 14835009 14629064 14431411 14299691 14211949 14202725
3014 14202725 14200089 14279768 14384439 14551484 14725584 14868751 15043120 15260037 15526969 15784161
3004 15784161 16405023 17248664 18431698 19964470 21803203 23876698 25837185 27456964
2996 27456964 28693058 29560239 30313968 31716110 34661892 40436833 49736497 60992108
2988F0992108R778537N129025o22445n493087p964905q340605p233957n670369
2980D0574302m133940l182396k681618k479981k447786k310063k393757k320693
2972A8624068k116748j854259j607581j275166r57144q81695p32834n41889l80883
2963H275869m26429j96766k52486k44351j13945j35122l4466k0514K7851J67565
2953G047206K01583K30521Q305p9475J4988o5287j178K58187L20457M63200O17100
2942I015607N90119M76431K55527k96l15747m78486o53890n91936o03404n70079
2932G123846m23165k66455j19460j7375J20870K16859M34053N90001O00014N05684
2922H764872L72264J11930k28103m86196o25656p10279p31141n55528m28987l11398
$$ plain form
2988 60992108 70770645 75899670 75277225 69784138 61819233 53478628 46244671 40574302
2980 40574302 36440362 33257966 30576348 28096367 25648581 23338518 20944761 18624068
2972 18624068 16507320 14653061 13045480 11770314 10813170 9931475 9198641 8656752 8275869
2963 8275869 7849440 7652674 7400188 7155837 7041892 6906770 6872304 6851790 6879641 7047206
2953 7047206 7248789 7479310 7487615 7408140 7423128 7357841 7356663 7614850 7935307 8398507 9015607
2942 9015607 9605726 10082157 10337684 10337388 10021641 9543155 8889265 8297329 7693925 7123846
2932 7123846 6700681 6434226 6314766 6297391 6418261 6635120 7069173 7659174 8259188 8764872
2922 8764872 9137136 9249066 9020963 8534767 7909111 7198832 6467691 5912163 5483176 5171778
2912E171778q1595J29142K91551M53449N09390N22672K76553O3251k76328m81540
2902F578323o25712p18099n89221m19496m17174l88791k45939r4610l4742j1205
2892C033334J14129K61169L78509N13428N09479N30819M18219J93151j8511k94425
2882E639301n15758n77170n89629n89102m86095l32787l03322k09999j75846j22905
2872A736688p2281l3348o3937l8385l2097m0375N2008L5810O680l2789o7980k4650
2860A425344p336k6360Q2045K3391J14050Q9000Q7631K68302L54553M43108N58585
2849C412313N64544N24496L39558J48494l4933l04996m23340m91913m38126l62850
2839B933247l27213k94499q0633m5466j2918J05880K14288K93347L79300M73580
$$ plain form
2912 5171778 5090183 5219325 5510876 5964325 6473715 6996387 7272940 7336191 7059863 6578323
2902 6578323 5952611 5234512 4645291 4225795 3808621 3419830 3173891 3079281 3044539 3033334
2892 3033334 3147463 3408632 3787141 4300569 4810048 5340867 5759086 5952237 5933726 5639301
2882 5639301 5123543 4546373 3956744 3367642 2881547 2548760 2245438 2035439 1859593 1736688
2872 1736688 1664407 1631059 1567122 1528737 1496640 1456265 1508273 1544083 1550763 1517974 1449994 1425344
2860 1425344 1418008 1391648 1473693 1497084 1611134 1700134 1787765 2056067 2410620 2853728 3412313
2849 3412313 3976857 4501353 4840911 4989405 4954472 4649476 4226136 3734223 3296097 2933247
2839 2933247 2606034 2311535 2230902 2185436 2172518 2278398 2492686 2786033 3165333 3638913
2829C638913N89186N63910M47520K71473R9887q7673l57799m70411n03595m19548
2819C771863m15613l86141l21542k77138k13981k23677j97873j61230p1039k4690
2809A478939n3530l5402m6420L3855n6966r9550o8480r1909j6655j6929o3516
2798I63437r730m8613m1348N4370o80o1844k6559o7864n3259p8491k6060J1880
2786F15239J264p330j12278M497M8821P2241M1628j22431P2878M6960J64M1686
2774G03339J39515J8372k0724j3054j08642q0646j02838j00193p8939r1736k3297
2763B41157n4517p909n1556r684k8354j7501n5495l3565L7358J6907k465J2673
2751D7049j3134r0579j3066n4543J4705J0487k1340R7785M6749k6674j01158q084
$$ plain form
2829 3638913 4228099 4792009 5239529 5511002 5610889 5523216 5165417 4695006 4191411 3771863
2819 3771863 3356250 2970109 2648567 2371429 2157448 1933771 1735898 1574668 1503629 1478939
2809 1478939 1425409 1390007 1343587 1377442 1320476 1220926 1152446 1060537 1043882 1026953 963437
2798 963437 953707 905094 863746 918116 917436 855592 829033 761169 707910 629419 603359 615239
2786 615239 616503 609173 496895 501392 550213 622454 664082 541651 614529 661489 661653 703339
2774 703339 842854 861226 840502 827448 718806 638160 535322 435129 356190 264454 241157
2763 241157 186640 178731 127175 117491 89137 71636 16141 -17424 19934 36841 34376 47049
2751 47049 33915 -56664 -69730 -124273 -109568 -99081 -120421 -22636 24113 -2561 -103719 -111803
2739a11803n174K7849o554M7345p5049m8206P8896q684k4726K6442J8650M5275
2727c5739l2605N371k1982K2870o6500n2142K8511r6571R7526o864r7061m9097
2715c04283J11015J5198n2866J2395O5135l2502J06252K6950P9194L3046J6499
2704G6033L9835J0422q1193K0557j09957j19212r772J8679m5474K7128K4466J105
2692a47383r8253M205q4084P9902O7112n1607k5417M838K4635j0209J1037J3195
2680b12029m4824o6447N7601J2274m955N650j1911N0080K9378l6190J3743n2576
2668b60206P463L3398n7042o991j476n0600L2913L2500N4828q8853J0956J4894
2656b78216O4241j4499n8316M947M101L5328k5809n19L1884K0541o3915k3898
$$ plain form
2739 -111803 -116977 -89128 -95682 -48337 -123386 -171592 -92696 -101380 -126106 -99664 -81014 -35739
2727 -35739 -68344 -62973 -84955 -62085 -128585 -180727 -152216 -248787 -151261 -158125 -255186 -304283
2715 -304283 -193268 -178070 -230936 -218541 -153406 -185908 -79656 -52706 26488 59534 76033
2704 76033 115868 126290 45097 65654 -44303 -163515 -173287 -154608 -200082 -172954 -148488 -147383
2692 -147383 -245636 -241431 -325515 -245613 -178501 -230108 -255525 -250687 -226052 -236261 -225224 -212029
2680 -212029 -256853 -323300 -265699 -253425 -258380 -252730 -264641 -214561 -185183 -221373 -207630 -260206
2668 -260206 -252743 -219345 -276387 -283378 -284854 -335454 -302541 -270041 -215213 -304066 -293110 -278216
2656 -278216 -213975 -228474 -286790 -281843 -277742 -242414 -268223 -268742 -236858 -216317 -280232 -304130
2644c04130k659j0429J02822l5132M6481N284M6751k1393m3524l3780L4760K6297
2632a88652n1361K8803l2332J1175M7222K066m3803m2712N1674K9350n948M4204
2620a50314L9575P5889J08216Q9115O9053o9535k5722k7398m5174p6550k7297
2609d0142L0779o7983o5381o2841m8565j6146M6693J2969J6823k4002M1299l1970
2597b08467m3979K4630J9885L367o4220j8936J7426R311j3794K0252J4107J7905
2585b22513q8397l0456J1716k7988j2556O4530J7412j172J8249J4708q0615K6839
2573c10243M6408L1007J7306n4056K0961j961K2894l9362k5328N4053r268k3941
2561b71530j9720n376O0657M9868L4628l4504n168K99m7960j3614K1691J4785
$$ plain form
2644 -304130 -306789 -317218 -214396 -249528 -203047 -197763 -151012 -172405 -215929 -249709 -214949 -188652
2632 -188652 -240013 -211210 -243542 -232367 -185145 -183079 -226882 -269594 -217920 -188570 -194518 -150314
2620 -150314 -110739 -34850 73366 162481 231534 161999 136277 108879 63705 -12845 -40142
2609 -40142 -9363 -77346 -142727 -205568 -254133 -270279 -223586 -210617 -193794 -217796 -176497 -208467
2597 -208467 -252446 -227816 -207931 -204564 -268784 -287720 -270294 -260983 -274777 -254525 -240418 -222513
2585 -222513 -310910 -341366 -329650 -357638 -370194 -305664 -288252 -289424 -271175 -256467 -337082 -310243
2573 -310243 -263835 -232828 -215522 -269578 -248617 -250578 -227684 -267046 -292374 -238321 -247589 -271530
2561 -271530 -291250 -296626 -235969 -186101 -151473 -185977 -191145 -190846 -238806 -252420 -230729 -215944
2549b15944J747n9698N30P2541N3682m5968j723j4755N1736J1789j250J5117l5159
2536a67355m0819J2273K5146m2179o866M3371K1406M8152O70L649k6357p5719
2524b04628k9587j4400J1255M6975N4843o4688m5774N7213P1307o5594n5339N6233
2512a82184k6884K8034J08555J0042m2185J2661Q190M516p398m68k1768m4619
2500a53508N481m0368J5082P5700J5617J7973n0435J862J6413o2423P1774j1820
2488i8652m1181j4361M2842k0039M5572L237p4979n0077k7947J8795Q205J11443
2476i7142L719k5898m86l0596M1962M9317M5426k9475l5050J0234p100P9638N4445
2463E8994L255k7994j6779q2641J4025R6574J5539l9321o7442J2866L1315J3492
$$ plain form
2549 -215944 -214197 -273895 -273365 -200824 -147142 -193110 -194833 -209588 -157852 -146063 -147313 -132196 -167355
2536 -167355 -208174 -195901 -170755 -212934 -219800 -176429 -155023 -106871 -106201 -102552 -128909 -204628
2524 -204628 -234215 -248615 -237360 -190385 -135542 -200230 -246004 -188791 -117484 -183078 -238417 -182184
2512 -182184 -209068 -181034 -72479 -62437 -104622 -91961 -83771 -79255 -86653 -87121 -108889 -153508
2500 -153508 -148027 -188395 -173313 -97613 -81996 -64023 -114458 -112596 -96183 -158606 -86832 -98652
2488 -98652 -139833 -154194 -111352 -131391 -85819 -82582 -157561 -207638 -235585 -216790 -208585 -97142
2476 -97142 -93423 -119321 -119807 -150403 -108441 -59124 -13698 -43173 -78223 -67989 -75089 4549 58994
2463 58994 62249 34255 17476 -65165 -51140 45434 60973 21652 -45790 -32924 -1609 11883
2451A1883N1434K269j6661k2133K1020M5897Q765L317j3236K1561O964K2868J1894
2438A55842k0828l0683R192M5947O6887m1472L9591L034k9856K7468n1225k8897
2426A45000K9156l086K8258K0916L0096R883K1706n081L725o519j3142M1908O8400
2413C71220K6606m6822O2695J3176K9084N6809N119j1584l5361R215L6010K2498
2401E38665K9818N0023J37626n4779J8676J01358O2609k9624j5395M1308J12742
2390I93027N5532J06364m6820l2399M8871J02701k9236P2100P5011J28761P6904
2379A550816O8240P1834M4098K5739R5461J31188K82512K90394K27287L01748
2369C089317K56718L50456O91453P31629P14443M25829L17643J73140L22625L92985
$$ plain form
2451 11883 63317 65586 48925 26792 47812 93709 102474 105791 92555 114116 121080 143948 155842
2438 155842 135014 104331 113523 159470 226357 184885 224476 227510 197654 225122 173897 145000
2426 145000 174156 171070 199328 220244 250340 260223 281929 276848 280573 274054 260912 302820 371220
2413 371220 397826 351004 413699 426875 455959 512768 517887 506303 470942 480157 516167 538665
2401 538665 568483 618506 756132 701353 720029 821387 883996 854372 838977 880285 993027
2390 993027 1048559 1154923 1108103 1075704 1124575 1227276 1198040 1270140 1345151 1473912 1550816
2379 1550816 1619056 1690890 1734988 1760727 1856188 1987376 2269888 2560282 2787569 3089317
2369 3089317 3346035 3696491 4387944 5119573 5834016 6259845 6577488 6750628 7073253 7466238
2359G466238O54122P88266J277768J606249K396593L606538Q623522J6628649
2351D3047945K2113244J8234596M599210l608455j1566608j4501296j2989286
2344D5329350j0974778p917417n949220m514747l607721k572512j461171p18189
2336G613595l39715l48662n67214n44415o96381p32396o85945n01307l75366k46945
2326B575249k50374j23061j31626m0005j16628j29863j14124j35075j02662p9705
2316A352126m0469j90431q9355M3231k2012n9216n5462j2047p0544O175q7970
2305G74026O734j7771n6746j23949q124k6079K501o7529j1420n7724j8747R0648
2293D85820k7440q7530k8643p4178k0486q246J415k5071l4879L0486k1029l5099
$$ plain form
2359 7466238 8120360 8908626 10186394 11792643 14189236 17795774 26419296 43047945
2351 43047945 65161189 83395785 87994995 84386540 72819932 58318636 45329350
2344 45329350 34354572 26437155 20487935 15973188 12365467 9792955 8331784 7613595
2336 7613595 7273880 6925218 6358004 5813589 5117208 4384812 3698867 3197560 2822194 2575249
2326 2575249 2324875 2201814 2070188 2030183 1913555 1783692 1669568 1534493 1431831 1352126
2316 1352126 1311657 1121226 1031871 1075102 1053090 993874 938412 926365 855821 861996 774026
2305 774026 780760 762989 706243 582294 574170 548091 550592 483063 471643 413919 395172 485820
2293 485820 458380 370850 342207 268029 247543 239297 240712 215641 180762 211248 190219 155120
2281A55120l4688n762K5989p8256m2404k8581k8538J3316P2820n683l271j2050
2269B8012k1436Q67p387n0216M0423l4138p3160n232j4913K6414K7832n4697L0513
2256a07118m6494P2192J9370q1285P925J9190K2212n9137j01835K4354N5912L2096
2244a42618p6922n9422J2359J07482K7206k2627m4553J3142r219n6681P4916k7817
2232b04754j2804L1939m8433L0806J1578k7903o539n9518Q9699q297j784L8903
2220a67107k8341o7894K0310L0112q0347n8940K6650l0930L5076k0922o2999N1586
2208c53746j391M8462N5043q385L0374j6647j6103k1397k3154o7031O667L2267
2196c35041j3323l4189k2440J8688L269L6484N6307j3310j3154L3775j6376j3955
$$ plain form
2281 155120 120432 114670 140659 62403 19999 -8582 -37120 -23804 49016 43333 40062 28012
2269 28012 6576 7443 56 -50160 -9737 -43875 -117035 -122267 -137180 -110766 -82934 -137631 -107118
2256 -107118 -153612 -81420 -62050 -143335 -135410 -116220 -94008 -153145 -254980 -230626 -174714 -142618
2244 -142618 -219540 -278962 -266603 -159121 -131915 -154542 -199095 -185953 -195172 -251853 -176937 -204754
2232 -204754 -217558 -185619 -234052 -203246 -191668 -219571 -226110 -285628 -195929 -204226 -206010 -167107
2220 -167107 -195448 -263342 -243032 -212920 -293267 -352207 -325557 -356487 -321411 -342333 -405332 -353746
2208 -353746 -355137 -306675 -251632 -260017 -229643 -246290 -262393 -283790 -306944 -373975 -367308 -335041
2196 -335041 -348364 -382553 -404993 -386305 -383036 -346552 -290245 -303555 -316709 -282934 -299310 -313265
2184c13265k5036N2299m5036q128J7133k8653k0695m9285m1586L2258l470J2081
2172d21383L1188m6787L5829k5723L473P2461M7851r460j3474o2986l5660p045
2160d31716K5670l7951K6482J4434n5480j1096Q6762n6290K6467j9037l6546N9115
2148d09186L8787l7873J8787l1832j7393J8624P7742j16283L2915O6733j9688
2137c78667m5471k2560k4814O5923O3034m4187K990M9419P8591j9656j7782l4874
2125c28054k1055M231K9225k9123q567j4329r211M089k9092k8710M0542L1656
2113c58398N1548o3311j2874O176L8272J866k3998q5279o2973J21379J2975j1642
2101c86259N9157p38l7273k4722l86Q74M1287j7300J1091j2275l1300K0545J1828
$$ plain form
2184 -313265 -338301 -286002 -331038 -339166 -322033 -350686 -371381 -420666 -462252 -429994 -433464 -421383
2172 -421383 -390195 -436982 -401153 -426876 -423403 -350942 -303091 -312551 -326025 -389011 -424671 -431716
2160 -431716 -406046 -443997 -417515 -403081 -458561 -469657 -382895 -439185 -412718 -431755 -468301 -409186
2148 -409186 -370399 -408272 -389485 -421317 -438710 -420086 -342344 -458627 -425712 -358979 -378667
2137 -378667 -424138 -446698 -471512 -405589 -342555 -386742 -383752 -334333 -255742 -275398 -293180 -328054
2125 -328054 -349109 -344878 -315653 -344776 -353343 -367672 -376883 -372794 -401886 -430596 -390054 -358398
2113 -358398 -306850 -370161 -383035 -376859 -338587 -336721 -360719 -445998 -508971 -387592 -374617 -386259
2101 -386259 -327102 -327840 -365113 -389835 -390221 -389347 -348060 -365360 -354269 -366544 -397844 -377299 -365471
2088c65471L6475N1606m8740l4814P3829J19404J00073P4587N2988m5498l6296
2077b1857k0636j07651n3068k2970o3363k5965l3987J9735J3032l1800j0757n9158
2065d18445R399M0659L2573k0894M4412n8069J9234o7837N356J3686M1367Q516
2053c50043l5365M9943J7178l7813K6568K4218k2230k0788K7224M9986l5351l9759
2041c46232j1567J1319M7p6630K6128O0515l0427N4744M921n4148n8846o5j6293
2028d36534o313Q3609K1371j4608l1272j9247K5171l506j1647K4265n646m7000
2016d21357j4743J6568J4629j4137M8562l6865j7100K8223N2661k9857J6360K3066
2004c33990o2610j46R37P688r829L423j2077o693m3072L1469k8982j5836L0475
$$ plain form
2088 -365471 -328996 -277390 -326130 -360944 -287115 -167711 -67638 6949 59937 14439 -21857
2077 -21857 -42493 -150144 -203212 -226182 -289545 -315510 -349497 -329762 -316730 -348530 -359287 -418445
2065 -418445 -409046 -368387 -335814 -356708 -312296 -370365 -351131 -418968 -413612 -399926 -358559 -350043
2053 -350043 -385408 -335465 -318287 -356100 -329532 -305314 -327544 -348332 -321108 -271122 -306473 -346232
2041 -346232 -357799 -346480 -346433 -423063 -396935 -336420 -366847 -312103 -307182 -361330 -420176 -420241 -436534
2028 -436534 -442847 -359238 -337867 -352475 -383747 -402994 -377823 -381329 -392976 -368711 -374357 -421357
2016 -421357 -436100 -419532 -404903 -419040 -370478 -407343 -424443 -396220 -343559 -373416 -357056 -333990
2004 -333990 -396600 -396746 -395809 -388121 -397950 -394527 -406604 -413297 -456369 -424900 -453882 -469718 -439243
1991d39243k7907L0851J5314L37j7062O878O6996K0843l719r141o0907o1371J3076
1978d65055J4801K0336P4888P904j02188m7766L1168J2905J4780N630K208k2018
1966d52407M8262P599J2335p6938M2310L0614L0298o336O82j6270K4084o8111
1954d23878O7600L5623o1419J8049m6458l6491K2261J37511k0007K2785l7875
1943c22299j21761L1419J881J8345p023L3675N9438o5857l3916J7713K4821L6389
1931c27175p932N576l7579L7228Q277l4022j5903J0607K9205n5398q325P7102
1919c18339m0247k8707L3282k1659J8021k3314J595l3243L4008R294l1870k423
1907d03602K8276P842K5524J2244n9665j1372J8335k016k2346l8625k6033K9221
$$ plain form
1991 -439243 -467150 -436299 -420985 -420648 -437710 -430832 -363836 -342993 -346712 -355853 -416760 -478131 -465055
1978 -465055 -450254 -429918 -355030 -347126 -449314 -497080 -465912 -453007 -438227 -432597 -430389 -452407
1966 -452407 -404145 -396546 -384211 -461149 -418839 -388225 -357927 -364263 -363581 -379851 -355767 -423878
1954 -423878 -356278 -320655 -382074 -364025 -410483 -446974 -424713 -287202 -307209 -284424 -322299
1943 -322299 -444060 -412641 -410760 -392415 -399438 -365763 -306325 -372182 -406098 -388385 -363564 -327175
1931 -327175 -335107 -329531 -367110 -329882 -321605 -355627 -371530 -360923 -331718 -387116 -395441 -318339
1919 -318339 -358586 -387293 -354011 -375670 -357649 -380963 -379368 -412611 -378603 -369309 -401179 -403602
1907 -403602 -375326 -367484 -341960 -329716 -389381 -400753 -382418 -384434 -406780 -445405 -471438 -442217
1895d42217L5653K1234Q910K1597k209n8289j9211M8486N1472j3473K960M7920
1883b97167m7714k310N0630p0966p0578j0173O541j1777j291N16M449l4627N3027
1870d31440J8556O1131M5720l6277m9479J3001n1067J2110k2117M1551O3998p443
1858c41756j7046o2333M0930L8818R916p0786R1750r795j5325L1377m0944N0836
1846b94358r768n7496J690J9720J5520m2975q840K1785r4394L8013l4912k828
1834d48843L0229j5061Q4394p593o2267l4050k9245M5370J0579L3744l039M4091
1822c51691j2888j7803m247n4065Q7150j487j2970l0430k3398k0987j6178L2680
1810d26314M0314k8324k93L0435j1618O8666j6946j7204K7689J4895N5696m3168
$$ plain form
1895 -442217 -406564 -385330 -376420 -354823 -357032 -415321 -434532 -386046 -334574 -348047 -345087 -297167
1883 -297167 -344881 -347191 -296561 -367527 -438105 -448278 -441737 -453514 -454805 -454289 -449840 -484467 -431440
1870 -431440 -412884 -351753 -306033 -342310 -391789 -378788 -429855 -417745 -439862 -398311 -334313 -341756
1858 -341756 -358802 -421135 -380205 -341387 -331471 -402257 -310507 -320302 -335627 -304250 -345194 -294358
1846 -294358 -304126 -361622 -359932 -340212 -324692 -367667 -376507 -354722 -449116 -411103 -446015 -448843
1834 -448843 -418614 -433675 -349281 -356874 -419141 -453191 -482436 -437066 -426487 -392743 -395782 -351691
1822 -351691 -364579 -382382 -386629 -440694 -353544 -355031 -368001 -398431 -421829 -442816 -458994 -426314
1810 -426314 -386000 -414324 -414617 -384182 -395800 -327134 -344080 -361284 -333595 -318700 -263004 -306172
1798c06172k617K7359j29277k8027M3438K726j0904l6259L5190J6070k3559j9000
1786d31032L1271j9341o8434Q4359Q5621o445p531m5565P917K6832p8058J5521
1774d04885R0116K2950k120r2616L7097N7742j8371m3438k7508o650L0596k7618
1762c84705J5299m0980j8671K7095M7756k1761J3000p820k2158J6401K4209M44
1750c51891J5337Q8107o5272j7629j1747m338k2105l6892L2903r721J7345L9009
1738c26894L4960r183n6853K8629j8364k0132P5184Q468q0840K5048L7891N6049
1726b46037j6225j01396Q554L6927k9202l3668J1053P1209n0880j4552N8425M625
1714c01167m6013R4742q782q1078k1525l1496r441P4644L0198l2076j0288K1106
$$ plain form
1798 -306172 -308789 -281430 -410707 -438734 -395296 -392570 -403474 -439733 -404543 -388473 -412032 -431032
1786 -431032 -399761 -419102 -487536 -403177 -317556 -324001 -331532 -377097 -369180 -342348 -420406 -404885
1774 -404885 -314769 -291819 -293939 -386555 -349458 -291716 -310087 -353525 -381033 -387683 -357087 -384705
1762 -384705 -369406 -410386 -429057 -401962 -354206 -375967 -362967 -370787 -392945 -376544 -352335 -351891
1750 -351891 -336554 -248447 -313719 -331348 -343095 -347433 -369538 -406430 -373527 -383248 -365903 -326894
1738 -326894 -291934 -301117 -357970 -329341 -347705 -367837 -292653 -284185 -365025 -339977 -302086 -246037
1726 -246037 -262262 -363658 -355104 -318177 -347379 -381047 -369994 -298785 -349665 -364217 -305792 -301167
1714 -301167 -347180 -252438 -261220 -342298 -363823 -395319 -404760 -330116 -299918 -331994 -342282 -321176
1702c21176M178r703m8746J3362K6783J6363L5145p5640l3912j4789n86M8893
1690c59828L9211q082M5357n4619l2929N568J8121l4955m4292K1129M1476J6542
1678c47301k7174L0748k7010M1081L6077o7521K3975J6331J9272m5212j3333n939
1666c66006n1807P2162M3626p502m86k0485K5175L687l6633p4064J9802L8477
1654c54054P1262K1709l6079n8750p3578l1951J9502Q2787J7115o9091N9460J4874
1642c36794O336M055j5614K1479M8216n5437k3715L3666k315l962O0562n0377
1630c13900L1833N1892q4236n2521k9921M7360j3109J6408m6201k4324J04098
1619c12621N8743l0589l5593O338R22l5682J5669M8101m564o3032K7519j0871
$$ plain form
1702 -321176 -316998 -326701 -375447 -362085 -335302 -318939 -283794 -359434 -393346 -408135 -408721 -359828
1690 -359828 -320617 -328699 -283342 -337961 -370890 -365322 -347201 -382156 -426448 -405319 -363843 -347301
1678 -347301 -374475 -343727 -370737 -329656 -293579 -361100 -337125 -320794 -301522 -346734 -360067 -366006
1666 -366006 -417813 -345651 -302025 -309527 -310013 -330498 -305323 -301636 -338269 -412333 -392531 -354054
1654 -354054 -282792 -261083 -297162 -355912 -429490 -461441 -441939 -359152 -342037 -411128 -351668 -336794
1642 -336794 -330458 -326403 -342017 -320538 -272322 -327759 -351474 -317808 -320123 -324085 -263523 -313900
1630 -313900 -282067 -230175 -314411 -366932 -396853 -349493 -362602 -346194 -392395 -416719 -312621
1619 -312621 -253878 -284467 -320060 -313722 -312800 -348482 -332813 -284712 -289276 -352308 -324789 -335660
1607c35660J2019M4524r397o8161p547j9206J4677J1293J0379l7008j365L6791
1595c48661m3211N420M4028k3182M7395n7719j6445O2337k5523l3437q349r643
1583d06990Q444M4937M159p674n5995J4072N7325J6310M1354K8913J8598n7457
1571b94004j6221j0260q1979o9055L5199L1811j1890M7488J13327M164k0365r6490
1559c68275n7643m349N2922p071l6480J7971o2931M5705R8805O3817o9127l230
1547c29886m403l5415J7416L7852p014n7954k0852R2672Q875J5913j5056m4420
1535c42272J500K7390L149j0966J3885l599K7397l4348j5290N1074j3516k2583
1523c18179m269K8706k9712j3648O3264J0633p0369l5887l236L4106M7323J2626
$$ plain form
1607 -335660 -323641 -279117 -288514 -356675 -364222 -383428 -368751 -357458 -347079 -384087 -385452 -348661
1595 -348661 -391872 -386452 -342424 -365606 -318211 -375930 -392375 -330038 -355561 -388998 -397347 -406990
1583 -406990 -398546 -353609 -349450 -357124 -413119 -399047 -341722 -325412 -284058 -255145 -236547 -294004
1571 -294004 -310225 -320485 -402464 -471519 -436320 -404509 -416399 -368911 -255584 -251420 -271785 -368275
1559 -368275 -425918 -430267 -377345 -384416 -420896 -402925 -465856 -420151 -321346 -257529 -326656 -329886
1547 -329886 -334289 -369704 -352288 -314436 -321450 -379404 -400256 -307584 -298709 -282796 -297852 -342272
1535 -342272 -340772 -313382 -310233 -321199 -307314 -310913 -283516 -317864 -333154 -282080 -295596 -318179
1523 -318179 -322448 -293742 -323454 -337102 -273838 -263205 -333574 -369461 -372697 -338591 -291268 -278642
1511b78642r9460l1097N1994k3982O380q7698j0501J07280r485n306K6488j9463
1499c73492n4957L0502L1412j1289K4454r6936J03572P1442m287L4249j406j9173
1487b65909p7405j8186j9871l3001O9884J7749O460k0585k0765K0538j3216K6216
1475c28091P657M5660m4945j17271J00184L656n4129L8562L1588K0048k6025L3614
1463b89492K3553J1445p0442m2425k1450j948j8595K5304L774l0967O0146M7646
1451c03451l2949J533J7174m1072l3479P0341l572K8546j2509o8867R219N7774
1439c11312Q297p790l3058K2365p5656j1352M0100K7897k5161r064Q0228k3553
1427c18059l4530J8792k4223O7701M3618o6585p709K2718k7253k2956M2893J5700
$$ plain form
1511 -278642 -378102 -409199 -357205 -381187 -374807 -462505 -473006 -365726 -375211 -380517 -354029 -373492
1499 -373492 -428449 -397947 -366535 -377824 -353370 -450306 -346734 -275292 -279579 -245330 -246736 -265909
1487 -265909 -343314 -361500 -381371 -414372 -344488 -326739 -320279 -340864 -361629 -341091 -354307 -328091
1475 -328091 -320434 -274774 -319719 -436990 -336806 -333150 -387279 -348717 -317129 -297081 -323106 -289492
1463 -289492 -265939 -254494 -324936 -367361 -388811 -390759 -409354 -384050 -380276 -411243 -351097 -303451
1451 -303451 -336400 -334867 -317693 -358765 -392244 -321903 -325475 -296929 -309438 -378305 -369086 -311312
1439 -311312 -303015 -310805 -343863 -321498 -397154 -408506 -368406 -340509 -365670 -374734 -294506 -318059
1427 -318059 -352589 -333797 -358020 -290319 -246701 -313286 -320995 -298277 -325530 -348486 -305593 -289893
1415b89893k8349Q381J0482l9857m0480N3691l052n3985L8973K6940k8232j567
1403c46948L3679J1597n624o5379J2202M3002J2588o8167N387K9437k1378m4427
1391d04031J6786J1237K7167R587M9962j0478m3752r14M8696l7914l226O0591
1379b76289j8478m4177M2925M709J4785K3550n4972l5914J984J351N9880l8696
1367c19342o180j236M9630j8906j7042k0667L6818N2837q3520l4566Q5641r385
1355b85918j05577N9800K1497l0108p2127P2637L1135o3994L5353M231J5866l1421
1343c48626n3925J3735N5290J2086m692L4645K2170m6256j9676R073n3111r197
1331c88484L1317J9353m937o1683L7088K7760l125j0515L7141M751l2460L7673
$$ plain form
1415 -289893 -318242 -309861 -299379 -339236 -379716 -326025 -329077 -383062 -344089 -317149 -345381 -346948
1403 -346948 -313269 -301672 -307296 -372675 -360473 -317471 -304883 -373050 -367663 -338226 -359604 -404031
1391 -404031 -387245 -376008 -348841 -339254 -289292 -299770 -343522 -344436 -295740 -333654 -336880 -276289
1379 -276289 -294767 -338944 -296019 -291310 -276525 -252975 -307947 -343861 -341877 -340526 -280646 -319342
1367 -319342 -325522 -326758 -277128 -296034 -313076 -333743 -296925 -244088 -327608 -362174 -276533 -285918
1355 -285918 -391495 -331695 -310198 -340306 -412433 -339796 -308661 -372655 -337302 -333071 -317205 -348626
1343 -348626 -402551 -388816 -333526 -321440 -326132 -291487 -269317 -315573 -335249 -326176 -379287 -388484
1331 -388484 -357167 -337814 -342751 -404434 -367346 -339586 -342711 -353226 -316085 -311334 -343794 -306121
1319c06121m7264L7550J9834m7947J0718L811l7970p158m5829P9102r889M5686
1307c05477k7470k111o4918N3166L1241m151O9433L5697n3101m3840N9220J0884
1295b41427l3748k520O738m9288J962k0744n134K1712k8920p1936Q2241K978n2055
1282c90141J8663J03160j1772p3115j3861j983K9492N1845J5964o8173k5263N2043
1270c13141n3473J4910k2090L0877J4560l7562o412M2386J4991n0761L8394o02
1258c27923k5307N9265K3959j4041j8983p0526N8101n357m9928Q412j1932K435
1246c71825j2340M3759k2499j9829K386M7434j503J6917L4923j04982L3029J9473
1234c35057O0440l2709q1329K177Q978K6577M4617n871m259K4967Q726k0645R4236
$$ plain form
1319 -306121 -353385 -315835 -296001 -343948 -333230 -329419 -367389 -374547 -420376 -341274 -351163 -305477
1307 -305477 -332947 -335058 -399976 -346810 -315569 -319720 -250287 -214590 -267691 -311531 -252311 -241427
1295 -241427 -275175 -277695 -270957 -320245 -318283 -339027 -344161 -322449 -351369 -423305 -341064 -338086 -390141
1282 -390141 -371478 -268318 -280090 -353205 -367066 -369049 -339557 -287712 -271748 -339921 -365184 -313141
1270 -313141 -366614 -351704 -373794 -342917 -328357 -365919 -372331 -329945 -314954 -365715 -327321 -327923
1258 -327923 -353230 -293965 -270006 -284047 -303030 -373556 -315455 -320812 -370740 -362328 -374260 -371825
1246 -371825 -384165 -340406 -362905 -382734 -380348 -332914 -334417 -317500 -282577 -387559 -354530 -335057
1234 -335057 -274617 -307326 -388655 -386478 -377500 -350923 -306306 -312177 -316436 -291469 -282743 -303388 -209152
1221b09152l9889q6723m8813J9546O2086K8876m0367n8401L4728M6335m2706k0552
1209c55032J1981M9971q5966l5413M3289M1551P4396L671p3761P441L0965o9160
1197c56067L8449m84P45l9594K5127J3231n2782K5591N7516P837J6819m3862j5633
1184c23107K3233k1832k1358J1828k6852j9405l5073K3212N208L5177M8295j5104
1172c15778O2279K5526l587q0219O824L5034n5592j2567J25J0275j4503l8549
1160c80732K4434K6209n3726J5235N9664r68k6543L1926j4820M1039M3142j4637
1148b49777r071r26q1685Q5275J4336m5430K1252o1956m3379n595K1598K5561
1136c29797l7017J517L9206K3383K9069L0630r800o918m8001o3074k2621l3866
$$ plain form
1221 -209152 -249041 -335764 -384577 -365031 -302945 -274069 -314436 -372837 -338109 -291774 -334480 -355032
1209 -355032 -343051 -293080 -379046 -414459 -371170 -329619 -255223 -251552 -325313 -317872 -286907 -356067
1197 -356067 -317618 -318102 -317357 -356951 -331824 -318593 -371375 -345784 -288268 -280431 -263612 -307474 -323107
1184 -323107 -299874 -321706 -343064 -331236 -358088 -377493 -412566 -389354 -384146 -348969 -300674 -315778
1172 -315778 -253499 -227973 -231560 -311779 -304955 -269921 -325513 -338080 -337955 -327680 -342183 -380732
1160 -380732 -356298 -330089 -383815 -368580 -308916 -309884 -336427 -304501 -319321 -278282 -235140 -249777
1148 -249777 -258848 -259774 -341459 -256184 -241848 -287278 -266026 -327982 -371361 -376956 -355358 -329797
1136 -329797 -366814 -365297 -326091 -302708 -273639 -243009 -252809 -259727 -307728 -370802 -393423 -427289
1124d27289K5987O5727L8965k3273l7331J3211J1592K5626K033p3488k8098J00918
1112c05420R35l1225N837j7833j17204N9131M4971J0628L1061k6411l2110k1763
1100c99403L5481n5003M0872L3896K1129Q179K86l0960L3105n4080J01229L1130
1088b34139j8163J4274n4762M323k8195j6542M4068J5593j7473K2437j1430o4727
1076c44736K4127O430j7567l4619L1957j840o048R704j1969K1225L0166n663N1851
1063b46982n2897j6231L0331j6682q654j0081L1850N717p4467l3142N2242M3043
1051b95953j5937k7926R661k8740N831m699m4116k170M6982P4886J987M919k3357
1038b98632k7249J7782J4459L0472K9975m927o1670o51j5106M796O2000n5628
$$ plain form
1124 -427289 -401302 -335575 -296610 -319883 -357214 -344003 -332411 -306785 -304752 -378240 -406338 -305420
1112 -305420 -304485 -335710 -329873 -347706 -464910 -405779 -360808 -350180 -319119 -345530 -377640 -399403
1100 -399403 -363922 -418925 -378053 -344157 -323028 -314849 -314563 -345523 -312418 -366498 -265269 -234139
1088 -234139 -252302 -238028 -292790 -288467 -316662 -333204 -289136 -273543 -291016 -268579 -280009 -344736
1076 -344736 -320609 -314179 -331746 -366365 -334408 -336248 -342296 -332592 -344561 -323336 -293170 -298833 -246982
1063 -246982 -299879 -316110 -285779 -302461 -311115 -321196 -289346 -283629 -358096 -391238 -338996 -295953
1051 -295953 -311890 -339816 -330155 -358895 -353064 -357763 -401879 -404049 -357067 -282181 -280194 -275275 -298632
1038 -298632 -325881 -308099 -293640 -263168 -233193 -238120 -299790 -300441 -315547 -310751 -248751 -304379
1026c04379Q945L2767m5214j9917J9950P5144p6592K9374o3472O955k6801k7592
1014c90832M4381N0402J7497o1987J4534O0322o4741J1753L7752k275j9501N1309
1002b51386r009o5239J8526J11417k7554n2890j7569l6960P8486K938n5306K9038
990b75508L8904p6907J8383n5895j6951m3996P3221M8274k5410J2917M0977r978
978b71969p7237K7893J10284K2426q7750q53J9116m336m2014l8200k2212L476
966c61376j9893P9645O5768q891m7978j3369O2223R860m0045o6978Q3134J8401
954b39499j2973n2712l4307R621K9906m2122K2749o413K5806M1183N4174k1445
942b26032p5812M9431l3324l5001l4466O3398L3787m5401k3727J1173k5802J450
$$ plain form
1026 -304379 -295434 -262667 -307881 -327798 -307848 -232704 -309296 -279922 -343394 -336439 -363240 -390832
1014 -390832 -346451 -296049 -278552 -340539 -326005 -265683 -330424 -318671 -280919 -283194 -302695 -251386
1002 -251386 -260395 -325634 -307108 -195691 -223245 -276135 -293704 -330664 -252178 -249240 -304546 -275508
990 -275508 -236604 -313511 -295128 -351023 -367974 -411970 -338749 -290475 -315885 -302968 -261991 -271969
978 -271969 -349206 -321313 -211029 -188603 -276353 -277206 -258090 -262426 -304440 -342640 -364852 -361376
966 -361376 -381269 -301624 -235856 -244747 -292725 -306094 -243871 -234011 -274056 -341034 -257900 -239499
954 -239499 -252472 -305184 -339491 -329870 -299964 -342086 -319337 -325750 -299944 -258761 -204587 -226032
942 -226032 -301844 -252413 -285737 -320738 -355204 -291806 -258019 -303420 -327147 -315974 -341776 -340326
930c40326j4058N339M2967k4352O3885o708j6915N6388k9554r3082N6640L057
918b96719p659Q1850n2114P8450J5278j07611j555K6596J9002n4503n03J0793
906b88695p1347j4245N4144J0300L4115p8447j675M5163k3722l995J2175L4238
894b91991N3731o4996n0036j9204N50J6260m3559R1930k8347M2076K510q769j4098
881c13943K2706j2896L9848L904k9591K070J4899k4935j3179k1041J4525Q806
869c08827l0517K2223L2945R546n1403Q36j7457K1964r509R551K2037j7105K5808
856b89908L787n7493j6325M8056K6708M915j865k8482K154N8522o1497j2361j3226
843c37015M6989L937j7479n3155L3328n7494j6764N7914l0974L1748m1626K6589
$$ plain form
930 -340326 -354384 -349045 -306078 -330430 -266545 -273253 -290168 -233780 -263334 -356416 -299776 -296719
918 -296719 -304378 -222528 -274642 -196192 -180914 -288525 -290080 -263484 -244482 -298985 -299488 -288695
906 -288695 -360042 -374287 -320143 -309843 -275728 -354175 -355850 -310687 -334409 -338404 -326229 -291991
894 -291991 -238260 -303256 -353292 -372496 -371946 -355686 -399245 -307315 -335662 -293586 -291076 -299845 -313943
881 -313943 -291237 -304133 -264285 -260381 -289972 -287902 -273003 -297938 -311117 -332158 -317633 -308827
869 -308827 -339344 -317121 -284176 -274630 -326033 -325197 -342654 -320690 -330199 -320648 -298611 -315716 -289908
856 -289908 -286121 -343614 -359939 -311883 -285175 -280260 -282125 -310607 -308453 -249931 -311428 -323789 -337015
843 -337015 -290026 -286089 -303568 -356723 -323395 -380889 -397653 -339739 -370713 -338965 -380591 -354002
831c54002N7508J783M9349n1364p021K7718l7499Q41n702J0360p128J2787K078
818c00292K1564j9791k3285R679k3270O751j6795R450N6206n7852J7169J5379
806c05087q766k1991L3187k1062l773k7213M2261K6232k3128m7427N8536Q634
794b89597j7125m2825K0435L0819Q327k6604K9538k1281M8826r254l3048J0661
782b91128k8246J5084n1507O8575K4053m0376K9301k7823m7539j0093K6356J10858
770b22485J1284k9462q443m6428n1693K1107M3714m0623L3384p973k0534K1883
758b96269j5315K7863l2446p7847N9294K0650j1278l1178K4868K6796m686P817
746c01731p1536P0747k8884j3363o7466J57266Q872o1829Q30j0801M6407K450
$$ plain form
831 -354002 -296494 -294711 -245362 -296726 -303747 -276029 -313528 -312687 -318389 -308029 -315157 -302370 -300292
818 -300292 -278728 -298519 -321804 -312125 -335395 -328644 -345439 -335989 -279783 -337635 -320466 -305087
806 -305087 -313853 -335844 -302657 -323719 -327492 -354705 -312444 -286212 -309340 -356767 -298231 -289597
794 -289597 -306722 -349547 -329112 -298293 -289966 -316570 -287032 -308313 -259487 -268741 -301789 -291128
782 -291128 -319374 -304290 -355797 -287222 -263169 -303545 -274244 -302067 -349606 -359699 -333343 -222485
770 -222485 -211201 -240663 -249106 -295534 -347227 -326120 -282406 -323029 -289645 -297618 -318152 -296269
758 -296269 -311584 -283721 -316167 -394014 -334720 -314070 -325348 -356526 -331658 -304862 -309548 -301731
746 -301731 -373267 -302520 -331404 -344767 -412233 -254967 -246095 -307924 -307094 -317895 -271488 -269038
734b69038J6478q4849N1505o575l5129J5306l7243K7946l4289Q0161P2823m9611
722b52515l2583N4302j0652m8103K6546l7307l5754k041R568N4304k0726M1592
710b53369k1357K3620J712k9166K8492m4578k3560L5123K9428o156m2139J8791
698b83159L2275o5656O6560J3242o4100L3649L1113K8194o187j07282q2398M8605
686c55144j4355j1946K3350J1603J9509m6082J1034N0601P9212j1178P997o9387
674c04786J6420O763j0695j6583J6049K7071j6003Q1603j4000j5765J769l1223
662b59380N9066o7698o0054L977O203J5566N6292j4079r3850j4887K5259k1461
650c65046K9869r413j9408J8756M0273L1326j8825K5983j3813q4612L5465J24261
$$ plain form
734 -269038 -252560 -337409 -285904 -292479 -327608 -312302 -349545 -321599 -355888 -275727 -202904 -252515
722 -252515 -285098 -230796 -241448 -289551 -263005 -300312 -336066 -338107 -328539 -274235 -294961 -253369
710 -253369 -274726 -251106 -249394 -278560 -250068 -294646 -318206 -283083 -253655 -259811 -301950 -283159
698 -283159 -250884 -316540 -249980 -236738 -300838 -267189 -236076 -207882 -214069 -321351 -403749 -355144
686 -355144 -369499 -381445 -358095 -346492 -326983 -373065 -362031 -311430 -232218 -243396 -235399 -304786
674 -304786 -288366 -281603 -292298 -308881 -292832 -265761 -281764 -200161 -214161 -229926 -228157 -259380
662 -259380 -200314 -268012 -328066 -324089 -317886 -302320 -246028 -260107 -353957 -368844 -343585 -365046
650 -365046 -335177 -344590 -363998 -345242 -304969 -273643 -292468 -266485 -280298 -364910 -329445 -205184
638b05184m1807J4724l0341n8814J9450L3099q0314k4514J8085K3167K0635N3677
626b58137n7088m3295P4474J0959r6274L5739M9562n021O7308n5518L5835P157
614b34299m6362l6606N9327M3937p3952n9556J9400O8785L5306Q183o1613m2688
602c20138J0763M1602K9717r3055J5793O4553k8096l1746q203k849K5192j7172
590c13639K4658n442k4685j7506m409L5928n6653J0311K2601Q691p2985K1571
578c71559N9609L8354M5146j7525M1039n1832o5685M4724m2486J1025L9220k6373
566b96343n9406K0929M68j209L7689n112r422R273K7628o10l1347N7823N5713
553a93926o0015j24065J04881j748J8054J3j5938j9297p514l1590M7230J6686
$$ plain form
638 -205184 -246991 -232267 -262608 -321422 -301972 -268873 -349187 -373701 -355616 -332449 -311814 -258137
626 -258137 -315225 -358520 -284046 -273087 -369361 -333622 -284060 -289081 -221773 -277291 -241456 -234299
614 -234299 -280661 -317267 -257940 -214003 -287955 -347511 -328111 -259326 -224020 -215837 -277450 -320138
602 -320138 -309375 -267773 -238056 -331111 -315318 -250765 -278861 -310607 -318810 -321659 -296467 -313639
590 -313639 -288981 -294423 -319108 -336614 -341023 -305095 -361748 -351437 -328836 -320145 -393130 -371559
578 -371559 -311950 -273596 -228450 -245975 -204936 -256768 -322453 -277729 -320215 -309190 -269970 -296343
566 -296343 -355749 -334820 -334352 -335561 -297872 -302984 -312406 -303133 -275505 -276115 -307462 -249639 -193926
553 -193926 -253941 -378006 -273125 -274873 -256819 -256806 -272744 -292041 -299555 -331145 -283915 -267229
541b67229q2640l1850j5226L2961M7175N5282j5447p189m4965L7789M9570P971
529b33798k7134J488l9210j2870p3939K7287K2392M8513p953k091O082M347l2403
516c19289k7719L1023J02755l485M3643n0307k3172k2785J9435l3938n5947K0015
504c19771N5393o0354k4708L9551J0632n7520J6159L7907k8969j338l4306j2715
492c80039J2432O9505Q211K904O8722m9147k0564j7633k1194J2348J0204N500
480b98751l7800P4648m3594j6819J5382l111q255L4794j1407L2600L9859k0402
468b42856q5601n290M6379K7253l9580m2752M7727o999k4490Q738R3045l4921
456b59347n82L3632J3013M1936j51172j8278L6561M5615q6757P8546k0737j2869
$$ plain form
541 -267229 -349869 -381719 -396945 -363984 -316809 -261527 -276974 -284163 -329128 -291339 -241769 -233798
529 -233798 -260932 -259444 -298654 -311524 -385463 -358176 -335784 -287271 -295224 -297315 -291233 -286886 -319289
516 -319289 -347008 -315985 -213230 -216715 -173072 -223379 -246551 -269336 -249901 -283839 -339786 -319771
504 -319771 -264378 -324732 -349440 -309889 -299257 -356777 -340618 -302711 -331680 -333018 -367324 -380039
492 -380039 -367607 -298102 -289891 -286987 -218265 -267412 -287976 -305609 -326803 -314455 -304251 -298751
480 -298751 -336551 -261903 -305497 -322316 -306934 -310045 -318300 -283506 -294913 -262313 -222454 -242856
468 -242856 -328457 -333747 -287368 -260115 -299695 -342447 -294720 -301719 -326209 -317471 -224426 -259347
456 -259347 -259929 -226297 -213284 -171348 -322520 -340798 -304237 -258622 -345379 -266833 -287570 -300439
444c00439M714K3256P3990n2308m7602K8464N1577p8128j0464M4438J71o8553
432c30884K8825M8181o7581N0597l994q5568J2742Q8853R72J2453M3557p6472
420b78319J5024k0472j6741r50l2342K8385m2021K4149L7045K4889p0731J037
408c31047M0073K2923o753m2089J3929q00J09116n2295k6717j7587K2566K4161
396b44520r9090R2344K9409L9459K3493m3471m8325k2769O0540o2878L1647L3734
384b10427j9478o0205n1047K9266l2066R1643k6526l2081K636l6815J8439L9927
372b86734k187K4297J0308l6963j9760j6673R8945l1448j00068L971N609N917
360c44786K89r031N4921P0O0104N3702l1354n6241n737O560m9532m2632K2545
$$ plain form
444 -300439 -295725 -272469 -198479 -250787 -298389 -269925 -218348 -296476 -306940 -262502 -262331 -330884
432 -330884 -302059 -253878 -321459 -270862 -274856 -360424 -347682 -258829 -257857 -245404 -201847 -278319
420 -278319 -263295 -283767 -300508 -301458 -333800 -305415 -347436 -323287 -286242 -261353 -332084 -331047
408 -331047 -290974 -268051 -274804 -316893 -302964 -303764 -194648 -246943 -273660 -291247 -268681 -244520
396 -244520 -343610 -251266 -221857 -182398 -158905 -202376 -250701 -273470 -212930 -275808 -244161 -210427
384 -210427 -229905 -290110 -341157 -311891 -343957 -252314 -278840 -310921 -308285 -345100 -326661 -286734
372 -286734 -288921 -264624 -254316 -291279 -311039 -327712 -228767 -260215 -360283 -356312 -350703 -344786
360 -344786 -344497 -353528 -298607 -298537 -238433 -184731 -216085 -272326 -278063 -271503 -321035 -363667 -341122
347c41122k6275J10795K9189o3995j3081K8834l9912m2312O4606m1111j4573Q047
335c40910m3921K6182Q9960K849l9976O7888o9711j3741R6686m4809J4346Q0427
323a74730m1679n7370j9743K0737K382k1848K6045J058O2834m147l0211m5675
311b82347k7614O795P799k4673k4756N9321j8118m3692j3793O411J7920L131q184
298c41800P0251n0740K8142P1239j9044n0662n4017J4005J0587N5568K0574J1897
286b34000K503p0150J9798J3950M7492m1013n662O8362m7433n5745m6644R57O0911
273b86674r701l14J1109j4208O1232K4584l9997m8606p38l020n6494j0635N328
260c68134o18K4210L8659R814k2471L1131n4788o1673O5542N4512n3023q836J882
$$ plain form
347 -341122 -367397 -256602 -227413 -291408 -304489 -275655 -315567 -357879 -293273 -334384 -348957 -340910
335 -340910 -384831 -358649 -268689 -265840 -305816 -237928 -307639 -321380 -224694 -269503 -255157 -174730
323 -174730 -216409 -273779 -293522 -272785 -270403 -292251 -266206 -265148 -202314 -206461 -236672 -282347
311 -282347 -309961 -303166 -295367 -320040 -344796 -285475 -303593 -347285 -361078 -354667 -336747 -333616 -341800
298 -341800 -271549 -322289 -294147 -222908 -241952 -292614 -346631 -332626 -322039 -266471 -245897 -234000
286 -234000 -231497 -301647 -281849 -267899 -220407 -261420 -267082 -198720 -246153 -301898 -348542 -347585 -286674
273 -286674 -296375 -296689 -285580 -299788 -238556 -213972 -253969 -302575 -303313 -306333 -362827 -373462 -368134
260 -368134 -368752 -344542 -305883 -296069 -318540 -287409 -342197 -403870 -338328 -283816 -336839 -345675 -343793
247c43793j6905J085M3024Q752J4419l3821j9748k6931N3321P3454m2968o8644
235c58755p385N6306j875O834Q6898j7493m1544J8702L8980J7613m3961m3837
223b89517N4806K7566p1058o5444P6698N3038l2914m8083l6505M4361p477Q053
211b86476L6614k1362L2129k835J8714k6886p1298N3346K1078p0799j6033P979
199c25829K4252N5270l4770M224M62p664J3029O318K0648m8595Q2385M5831l3354
186a97793m873q589o8710J585N5902l3826n3493J2373M3083q527j0279J7579k4046
173b79614j390j1611n589k4569O01m821K3284m847L1090l1278m0299K0414L5271
160b93358K5759o6238P927M1234R318k1666j5386K8540L961m7229k857n771j9310
$$ plain form
247 -343793 -360698 -359613 -316589 -307837 -293418 -327239 -346987 -373918 -320597 -247143 -290111 -358755
235 -358755 -366140 -309834 -311709 -304875 -217977 -235470 -277014 -258312 -219332 -201719 -245680 -289517
223 -289517 -234711 -207145 -278203 -343647 -266949 -213911 -246825 -294908 -331413 -287052 -294529 -286476
211 -286476 -249862 -271224 -239095 -241930 -223216 -250102 -321400 -268054 -246976 -317775 -333808 -325829
199 -325829 -301577 -246307 -281077 -276853 -276391 -284055 -271026 -264708 -244060 -292655 -210270 -164439 -197793
186 -197793 -202666 -211255 -279965 -278380 -222478 -256304 -309797 -297424 -254341 -262868 -273147 -255568 -279614
173 -279614 -281004 -292615 -298204 -322773 -322172 -326993 -303709 -308556 -277466 -308744 -349043 -328629 -293358
160 -293358 -267599 -333837 -325910 -284676 -275358 -297024 -312410 -283870 -279909 -327138 -329995 -335766 -355076
147c55076L6143K6850p607J4110l8669j0721l5039M0430j1350N5840k5047k9454
135c39590k0069q820J1078N4487k0566L0414N0498J1683n6173n9840M9865K2870
123b74163j1298k5905l6692L2254k7563N1321M931j5094m0m6044l3462l029O0875
110c23909m9677K4839M5201R096J265p949l3694L458J632o2224K9737M9751m3598
97c56072N484M8496o989J524J4698J6710k717l4804k9933k1967O4534M1090K724
84b57222m7245q000K3721L6138l6860k2855L5478Q129j5037n9057m1423q205N0622
71c41816l592M2328r196k2860p888l4284L7096j9462J0451k9826l3630M6722J3898
58c52059m79j3672l0093M1257P7590l3713l3120K1148j5524K7070K9169l3728
$$ plain form
147 -355076 -318933 -292083 -299690 -285580 -324249 -334970 -370009 -329579 -340929 -285089 -310136 -339590
135 -339590 -359659 -368479 -357401 -302914 -323480 -293066 -242568 -230885 -287058 -346898 -297033 -274163
123 -274163 -285461 -311366 -348058 -315804 -343367 -292046 -287115 -302209 -302249 -348293 -381755 -384784 -323909
110 -323909 -373586 -348747 -303546 -294450 -293185 -301134 -334828 -331370 -329738 -391962 -362225 -312474 -356072
97 -356072 -350588 -302092 -309081 -307557 -292859 -276149 -278866 -313670 -343603 -365570 -301036 -259946 -257222
84 -257222 -304467 -312467 -288746 -252608 -289468 -312323 -276845 -268716 -283753 -342810 -384233 -392438 -341816
71 -341816 -345408 -303080 -312276 -335136 -343024 -377308 -340212 -359674 -349223 -379049 -412679 -365957 -352059
58 -352059 -352538 -366210 -396303 -355046 -277456 -311169 -344289 -323141 -338665 -311595 -282426 -316154
46c16154j8033j6131K4843k3883l2643M8075r395m3643J6475N3216n5424l2494
34d05191J2816K4515K3125j1554K2260j6889l7235O873j552J3025j5438L87j2742
21c97600N668J0403J9403k242j5706J9988j1471n0662J8612j9789j194J9484l5661
8d40767M3300j2642J7222K5175M5233j899n4076J6841
0c61613
$$ plain form
46 -316154 -334187 -350318 -325475 -349358 -382001 -333926 -343321 -386964 -370489 -317273 -372697 -405191
34 -405191 -392375 -367860 -344735 -356289 -334029 -350918 -388153 -381280 -382832 -369807 -385245 -384858 -397600
21 -397600 -391932 -381529 -362126 -364368 -380074 -360086 -371557 -422219 -403607 -423396 -424590 -405106 -440767
8 -440767 -397467 -410109 -392887 -367712 -322479 -324378 -378454 -361613
0 -361613
$$ Imaginary data points
##PAGE= N=2
##DATA TABLE= (X++(I..I)), XYDATA
16383a549403J9079j2187L5864J4638M5967K9387K3622K326K6220R19L0020p713
16371a341261m304M095L2392P0363J9886M4989R88M4051M5173N1067j4294L44
16359a046511K9028r414J3368l38N795N0303N4571J4628L7377j2729r35J9884
16347h44973K8996n923L4236O3567K1991J7039J5896O6140K6052o0607k5975O8340
16335e95221O6019N4205j7727l0423O0636o940k0991M0049O4616R241N5344N1656
$$ plain form
16383 -1549403 -1530324 -1542511 -1506647 -1492009 -1446042 -1416655 -1393033 -1390707 -1364487 -1363568 -1333548 -1341261
16371 -1341261 -1345565 -1341470 -1309078 -1238715 -1218829 -1173840 -1172852 -1128801 -1083628 -1032561 -1046855 -1046511
16359 -1046511 -1017483 -1026897 -1013529 -1013867 -1008072 -957769 -903198 -888570 -851193 -863922 -864857 -844973
16347 -844973 -815977 -821900 -787664 -724097 -702106 -685067 -669171 -603031 -576979 -637586 -663561 -595221
16335 -595221 -529202 -474997 -492724 -523147 -462511 -469451 -490442 -450393 -385777 -376536 -321192 -269536
$$ [...]
##END NTUPLES=NMR SPECTRUM
##END=
