##TITLE=1H_DE-80H_X3
 200.13MHz, d2o
 8 sc
 
 19ns.26.2.2025
##JCAMPDX= 6.0         $$ Bruker NMR JCAMP-DX V2.0
##DATA TYPE= NMR SPECTRUM
##DATA CLASS= NTUPLES
##ORIGIN= UXNMR, Bruker Analytische Messtechnik GmbH
##OWNER= pz
$$ XWIN-NMR		Version 3.5
$$ Wed Mar  4 10:25:15 2026 Russian Standard Time (UT+4h)  Yarkov@DPX200
##.OBSERVE FREQUENCY= 200.1313
##.OBSERVE NUCLEUS= ^1H
##.ACQUISITION MODE= SIMULTANEOUS
##.ACQUISITION SCHEME= undefined
##.AVERAGES= 8
##.DIGITISER RES= 18
##SPECTROMETER/DATA SYSTEM= spect
##.PULSE SEQUENCE= zg30
##.SOLVENT NAME= DMSO
##.SHIFT REFERENCE= (INTERNAL, DMSO, 0, 15.4604)
##AUDIT TRAIL= $$ (NUMBER, WHEN, WHO, WHERE, WHAT)
$$ ##TITLE= Audit trail, XWIN-NMR		Version 3.5
$$ ##JCAMPDX= 5.01
$$ ##ORIGIN= Bruker BioSpin GmbH
$$ ##OWNER= Yarkov
$$ C:/Bruker/XWIN-NMR/data/yarkov2/nmr/H-C/1/pdata/1/auditp.txt
$$ ##AUDIT TRAIL=  $$ (NUMBER, WHEN, WHO, WHERE, WHAT)
(   1,<2026-03-04 10:23:46.59 +0400>,<Yarkov>,<DPX200>,
      <created by zg, POWCHK disabled, PULCHK disabled
       configuration hash MD5:
       00 E9 B6 7A A2 85 ED C7 34 08 36 98 17 FE 4E 26
       data hash MD5: 16K
       3B D2 3C 21 8E BC C1 AC 5E F1 38 47 F4 AA 5A 25>)
(   2,<2026-03-04 10:23:51.71 +0400>,<Yarkov>,<DPX200>,
      <Start of raw data processing
       efp BC_mod = 2 LB = 0.25 FT_mod = 6 PKNL = 1 PHC0 = -5299.748 PHC1 = 6.821927 SI = 16K 
       data hash MD5: 16K
       5D 2B C4 DB 8D 48 60 2B B4 3A 3E B1 B8 3D D6 55>)
$$ ##END=
$$ 
$$ hash MD5
$$ 54 A2 66 A7 98 52 AB A1 E5 F6 B0 4B C4 84 E1 98
##$RELAX= 
##$RELAX= 
##$RELAX= 
##$RELAX= 
##$RELAX= 
##$RELAX= 
$$ Bruker specific parameters
$$ --------------------------
##$DU= <C:/Bruker/XWIN-NMR>
##$EXPNO= 1
##$NAME= <H-C>
##$PROCNO= 1
##$TYPE= <nmr>
##$USER= <yarkov2>
##$AMP= (0..31)
100 100 100 100 100 100 100 100 100 100 100 100 100 100 100 100 100 100 
100 100 100 100 100 100 100 100 100 100 100 100 100 100 
##$AQSEQ= 0
##$AQ_mod= 1
##$AUNM= <au_zg>
##$AUTOPOS= <>
##$BF1= 200.13
##$BF2= 200.13
##$BF3= 200.13
##$BF4= 200.13
##$BF5= 200.13
##$BF6= 200.13
##$BF7= 200.13
##$BF8= 200.13
##$BYTORDA= 1
##$CFDGTYP= 0
##$CFRGTYP= 5
##$CHEMSTR= <none>
##$CNST= (0..31)
1 1 145 1 1 1 1 1 1 1 1 1 1 1 1 1 1 1 1 1 1 1 1 1 1 1 1 1 1 1 1 1 
##$CPDPRG= <>
##$CPDPRG1= <>
##$CPDPRG2= <>
##$CPDPRG3= <>
##$CPDPRG4= <mlev>
##$CPDPRG5= <mlev>
##$CPDPRG6= <mlev>
##$CPDPRG7= <mlev>
##$CPDPRG8= <mlev>
##$CPDPRGB= <>
##$CPDPRGT= <>
##$D= (0..31)
0 0.7 0 0 0 0 0 0 0 0 0 0.03 0 0 0 0 0 0 0 0 0 0 0 0 0 0 0 0 0 0 0 0 
##$DATE= 1772605426
##$DBL= (0..7)
120 120 120 120 120 120 120 120 
##$DBP= (0..7)
150 150 150 150 150 150 150 150 
##$DBP07= 0
##$DBPNAM0= <>
##$DBPNAM1= <>
##$DBPNAM2= <>
##$DBPNAM3= <>
##$DBPNAM4= <>
##$DBPNAM5= <>
##$DBPNAM6= <>
##$DBPNAM7= <>
##$DBPOAL= (0..7)
0.5 0.5 0.5 0.5 0.5 0.5 0.5 0.5 
##$DBPOFFS= (0..7)
0 0 0 0 0 0 0 0 
##$DE= 6
##$DECBNUC= <off>
##$DECIM= 32
##$DECNUC= <off>
##$DECSTAT= 4
##$DIGMOD= 1
##$DIGTYP= 9
##$DL= (0..7)
0 120 120 120 120 120 120 120 
##$DP= (0..7)
$$ [...]
##$SUBNAM2= <"">
##$SUBNAM3= <"">
##$SUBNAM4= <"">
##$SUBNAM5= <"">
##$SUBNAM6= <"">
##$SUBNAM7= <"">
##$SUBNAM8= <"">
##$SUBNAM9= <"">
##$SW= 18.0517328524113
##$SWIBOX= (0..15)
0 0 2 0 0 0 0 0 0 0 0 0 0 0 0 0 
##$SW_h= 3612.71676300578
##$TD= 16384
##$TD0= 1
##$TE= 0
##$TE2= 300
##$TE3= 300
##$TEG= 300
##$TL= (0..7)
0 120 120 120 120 120 120 120 
##$TP= (0..7)
150 150 150 150 150 150 150 150 
##$TP07= 0
##$TPNAME0= <>
##$TPNAME1= <>
##$TPNAME2= <>
##$TPNAME3= <>
##$TPNAME4= <>
##$TPNAME5= <>
##$TPNAME6= <>
##$TPNAME7= <>
##$TPOAL= (0..7)
0.5 0.5 0.5 0.5 0.5 0.5 0.5 0.5 
##$TPOFFS= (0..7)
0 0 0 0 0 0 0 0 
##$TUNHIN= 0
##$TUNHOUT= 0
##$TUNXOUT= 0
##$USERA1= <user>
##$USERA2= <user>
##$USERA3= <user>
##$USERA4= <user>
##$USERA5= <user>
##$V9= 5
##$VALIST= <valist>
##$VCLIST= <CCCCCCCCCCCCCCC>
##$VD= 0
##$VDLIST= <DDDDDDDDDDDDDDD>
##$VPLIST= <PPPPPPPPPPPPPPP>
##$VTLIST= <TTTTTTTTTTTTTTT>
##$WBST= 1024
##$WBSW= 4
##$XGAIN= (0..3)
0 0 0 0 
##$XL= 0
##$YL= 0
##$YMAX_a= 213708
##$YMIN_a= -165693
##$ZGOPTNS= <>
##$ZL1= 120
##$ZL2= 120
##$ZL3= 120
##$ZL4= 120
##$ABSF1= 0
##$ABSF2= 0
##$ABSG= 0
##$ABSL= 0
##$ALPHA= 0
##$AQORDER= 0
##$ASSFAC= 0
##$ASSFACI= 0
##$ASSFACX= 0
##$ASSWID= 0
##$AUNMP= <proc_1d>
##$AZFE= 0.1
##$AZFW= 0.1
##$BCFW= 0
##$BC_mod= 2
##$BYTORDP= 0
##$COROFFS= 0
##$CY= -3
##$DATMOD= 1
##$DC= 0
##$DFILT= <>
##$DTYPP= 0
##$F1P= 0
##$F2P= 0
##$FCOR= 1
##$FTSIZE= 16384
##$FT_mod= 6
##$GAMMA= 0
##$GB= 0
##$INTBC= 1
##$INTSCL= 3.241238e-09
##$ISEN= 128
##$LB= 0.25
##$LEV0= 0
##$LPBIN= 0
##$MAXI= 10000
##$MC2= 0
##$MEAN= 0
##$ME_mod= 0
##$MI= 1.114404
##$NCOEF= 0
##$NC_proc= -8
##$NLEV= 6
##$NOISF1= 3.799351
##$NOISF2= 2.8
##$NSP= 0
##$NTH_PI= 0
##$NZP= 0
##$OFFSET= 15.46042
##$PC= 1
##$PHC0= -5299.748
##$PHC1= 6.821927
##$PH_mod= 1
##$PKNL= yes
##$PPARMOD= 0
##$PSCAL= 0
##$PSIGN= 0
##$REVERSE= no
##$SF= 200.130012264588
##$SI= 16384
##$SIGF1= 3
##$SIGF2= 2
##$SINO= 0.751879
##$SIOLD= 32768
##$SREGLST= <19F.Aceton>
##$SSB= 0
##$STSI= 16384
##$STSR= 0
##$SW_p= 3612.71676300578
##$SYMM= 0
##$S_DEV= 0
##$TDeff= 16384
##$TDoff= 0
##$TI= <>
##$TILT= no
##$TM1= 0
##$TM2= 0
##$TOPLEV= 0
##$USERP1= <user>
##$USERP2= <user>
##$USERP3= <user>
##$USERP4= <user>
##$USERP5= <user>
##$WDW= 1
##$XDIM= 16384
##$YMAX_p= 472614418
##$YMIN_p= -1812601
$$ End of Bruker specific parameters
$$ ---------------------------------
##NTUPLES= NMR SPECTRUM
##VAR_NAME=  FREQUENCY,     SPECTRUM/REAL,   SPECTRUM/IMAG
##SYMBOL=    X,             R,               I
##VAR_TYPE=  INDEPENDENT,   DEPENDENT,       DEPENDENT
##VAR_FORM=  AFFN,          ASDF,            ASDF
##VAR_DIM=   16384,         16384,           16384
##UNITS=     HZ,            ARBITRARY UNITS, ARBITRARY UNITS
##FACTOR=    0.220516191357247, 1,           1
##FIRST=     3094.09397514005, 0,            0
##LAST=      -518.622787865735, 0,           0
##MIN=       -518.622787865735, -1812601,    0
##MAX=       3094.09397514005, 472614418,    0
$$ Real data points
##PAGE= N=1
##DATA TABLE= (X++(R..R)), XYDATA
$$ [...]
$$ plain form
6709 606917 823889 1017628 1050623 1047446 773906 782286 739596 922713 623833 669345 766949
6698 766949 913318 1337603 1151569 1001379 813513 827232 676948 163701 298099 592302
6688 592302 710890 405324 323668 528901 855131 578178 389939 749682 872327 651718
6678 651718 830357 751529 686452 856218 863949 976764 677923 760854 670361 708810 646975
6667 646975 746304 830291 779375 683566 724355 669771 885858 1047084 998709 945785 993086
6656 993086 1238161 1258898 900521 856185 1221815 1616332 1401390 1454803 1129049 1403406
6646 1403406 1310272 1040297 980141 1027981 1208191 961923 1141145 1400060 1335360 1368740
6636 1368740 1323748 1092930 1124768 1177625 1125052 1165218 987718 1087053 1170744 1086614 1050461
$$ packed form
6709F06917K16972J93739L2995l177k73540Q380m2690J83117k98880M5512R7604
6698G66949J46369M24285j86034j50190j87866J3719j50284n13247J34398K94203
6688E92302J18588l05566q1656K05233L26230k76953j88239L59743J22645k20609
6678F51718J78639p8828o5077J69766P731J12815k98841Q2931r0493L8449o1835
6667F46975R9329Q3987n0916r5809M0789n4584K16087J61226m8375n2924M7301
6656I93086K45075K0737l58377m4336L65630L94517k14942N3413l25754K74357
6646A403406r3134k69975o0156M7840J80210k46268J79222K58915o4700L3380
6636A368740m4992k30818L1838N2857n2573M0166j77500R9335Q3691q4130l6153
$$ plain form
6625 1050461 824304 938795 1043416 955891 725678 774380 814370 1013266 997924 1212721
6615 1212721 1166890 1132193 984298 980389 891350 760781 594392 599354 859317 892436 725007
6604 725007 713767 979331 1107189 993221 1082355 1070926 972809 978180 992880 1209653 1247173
6593 1247173 1087581 917717 929181 939208 850635 933086 1245364 1339941 919771 1102635
6583 1102635 1268529 1210928 1441857 1469419 1489640 1814298 1971758 1855034 1694556 1536047
6573 1536047 1314186 1525302 1714075 1877191 1565916 1434015 1439914 1154909 1566834 1717192
6563 1717192 1633527 1760366 1870946 1646212 1514916 1393816 1237029 1383793 1513151 1549360
6553 1549360 1422816 1404788 1403832 1377751 1329902 1380853 1534476 1320645 1316958 1264359 1098302
$$ packed form
6625A050461k26157J14491J04621q7525k30213M8702L9990J98896j5342K14797
6615A212721m5831l4697j47895l909q9039j30569j66389M962K59963L3119j67429
6604G25007j1240K65564J27858j13968Q9134j1429r8117N371J4700K16773L7520
6593A247173j59592j69864J1464J0027q8573Q2451L12278R4577m20170J82864
6583A102635J65894n7601K30929K7562K0221L24658J57460j16724j60478j58509
6573A536047k21861K11116J88773J63116l11275j31901N899k85005M11925J50358
6563A717192q3665J26839J10580k24734j31296j21100j56787J46764J29358L6209
6553A549360j26544j8028r56k6081m7849N0951J53623k13831l687n2599j66057
$$ plain form
6542 1098302 1329149 1476645 1294610 1433111 1461318 1383399 1257858 1342945 1297062 1284217
6532 1284217 1159309 1021826 1190632 1276320 1301233 1109136 1194987 1508357 1636125 1616724
6522 1616724 1374035 1276355 1294021 844392 1154016 1324902 1125373 1414755 1572365 1312589
6512 1312589 982178 959814 1081435 1256768 1348161 1361414 1373295 1537277 1519304 1684036
6502 1684036 1845972 1677938 1519310 1647190 1814662 1963342 1959791 1764506 1660024 1589875
6492 1589875 1636626 1907270 1802634 1891620 1808542 1770101 1586089 1835940 1932759 1768753
6482 1768753 1571860 1418876 1638330 1790615 1813657 1815321 1925906 2028542 1915644 2024305
6472 2024305 2166087 2278012 2303524 2321769 2348310 2174388 2059324 2148626 2146574 2081006 2126328
$$ packed form
6542A098302K30847J47496j82035J38501K8207p7919j25541Q5087m5883j2845
6532A284217j24908j37483J68806Q5688K4913j92097Q5851L13370J27768j9401
6522A616724k42689r7680J7666m49629L09624J70886j99529K89382J57610k59776
6512A312589l30411k2364J21621J75333R1393J3253J1881J63982j7973J64732
6502A684036J61936j68034j58628J27880J67472J48680l551j95285j04482p0149
6492A589875M6751K70644j04636Q8986q3078l8441j84012K49851R6819j64006
6482A768753j96893j52984K19454J52285K3042J664J10585J02636j12898J08661
6472B024305J41782J11925K5512J8245K6541j73922j15064Q9302k052o5568M5322
$$ plain form
6461 2126328 2369617 2508895 2366899 2341184 2317424 2275744 2194173 2210030 2092109 2379160
6451 2379160 2282487 2234510 2167437 2137921 2202766 1959232 2033683 2461398 2480651 2410065 2312753
6440 2312753 2739565 2644427 2487670 2544640 2537352 2474226 2604295 2725477 2466456 2640035
6430 2640035 2861296 2798410 2894388 2733453 2761273 2987962 3088529 2733026 2775558 2664831
6420 2664831 2680848 2847751 2905463 3009232 2947233 2899255 2877641 3023714 2827109 2955623
6410 2955623 2944391 3019207 3085989 3351095 3165518 3161509 3164768 3044953 3017699 3320005 3426876
6399 3426876 3255165 3497764 3347295 3207369 3486754 3619825 3817647 3696316 3570724 3642189
6389 3642189 3719346 3755781 3966547 4207392 4062575 3997153 4159338 4353739 4518178 4690902
$$ packed form
6461B126328K43289J39278j41996k5715k3760m1680q1571J5857j17921K87051
6451B379160r6673m7977o7073k9516O4845k43534P4451M27715J9253p0586r7312
6440B312753M26812r5138j56757N6970p288o3126J30069J21182k59021J73579
6430B640035K21261o2886R5978j60935K7820K26689J00567l55503M2532j10727
6420B664831J6017J66903N7712J03769o1999m7978k1614J46073j96605J28514
6410B955623j1232P4816O6782K65106j85577m009L259j19815k7254L02306J06871
6399C426876j71711K42599j50469j39926K79385J33071J97822j21331j25592P1465
6389C642189P7157L6435K10766K40845j44817o5422J62185J94401J64439J72724
$$ plain form
6379 4690902 4860527 4915732 4958371 5507057 5500383 5597931 5858894 6031976 6328976 6225867
6369 6225867 6741391 6966989 7009808 7198482 7251392 7558761 7930455 8275040 8545388 9032891
6359 9032891 9389915 9943149 10636622 11207789 12033137 13033788 14340232 15561374 17021592
6350 17021592 19198634 21592421 24276198 28064957 33357229 40804387 50896489 62327533
6342 62327533 73376749 81549496 85044330 84234351 79555059 72916628 65941532 60009991
6334 60009991 56098258 54615300 56221849 61422550 69657196 78650399 85822489 88417329
6326 88417329 86176345 79890403 70909278 60862420 51328098 42969237 35920832 30241563
6318 30241563 25830260 22242040 19670901 17776497 16312927 15014297 14004512 13164766
$$ packed form
6379D690902J69625N5205M2639N48686o674R7548K60963J73082K97000j03109
6369F225867N15524K25598M2819J88674N2910L07369L71694L44585K70348M87503
6359I032891L57024N53234O93473N71167Q25348J000651J306444J221142J460218
6350A7021592K177042K393787K683777L788759N292272P447158J0092102J1431044
6342F2327533J1049216Q172747L494834q09979m679292o638431o975096n931541
6334F0009991l911733j482958J606549N200701Q234646Q993203P172090K594840
6326H8417329k240984o285942q981125j0046858r534322q358861p048405n679269
6318C0241563m411303l588220k571139j894404j463570j298630j009785q39746
$$ plain form
6310 13164766 12690797 12105879 11940709 11772107 11441232 11400689 10888457 10944226 10912998 10931261
6300 10931261 10656281 10649640 11056130 11083563 11243786 11609563 12094581 12422756 12648550 13147704
6290 13147704 13335367 13802810 14494155 15356637 16454296 17441783 18441429 19861444 21508261
6281 21508261 23315151 25828941 28699120 32176956 36339308 41661837 49367339 60297935
6273 60297935 75457018 93161043 110453809 124630402 132563146 133223051 127872872 118336406
6265 118336406 107612416 97754139 90432113 86596526 87329091 93432588 104345644 116823614
6257 116823614 127314950 132748461 131116019 123543595 111031205 96328602 81770595
6250 81770595 68474427 56721868 47222249 39724920 33612059 28704590 24930717 22051528
$$ packed form
6310A3164766m73969n84918j65170j68602l30875m0543n12232N5769l1228J8263
6300A0931261k74980o641M06490K7433J60223L65777M85018L28175K25794M99154
6290A3147704J87663M67443O91345Q62482J097659R87487R99646J420015J646817
6281B1508261J806890K513790K870179L477836M162352N322529P705502J0930596
6273F0297935J5159083J7704025J7292766J4176593P932744O59905n350179r536466
6265A18336406j0723990r858277p322026l835587P32565O103497J0913056J2477970
6257A16823614J0491336N433511j632442p572424j2512390j4702603j4558007
6250H1770595j3296168j1752559r499619p497329o112861m907469l773873k879189
$$ plain form
6242 22051528 19748616 17859952 16196601 14876077 13619106 12380326 11646616 10958616
6234 10958616 10056202 9373427 8717695 8504898 8187306 7663072 7544310 7142219 7121471 6960010
6224 6960010 6505069 6289285 6345603 6235922 6061311 5959009 5762929 5513496 5078522 4850853
6214 4850853 4875066 4783759 4931486 5000378 5007407 4942862 4928906 4738923 4899673 5025183 4978562
6203 4978562 4713307 4642098 4428980 4211987 4226096 4374298 4504134 4427388 4294573 4249672
6193 4249672 3958492 3882335 3984166 3605757 3668869 3532641 3741699 3873673 4008405 3986185
6183 3986185 4106179 3858880 3703603 3716522 3637462 3383679 3447206 3487584 3462062 3341657
6173 3341657 3366272 3284326 3560199 3502964 3496449 3464758 3392737 3262014 3355509 3541242 3458388
$$ packed form
6242B2051528k302912j888664j663351j320524j256971j238780p33710o88000
6234A0958616r02414o82775o55732k12797l17592n24234j18762m02091k0748j61461
6224F960010m54941k15784N6318j09681j74611j02302j96080k49433m34974k27669
6214D850853K4213r1307J47727O8892P029o4545j3956j89983J60750J25510m6621
6203D978562k65255p1209k13118k16993J4109J48202J29836p6746j32815m4901
6193D249672k91180p6157J01831l78409O3112j36228K09058J31974J34732k2220
6183C986185J19994k47299j55277J2919p9060k53783O3527M0378k5522j20405
6173C341657K4615q1946K75873n7235o515l1691p2021j30723R3495J85733q2854
$$ plain form
6162 3458388 3876087 3803798 3751602 3639442 3378726 3451025 3708334 3836358 3549771 3342064
6152 3342064 3337962 3527416 3269956 3351301 3610814 3325242 3418808 3480596 3433111 3487415 3652941
6141 3652941 3583008 3521466 3725167 3734623 3619684 3743845 3814670 3928481 3936499 3907326 4063556
6130 4063556 4028270 3927791 3783180 3665262 4100717 4237548 3990948 4195815 4423021 4443994
6120 4443994 4567087 4666829 4491932 4585652 4610416 4719867 4891107 4693060 4806197 4964434
6110 4964434 5047340 4974821 4902347 5011791 5006577 4934007 4984147 5000915 5126550 5227506 5479275
6099 5479275 5754737 5814139 5903181 6121400 6060432 6295310 6132196 6226391 6332487 6704074
6089 6704074 6771929 6664800 6867258 6917771 6950028 7302982 7688054 7664965 7778004 8081748
$$ packed form
6162C458388M17699p2289n2196j12160k60716P2299K57309J28024k86587k07707
6152C342064m102J89454k57460Q1345K59513k85572R3566O1788m7485N4304J65526
6141C652941o9933o1542K03701R456j14939J24161P0825J13811Q018k9173J56230
6130D063556l5286j00479j44611j17918M35455J36831k46600K04867K27206K0973
6120D443994J23093R9742j74897R3720K4764J09451J71240j98047J13137J58237
6110D964434Q2906p2519p2474J09444n214p2570N0140J6768J25635J00956K51769
6099E479275K75462N9402Q9042K18219o0968K34878j63114R4195J06096L71587
6089F704074O7855j07129K02458N0513L2257L52954L85072k3089J13039L03744
$$ plain form
6079 8081748 8267195 8290597 8621560 8760890 8611814 8849292 8951683 9327246 9699394 9784735
6069 9784735 10176447 10205510 10373697 11121753 11559472 11941186 12629670 13180362 13550289 14286536
6059 14286536 15034117 16043467 16884977 17982919 19354297 20718426 22101253 23906706
6051 23906706 26028175 28415270 31212540 34730715 39299374 45253678 53771447 65830713
6043 65830713 81565935 99070933 114501194 124058539 126411879 121540002 111704420 99630042
6035 99630042 86538488 74514960 64708089 56872992 50833348 46724271 44146132 42676200
6027 42676200 42634791 43012642 44251618 46732934 50570368 56276119 65425399 78603228
6019 78603228 95585523 113621025 128631875 137022012 137685259 130912176 118989143 104613946
$$ packed form
6079H081748J85447K3402L30963J39330j49076K37478J02391L75563L72148Q5341
6069I784735L91712K9063J68187P48056M37719L81714O88484N50692L69927P36247
6059A4286536P47581J009350Q41510J097942J371378J364129J382827J805453
6051B3906706K121469K387095K797270L518175M568659N954304Q517769J2059266
6043F5830713J5735222J7504998J5430261R557345K353340m871877r835582j2074378
6035I9630042j3091554j2023528r806871p835097o039644m109077k578139j469932
6027D2676200m1409L77851J238976K481316L837434N705751R149280J3177829
6019G8603228J6982295J8035502J5010850Q390137O63247o773083j1923033j4375197
$$ plain form
6011 104613946 90105033 76698848 65665315 56596694 49069857 43266187 38514670 35067315
6003 35067315 32196860 29682078 27560976 25824705 24366455 23209024 22227186 21074520
5995 21074520 20523042 19669434 18900328 18701379 18402724 18568679 18633561 18366752 18574783 18961768
5985 18961768 19034432 19616593 20397439 21017975 22281807 23491086 24938770 26698282 28553822
5976 28553822 30990567 34522124 39384812 46503540 56363685 68308942 79669715 88148961
5968 88148961 91286831 89873338 84978156 77583218 69777174 62508948 56458596 52056976
5960 52056976 49330837 47784209 47294295 47773467 49095740 50381549 51740677 53239100
5952 53239100 55237016 58440578 62790521 69481467 79271297 90501223 100703470 107085874
$$ packed form
6011A04613946j4508913j3406185j1033533r068621p526837n803670m751517l447355
6003C5067315k870455k514782k121102j736271j458250j157431r81838j152666
5995B1074520n51478q53608p69106j98949k98655J65955O4882k66809K08031L86985
5985A8961768P2664N82161P80846O20536J263832J209279J447684J759512J855540
5976B8553822K436745L531557M862688P118728R860145J1945257J1360773Q479246
5968H8148961L137870j413493m895182p394938p806044p268226o050352m401620
5960E2056976k726139j546628m89914M79172J322273J285809J359128J498423
5952E3239100J997916L203562M349943O690946R789830J1229926J0202247O382404
$$ plain form
5944 107085874 108269697 104689315 97513345 88033672 77982805 68688731 60962312 54661766
5936 54661766 49520049 45449459 42287904 40104511 38249014 36684786 35476194 34089655
5928 34089655 32857319 31881418 30833636 29592882 28773861 28026230 27045412 25848444 24994152
5919 24994152 23838240 22559831 21640059 20801814 20007689 19036435 17867003 16821461 16198454
5910 16198454 15486178 15038060 14534547 13544063 12978108 12582882 12161124 11517825 10929376
5901 10929376 10278079 10034696 9574390 9027992 8853261 8561286 8199116 8216495 7830408 7427874
5891 7427874 6961750 6992965 6958905 6574432 6356566 6674520 6446605 6066031 6261785 6270026
5881 6270026 6236930 6221403 6582315 6676207 6420399 6568356 6813555 6780860 6554374 6285780
$$ packed form
5944A07085874J183823l580382p175970r479673j0050867r294074p726419o300546
5936E4661766n141717m070590l161555k183393j855497j564228j208592j386539
5928C4089655j232336r75901j047782j240754q19021p47631r80818j196968q54292
5919B4994152j155912j278409r19772q38245p94125r71254j169432j045542o23007
5910A6198454p12276m48118n03513r90484n65955l95226m21758o43299n88449
5901A0929376o51297k43383m60306n46398j74731k91975l62170J7379l86087m02534
5891G427874m66124L1215l4060l84473k17866L17954k27915l80574J95754Q241
5881F270026l3096j5527L60912R3892k55808J47957K45199l2695k26486k68594
$$ plain form
5871 6285780 6251624 6184765 5768454 5393989 5314818 5334379 5275445 4927096 4615499 4467544
5861 4467544 4250720 4368680 4370858 4297058 4310028 4248925 4534613 4605163 4284930 4161176 4281412
5850 4281412 4045534 3794081 3832455 3771515 3995829 3720375 3624166 3629600 3324029 3081860
5840 3081860 2803734 2948766 2910276 2780015 2719117 2663965 2388933 2584185 2527377 2248473
5830 2248473 1961110 2290101 2658113 2688874 2766429 2639303 2361962 2430950 2490902 2492475 2562435
5819 2562435 2591298 2254686 2406902 2707627 2446274 2225161 2295136 2587655 2634938 2653903
5809 2653903 2451749 2561136 2694842 2643956 2661338 2569020 2860644 3001385 3061041 3137137
5799 3137137 3160311 3001609 3036835 3255277 3510913 3153346 3182854 3287849 3298482 2970727
$$ packed form
5871F285780l4156o6859m16311l74465p9171J9561n8934l48349l11597j47955
5861D467544k16824J17960K178p3800J2970o1103K85688P0550l20233j23754J20236
5850D281412k35878k51453L8374o0940K24314k75454r6209N434l05571k42169
5840C081860k78126J45032l8490j30261o0898n5152k75032J95252n6808k78904
5830B248473k87363L28991L68012L0761P7555j27126k77341O8988N9952J573O9960
5819B562435K8863l36612J52216L00725k61353k21113O9975K92519M7283J8965
5809B653903k02154J09387J33706n0886J7382r2318K91624J40741N9656P6096
5799C137137K3174j58702L5226K18442K55636l57567K9508J04995J0633l27755
$$ plain form
5789 2970727 3069607 3070373 3491461 3579964 3803486 4103992 4163553 4545138 4531447 4659768 4927285
5778 4927285 5258113 5700180 6243508 6963565 7741511 8569711 9386920 10317102 11547499
5769 11547499 12951045 14624584 17930910 23501728 35981414 56021748 77367865 89662202
5761 89662202 88423186 81869448 67889019 53146350 40911433 31261275 24261790 18475427
5753 18475427 14098764 11022851 9384982 8441442 7745950 6853346 6027592 5563866 5525684
5744 5525684 5094236 4553775 4520559 4312517 4427648 4310179 3864288 3817584 3797228 3708277
5734 3708277 3302351 3307209 3236810 3393081 3101905 3050394 3014303 3234347 3101794 2882560
5724 2882560 2737568 2898203 2912998 2756044 2452018 2703502 2693129 2804875 2950810 2752119
$$ packed form
5789B970727R8880P66M21088Q8503K23522L00506N9561L81585j3691J28321K67517
5778D927285L30828M42067N43328P20057P77946Q28200Q17209R30182J230397
5769A1547499J403546J673539L306326N570818J2479686K0040334K1346117J2294337
5761H9662202j239016o553738j3980429j4742669j2234917r650158o999485n786363
5753A8475427m376663l075913j637869r43540o95492q92604q25754m63726l8182
5744E525684m31448n40461l3216k08042J15131j17469m45891m6704k0356q8951
5734C708277m05926M858p0399J56271k91176n1511l6091K20044j32553k19234
5724B882560j44992J60635J4795j56954l04026K51484j0373J11746J45935j98691
$$ plain form
5714 2752119 2650190 2364168 2276364 2321113 1967438 2159976 2630622 2439942 2481104 2490795
5704 2490795 2629627 2699681 2792284 2830518 2889974 3047595 2990651 2889097 2626116 2593199 2286418
5693 2286418 2071183 2127588 2104773 1962681 1711394 1792755 1776015 2025598 1950868 1983018 1711554
5682 1711554 1478284 1313651 1884926 2255457 1993725 1733671 1803377 1769687 1866122 1835826
5672 1835826 1744302 1552016 1776096 2038005 1850935 1914108 2462225 2819033 2603111 2639553
5662 2639553 2327059 1957282 2061310 2211884 2353783 2111364 1962370 1999620 2092589 2230013
5652 2230013 2118636 2195481 2184337 2206350 2252897 2317330 2749184 2482511 2474541 2514361 2256461
5641 2256461 2388748 2450016 2217289 2113382 2012382 1979629 1866266 1716150 2042667 1989730
$$ packed form
5714B752119j01929k86022q7804M4749l53675J92538M70646j90680M1162R691
5704B490795J38832P0054R2603L8234N9456J57621n6944j01554k62981l2917l06781
5693B286418k15235N6405k2815j42092k51287Q1361j6740K49583p4730L2150k71464
5682A711554k33270j64633N71275L70531k61732k60054O9706l3690R6435l0296
5672A835826r1524j92286K24080K61909j87070O3173N48117L56808k15922L6442
5662B639553l12494l69777J04028J50574J41899k42419j48994L7250R2969J37424
5652B230013j11377P6845j1144K2013M6547O4433M31854k66673p970L9820k57900
5641B256461J32287O1268k32727j03907j01000l2753j13363j50116L26517n2937
$$ plain form
5631 1989730 1985543 2153856 2003830 1703734 1768727 1748088 1975729 1871970 1859763 1776771 1802383
5620 1802383 1804808 1892191 1756275 1916895 2071753 1615611 1478119 1698059 1769028 1922851
5610 1922851 1723112 1877467 1846938 1643038 1897745 1767899 1860050 1842565 1795611 1751267
5600 1751267 1896053 2076756 1962432 1819386 1993955 2123173 2296510 2138631 1875017 2188662
5590 2188662 2051770 1884003 2146583 2238722 2250001 2375573 2541419 2179960 2374519 2566381
5580 2566381 2394812 2319991 2387157 2014542 2191959 2590678 2351255 2485003 2527362 2398253
5570 2398253 2337188 2235079 2203743 2212345 1965220 2172172 2246687 2233978 2359796 2377552 2479833
5559 2479833 2449080 2322569 2396236 2366483 2124908 2186223 2270694 1920456 2267749 2361503 2579265
$$ packed form
5631A989730m187J68313j50026l00096O4993k0639K27641j03759j2207q2992K5612
5620A802383K425Q7383j35916J60620J54858m56142j37492K19940P0969J53823
5610A922851j99739J54355l0529k03900K54707j29846R2151j7485m6954m4344
5600A751267J44786J80703j14324j43046J74569J29218J73337j57879k63614L13645
5590B188662j36892j67767K62580R2139J1279J25572J65846l61459J94559J91862
5580B566381j71569p4821O7166l72615J77417L98719k39423J33748M2359j29109
5570B398253o1065j02109l1336Q602k47125K06952P4515j2709J25818J7756J02281
5559B479833l0753j26511P3667k9753k41575O1315Q4471l50238L47293R3754K17762
$$ plain form
5548 2579265 2666612 2863135 2774936 2651576 2598779 2455333 2443391 2472925 2517853 2363497 1993145
5537 1993145 2199565 2393555 2385147 2405901 1863403 1967536 2130994 2266756 2246706 1931651
5527 1931651 1773201 2198518 2428014 2645522 2746373 2696883 2723276 2885381 2998029 3115311
5517 3115311 3029387 2970971 2843262 2783902 2635733 2695972 2663975 2483347 2431536 2443710 2438395
5506 2438395 2289206 2030603 2069012 2293721 2539450 2404301 2164940 2581013 2479856 2417024
5496 2417024 2477720 2718824 2674056 2424336 2458892 2604642 2613898 2580493 2580530 2580103 2556760 2561879
5484 2561879 2434514 2499735 2588962 2381765 2283711 2373545 2450074 2194239 2285440 2368692 2340086
5473 2340086 2902070 3047804 3031621 3026761 2937441 2797182 2782604 2621588 2593731 3089888 2982636
$$ packed form
5548B579265Q7347J96523q8199j23360n2797j43446j1942K9534M4928j54356l70352
5537A993145K06420J93990q408K0754n42498J04133J63458J35762k0050l15055
5527A931651j58450M25317K29496K17508J00851m9490K6393J62105J12648J17282
5517C115311q5924n8416j27709n9360j48169O0239l1997j80628n1811J2174n315
5506B438395j49189k58603L8409K24709K45729j35149k39361M16073j01157o2832
5496B417024O0696K41104m4768k49720L4556J45750R256l3405L7m27k3343N119
5484B561879j27365O5221Q9227k07197r8054Q9834P6529k55835R1201Q3252k8606
5473B340086N61984J45734j6183m860q9320j40259j4578j61016k7857M96157j07252
$$ plain form
5462 2982636 2663049 2537176 2701479 2607953 2656806 2712546 2660512 2845686 2840826 2724169 2702543
5451 2702543 2677711 2627129 2696621 2388488 2396047 2617513 2650479 2612893 2797587 2770728 2594340
5440 2594340 2720732 2690920 2980824 2861761 2967010 3149171 3205665 3086840 2930866 2939625
5430 2939625 2936762 2946690 2868970 2773620 2921546 2701081 2702753 3108217 3244447 3177734 2971243
5419 2971243 3112026 3231033 3020235 2916812 2883599 3137887 3294858 3187378 3287536 3638303
5409 3638303 3762091 3635874 3417495 3611474 3410104 3141397 3250327 3429239 3563282 3771320
5399 3771320 3798764 3800329 3833940 3659520 3359041 3291230 3728500 3977328 3934469 3962797 4042053
5388 4042053 3991095 4001977 4085523 4074886 3989800 4002472 4033007 4121189 4337626 4532047 4283507
$$ packed form
5462B982636l19587j25873J64303r3526M8853N5740n2034J85174m860j16657k1626
5451B702543k4832n0582O9492l08133P559K21466L2966l7586J84694k6859j76388
5440B594340J26392k9812K89904j19063J05249J82161N6494j18825j55974Q759
5430B939625k863R928p7720r5350J47926k20465J672M05464J36230o6713k06491
5419B971243J40783J19007k10798j03423l3213K54288J56971j07480J00158L50767
5409C638303J23788j26217k18379J93979k01370k68707J08930J78912J34043K08038
5399C771320K7444J565L3611j74420l00479o7811M37270K48828m2859K8328P9256
5388D042053n0958J0882Q3546j0637q5086J2672L0535Q8182K16437J94421k48540
$$ plain form
5377 4283507 4137116 4099619 4069932 3880413 3900048 3961757 4168319 4185642 4064366 4115722 4118834
5366 4118834 4144836 4238290 3990981 4242788 4440236 4649074 4638245 4658006 4835678 4771238
5356 4771238 4610114 4517505 4592310 4554307 4673497 4810678 4752909 4762077 4726980 4762658 5084439
5345 5084439 5011123 4949151 5057694 5058699 5194457 5211174 5181684 5609734 5591246 5267132 5068167
5334 5068167 5043559 5185922 5193798 5418914 5458604 5695276 5713315 5926665 5920571 6113222 6455443
5323 6455443 6348094 6338809 6232787 6388065 6295226 6426890 6646067 6746011 6634857 6820539
5313 6820539 6954940 7161984 7606611 7562611 7296944 7522381 7583937 7604989 7626562 7657809
5303 7657809 8098386 8237685 8350298 8532434 8299699 8549565 9054260 9163347 9170301 9150594
$$ packed form
5377D283507j46391l7497k9687j89519J9635O1709K06562J7323j21276N1356L112
5366D118834K6002R3454k47309K51807J97448K08838j0829J9761J77672o4440
5356D771238j61124r2609P4805l8003J19190J37181n7769R168l5097L5678L21781
5345E084439p3316o1972J08543J005J35758J6717k9490M28050j8488l24114j98965
5334E068167k4608J42363P876K25116L9690K36672J8039K13350o094J92651L42221
5323F455443j07349r285j06022J55278r2839J31664K19177R9944j11154J85682
5313F820539J34401K07044M44627m4000k65667K25437O1556K1052K1573L1247
5303G657809M40577J39299J12613J82136k32735K49866N04695J09087O954j9707
$$ plain form
5293 9150594 9652708 9808674 10023472 10050465 10068903 10153534 10539457 10764075 10689787 10629427
5283 10629427 10683305 10702974 10920573 11034831 11086669 10968414 11319357 11677736 11781742 11648274
5273 11648274 12008524 12525236 12864369 13101862 12942552 13184764 13618507 14040121 14041360 14199782
5263 14199782 14339032 14764684 14875263 15234688 15415446 15664165 15728382 15758668 16052087 16457902
5253 16457902 16763733 16986244 17506962 17806024 18483270 18917677 19297148 19826764 20200935
5244 20200935 20982271 21321292 21702605 22450818 23243417 24016082 24561677 25316284 26314764
5235 26314764 27264258 28339790 29310687 30468674 31867034 33140972 34321543 35607748
5227 35607748 37168797 38684328 40263262 41670776 43421416 45662780 48002558 50366168
$$ packed form
5293I150594N02114J55966K14798K6993J8438Q4631L85923K24618p4288o0360
5283A0629427N3878J9669K17599J14258N1838j18255L50943L58379J04006j33468
5273A1648274L60250N16712L39133K37493j59310K42212M33743M21614J239J58422
5263A4199782J39250M25652J10579L59425J80758K48719O4217L0286K93419M05815
5253A6457902L05831K22511N20718K99062O77246M34407L79471N29616L74171
5244B0200935P81336L39021L81313P48213P92599P72665N45595P54607R98480
5235B6314764R49494J075532R70897J157987J398360J273938J180571J286205
5227C5607748J561049J515531J578934J407514J750640K241364K339778K363610
$$ plain form
5219 50366168 53112054 56676282 60667951 65915612 72255241 78763225 84258409 88068385
5211 88068385 90407881 92357375 93791330 96122308 98784743 102899991 109108047 117519556
5203 117519556 128425030 140203270 151001505 160119892 166702222 171442509 175293963 178653319
5195 178653319 181527601 183575902 185628200 188852774 193700540 200114805 205636415 208112744
5187 208112744 208139382 207120193 205905925 205176384 204711811 202985334 199850454 196201327 192973805
5178 192973805 189074185 184523260 179329890 173617109 169043940 166643244 165782009 163827175
5170 163827175 159359904 152381226 144087000 136214399 129645931 124628389 120412237 117868102
5162 117868102 116528301 116588263 117022791 116297752 112784961 106329484 97906190 88653833 79965051
$$ packed form
5219E0366168K745886L564228L991669N247661O339629O507984N495184L809976
5211H8068385K339496J949494J433955K330978K662435M115248O208056Q411509
5203A17519556J0905474J1778240J0798235R118387O582330M740287L851454L359356
5195A78653319K874282K048301K052298L224574M847766O414265N521610K476329
5187B08112744K6638j019189j214268p29541m64573j726477l134880l649127l227522
5178A92973805l899620m550925n193370n712781m573169k400696q61235j954834
5170A63827175m467271o978678q294226p872601o568468n017542m216152k544135
5162A17868102j339801N9962M34528p25039l512791o455477q423294r252357q688782
$$ plain form
5153 79965051 72686004 66880364 63105972 60797602 60078411 60351235 60679085 60203054 58049747
5144 58049747 54337674 50011015 45515881 41237210 37732652 34709139 31991830 29899510
5136 29899510 28017751 26875921 25571889 24720435 24083922 22895610 21818342 21216006 20527906
5127 20527906 20111652 19852861 19313266 18855928 18290065 17679084 17262538 16972761 16617988
5118 16617988 16336668 16301628 15796365 15453244 15332889 14863322 14678831 14442886 14280745 14040049
5108 14040049 13775886 13636871 13667187 13420805 13103551 12957519 12645359 12505649 12218165 12041644
5098 12041644 12045716 11977906 12067598 11621485 11476505 11465918 11031505 10714309 10722172 10774916 10537778
5087 10537778 10319551 10334142 10343964 10340831 10093839 9799177 9845277 9612542 9147876 8821967
$$ packed form
5153G9965051p279047n805640l774392k308370p19191K72824L27850m76031k153307
5144E8049747l712073m326659m495134m278671l504558l023513k717309k092320
5136B9899510j881759j141830j304032q51454o36513j188312j077268o02336o88100
5127B0527906m16254k58791n39595m57338n65863o10981m16546k89777l54773
5118A6617988k81320l5040n05263l43121j20355m69567j84491k35945j62141k40696
5108A4040049k64163j39015L0316k46382l17254j46032l12160j39710k87484j76521
5098A2041644M072o7810Q9692m46113j44980j0587m34413l17196P863N2744k37138
5087A0537778k18227J4591R822l133k46992k94662M6100k32735m64666l25909
$$ plain form
5077 8821967 8789702 8867713 8498281 8580761 8523014 8395800 8294719 8332201 8083772 8128971 7763327
5066 7763327 7611299 7838360 8096608 7897891 7624028 7824486 7725496 7511865 7155489 7295447
5056 7295447 7332218 7270656 7243480 7214396 7419536 7473903 7428865 7386027 7395955 7041091 6784387
5045 6784387 6764550 6631084 6799437 7008198 6952976 7156467 7250664 7302094 7319630 7319168 7088401
5034 7088401 6971501 7185958 7156845 7161557 7211150 7397922 7341604 7411131 7538820 7636297 7674362
5023 7674362 7383330 7661951 7872677 7855828 7834589 7885086 7781643 7973444 8073115 8114978
5013 8114978 8016029 8009826 8073334 7816390 7967508 8029943 8373477 8123685 8499525 8569366 8513117
5002 8513117 8483447 8575036 8635655 8648528 8754788 9006559 8902174 8801315 9012787 8943043
$$ packed form
5077H821967l2265P8011l69432Q2480n7747j27214j01081L7482k48429M5199l65644
5066G763327j52028K27061K58248j98717k73863K00458r8990k13631l56376J39958
5056G295447L6771o1562k7176k9084K05140N4367m5038m2838R928l54864k56704
5045F784387j9837j33466J68353K08761n5222K03491R4197N1430J7536m62k30767
5034G088401j16900K14457k9113M712M9593J86772n6318O9527J27689R7477L8065
5023G674362k91032K78621K10726j6849k1239N0497j03443J91801R9671M1863
5013H114978r8949o203O3508k56944J51118O2435L43534k49792L75840O9841n6249
5002H513117k9670R1589O0619J2873J06260K51771j04385j00859K11472o9744
$$ plain form
4992 8943043 8826067 8940566 9001685 9000346 9020071 9117402 9347940 9610582 10138636 10753260
4982 10753260 11217739 11301195 11373980 11060527 10519538 10200220 10234140 10001752 9750108 9702774
4972 9702774 9605311 9484953 9530991 9452330 9120004 9034532 9136212 9011168 8995627 8922303 9010213
4961 9010213 9325009 9266995 9243259 9353518 9139409 9193155 9054219 9297594 9582861 9510078
4951 9510078 9606399 9532719 9628510 9665810 9753900 9852460 9712792 9769048 9834311 10165194 10247386
4940 10247386 10409929 10506475 10459921 10740051 10730809 10743991 10848357 11066924 11323707 11249174
4930 11249174 11205924 11124567 11573876 11843356 11783192 11860845 11897112 12113890 12457083 12592732
4920 12592732 12920762 13120069 13371208 13604067 13786213 14101703 14249746 14498851 14898090
$$ packed form
4992H943043j16976J14499O1119j339J9725R7331K30538K62642N28054O14624
4982A0753260M64479Q3456P2785l13453n40989l19318L3920k32388k51644m7334
4972I702774r7463j20358M6038p8661l32326q5472J01680j25044j5541p3324Q7910
4961I010213L14796n8014k3736J10259k14109N3746j38936K43375K85267p2783
4951I510078R6321p3680R5791L7300Q8090R8560j39668N6256O5263L30883Q2192
4940A0247386J62543R6546m6554K80130r242J3182J04366K18567K56783p4533
4930A1249174m3250q1357M49309K69480o0164P7653L6267K16778L43193J35649
4920A2592732L28030J99307K51139K32859J82146L15490J48043K49105L99239
$$ plain form
4911 14898090 14863257 15174948 15390843 15524600 16119806 16301147 16494029 17089666 18007554 18521695
4901 18521695 18589821 18712347 19030896 18698838 18856233 19082950 19452485 19694338 19783977 19925399
4891 19925399 20246684 20810694 21088582 21368176 21761036 22125316 22732372 23430842 24141111
4882 24141111 24813833 25245402 25712033 25976602 26047426 26524028 27160422 27769589 28135061 28504458
4872 28504458 29152473 29623065 29990590 30312823 30734020 31610908 32029202 32753766 33601380
4863 33601380 34815848 35813291 36869994 38056989 38711705 39194724 39755120 40453684 41545346
4854 41545346 42743623 44230337 45704249 47400562 49607891 52275705 55199985 58042059
4846 58042059 61125455 65208106 69447715 74176817 79676599 86048673 93396827 102192390
$$ packed form
4911A4898090l4833L11691K15895J33757N95206J81341J92882N95637R17888N14141
4901A8521695O8126J22526L18549l32058J57395K26717L69535K41853Q9639J41422
4891A9925399L21285N64010K77888K79594L92860L64280O07056O98470P10269
4882B4141111O72722M31569M66631K64569P0824M76602O36394O09167L65472L69397
4872B8504458O48015M70592L67525L22233M21197Q76888M18294P24564Q47614
4863C3601380J214468R97443J056703J186995O54716M83019N60396O98564J091662
4854D1545346J198277J486714J473912J696313K207329K667814K924280K842074
4846E8042059L083396M082651M239609M729102N499782O372074P348154Q795563
$$ plain form
4838 102192390 113744452 131529281 154272996 177111537 192168303 199705472 203128889
4831 203128889 201581495 200886111 200855218 201940629 203090207 203868256 204458979 204768380 205658055
4822 205658055 207321117 209245986 210964168 212873914 215519740 218164714 221026883 224089295
4814 224089295 228586320 234449233 241393371 249479812 258554819 268132028 277361173 287288952
4806 287288952 298041845 308608472 319243572 329281988 337980274 343966207 346876402
4799 346876402 346186435 342422321 336353517 329285930 322346941 317030409 315714034 321001238
4791 321001238 330597764 338555712 337642542 327587585 311088747 290836012 271492513 255217361
4783 255217361 242880633 234073369 228613579 226178709 226425505 229324987 235038221 243877021
$$ packed form
4838A02192390J1552062J7784829K2743715K2838541J5056766P537169L423417
4831B03128889j547394o95384l0893J085411J149578P78049N90723L09401Q89675
4822B05658055J663062J924869J718182J909746K645826K644974K862169L062412
4814B24089295M497025N862913O944138Q086441R075007R577209R229145R927779
4806B87288952J0752893J0566627J0635100J0038416Q698286N985933K910195
4799C46876402o89967l764114o068804p067587o938989n316532j316375N287204
4791C21001238R596526P957948r13170j0054957j6498838k0252735j9343499j6275152
4783B55217361j2336728q807264n459790k434870K46796K899482N713234Q838800
$$ plain form
4775 243877021 257489540 276502273 298216292 317523240 330577788 338872955 346690252
4768 346690252 352606163 352173202 341149955 320620833 292933311 261900897 232693623
4761 232693623 207800472 187852775 172994053 162601402 155908242 152858159 153321980 157736200
4753 157736200 167433612 184750359 210734266 240491843 264900542 277481394 279274231
4746 279274231 272195598 260531622 249654973 240835877 234474354 229950821 226014000 222400499
4738 222400499 218342336 214510959 211047972 208050374 206086218 204711809 204157626 204461371
4730 204461371 205575734 207644916 210753657 215603216 222240020 230743362 241700523 254166622
4722 254166622 268167959 282381828 296681065 311025886 325037834 338691715 351629773
$$ packed form
4775B43877021J3612519J9012733K1714019J9306948J3054548Q295167P817297
4768C46690252N915911m32961j1023247k0529122k7687522l1032414k9207274
4761B32693623k4893151j9947697j4858722j0392651o693160l050083M63821M414220
4753A57736200R697412J7316747K5983907K9757577K4408699J2580852J792837
4746B79274231p078633j1663976j0876649q819096o361523m523533l936821l613501
4738B22400499m058163l831377l462987k997598j964156j374409n54183L03745
4730B04461371J114363K069182L108741M849559O636804Q503342J0957161J2466099
4722B54166622J4001337J4213869J4299237J4344821J4011948J3653881J2938058
$$ plain form
4715 351629773 362447016 369412001 371997878 369461198 363355841 354768542 345290530 335110786
4707 335110786 323931902 312382091 300294079 288091155 276611769 266442374 257944187
4700 257944187 250751184 245054938 241023122 238036452 235804892 233702965 232191749 231482843
4692 231482843 231165661 230866844 230364488 228966229 225738249 220288722 212494593 202705117
4684 202705117 191581743 179585068 167149856 155266870 143596972 132269230 121043487
4677 121043487 110777833 101348680 92423882 84795288 78028546 71989696 66452627 61811817
4669 61811817 57955105 54109853 50721421 48118784 45808510 43422820 41601515 39980031
4661 39980031 38386771 36938863 35611247 34487925 33562715 32484020 31570556 30784468 30118346
$$ packed form
4715C51629773J0817243O964985K585877k536680o105357q587299r478012j0179744
4707C35110786j1178884j1549811j2088012j2202924j1479386j0169395q498187
4700B57944187p193003n696246m031816k986670k231560k101927j511216p08906
4692B31482843l17182k98817n02356j398259l227980n449527p794129r789476
4684B02705117j1123374j1996675j2435212j1882986j1669898j1327742j1225743
4677A21043487j0265654r429153q924798p628594o766742o038850n537069m640810
4669F1811817l856712l845252l388432k602637k310274k385690j821305j621484
4661C9980031j593260j447908j327616j123322r25210j078695r13464p86088o66122
$$ plain form
4652 30118346 29903489 29472819 29005916 28480560 28251535 27881862 27372287 27115683 26916939
4643 26916939 26379888 25808828 25346868 24708440 24231290 23910271 23379283 22729605 22258121
4634 22258121 22190586 22237651 22222849 22602665 23750157 26122600 29724996 33361258 35507573
4625 35507573 35332941 33925284 31038808 28129429 25831065 23668204 21835097 20791925
4617 20791925 20249595 19654062 19683159 20057841 20788076 22021226 23377797 24998145 26718124
4608 26718124 27738454 28092378 28488933 28915011 30575988 33483153 36714115 39112447 40151933
4599 40151933 40771148 40500962 40201617 40417991 42242964 45174231 48117194 49707581 49434806
4590 49434806 47741514 44978077 42301019 40541964 40216117 40384544 40096509 39164358 37068333
$$ packed form
4652C0118346k14857m30670m66903n25356k29025l69673n09575k56604j98744
4643B6916939n37051n71060m61960o38428m77150l21019n30988o49678m71484
4634B2258121o7535M7065j4802L79816J147492K372443L602396L636262K146315
4625C5507573j74632j407657k886476k909379k298364k162861j833107j043172
4617B0791925n42330n95533K9097L74682P30235J233150J356571J620348J719979
4608B6718124J020330L53924L96555M26078J660977K907165L230962K398332J039486
4599D0151933O19215k70186k99345K16374J824973K931267K942963J590387k72775
4590D9434806j693292k763437k677058j759055l25847J68427k88035r32151k096025
$$ plain form
4581 37068333 34323298 31459151 28894295 27419264 26195022 25149578 23943514 22390197
4573 22390197 20562712 18765105 16763631 15199465 13867992 12602090 11732513 11355959
4565 11355959 10681128 10324812 10121918 9725819 9568343 9503248 9819762 9880647 9946628 10057864
4555 10057864 10003869 9874091 9976876 10109437 10477114 10851862 11048886 11353683 11404850 11411704
4545 11411704 11673194 11933333 12397229 12683365 13348414 14119165 14680480 15111461 15873687
4536 15873687 16996844 18184235 19323780 20667327 22634094 24607680 26849156 29861230
4528 29861230 33336108 38085441 44709914 54852511 71109502 93434057 117831064 136903150
4520 136903150 145412347 143681684 134136523 120505553 107250561 97267616 92438779 94763897
$$ packed form
4581C7068333k745035k864147k564856j475031j224242j045444j206064j553317
4573B2390197j827485j797607k001474j564166j331473j265902q69577l76554
4565A1355959o74831l56316k02894l96099j57476o5095L16514O0885O5981J11236
4555A0057864n3995j29778J02785J32561L67677L74748J97024L04797N1167O854
4545A1411704K61490K60139M63896K86136O65049P70751N61315M30981P62226
4536A5873687J123157J187391J139545J343547J966767J973586K241476L012074
4528B9861230L474878M749333O624473J0142597J6256991K2324555K4397007J9072086
4520A36903150Q509197j730663r545161j3630970j3254992r982945m828837K325118
$$ plain form
4512 94763897 104966792 121498324 138970891 150178837 151552060 143900853 130167778
4505 130167778 114967040 101607156 93081178 90996057 96074645 108617205 123374047
4498 123374047 133565500 135449954 129715640 118267724 104397425 92124014 83029615
4491 83029615 78515284 80756858 89812994 103360013 115850991 121693183 118994037 108919059
4483 108919059 94418191 78641607 64192509 52040275 42395162 34819549 28915933
4476 28915933 24466313 21025905 18641078 16923962 15557064 14271988 13364715 12504695
4468 12504695 11858628 11196028 10390348 10210144 9635983 9169726 8704076 8384261 8226194
4459 8226194 8116745 7974568 7631512 7408383 7340915 7211755 7154192 7140377 6867284 6695784
$$ packed form
4512I4763897J0202895J6531532J7472567J1207946J373223p651207j3733075
4505A30167778j5200738j3359884q525978k085121N078588J2542560J4756842
4498A23374047J0191453J884454n734314j1447916j3870299j2273411r094399
4491H3029615m514331K241574R056136J3547019J2490978N842192k699146j0074978
4483A08919059j4500868j5776584j4449098j2152234r645113p575613n903616
4476B8915933m449620l440408k384827j717116j366898j285076r07273q60020
4468A2504695o46067o62600q05680j80204n74161m66257m65650l19815j58067
4459H226194j09449j42177l43056k23129o7468j29160n7563j3815k73093j71500
$$ plain form
4449 6695784 6345353 6393763 6290364 6183710 6085721 6254945 6264950 5799470 5768464 5775128 5957126
4438 5957126 5881148 5541076 5609763 5647126 5631016 5996818 6120546 6275536 6372885 6501592
4428 6501592 6654765 6738044 6803475 6445016 6228866 6100798 6214507 5863071 5445320 5443880
4418 5443880 5190724 5155268 5047433 5004915 4923968 4841457 4813403 5220273 5211648 5013486 4922488
4407 4922488 4877055 5033142 4873385 4787931 4972739 5023260 5069624 4957207 4553550 4554534 4495281
4396 4495281 4424357 4121745 4080819 3908777 3915921 4116765 4215439 4275908 4292877 4373905 4470446
4385 4470446 4471492 4356165 4324972 4353646 4505965 4420881 4266992 4160556 3937647 4158950
4375 4158950 4486073 4597999 5095274 5367071 5969003 6212059 6098933 5944355 5419463 5284839
$$ packed form
4449F695784l50431M8410j03399j06654r7989J69224J0005m65480l1006O664J81998
4438E957126p5978l40072O8687L7363j6110L65802J23728J54990R7349J28707
4428F501592J53173Q3279O5431l58459k16150j28068J13709l51436m17751j440
4418E443880k53156l5456j07835m2518q0947q2511k8054M06870q625j98162r0998
4407D922488m5433J56087j59757q5454J84808N0521M6364j12417m03657R84n9253
4396D495281p0924l02612m0926j72042P144K00844R8674O0469J6969Q1028R6541
4385D470446J046j15327l1193K8674J52319q5084j53889j06436k22909K21303
4375D158950L27123J11926M97275K71797O01932K43056j13126j54578n24892j34624
$$ plain form
4365 5284839 5162936 5054796 4881090 4955231 4855054 4567411 4740823 4619507 4528643 4555487
4355 4555487 4320983 4486424 4275993 4370639 4631389 4597918 4771158 4915774 4951813 5328615
4345 5328615 5183221 5116297 4671795 4429233 4542988 4620289 4865125 4706389 4590716 4572052
4335 4572052 4700270 4659322 4785170 4546930 4443952 4257916 4239453 4178409 4324636 4540669
4325 4540669 4649709 4781197 4660886 4756775 4802053 4678825 4813862 5075337 5415097 5370030
4315 5370030 4912607 4618042 4589599 4440842 4646199 4706606 4471908 4509307 4621667 4722634
4305 4722634 4802341 4572924 4696321 4939078 4722313 4663343 4842863 4645781 4521811 4508434
4295 4508434 4493321 4608980 4719107 4751669 4943029 5192803 5149347 5012529 4904699 4754977
$$ packed form
4365E284839j21903j08140j73706P4141j00177k87643J73412j21316r0864K6844
4355D555487k34504J65441k10431R4646K60750l3471J73240J44616L6039L76802
4345E328615j45394o6924m44502k42562J13755P7301K44836j58736j15673j8664
4335D572052J28218m0948J25848k38240j02978j86036j8463o1044J46227K16033
4325D540669J09040J31488j20311R5889M5278j23228J35037K61475L39760m5067
4315E370030m57423k94565k8443j48757K05357O0407k34698L7399J12360J00967
4305D722634P9707k29417J23397K42757k16765n8970J79520j97082j23970j3377
4295D508434j5113J15659J10127L2562J91360K49774m3456j36818j07830j49722
$$ plain form
4285 4754977 4543426 4312957 4700577 4821337 4946636 4969889 5108755 5365013 4892638 4976501
4275 4976501 5134987 5233594 5124560 5174463 5051232 5211762 5265654 5061744 5141686 5401517
4265 5401517 5306992 5087234 5037529 5124586 5068124 4944428 4972120 5181918 5407231 5231032
4255 5231032 5256914 5341827 5223824 5142357 5079355 4917333 5096994 5169367 5233156 5204783 5333610
4244 5333610 5523312 5568948 5701859 5747096 6121421 6135418 6559578 7147924 7469929 7302277
4234 7302277 7296450 7328655 6969472 6685108 6623255 6506455 6262041 6204549 6185364 6402108 6073572
4223 6073572 6359666 6507571 6410378 6629201 6650664 6885053 6635407 6663112 6827625 6672326
4213 6672326 6903417 7005322 7044375 7270624 7089377 6992716 7211392 7511278 7597105 7519099
$$ packed form
4285D754977k11551k30469L87620J20760J25299K3253J38866K56258m72375Q3863
4275D976501J58486R8607j09034M9903j23231J60530N3892k03910P9942K59831
4265E401517r4525k19758m9705Q7057n6462j23696K7692K09798K25313j76199
4255E231032K5882Q4913j18003q1467o3002j62022J79661P2373O3789k8373J28827
4244E333610J89702M5636J32911M5237L74325J3997M24160N88346L22005j67652
4234G302277n827L2205l59183k84364o1853j16800k44414n7492j9185K16744l28536
4223F073572K86094J47905r7193K18823K1463K34389k49646K7705J64513j55299
4213F672326K31091J01905L9053K26249j81247r6661K18676K99886Q5827p8006
$$ plain form
4203 7519099 7298643 7485563 7380333 7562171 7775007 7795097 7931872 8164848 8210806 8366264
4193 8366264 8181219 8163179 8472150 8533424 8760958 8724164 8862072 9135564 9168483 9005355
4183 9005355 9419554 9670047 10008987 9966126 9878500 10175680 10423516 10480142 10509879 10642183
4173 10642183 11211761 11226233 11400377 11790280 12059539 12230960 12474065 12603998 12628124 12953776
4163 12953776 13030225 13383564 13391703 13803364 14098322 14336740 14735476 15061848 15471269 16011436
4153 16011436 16469537 16635305 17406030 17709700 18302989 19169010 20028092 20945013 21922236
4144 21922236 23056804 24057410 25295094 27134440 29075060 30587804 32435380 34575092
4136 34575092 36369398 37959376 39923272 41823769 43257006 44511791 45707376 46908467
$$ packed form
4203G519099k20456J86920j05230J81838K12836K0090J36775K32976M5958J55458
4193H366264j85045j8040L08971O1274K27534l6794J37908K73492L2919j63128
4183I005355M14199K50493L38940m2861q7626K97180K47836N6626K9737J32304
4173A0642183N69578J4472J74144L89903K69259J71421K43105J29933K4126L25652
4163A2953776P6449L53339Q139M11661K94958K38418L98736L26372M09421N40167
4153A6011436M58101J65768P70725L03670N93289Q66021Q59082R16921R77223
4144B1922236J134568J000606J237684J839346J940620J512744J847576K139712
4136C4575092J794306J589978J963896J900497J433237J254785J195585J201091
$$ plain form
4128 46908467 47611978 48199817 48616352 49587769 50795686 52615334 55197879 58098607 61052212
4119 61052212 63865787 66608619 69005445 70971232 72650866 74644891 76923920 79448971
4111 79448971 82050927 84432490 86609396 88809952 90990334 93463336 95813703 98163734
4103 98163734 100803305 103413707 105795768 108303723 110450578 112695292 115467168 119266719
4095 119266719 124472686 131551238 138722844 145282268 150733426 153744486 155686088 156484283
4087 156484283 156707800 157306358 158270608 159843325 162064401 164803014 168454717 172948265
4079 172948265 176458194 178577569 179581109 179672784 179492536 179442891 179621916 179984893 180316100
4070 180316100 181657309 184588206 189584530 196839176 206126016 216589223 227763100 238515963
$$ packed form
4128D6908467P03511N87839M16535R71417J207917J819648K582545K900728K953605
4119F1052212K813575K742832K396826J965787J679634J994025K279029K525051
4111G9448971K601956K381563K176906K200556K180382K473002K350367K350031
4103I8163734K639571K610402K382061K507955K146855K244714K771876L799551
4095A19266719N205967P078552P171606O559424N451158L011060J941602P98195
4087A56484283K23517N98558R64250J572717K221076K738613L651703M493548
4079A72948265L509929K119375J003540R1675j80248m9645J79025L62977L31207
4070A80316100J341209K930897M996324P254646R286840J0463207J1173877J0752863
$$ plain form
4062 238515963 248106482 256243499 263463444 270635052 277346146 283752214 289357879 293989692
4054 293989692 298143804 301603385 304002126 304935130 305313670 305235277 304938972 305395647 307725187
4045 307725187 312497286 319861370 330815040 343430279 356247837 367578325 375946392
4038 375946392 380400427 381517955 380759150 378944326 377489677 376936025 377527761 379760656
4030 379760656 383296751 387361643 391566326 394663574 395953156 395990659 394615536 392707155
4022 392707155 390415125 387153934 382759470 377037148 370921187 365300752 360746857 357521287
4014 357521287 353899289 348995919 341413227 330983195 318162615 304133319 289816709
4007 289816709 277393178 266966778 259133425 253498768 248780595 245139148 241832673 238556591
$$ packed form
4062B38515963R590519Q137017P219945P171608O711094O406068N605665M631813
4054B93989692M154112L459581K398741R33004L78540p8393k96305M56675K329540
4045C07725187M772099P364084J0953670J2615239J2817558J1330488Q368067
4038C75946392M454035J117528p58805j814824j454649n53652N91736K232895
4030C79760656L536095M064892M204683L097248J289582L7503j375123j908381
4022C92707155k292030l261191m394464n722322o115961n620435m553895l225570
4014C57521287l621998m903370p582692j0430032j2820580j4029296j4316610
4007B89816709j2423531j0426400p833353n634657m718173l641447l306475l276082
$$ plain form
3999 238556591 234841221 230801207 226367673 221898444 216964361 212135864 207221884 202558022
3991 202558022 198557694 195039030 191968390 189406913 187017990 184175716 179994863 174042792
3983 174042792 166752434 159015487 151501092 144874972 139030723 134270552 130488599 127292580
3975 127292580 123823625 120412461 116942941 113308020 109776465 106393197 103219277 100470029
3967 100470029 97790513 95397945 93279925 91429472 90273710 89976175 89886715 90064715 89091901
3958 89091901 85951646 82013071 76911160 71733680 67101169 63149413 59858134 57124098
3950 57124098 54953092 52789513 50893408 48948217 46848957 44963881 43349633 41830923
3942 41830923 40161866 38868309 37480678 35892570 33867400 31961978 30153960 28131643
$$ packed form
3999B38556591l715370m040014m433534m469229m934083m828497m913980m663862
3991B02558022m000328l518664l070640k561477k388923k842274m180853n952071
3983A74042792p290358p736947p514395o626120n844249m760171l781953l196019
3975A27292580l468955l411164l469520l634921l531555l383268l173920k749248
3967A00470029k679516k392568k118020j850453j155762k97535q9460J78000r72814
3958H9091901l140255l938575n101911n177480m632511l951756l291279k734036
3950E7124098k171006k163579j896105j945191k099260j885076j614248j518710
3942D1830923j669057j293557j387631j588108k025170j905422j808018k022317
$$ plain form
3934 28131643 26274793 24858901 24092257 23904153 24837260 26184277 26597372 25801796 24373680
3925 24373680 22397951 20071718 18044778 16364430 15310310 14047238 12969701 12161950
3917 12161950 11688425 11155886 10508445 10245238 9951448 9399036 9130221 8847117 8415083
3908 8415083 8131636 7823344 7736842 7447309 7234863 6955101 6803756 6509073 6312744 6173068
3898 6173068 5906881 5851436 5653913 5584930 5207150 5122763 4898036 4843150 4842365 4646317 4904259
3887 4904259 4697896 4323260 4265792 4136511 4058768 3820705 3776799 3971169 3703326 3386101
3877 3386101 3041803 3329118 3522552 3392737 3548864 3386381 2971804 2943491 2669729 2421726
3867 2421726 2503173 2558980 2669033 2517193 2189665 2018649 1884972 2069587 2125679 1980706
$$ packed form
3934B8131643j856850j415892p66644j88104R33107J347017M13095p95576j428116
3925B4373680j975729k326233k026940j680348j054120j263072j077537q07751
3917A2161950m73525n32539o47441k63207k93790n52412k68815k83104m32034
3908H415083k83447l08292q6502k89533k12446k79762j51345k94683j96329j39676
3898F173068k66187n5445j97523o8983l77780q4387k24727n4886p85j96048K57942
3887D904259k06363l74636n7468j29281p7743k38063m3906J94370k67843l17225
3877C386101l44298K87315J93434j29815J56127j62483m14577k8313k73762k48003
3867B421726Q1447N5807J10053j51840l27528j71016j33677J84615N6092j44973
$$ plain form
3857 1980706 1985336 1654180 1526765 1517361 1628774 1642996 1317504 1349923 1787284 1580270 1597872
3846 1597872 1665497 1646562 1828412 1708302 1541309 1137780 877105 929440 752245 1063092
3836 1063092 857068 936908 1195523 1043211 1090919 901764 1191092 1279483 1186839 968083
3826 968083 692512 606515 755005 980355 943671 759616 714019 766001 1029016 1000057 975444
3815 975444 755954 968484 1156707 1178852 1147218 1317489 1345522 1129802 830594 1175589
3805 1175589 1180646 1098403 928478 853060 1150407 991617 910488 887382 1050544 1176913 997629
3794 997629 964304 1025767 763652 802820 943559 914859 1107623 1309956 1199775 1243657 1319091
3783 1319091 1421063 1266067 1275077 1170821 1152945 1039902 1312847 1231696 1290696 1356600 1076965
$$ packed form
3857A980706M630l31156j27415r404J11413J4222l25492L2419M37361k07014J7602
3846A597872O7625j8935J81850j20110j66993m03529k60675N2335j77195L10847
3836A063092k06024P9840K58615j52312M7708j89155K89328Q8391r2644k18756
3826I68083k75571q5997J48490K25350l6684j84055m5597N1982K63015k8959k4613
3815I75444k19490K12530J88223K2145l1634J70271K8033k15720k99208L44995
3805A175589N057q2243j69925p5418K97347j58790q1129k3106J63162J26369j79284
3794I97629l3325O1463k62115L9168J40739k8700J92764K02333j10181M3882P5434
3783A319091J01972j54996R010j04256j7876j13043K72945q1151N9000O5904k79635
$$ plain form
3772 1076965 1131570 1187855 1275784 1265598 1236312 1267602 1118191 949518 1107129 1073524 964907
3761 964907 1221531 1418346 1201020 1020663 1163896 1334055 1410304 1418090 1370433 1222552
3751 1222552 1296874 1465912 1377087 1488515 1610617 1271822 1038787 1363409 1841951 1863332
3741 1863332 1418296 1496506 1436500 1442286 1425134 1458718 1255963 1147388 1089204 1036113 1194857
3730 1194857 1339481 1376211 1177546 1304813 1242423 1094509 874090 904675 1001599 1133039
3720 1133039 1105677 1012055 993446 803529 997455 1030266 1062926 1274821 1225557 1307574 1519483
3709 1519483 1448546 1370587 1470879 1105483 1101062 1007560 908851 968280 1166384 776092 755276
3698 755276 1037122 1236040 1137302 659161 678680 354295 634253 649782 495367 295995
$$ packed form
3772A076965N4605N6285Q7929j0186k9286L1290j49411j68673J57611l3605j08617
3761I64907K56624J96815k17326j80357J43233J70159P6249P786m7657j47881
3751A222552P4322J69038q8825J11428J22102l38795k33035L24622M78542K1381
3741A863332m45036P8210o0006N786j7152L3584k02755j08575n8184n3091J58744
3730A194857J44624L6730j98665J27267o2390j47914k20419L0585R6924J31440
3720A133039k7362r3622j8609j89917J93926L2811L2660K11895m9264Q2017K11909
3709A519483p0937p7959J00292l65396m421r3502r8709N9429J98104l90292k0816
3698G55276K81846J98918r8738m78141J9519l24385K79958J5529j54415j99372
$$ plain form
3688 295995 338840 455309 204425 364230 373665 424451 375403 352048 515462 627027 600043
3677 600043 353763 314740 161907 237790 707698 580009 608415 405348 262258 309524
3667 309524 140782 101231 313550 421994 525610 504990 244656 328870 444131 349356
3657 349356 474761 814246 541256 399047 408934 313326 407037 158437 332133 503163
3647 503163 190363 218903 273730 124741 241396 303903 88302 257803 331144 501119
3637 501119 535332 312839 194957 300682 204810 308379 405836 394795 268569 118313
3627 118313 45188 218027 144232 262825 467538 307115 49951 250139 375227 585070
3617 585070 731833 479293 330195 462518 378544 419323 795661 643034 248990 215883
$$ packed form
3688B95995M2845J16469k50884J59805R435N0786m9048k3355J63414J11565k6984
3677F00043k46280l9023j52833P5883M69908j27689K8406k03067j43090M7266
3667C09524j68742l9551K12319J08444J03616k0620k60334Q4214J15261r4775
3657C49356J25405L39485k72990j42209R887r5608R3711k48600J73696J71030
3647E03163l12800K8540N4827j48989J16655O2507k15601J69501P3341J69975
3637E01119L4213k22493j17882J05725r5872J03569R7457j1041j26226j50256
3627A18313p3125J72839p3795J18593K04713j60423k57164K00188J25088K09843
3617E85070J46763k52540j49098J32323q3974M0779L76338j52627l94044l3107
$$ plain form
3607 215883 195698 404367 398426 338236 840919 627186 614940 800535 1039547 1333431 1339147
3596 1339147 1140091 1436622 1089750 920616 874552 1201426 1173935 1017032 962625 1026443
3586 1026443 1368977 1320907 1486685 1067435 1140512 1272851 1558765 1691983 1352593 1474477
3576 1474477 1870013 1910612 1918024 2063659 1998392 2022302 1963996 1983058 2213559 2343177 2267836
3565 2267836 2306142 2385187 2382417 2764467 2594119 2345293 2785050 2739478 2896236 2799996 2978952
3554 2978952 2833424 2727683 3049572 3198469 3423173 3347931 3353709 3721248 4387652 4413324
3544 4413324 4591535 4661368 4888356 5071983 5148269 5456120 5555491 5785139 6087699 6078655
3534 6078655 6229464 6531843 6624859 6617835 6607854 6480430 6730980 7171221 7147144 7164518 7383167
$$ packed form
3607B15883k0185K08669n941o0190N02683k13733j2246J85595K39012K93884N716
3596A339147j99056K96531l46872j69134m6064L26874k7491j56903n4407O3818
3586A026443L42534m8070J65778m19250P3077J32339K85914J33218l39390J21884
3576A474477L95536M0599P412J45635o5267K3910n8306J9062K30501J29618p5341
3565B267836L8306P9045k770L82050j70348k48826M39757m5572J56758r6240J78956
3554B978952j45528j05741L21889J48897K24704p5242N778L67539O66404K5672
3544D413324J78211O9833K26988J83627P6286L07851R9371K29648L02560r044
3534F078655J50809L02379R3016p024r981j27424K50550M40241k4077J7374K18649
$$ plain form
3523 7383167 7541692 7785895 8290032 8773509 9270480 9560189 10333911 10787445 11194182 11133953
3513 11133953 11305691 11459305 11951539 12470763 12844477 13396774 13784245 14640191 15887381
3504 15887381 17457968 18841486 20621229 22415186 24159806 25769979 27788847 29508013
3496 29508013 30759282 31844004 32083724 32066905 31444615 30407558 29738274 28306661 27216443
3487 27216443 26352951 25282855 24309563 23955267 23558906 23376166 22926476 22580978 22109556
3478 22109556 21562828 21097287 20171529 19100589 17892161 16604815 15427397 14263668 13109965
3469 13109965 12206658 11297016 10778971 9850699 9066504 8578320 8320870 7875735 7320069
3460 7320069 7020769 6697064 6657021 6435554 6164046 5900389 5701818 5421852 5133449 5019529
$$ packed form
3523G383167J58525K44203N04137M83477M96971K89709P73722M53534M06737o0229
3513A1133953J71738J53614M92234N19224L73714N52297L87471Q55946J247190
3504A5887381J570587J383518J779743J793957J744620J610173K018868J719166
3496B9508013J251269J084722K39720j6819o22290j037057o69284j431613j090218
3487B7216443q63492j070096r73292l54296l96361j82740m49690l45498m71422
3478B2109556n46728m65541r25758j070940j208428j287346j177418j163729j153703
3469A3109965r03307r09642n18045r28272p84195m88184k57450m45135n55666
3460G320069k99300l23705m0043k21467k71508k63657j98571k79966k88403j13920
$$ plain form
3450 5019529 4810056 4545250 4554747 4508292 4174347 4169263 3948821 3887339 3748294 3942674 3842206
3439 3842206 3638140 3214362 2906897 3143647 2874644 2888746 3084361 3036833 2928490 2789646
3429 2789646 2640295 2759687 2188875 2272881 2351701 2067186 2236800 2359838 2114365 2089515
3419 2089515 2066051 1839370 1879742 1474214 1397011 1728896 1654840 1586415 1488919 1276243 1230553
3408 1230553 1223954 1311987 1038303 884939 898425 1238670 1417132 1263350 1298250 1234035 1215322
3397 1215322 1036217 1019790 1117940 1114409 952317 770663 862452 574003 978911 634322
3387 634322 725704 601355 594198 596510 839073 815133 902924 946545 858031 1005246 1195796
3376 1195796 1319127 1103646 1034999 825512 979426 1044579 1034589 858436 760775 551054
$$ packed form
3450E019529k09473k64806R497m6455l33945n084k20442o1482j39045J94380j00468
3439C842206k04066m23778l07465K36750k69003J4102J95615m7528j08343j38844
3429B789646j49351J19392n70812Q4006P8820k84515J69614J23038k45473k4850
3419B089515k3464k26681M0372m05528p7203L31885p4056o8425r7496k12676m5690
3408A230553o599Q8033k73684j53364J3486L40245J78462j53782L4900o4215j8713
3397A215322j79105j6427R8150l531j62092j81654R1789k88449M04908l44589
3387F34322R1382j24349p157K312K42563k3940Q7791M3621q8514J47215J90550
3376A195796J23331k15481o8647k09487J53914O5153r990j76153r7661k09721
$$ plain form
3366 551054 437499 380926 494159 747110 820890 551762 468992 542230 646529 447827
3356 447827 466935 470108 396785 450348 485443 617374 614564 603423 642830 639882 1004420 1187324
3344 1187324 1326071 1346658 1535150 1404612 1286041 1236597 1343582 887466 802579 596989
3334 596989 345676 285119 133788 35978 -198101 52059 271482 3582 -84324 161306
3324 161306 187105 143837 -81187 32260 168825 333406 297482 301040 58799 -165647 112391
3313 112391 122902 375922 449060 347520 758898 751385 279597 437454 593214 468306
3303 468306 388222 66887 -203750 -94400 -107281 -232206 104997 72675 170796 468326
3293 468326 148894 113636 137244 103973 36150 72317 57196 142942 174041 87806 188060
$$ packed form
3366E51054j13555n6573J13233K52951P3780k69128q2770P3238J04299j98702
3356D47827J9108L173p3323N3563L5095J31931k810j1141L9407k948L64538J82904
3344A187324J38747K0587J88492j30538j18571m9444J06985m56116q4887k05590
3334E96989k51313o0557j51331r7810k34079K50160K19423k67900q7906K45630
3324A61306K5799m3268k25024J13447J36565J64581l5924L558k42241k24446K78038
3313A12391J0511K53020P3138j01540M11378p513m71788J57857J55760j24908
3303D68306q0084l21335k70637J09350j2881j24925L37203l2322R8121K97530
3293D68326l19432l5258K3608l3271o7823L6167j5121Q5746L1099q6235J00254
$$ plain form
3282 188060 98356 -167584 -5981 -31567 86931 -88818 -167162 -208767 -128490 80706 32756
3271 32756 34843 -32517 16300 -92114 -396596 -532521 -517318 -323184 -130541 87041 2021
3260 2021 14606 130545 -45048 205433 -73462 168568 176682 -9901 -41768 66731 105864
3249 105864 -60226 62576 198808 231372 516368 381597 240977 271613 148558 422279
3239 422279 371710 588536 460419 324982 305238 349998 563117 443012 471238 386490 483155
3228 483155 561675 779741 449270 273527 446579 769894 851240 1104127 1141690 1080213
3218 1080213 1061798 1277088 973861 973427 1017042 1126193 989400 772798 935307 1108793
3208 1108793 1704012 1596784 1547091 1674622 1760801 1895035 2074396 2159419 2118780 2246176
$$ packed form
3282A88060q9704k65940J61603k5586J18498j75749p8344m1605Q0277K09196m7950
3271C2756K087o7360M8817j08414l04482j35925J5203J94134J92643K17582q5020
3260B021J2585J15939j75593K50481k78895K42030Q114j86583l1867J08499L9133
3249A05864j66090J22802J36232L2564K84996j34771j40620L0636j23055K73721
3239D22279n0569K16826j28117j35437j9744M4760K13119j20105K8226q4748R6665
3228D83155P8520K18066l30471j75743J73052L23315Q1346K52887L7563o1477
3218A080213j8415K15290l03227m34M3615J09151j36793k16602J62509J73486
3208A108793N95219j07228m9693J27531Q6179J34234J79361Q5023m0639J27396
$$ plain form
3198 2246176 2523050 2919717 3050826 3288837 3437588 3697949 3829184 4293634 4507678 4810972
3188 4810972 5312542 5881948 6640055 7272570 7909906 8820222 9669006 9879690 10124637 10304943
3178 10304943 10345649 10319734 10391851 10204256 10191478 9770084 9802470 9777697 9851650 9825812 9853244
3167 9853244 9991699 10037213 10231364 10571114 11021781 11162621 11135337 11491878 11830980 12754911
3157 12754911 14002610 16082428 18987081 22516146 25446322 26824464 26316976 24606777
3149 24606777 22342652 19911650 17621343 15542374 13916078 12436404 11448774 10701212
3141 10701212 10047867 9421356 8965434 8567182 8239135 7890646 7854534 8015833 7953722 8047803
3131 8047803 8151154 8254293 8489277 8835803 9386294 9899960 10280110 11117600 11756534 11994142
$$ packed form
3198B246176K76874L96667J31109K38011J48751K60361J31235M64450K14044L03294
3188D810972N01570N69406P58107O32515O37336R10316Q48784K10684K44947J80306
3178A0304943M0706k5915P2117j87595j2778m21394L2386k4773P3953k5838K7432
3167I853244J38455M5514J94151L39750M50667J40840k7284L56541L39102R23931
3157A2754911J247699K079818K904653L529065K930176J378142n07488j710199
3149B4606777k264125k431002k290307k078969j626296j479674r87630p47562
3141A0701212o53345o26511m55922l98252l28047l48489l6112J61299o2111R4081
3131H047803J03351J03139K34984L46526N50491N13666L80150Q37490O38934K37608
$$ plain form
3121 11994142 12289297 11836119 11386962 10798189 10029709 9327326 8464999 7606468 6663331
3112 6663331 6106140 5825166 5387478 4804619 4248944 4207251 4056612 4097868 3883092 3943327
3102 3943327 3897371 3608919 3523984 3531729 3083636 2727603 2930515 2722713 2584608 2383132
3092 2383132 2707537 2629553 2345048 2467982 2453130 2237069 1932394 1737759 1549345 1564299
3082 1564299 1414523 1312412 1391301 1233404 1303493 991261 788919 601025 693997 812607
3072 812607 940739 651856 575448 714950 550848 535749 423914 376312 344279 -17992
3062 -17992 37138 143178 37354 24763 -263804 -214874 -96813 -196355 -335589 132683 229404
3051 229404 -81413 -178072 -50580 -141085 -193584 27285 95130 -171817 -146523 -131345 -155358
$$ packed form
3121A1994142K95155m53178m49157n88773p68480p02383q62327q58531r43137
3112F663331n57191k80974m37688n82859n55675m1693j50639M1256k14776O0235
3102C943327m5956k88452q4935P745m48093l56033K02912k07802j38105k01476
3092B383132L24405p7984k84505J22934j4852k16061l04675j94635j88414J4954
3082A564299j49776j02111P8889j57897P0089l12232k02342j87894R2972J18610
3072H12607J28132k88883p6408J39502j64102j5099j11835m7602l2033l62271
3062a7992N5130J06040j05824j2591k88567M8930J18061r9542j39234M68272R6721
3051B29404l10817r6659J27492r0505n2499K20869O7845k66947K5294J5178k4013
$$ plain form
3040 -155358 -302692 -545163 -565055 -568418 -352265 -109707 -56747 -479929 -412361 -313759 -301043
3029 -301043 -439076 -404692 -544679 -571621 -445595 -554352 -523606 -791290 -820623 -567137
3019 -567137 -441811 -331285 -291241 -610799 -493750 -382164 -491412 -630862 -581598 -590509
3009 -590509 -490187 -531145 -366712 -527485 -466552 -463035 -618363 -844699 -823898 -835864 -746768
2998 -746768 -655443 -787519 -822773 -763072 -775188 -926469 -692440 -802739 -886272 -981545 -1052808
2987 -1052808 -1081886 -1148241 -958315 -902754 -1102993 -1305805 -1020431 -1067529 -1073829 -926506 -752134
2976 -752134 -464650 -565437 -661318 -685881 -837344 -684838 -915461 -1049737 -1120856 -950939
2966 -950939 -876401 -882930 -652038 -776969 -770709 -1033475 -986623 -908518 -928831 -799066 -763435
$$ packed form
3040a55358j47334k42471j9892l363K16153K42558N2960m23182O7568R8602J2716
3029c01043j38033L4384j39987k6942J26026j08757L0746k67684k9333K53486
3019e67137J25326J10526M0044l19558J17049J11586j09248j39450M9264q911
3009e90509J00322m0958J64433j60773O0933L517j55328k26336K0801j1966Q9096
2998g46768R1325j32076l5254N9701j2116j51281K34029j10299q3533r5273p1263
2987a052808k9078o6355J89926N5561k00239k02812K85374m7098o300J47323J74372
2976g52134K87484j00787r5881k4563j51463J52506k30623j34276p1119J69917
2966i50939P4538o529K30892j24931O260k62766M6852P8105k0313J29765L5631
$$ plain form
2955 -763435 -791484 -542198 -785807 -902078 -767633 -510347 -503914 -713007 -1081991 -1210723
2945 -1210723 -1317295 -1189503 -857993 -650525 -546096 -599811 -676938 -727011 -721115 -685131 -808452
2934 -808452 -858335 -1004320 -995056 -804320 -769658 -631669 -658721 -762859 -814458 -833534 -954286
2923 -954286 -1116882 -1153268 -1158720 -1232546 -1288267 -1105916 -1078660 -1391646 -1011735 -1032832 -829385
2912 -829385 -752270 -831716 -794284 -1072550 -1054100 -755453 -760193 -1044692 -1000195 -979595 -675014
2901 -675014 -806954 -913996 -932832 -1016093 -1040729 -1090573 -893096 -715064 -712103 -870126 -973069
2890 -973069 -1012907 -968326 -771550 -916393 -939326 -1012153 -1002762 -854655 -696189 -1038838 -1032535
2879 -1032535 -847990 -822152 -586771 -627358 -636292 -641541 -854312 -950148 -707623 -514465 -392088
$$ packed form
2955g63435k8049K49286k43609j16271J34445K57286O433k09093l68984j28732
2945a210723j06572J27792L31510K07468J04429n3715p7127n0073N896L5984j23321
2934h08452m9883j45985R264J90736L4662J37989k7052j04138n1599j9076j20752
2923i54286j62596l6386n452p3826n5721J82351K7256l12986L79911k1097K03447
2912h29385P7115p9446L7432k78266J8450K98647m740k84499M4497K0600L04581
2901f75014j31940j07042j8836q3261k4636m9844J97477J78032K961j58023j02943
2890i73069l9838M4581J96776j44843k2933p2827R391J48107J58466l42649O303
2879a032535J84545K5838K35381m0587q934n249k12771r5836K42525J93158J22377
$$ plain form
2868 -392088 -292566 -392419 -856146 -931717 -707766 -647725 -695646 -908537 -984524 -1028469 -1214015
2857 -1214015 -1113101 -831920 -1018630 -1004987 -951417 -1014792 -1123065 -992771 -769187 -791180
2847 -791180 -759256 -895721 -1069471 -1337727 -960594 -785816 -1117184 -1072454 -1048112 -1073089
2837 -1073089 -1159181 -1083650 -670171 -576972 -730095 -756097 -799831 -841348 -824224 -951388 -1122998
2826 -1122998 -1035000 -976607 -1037363 -1117951 -988308 -849698 -912157 -689195 -705136 -896813 -908793
2815 -908793 -816027 -887529 -875086 -838534 -652388 -632595 -735132 -893432 -719249 -691177 -913035
2804 -913035 -512386 -719008 -756826 -657257 -671385 -771515 -1102586 -957771 -941419 -739508
2794 -739508 -646015 -690325 -472406 -761916 -1054926 -1029373 -951674 -893621 -763349 -644817 -650055
$$ packed form
2868c92088R9522r9853m63727p5571K23951O0041m7921k12891p5987m3945j85546
2857a214015J00914K81181j86710J3643N3570o3375j08273J30294K23584k1993
2847g91180L1924j36465j73750k68256L77133J74778l31368M4730K4342k4977
2837a073089q6092P5531M13479R3199j53123k6002m3734m1517J7124j27164j71610
2826a122998Q7998N8393o0756q0588J29643J38610o2459K22962j5941j91677j1980
2815i08793R2766p1502J2443L6552J86146J9793j02537j58300J74183K8072k21858
2804i13035M00649k06622l7818R9569j4128j00130l31071J44815J6352K01911
2794g39508R3493m4310K17919k89510k93010K5553P7699N8053J30272J18532n238
$$ plain form
2783 -650055 -484114 -711289 -943093 -1025699 -882128 -747776 -579185 -611726 -712792 -774925
2773 -774925 -800402 -851552 -892598 -880134 -782686 -347973 -534161 -727076 -642853 -482091 -866381
2762 -866381 -952858 -1229692 -1335688 -1119844 -1037025 -900463 -1080019 -993007 -1137723 -1305221
2752 -1305221 -1359051 -963093 -790756 -693758 -739467 -738313 -977961 -1130646 -1100827 -754017 -511432
2741 -511432 -672537 -621964 -453233 -368205 -813889 -921450 -765783 -533582 -470101 -479109 -627159
2730 -627159 -763796 -785623 -858539 -978199 -795236 -670758 -916454 -940524 -627641 -462787
2720 -462787 -765132 -492015 -480461 -765785 -863693 -691612 -878564 -1002162 -819526 -866351
2710 -866351 -1008442 -491932 -467338 -786503 -969265 -905628 -814043 -716957 -290801 -560046
$$ packed form
2783f50055J65941k27175k31804q2606J43571J34352J68591l2541j01066o2133
2773g74925k5477n1150m1046J2464R7448M34713j86188j92915Q4223J60762l84290
2762h66381q6477k76834j05996K15844Q2819J36562j79556Q7012j44716j67498
2752a305221n3830L95958J72337R6998m5709J154k39648j52685K9819L46810K42585
2741e11432j61105N0573J68731Q5028m45684j07561J55667K32201O3481r008j48050
2730f27159j36637k1827p2916j19660J82963J24478k45696k4070L12883J64854
2720d62787l02345K73117J1554k85324r7908J72081j86952j23598J82636m6825
2710h66351j42091N16510K4594l19165j82762O3637R1585R7086M26156k69245
$$ plain form
2700 -560046 -681765 -970789 -941636 -832480 -509852 -665177 -666887 -610223 -671033 -911117 -660332
2689 -660332 -648302 -759350 -685016 -799979 -826966 -830459 -681427 -787550 -576204 -710468 -850530
2678 -850530 -875887 -552498 -729081 -552143 -713366 -881557 -800579 -862911 -603403 -633245
2668 -633245 -795306 -691503 -719508 -645959 -433377 -642485 -264437 -331196 -584602 -803828
2658 -803828 -940344 -811250 -679955 -471917 -453371 -567208 -668556 -518040 -545702 -531787
2648 -531787 -490703 -695133 -836480 -883964 -810783 -650643 -666830 -485538 -265305 -393067
2638 -393067 -501970 -677738 -568239 -558610 -499595 -592243 -566000 -551958 -622804 -537596 -534431
2627 -534431 -666066 -385648 -347785 -411498 -377020 -103462 217349 486397 810232 1237140
$$ packed form
2700e60046j21719k89024K9153J09156L22628j55325j710N6664o0810k40084K50785
2689f60332J2030j11048P4334j14963k6987l493J49032j06123K11346j34264j40062
2678h50530k5357L23389j76583J76938j61223j68191Q0978o2332K59508k9842
2668f33245j62061J03803k8005P3549K12582k09108L78048o6759k53406k19226
2658h03828j36516J29094J31295K08038J8546j13837j01348J50516k7662J3915
2648e31787M1084k04430j41347m7484P3181J60140j6187J81292K20233j27762
2638c93067j08903j75768J09499R629N9015r2648K6243J4042p0846Q5208L165
2627e34431j31635K80418L7863o3713L4478K73558L20811K69048L23835M26908
$$ plain form
2617 1237140 1475894 1774386 1412244 1224374 871142 396106 358133 -37554 -381992 -238790
2607 -238790 -265120 -489785 -389970 -362400 -334400 -377892 -409020 -459532 -319456 -545099 -572009
2596 -572009 -572485 -649991 -633366 -692582 -550944 -509391 -472549 -562670 -586233 -751794 -675582 -384074
2584 -384074 -268348 -259895 -163110 -398687 -495761 -220391 92331 -35371 -59901 -69800 -116561
2573 -116561 -120403 -318273 -607411 -672570 -513660 -445966 -72465 -88739 163790 -10737 152708
2562 152708 -69495 -336811 -248452 -514737 -437911 -537567 -608572 -320755 28080 258932
2552 258932 417092 67912 -312660 -195807 -302108 -356084 -375628 -356320 -443816 -390452 -416605
2541 -416605 -191158 -150100 -95652 -72420 -29409 -95292 -240984 -175349 -49845 99789 190726
$$ packed form
2617A237140K38754K98492l62142j87870l53232m75036l7973l95687l44438J43202
2607b38790k6330k24665R9815K7570K8000m3492l1128n0512J40076k25643k6910
2596e72009m76p7506J6625n9216J41638M1553L6842r0121k3563j65561P6212K91508
2584c84074J15726Q453R6785k35577r7074K75370L12722j27702k4530r899m6761
2573a16561l842j97870k89138o5159J58910O7694L73501j6274K52529j74527J63445
2562A52708k22203k67316Q8359k66285P6826r9656p1005K87817L48835K30852
2552B58932J58160l49180l80572J16853j06301n3976j9544J9308q7496N3364k6153
2541d16605K25447M1058N4448K3232M3011o5883j45692O5635J25504J49634R0937
$$ plain form
2530 190726 147943 -204249 -404794 -164359 -157288 -280892 -273176 -365648 -420793 -415707 -306858
2519 -306858 -67891 -111985 -127758 -393423 -208347 -384099 -323478 48967 96089 79207 -199641
2508 -199641 -262416 -245496 -292590 5013 135165 104608 183467 268618 290309 25991 -434806
2497 -434806 -250363 -173668 150661 131770 -27149 -158140 -177194 -131779 87317 115178 104158
2486 104158 -179360 -360775 -61723 189672 -32028 7468 235799 322075 164228 125002
2476 125002 174002 190377 114550 -21736 -124056 -22727 197352 246247 247159 326827 379151
2465 379151 490071 573829 660583 845826 756719 859236 844958 1089776 1130769 1149021 869902
2454 869902 958738 758455 1059605 1318637 1256834 962124 897055 1166560 1303976 729833
$$ packed form
2530A90726m2783l52192k00545K40435P071j23604P716r2472n5145N086J08849
2519c06858K38967m4094j5773k65665J85076j75752O0621L72445M7122j6882k78848
2508a99641o2775J6920m7094K97603J30152l0557P8859Q5151K1691k64318m60797
2497d34806J84443P6695L24329j8891j58919j30991j9054M5415K19096K7861j1020
2486A04158k83518j81415K99052K51395k21700L9496K28331Q6276j57847l9226
2476A25002M9000J6375p5827j36286j02320J01329K20079M8895R12P9668N2324
2465C79151J10920Q3758Q6754J85243q9107J02517j4278K44818M0993J8252k79119
2454H69902Q8836k00283L01150K59032o1803k94710o5069K69505J37416n74143
$$ plain form
2444 729833 1005577 1148684 1270509 963914 1274343 1081991 1114086 988876 941186 1276435
2434 1276435 1340485 1220100 1243047 1542966 1823383 1854676 1601235 1343511 1183938 1262922
2424 1262922 1150646 947036 1102680 1271286 1276870 1446752 1827716 2016917 1892840 1783674
2414 1783674 2069669 1867090 1782720 1706183 1601956 1704509 2019452 2357980 2588835 2862188
2404 2862188 2761319 2774175 3448145 3739681 4050776 4116744 4599561 4872732 5132667 5015098
2394 5015098 5044613 5100927 5815999 6441748 6947449 7013530 7406336 7659566 7930106 8081963
2384 8081963 8070496 7790801 8129670 8473128 8877494 9309722 9604872 9880243 10212030 10495103
2374 10495103 11124488 11991036 13518992 14972073 16407826 18313618 21796167 26327449
$$ packed form
2444G29833K75744J43107J21825l06595L10429j92352L2095j25210m7690L35249
2434A276435O4050j20385K2947K99919K80417L1293k53441k57724j59573P8984
2424A262922j12276k03610J55644J68606N584J69882L80964J89201j24077j09166
2414A783674K85995k02579q4370p6537j04227J02553L14943L38528K30855K73353
2404B862188j00869J2856O73970K91536L11095O5968M82817K73171K59935j17569
2394E015098K9515N6314P15072O25749N05701O6081L92806K53230K70540J51857
2384H081963j1467k79695L38869L43458M04366M32228K95150K75371L31787K83073
2374A0495103O29385Q66548J527956J453081J435753J905792L482549M531282
$$ plain form
2366 26327449 30877030 34159831 36540295 38006149 39730618 41982973 45734694 50607896
2358 50607896 57379450 66395671 79081007 99653785 146830826 241632365 362569299
2351 362569299 456745902 472614418 443752922 368572009 281728945 214280727 163528092
2344 163528092 126090851 95952877 74190499 56700512 45750279 39501270 37498084
2337 37498084 36268470 35780397 33637974 31471493 27598630 24220757 21084625 18610768
2329 18610768 16519638 15581195 14204380 13081372 12094774 11532946 10237083 9643482 8804498
2320 8804498 8396029 7862329 7504445 6787989 6415903 5675870 5257081 5224072 4970550 4583487
2310 4583487 4394221 4205117 4472209 4025250 4202206 4048289 3944072 3772307 3806681 3722130
$$ packed form
2366B6327449M549581L282801K380464J465854J724469K252355L751721M873202
2358E0607896O771554R016221J2685336K0572778M7177041R4801539J20936934
2351C62569299R4176603J5868516k8861496p5180913q6843064o7448218n0752635
2344A63528092l7437241l0137974k1762378j7489987j0950233o249009k003186
2337C7498084j229614m88073k142423k166481l872863l377873l136132k473857
2329A8610768k091130r38443j376815j123008r86598n61828j295863n93601q38984
2320H804498m08469n33700l57884p16456l72086p40033m18789l3009k53522l87063
2310D583487j89266j89104K67092m46959J76956j53917j04217j71765L4374q4551
$$ plain form
2300 3722130 4016604 4012048 3933271 3609953 3529051 3348851 3299793 3291617 3334942 3153924 3115473
2289 3115473 2929422 2553337 2160207 2030698 1595933 1976381 2023819 2095619 2097466 2038978
2279 2038978 1860333 1779497 1682321 1648188 1562371 1381030 1240002 1063456 1057429 716759 377393
2268 377393 536016 685046 854265 903853 904237 651030 481655 552708 408817 121524 35660
2257 35660 278729 49940 56178 58031 -119851 -20892 -39028 -386651 -405362 -234428 16289
2246 16289 -246208 -348215 -303042 -352738 -480805 -477303 -355781 -550216 -391404 -383653 -485725
2235 -485725 -722378 -480368 -199069 -112266 -70319 -344452 -479934 -559786 -515669 -420451 -384931
2224 -384931 -321288 -438103 -774290 -702176 -645440 -436757 -305411 -471098 -606014 -358295
$$ packed form
2300C722130K94474m556p8777l23318q0902j80200m9058q176M3325j81018l8451
2289C115473j86051l76085l93130j29509m34765L80448M7438P1800J847n8488
2279B038978j78645q0836r7176l4133q5817j81341j41028j76546o027l40670l39366
2268C77393J58623J49030J69219M9588L84k53207j69375P1053j43891k87293q5864
2257C5660K43069k28789O238J853j77882R8959j8136l47623j8711J70934K50717
2246A6289k62497j02007M5173m9696j28067L502J21522j94435J58812P751j02072
2235d85725k36653K42010K81299Q6803M1947k74133j35482p9852M4117R5218L5520
2224c84931O3643j16815l36187P2114N6736K08683J31346j65687j34916K47719
$$ plain form
2214 -358295 -613298 -318589 -366726 -623308 -687412 -518184 -689838 -708256 -734895 -710231 -715163
2203 -715163 -848357 -955956 -810429 -708069 -759874 -586278 -571953 -577406 -534565 -538294 -891152
2192 -891152 -860755 -676099 -798854 -809812 -613568 -260867 -415818 -680924 -750592 -721312
2182 -721312 -708932 -669883 -755021 -912263 -952506 -959183 -1214622 -1168637 -994261 -861192 -842712
2171 -842712 -1092752 -1044404 -999807 -1202327 -1079302 -1214792 -1036164 -1125405 -1191095 -1005755
2161 -1005755 -1074980 -958304 -874498 -1075569 -1249397 -1054397 -821947 -907671 -745285 -713031
2151 -713031 -1084181 -1329740 -1188120 -1231304 -1246081 -1523152 -1430077 -1078983 -1049104 -1264839
2141 -1264839 -1317691 -1205290 -1117048 -1143449 -1455404 -1474139 -1212167 -1281707 -1125011 -986946
$$ packed form
2214c58295k55003K94709m8137k56582o4104J69228j71654j8418k6639K4664m932
2203g15163j33194j07599J45527J02360n1805J73596J4325n453M2841l729l52858
2192h91152L0397J84656j22755j0958J96244L52701j54951k65106o9668K9280
2182g21312J2380L9049q5138j57242m0243o677k55439M5985J74376J33069J8480
2171h42712k50040M8348M4597k02520J23025j35490J78628q9241o5690J85340
2161a005755o9225J16676Q3806k01071j73828J95000K32450q5724J62386L2254
2151g13031l71150k45559J41620m3184j4777k77071R3075L51094K9879k15735
2141a264839n2852J12401Q8242k6401l11955j8735K61972o9540J56696J38065
$$ plain form
2131 -986946 -947875 -678853 -1039678 -932265 -944445 -1320221 -1266925 -1228868 -1250968 -1579219 -1539296
2120 -1539296 -1226686 -1265508 -1146154 -1019546 -1003186 -1212968 -1236007 -1211664 -712877 -617968
2110 -617968 -817375 -788521 -855507 -857594 -906319 -821269 -567686 -634410 -782790 -922713 -1042997
2099 -1042997 -1292893 -973990 -797068 -811651 -729512 -900054 -1108774 -999007 -745007 -867326
2089 -867326 -1363099 -1252619 -875848 -781369 -462361 -86361 130314 578871 954325 1079854
2079 1079854 758912 514000 98899 -433838 -510497 -714877 -824585 -646723 -657665 -777085
2069 -777085 -549469 -503965 -663792 -850200 -1168733 -1114429 -946461 -907846 -965826 -890651 -905551
2058 -905551 -798356 -742799 -799450 -1006999 -1058068 -865284 -877148 -1035747 -1303907 -1299577 -1042801
$$ packed form
2131i86946L9071K69022l60825J07413j2180l75776N3296L8057k2100l28251L9923
2120a539296L12610l8822J19354J26608J6360k09782k3039K4343M98787R4909
2110f17968j99407K8854o6986k087m8725Q5050K53583o6724j48380j39923j20284
2099a042997k49896L18903J76922j4583Q2139j70542k08720J09767K54000j22319
2089h67326m95773J10480L76771R4479L19008L76000K16675M48557L75454J25529
2079A079854l20942k44912m15101n32737p6659k04380j09708J77862j0942j19420
2069g77085K27616M5504j59827j86408l18533N4304J67968L8615n7980P5175j4900
2058i05551J07195N5557n6651k07549n1069J92784j1864j58599k68160M330K56776
$$ plain form
2047 -1042801 -891878 -946369 -912814 -737911 -1090470 -1160625 -790241 -897370 -1040079 -850391
2037 -850391 -1130518 -949205 -792611 -1335339 -1317832 -1099935 -1104258 -1380419 -1412674 -1106513
2027 -1106513 -937355 -952990 -955963 -1058547 -1035614 -1051572 -1128110 -1048773 -1206160 -1380135 -1260531
2016 -1260531 -1160646 -1061391 -1079481 -1265465 -1098151 -1087674 -1062423 -761801 -918783 -779395
2006 -779395 -831258 -1026560 -1156774 -1052961 -1188089 -1417024 -1294411 -1280755 -1284656 -1423501
1996 -1423501 -1411568 -1105623 -920336 -806367 -1084316 -937515 -1236893 -1072489 -930823 -1039536
1986 -1039536 -910564 -776317 -810202 -1120509 -859468 -823823 -606183 -657619 -818447 -1132804
1976 -1132804 -1197385 -1193068 -1084644 -1142452 -1135200 -1298637 -1262143 -1172536 -1322120 -1109419 -1099546
$$ packed form
2047a042801J50923n4491L3555J74903l52559p0155L70384j07129j42709J89688
2037h50391k80127J81313J56594n42728J7507K17897m323k76161l2255L06161
2027a106513J69158j5635k973j02584K2933j5958p6538P9337j57387j73975J19604
2016a260531R9885R9255j8090j85984J67314J0477K5251L00622j56982J39388
2006g79395n1863j95302j30214J03813j35128k28935J22613J3656l901j38845
1996a423501J1933L05945J85287J13969k77949J46801k99378J64404J41666j08713
1986a039536J28972J34247l3885l10307K61041L5645K17640n1436j60828l14357
1976a132804o4581M317J08424n7808P252j63437L6494Q9607j49584K12701R873
$$ plain form
1965 -1099546 -1146900 -1089482 -1395536 -1374680 -1205448 -1232244 -1132277 -1410288 -1445412 -1311623 -1224394
1954 -1224394 -1082382 -1196577 -1114090 -1234969 -1212241 -905479 -977496 -1057524 -1133612 -986065
1944 -986065 -1110916 -811360 -826812 -1141419 -1138825 -1128212 -656352 -855194 -1085498 -1000341 -1010082
1933 -1010082 -1055273 -1013002 -1025799 -964870 -975706 -1241363 -1007137 -990522 -738095 -895459 -936501
1922 -936501 -844229 -744534 -1040021 -1130334 -868214 -735188 -868405 -822156 -872255 -897530 -746867
1911 -746867 -781440 -858427 -990088 -1271438 -1534215 -1326927 -1159914 -972118 -1105929 -1390127
1901 -1390127 -1383087 -1187653 -956707 -714086 -955379 -1192119 -1216475 -1131937 -1090927 -1003140 -799098
1890 -799098 -842678 -1221429 -1377347 -1157288 -1144827 -1163491 -1000559 -1026520 -952796 -923253 -891603
$$ packed form
1965a099546m7354N7418l06054K0856J69232k6796R9967k78011l5124J33789Q7229
1954a224394J42012j14195Q2487j20879K2728L06762p2017q0028p6088J47547
1944i86065j24851K99556j5452l14607K594J0613M71860j98842k30304Q5157r741
1933a010082m5191M2271j2797O0929j0836k65657K34226J6615K52427j57364m1042
1922i36501R2272R9695k95487r0313K62120J33026j33217M6249n0099k5275J50663
1911g46867l4573p6987j31661k81350k62777K07288J67013J87796j33811k84198
1901a390127P040J95434K30946K42621k41293k36740k4356Q4538M1010Q7787K04042
1890g99098m3580l78751j55918K20059J2461j8664J62932k5961P3724K9543L1650
$$ plain form
1879 -891603 -1056454 -932215 -970578 -801507 -820916 -931983 -1036172 -880470 -804686 -954771
1869 -954771 -906081 -711550 -973452 -1104138 -791760 -976760 -1175960 -1393116 -1306123 -1248288
1859 -1248288 -1194298 -1192058 -965363 -1020092 -978356 -1250194 -944724 -1029167 -923939 -901089 -1041437
1848 -1041437 -829130 -849691 -875193 -660648 -513725 -707565 -403414 -486108 -757768 -922306
1838 -922306 -914823 -1103158 -1087878 -947615 -946758 -1134700 -962496 -690987 -760134 -888168 -723181
1827 -723181 -711531 -922566 -816924 -612611 -699510 -1051486 -921944 -746494 -986737 -1142833
1817 -1142833 -1055547 -771282 -807822 -855064 -586787 -779031 -916603 -859443 -1005540 -938001
1807 -938001 -1038743 -1073113 -993949 -1076019 -1044878 -911685 -1171388 -1149529 -962355 -733691 -725974
$$ packed form
1879h91603j64851J24239l8363J69071j9409j11067j04189J55702P5784j50085
1869i54771M8690J94531k61902j30686L12378j85000j99200k17156Q6993N7835
1859a248288N3990K240K26695n4729M1736k71838L05470q4443J05228K2850j40348
1848a041437K12307k0561k5502K14545J46923j93840L04151q2694k71660j64538
1838i22306P483j88335J5280J40263Q57j87942J72204K71509o9147j28034J64987
1827g23181J1650k11035J05642K04313q6899l51976J29542J75450k40243j56096
1817a142833Q7286K84265l6540m7242K68277j92244j37572N7160j46097O7539
1807i38001j00742l4370P9164q2070L1141J33193k59703K1859J87174K28664P717
$$ plain form
1796 -725974 -904059 -1134713 -1066371 -845053 -875274 -913863 -846375 -855402 -1049810 -1031175 -924314
1785 -924314 -1163625 -869708 -781454 -791848 -927251 -1146388 -1083701 -1181276 -985437 -755924
1775 -755924 -1065526 -956302 -910261 -773601 -866518 -1011078 -831145 -1189923 -1073999 -915882
1765 -915882 -886612 -799417 -815100 -838791 -676410 -932336 -858415 -913238 -796933 -744667 -612018
1754 -612018 -686307 -717914 -919518 -1069426 -980315 -893543 -874628 -988437 -1022547 -1144294 -1073815
1743 -1073815 -1049971 -502327 -595136 -602146 -729631 -931706 -824090 -768942 -992365 -996551 -808906
1732 -808906 -937247 -888422 -1045400 -994495 -1040843 -816092 -658778 -772038 -891868 -749936
1722 -749936 -846494 -970637 -867360 -890645 -1082097 -1049321 -858863 -707848 -940989 -1020958
$$ packed form
1796g25974j78085k30654O8342K21318l0221l8589O7488r027j94408J8635J06861
1785i24314k39311K93917Q8254j0394j35403k19137O2687r7575J95839K29513
1775g55924l09602J09224M6041J36660r2917j44560J79933l58778J15924J58117
1765i15882K9270Q7195j5683k3691J62381k55926P3921n4823J16305N2266J32649
1754f12018p4289l1607k01604j49908Q9111Q6772J8915j13809l4110j21747P0479
1743a073815K3844N47644r2809p010j27485k02075J07616N5148k23423m186J87645
1732h08906j28341M8825j56978N0905m6348K24751J57314j13260j19830J41932
1722g49936r6558j24143J03277k3285j91452L2776J90458J51015k33141p9969
$$ plain form
1712 -1020958 -1098437 -905563 -904864 -1030617 -979238 -985245 -1007723 -1187316 -1175297 -1060577 -1157711
1701 -1157711 -1169001 -951712 -899190 -1074491 -1134143 -1151459 -817030 -888329 -639441 -524908
1691 -524908 -717613 -954757 -970873 -758826 -1070736 -1163961 -1100965 -887818 -942739 -937079 -988770
1680 -988770 -980517 -858301 -649935 -872477 -953438 -1060408 -1153165 -1093590 -1143261 -1088982 -833967
1669 -833967 -1047742 -1092838 -991357 -1205946 -1253033 -1269513 -1219062 -1140455 -1165027 -874120 -1001848
1658 -1001848 -1017003 -1125295 -1122300 -1171978 -1092116 -782266 -730984 -789508 -862142 -883084 -975257
1647 -975257 -1041621 -846714 -613807 -788564 -920418 -865610 -973735 -846611 -800922 -1198320
1637 -1198320 -1257087 -800882 -747422 -932726 -858187 -845119 -934799 -769427 -747511 -639820 -707657
$$ packed form
1712a020958p7479J92874O99j25753N1379o007k2478j79593J2019J14720r7134
1701a157711j1290K17289N2522j75301n9652j7316L34429p1299K48888J14533
1691e24908j92705k37144j6116K12047l11910r3225O2996K13147n4921N660n1691
1680i88770Q253J22216K08366k22542q0961j06970r2757N9575m9671N4279K55015
1669h33967k13775m5096J01481k14589m7087j6480N0451P8607k4572K90907j27728
1658a001848j5155j08292K995m9678P9862L09850N1282n8524p2634k0942r2173
1647i75257o6364J94907K32907j74757j31854N4808j08125J27124M5689l97398
1637a198320n8767M56205N3460j85304P4539J3068q9680J65372K1916J07691o7837
$$ plain form
1626 -707657 -781910 -647453 -800060 -640271 -725134 -998298 -939740 -875028 -1018216 -856887
1616 -856887 -657189 -776887 -808065 -754499 -864948 -895570 -944926 -893036 -822074 -579602 -685323
1605 -685323 -885424 -744613 -802461 -858238 -958839 -906479 -795491 -852833 -817890 -813359 -939547
1594 -939547 -1007779 -921253 -881661 -905135 -991485 -928952 -1067299 -1122142 -961988 -851501 -910452
1583 -910452 -919270 -967082 -828311 -920449 -1198296 -1064355 -1171148 -925545 -1090382 -1211958
1573 -1211958 -1143820 -1154711 -1115312 -1178570 -1023158 -1026144 -703598 -925996 -1029970 -719764 -507034
1562 -507034 -786867 -862533 -1152469 -1149949 -1034585 -765100 -868461 -979011 -852052 -803592
1552 -803592 -1077256 -1314289 -1308687 -876064 -604262 -811047 -827861 -982675 -745388 -890437
$$ packed form
1626g07657p4253J34457j52607J59789q4863k73164N8558O4712j43188J61329
1616h56887J99698j19698l1178N3566j10449l0622m9356N1890P0962K42472j05721
1605f85323k00101J40811n7848n5777j00601N2360J10988n7342L4943M531j26188
1594i39547o8232Q6526L9592k3474q6350O2533j38347n4843J60154J10487n8951
1583i10452q818m7812J38771r2138k77847J33941j06793K45603j64837j21576
1573a211958O8138j0891L9399o3258J55412k986L22546k22398j03974L10206K12730
1562e07034k79833p5666k89936K520J15364K69485j03361j10550J26959M8460
1552h03592k73664k37033N602M32623K71802k06785j6814j54814K37287j45049
$$ plain form
1542 -890437 -1071125 -1222057 -1085299 -1014636 -1009332 -940273 -714714 -707523 -715475 -906003 -733379
1531 -733379 -941638 -913770 -779335 -762625 -787419 -882146 -596221 -724840 -706417 -754800 -819501
1520 -819501 -734317 -840458 -863361 -747326 -856864 -838195 -936588 -893848 -927175 -934258 -945876
1509 -945876 -998250 -1057484 -1082230 -828512 -858029 -775250 -806034 -631426 -536613 -914789 -1110918
1498 -1110918 -1007131 -892717 -799533 -881974 -760763 -718771 -737650 -562931 -585363 -857501
1488 -857501 -711878 -816195 -663452 -795351 -1114586 -885267 -1016040 -715827 -471348 -939687
1478 -939687 -947815 -1238777 -1140209 -907079 -889807 -815492 -999078 -962255 -1004811 -984322 -914260
1467 -914260 -762605 -880631 -956715 -1017159 -970529 -810646 -621566 -660637 -641801 -526492 -646631
$$ packed form
1542h90437j80688j50932J36758P0663N304O9059K25559P191p952j90528J72624
1531g33379k08259K7868J34435J6710k4794r4727K85925j28619J8423m8383o4701
1520h19501Q5184j06141k2903J16035j09538J8669r8393M2740l3327p083j1618
1509i45876n2374n9234k4746K53718k9517Q2779l0784J74608R4813l78176j96129
1498a110918J03787J14414R3184q2441J21211M1992j8879J74719k2432k72138
1488h57501J45623j04317J52743j31899l19235K29319j30773L00213K44479m68339
1478i39687q128k90962R8568K33130J7272P4315j83586L6823m2556K0489P0062
1467i14260J51655j18026p6084o0444M6630J59883J89080l9071J8836J15309j20139
$$ plain form
1456 -646631 -825502 -906509 -913263 -817366 -1048454 -1053206 -737243 -689152 -351603 -531826 -930746
1445 -930746 -861833 -874225 -687636 -560690 -649854 -815179 -886934 -818157 -724242 -690685 -955166
1434 -955166 -912189 -796870 -887930 -741156 -801352 -799844 -700557 -772911 -741223 -390250 -481548
1423 -481548 -705831 -1174621 -1107624 -1003004 -989574 -803070 -882210 -899157 -847332 -757011 -761406
1412 -761406 -818909 -1048013 -1106085 -880628 -790547 -814039 -656364 -799816 -1149653 -829055
1402 -829055 -678662 -922053 -908798 -939693 -1166149 -1148584 -1168417 -1176067 -1058253 -1102936 -719631
1391 -719631 -598025 -660752 -857190 -900939 -966974 -925231 -694995 -703178 -801068 -896885 -802631
1380 -802631 -613880 -597411 -685301 -783055 -986850 -978498 -776042 -845345 -841517 -1198665 -1216949
$$ packed form
1456f46631j78871q1007o754R5897k31088m752L15963M8091L37549j80223l98920
1445i30746O8913j2392J86589J26946q9164j65325p1755O8777R3915L3557k64481
1434i55166M2977J15319r1060J46774o0196J508R9287p2354L1688L50973r1298
1423d81548k24283m68790O6997J04620J3430J86504p9140j6947N1825R0321m395
1412g61406n7503k29104n8072K25457R0081k3492J57675j43452l49837L20598
1402h29055J50393k43391J3255l0895k26456J7565j9833p650J17814m4683L83305
1391g19631J21606o2727j96438m3749o6035M1743K30236q183r7890r5817R4254
1380h02631J88751J6469q7890r7754k03795Q352K02456o9303L828l57148j8284
$$ plain form
1369 -1216949 -1005347 -818746 -831670 -670363 -720104 -929140 -712936 -678450 -629916 -429238
1359 -429238 -446654 -596024 -784369 -940856 -610596 -848835 -740993 -905074 -995372 -852507
1349 -852507 -721076 -708553 -767090 -872060 -927497 -923630 -997760 -777102 -955618 -936903 -719336
1338 -719336 -705310 -559274 -754752 -908574 -957086 -564589 -356751 -532534 -854198 -863670
1328 -863670 -645376 -730087 -618828 -383611 -616191 -848503 -1065022 -1102731 -812354 -640333
1318 -640333 -686627 -734548 -677777 -507743 -427052 -676962 -724279 -644277 -604293 -607921 -737495
1307 -737495 -885821 -881961 -732676 -753153 -772347 -837301 -764112 -766922 -611479 -359547 -713225
1296 -713225 -717216 -632675 -609225 -626310 -701423 -599330 -588122 -914979 -864640 -854279 -584361
$$ packed form
1369a216949K11602J86601j2924J61307m9741k09036K16204L4486M8534K00678
1359d29238j7416j49370j88345j56487L30260k38239J07842j64081r0298J42865
1349h52507J31431J2523n8537j04970n5437L867p4130K20658j78516J8715K17567
1338g19336J4026J46036j95478j53822m8512L92497K07838j75783l21664r472
1328h63670K18294q4711J11259K35217k32580k32312k16519l7709K90377J72021
1318f40333m6294m7921N6771J70034Q0691k49910m7317Q0002L9984l628j29574
1307g37495j48326L860J49285k0477j9194o4954P3189k810J55443K51932l53678
1296g13225l991Q4541K3450j7085p5113J02093J1208l26857N0339J0361K69918
$$ plain form
1285 -584361 -721305 -990906 -890786 -665731 -794244 -889093 -1102961 -642898 -440201 -662031
1275 -662031 -774005 -768872 -696946 -831427 -1091170 -968456 -1009127 -1250617 -1033846 -1071150 -939172
1264 -939172 -698361 -778419 -722395 -565502 -678457 -655423 -765573 -759552 -859733 -991206 -968677
1253 -968677 -848403 -878432 -924578 -997948 -926620 -720385 -641076 -598977 -562117 -697857 -969359
1242 -969359 -1208980 -1205897 -1034529 -768576 -740076 -885689 -791648 -715622 -599458 -570326 -521982
1231 -521982 -715171 -739223 -903194 -908658 -979407 -730860 -743732 -765769 -975789 -939234 -927652
1220 -927652 -962133 -784056 -682429 -713675 -775521 -825243 -947193 -1001880 -1001239 -880084 -547346
1209 -547346 -701283 -1023804 -941178 -988341 -696931 -711258 -381786 -497255 -430908 -448483 -611118
$$ packed form
1285e84361j36944k69601J00120K25055j28513r4849k13868M60063K02697k21830
1275f62031j11974N133P1926j34481k59743J22714m0671k41490K16771l7304J31978
1264i39172K40811q0058N6024J56893j12955K3034j10150O021j00181j31473K2529
1253i68677J20274l0029m6146p3370P1328K06235P9309M2099L6860j35740k71502
1242i69359k39621L083J71368K65953K8500j45613R4041P6026J16164K9132M8344
1231e21982j93189k4052j63971n464p0749K48547j2872k2037k10020L6555J1582
1220i27652l4481J78077J01627l1246o1846m9722j21950n4687O41J21155L32738
1209e47346j53937l22521Q2626m7163K91410j4327L29472j15469O6347j7575j62635
$$ plain form
1198 -611118 -729377 -785951 -1062873 -949592 -900973 -834463 -850063 -548503 -559357 -748211 -597454
1187 -597454 -631568 -665344 -689862 -929802 -679601 -696603 -631328 -895721 -955481 -861186 -931484
1176 -931484 -886629 -900554 -669979 -801795 -1138535 -1252383 -1087366 -871837 -849741 -741814
1166 -741814 -738770 -761823 -898380 -947173 -931167 -1019369 -950597 -951205 -1047427 -1173799 -982092 -777165
1154 -777165 -1025088 -861865 -764539 -764015 -801553 -846630 -714986 -895427 -750067 -965650 -801586
1143 -801586 -558833 -574364 -520697 -592427 -600337 -418209 -616544 -732734 -893345 -1001682 -991730
1132 -991730 -1056631 -1023177 -1125116 -1180623 -872620 -670896 -552479 -828056 -1110273 -1034867
1122 -1034867 -687674 -432348 -582734 -646405 -438910 -813167 -914546 -708425 -734792 -621730
$$ packed form
1198f11118j18259n6574k76922J13281M8619O6510j5600L01560j0854j88854J50757
1187e97454l4114l3776k4518k39940K50201j7002O5275k64393n9760R4295p0298
1176i31484M4855j3925K30575j31816l36740j13848J65017K15529K2096J07927
1166g41814L044k3053j36557m8793J6006q8202O8772o08r6222j26372J91707K04927
1154g77165k47923J63223R7326N24l7538m5077J31644j80441J45360k15583J64064
1143h01586K42753j5531N3667p1730p910J82128j98335j16190j60611j08337R952
1132i91730o4901L3454j01939n5507L08003K01724J18417k75577k82217P5406
1122a034867L47193K55326j50386o3671K07495l74257j01379K06121k6367J13062
$$ plain form
1112 -621730 -685709 -953300 -1143844 -967108 -789604 -1004271 -1043972 -1086165 -1084163 -741670 -528389
1101 -528389 -854675 -785292 -595703 -543199 -631639 -809399 -901868 -739239 -684360 -743856 -672632
1090 -672632 -624796 -663730 -879105 -1066083 -1057948 -782765 -899452 -1125884 -981469 -758300
1080 -758300 -863906 -1112021 -710548 -554434 -556213 -795358 -983627 -1004125 -817913 -682381
$$ packed form
1112f21730o3979k67591j90544J76736J77504k14667l9701m2193K002L42493K13281
1101e28389l26286O9383J89589N2504q8440j77760r2469J62629N4879n9496P1224
1090f72632M7836l8934k15375j86978Q135K75183j16687k26432J44415K23169
1080g58300j05606k48115M01473J56114j779k39145j88269k0498J86212J35532
$$ [...]
##END NTUPLES=NMR SPECTRUM
##END=
