##TITLE=1H_DE-80H_X3
 200.13MHz, d2o
 8 sc
 
 19ns.26.2.2025
##JCAMPDX= 6.0         $$ Bruker NMR JCAMP-DX V2.0
##DATA TYPE= NMR SPECTRUM
##DATA CLASS= NTUPLES
##ORIGIN= UXNMR, Bruker Analytische Messtechnik GmbH
##OWNER= pz
$$ XWIN-NMR		Version 3.5
$$ Fri Apr 24 10:25:49 2026 Russian Standard Time (UT+4h)  Yarkov@DPX200
##.OBSERVE FREQUENCY= 200.1313
##.OBSERVE NUCLEUS= ^1H
##.ACQUISITION MODE= SIMULTANEOUS
##.ACQUISITION SCHEME= undefined
##.AVERAGES= 8
##.DIGITISER RES= 18
##SPECTROMETER/DATA SYSTEM= spect
##.PULSE SEQUENCE= zg30
##.SOLVENT NAME= CDCl3
##.SHIFT REFERENCE= (INTERNAL, CDCl3, 0, 18.0189)
##AUDIT TRAIL= $$ (NUMBER, WHEN, WHO, WHERE, WHAT)
$$ ##TITLE= Audit trail, XWIN-NMR		Version 3.5
$$ ##JCAMPDX= 5.01
$$ ##ORIGIN= Bruker BioSpin GmbH
$$ ##OWNER= Yarkov
$$ C:/Bruker/XWIN-NMR/data/yarkov2/nmr/H-C/1/pdata/1/auditp.txt
$$ ##AUDIT TRAIL=  $$ (NUMBER, WHEN, WHO, WHERE, WHAT)
(   1,<2026-04-24 10:24:07.84 +0400>,<Yarkov>,<DPX200>,
      <created by zg, POWCHK disabled, PULCHK disabled
       configuration hash MD5:
       00 E9 B6 7A A2 85 ED C7 34 08 36 98 17 FE 4E 26
       data hash MD5: 16K
       5A 47 91 14 56 48 D0 0A CF 44 F0 62 E7 54 D8 B8>)
(   2,<2026-04-24 10:24:25.15 +0400>,<Yarkov>,<DPX200>,
      <Start of raw data processing
       efp BC_mod = 2 LB = 0.25 FT_mod = 6 PKNL = 1 PHC0 = -5305.116 PHC1 = 11.42193 SI = 16K 
       data hash MD5: 16K
       84 61 72 FA 02 1A 17 13 67 0C A3 B0 95 33 83 08>)
(   3,<2026-04-24 10:24:42.78 +0400>,<Yarkov>,<DPX200>,
      <pk PHC0 = 6.199999 PHC1 = 0 
       data hash MD5: 16K
       1B F5 8E 21 41 61 7E 14 2D 2F 4D 73 33 75 9B 32>)
(   4,<2026-04-24 10:25:17.59 +0400>,<Yarkov>,<DPX200>,
      <abs ABSG = 5 
       data hash MD5: 16K
       1D AC EC 97 D5 0A 93 11 6A 1E E7 EA 0D F7 AB 7B>)
$$ ##END=
$$ 
$$ hash MD5
$$ D3 16 BE 25 4A 5D 87 0A CE 3D 0C F1 7B 06 5F 9C
##$RELAX= 
##$RELAX= 
##$RELAX= 
##$RELAX= 
##$RELAX= 
##$RELAX= 
$$ Bruker specific parameters
$$ --------------------------
##$DU= <C:/Bruker/XWIN-NMR>
##$EXPNO= 1
##$NAME= <H-C>
##$PROCNO= 1
##$TYPE= <nmr>
##$USER= <yarkov2>
##$AMP= (0..31)
100 100 100 100 100 100 100 100 100 100 100 100 100 100 100 100 100 100 
100 100 100 100 100 100 100 100 100 100 100 100 100 100 
##$AQSEQ= 0
##$AQ_mod= 1
##$AUNM= <au_zg>
##$AUTOPOS= <>
##$BF1= 200.13
##$BF2= 200.13
##$BF3= 200.13
##$BF4= 200.13
##$BF5= 200.13
##$BF6= 200.13
##$BF7= 200.13
##$BF8= 200.13
##$BYTORDA= 1
##$CFDGTYP= 0
##$CFRGTYP= 5
##$CHEMSTR= <none>
##$CNST= (0..31)
1 1 145 1 1 1 1 1 1 1 1 1 1 1 1 1 1 1 1 1 1 1 1 1 1 1 1 1 1 1 1 1 
##$CPDPRG= <>
##$CPDPRG1= <>
##$CPDPRG2= <>
##$CPDPRG3= <>
##$CPDPRG4= <mlev>
##$CPDPRG5= <mlev>
##$CPDPRG6= <mlev>
##$CPDPRG7= <mlev>
##$CPDPRG8= <mlev>
##$CPDPRGB= <>
##$CPDPRGT= <>
##$D= (0..31)
0 0.7 0 0 0 0 0 0 0 0 0 0.03 0 0 0 0 0 0 0 0 0 0 0 0 0 0 0 0 0 0 0 0 
##$DATE= 1777011847
##$DBL= (0..7)
120 120 120 120 120 120 120 120 
##$DBP= (0..7)
150 150 150 150 150 150 150 150 
##$DBP07= 0
##$DBPNAM0= <>
##$DBPNAM1= <>
##$DBPNAM2= <>
$$ [...]
##$SUBNAM3= <"">
##$SUBNAM4= <"">
##$SUBNAM5= <"">
##$SUBNAM6= <"">
##$SUBNAM7= <"">
##$SUBNAM8= <"">
##$SUBNAM9= <"">
##$SW= 18.0517328524113
##$SWIBOX= (0..15)
0 0 2 0 0 0 0 0 0 0 0 0 0 0 0 0 
##$SW_h= 3612.71676300578
##$TD= 16384
##$TD0= 1
##$TE= 0
##$TE2= 300
##$TE3= 300
##$TEG= 300
##$TL= (0..7)
0 120 120 120 120 120 120 120 
##$TP= (0..7)
150 150 150 150 150 150 150 150 
##$TP07= 0
##$TPNAME0= <>
##$TPNAME1= <>
##$TPNAME2= <>
##$TPNAME3= <>
##$TPNAME4= <>
##$TPNAME5= <>
##$TPNAME6= <>
##$TPNAME7= <>
##$TPOAL= (0..7)
0.5 0.5 0.5 0.5 0.5 0.5 0.5 0.5 
##$TPOFFS= (0..7)
0 0 0 0 0 0 0 0 
##$TUNHIN= 0
##$TUNHOUT= 0
##$TUNXOUT= 0
##$USERA1= <user>
##$USERA2= <user>
##$USERA3= <user>
##$USERA4= <user>
##$USERA5= <user>
##$V9= 5
##$VALIST= <valist>
##$VCLIST= <CCCCCCCCCCCCCCC>
##$VD= 0
##$VDLIST= <DDDDDDDDDDDDDDD>
##$VPLIST= <PPPPPPPPPPPPPPP>
##$VTLIST= <TTTTTTTTTTTTTTT>
##$WBST= 1024
##$WBSW= 4
##$XGAIN= (0..3)
0 0 0 0 
##$XL= 0
##$YL= 0
##$YMAX_a= 222540
##$YMIN_a= -143919
##$ZGOPTNS= <>
##$ZL1= 120
##$ZL2= 120
##$ZL3= 120
##$ZL4= 120
##$ABSF1= 18.01886
##$ABSF2= -0.03303528
##$ABSG= 5
##$ABSL= 3
##$ALPHA= 0
##$AQORDER= 0
##$ASSFAC= 0
##$ASSFACI= 0
##$ASSFACX= 0
##$ASSWID= 0
##$AUNMP= <proc_1d>
##$AZFE= 0.1
##$AZFW= 0.1
##$BCFW= 0
##$BC_mod= 2
##$BYTORDP= 0
##$COROFFS= 0
##$CY= -3
##$DATMOD= 1
##$DC= 0
##$DFILT= <>
##$DTYPP= 0
##$F1P= 0
##$F2P= 0
##$FCOR= 1
##$FTSIZE= 16384
##$FT_mod= 6
##$GAMMA= 0
##$GB= 0
##$INTBC= 1
##$INTSCL= 3.241238e-09
##$ISEN= 128
##$LB= 0.25
##$LEV0= 0
##$LPBIN= 0
##$MAXI= 10000
##$MC2= 0
##$MEAN= 0
##$ME_mod= 0
##$MI= 1.114404
##$NCOEF= 0
##$NC_proc= -8
##$NLEV= 6
##$NOISF1= 3.799351
##$NOISF2= 2.8
##$NSP= 0
##$NTH_PI= 0
##$NZP= 0
##$OFFSET= 18.01886
##$PC= 1
##$PHC0= -5298.916
##$PHC1= 11.42193
##$PH_mod= 1
##$PKNL= yes
##$PPARMOD= 0
##$PSCAL= 0
##$PSIGN= 0
##$REVERSE= no
##$SF= 200.129500253054
##$SI= 16384
##$SIGF1= 3
##$SIGF2= 2
##$SINO= 0.751879
##$SIOLD= 32768
##$SREGLST= <19F.Aceton>
##$SSB= 0
##$STSI= 16384
##$STSR= 0
##$SW_p= 3612.71676300578
##$SYMM= 0
##$S_DEV= 0
##$TDeff= 16384
##$TDoff= 0
##$TI= <>
##$TILT= no
##$TM1= 0
##$TM2= 0
##$TOPLEV= 0
##$USERP1= <user>
##$USERP2= <user>
##$USERP3= <user>
##$USERP4= <user>
##$USERP5= <user>
##$WDW= 1
##$XDIM= 16384
##$YMAX_p= 421971949
##$YMIN_p= -4536140
$$ End of Bruker specific parameters
$$ ---------------------------------
##NTUPLES= NMR SPECTRUM
##VAR_NAME=  FREQUENCY,     SPECTRUM/REAL,   SPECTRUM/IMAG
##SYMBOL=    X,             R,               I
##VAR_TYPE=  INDEPENDENT,   DEPENDENT,       DEPENDENT
##VAR_FORM=  AFFN,          ASDF,            ASDF
##VAR_DIM=   16384,         16384,           16384
##UNITS=     HZ,            ARBITRARY UNITS, ARBITRARY UNITS
##FACTOR=    0.220516191357247, 1,           1
##FIRST=     3606.10541956829, 0,            0
##LAST=      -6.61134343749063, 0,           0
##MIN=       -6.61134343749063, -4536140,    0
##MAX=       3606.10541956829, 421971949,    0
$$ Real data points
##PAGE= N=1
##DATA TABLE= (X++(R..R)), XYDATA
$$ [...]
5294d15036k85213k91172l6645k20966j57572L37016J8557K9128K45225J81803
5284e94875J40860k96325K4982K16740Q5067K5076J60210l1939j20872j8m1198
5273d32292J94068J07453k69744J77587L71820K74621K39383M11647R2274l08646
5263H58171R7879R2427L5807k8710J55413k70624k29438k66924O1019j81272n16504
5252a92756j94612o45978p590l13045o6472K913M882J505O6719J89492O9404L08875
5240g76663J01920j51023L62832J70974J25805k10083O263J26759P0987j26227
5230b98456j56555K82991j21660l02647j85481J50831J7079k83119J73945K21667
5220e01405K31463K95082K6265R2060J96868M33010J66462j27464J68471L51365
$$ y = [-415036, -700249, -991421, -1028066, -1249032, -1406604, -1069588, -1051031, -1021903, -776678, -594875, -454015, -750340, -725358, -508618, -423551, -398475, -238265, -270204, -391076, -391094, -432292, -238224, -130771, -400515, -222928, 148892, 423513, 662896, 1074543, 1166817, 858171, 956050, 1048477, 1084284, 1055574, 1210987, 940363, 710925, 444001, 505020, 323748, -192756, -387368, -1033346, -1040936, -1353981, -1420453, -1417540, -1412658, -1411153, -1344434, -1154942, -1085538, -776663, -674743, -825766, -462934, -291960, -166155, -376238, -369975, -243216, -172229, -298456, -455011, -172020, -293680, -596327, -781808, -630977, -613898, -897017, -723072, -501405, -269942, 25140, 51405, 143465, 340333, 773343, 939805, 812341, 980812, 1332177]
5210A332177J2106m12204j9491j19880l64354k24119k23503l90160j55674k24860
5200g89962l61714R869j27156l4254J67320K62148J26251J48297K2877J58424
5190d17900M1505l0723j12325J50229k8992J11131J45316p0586j26051L1636Q7346
5179b19414n6601j54910J44514j75160O4955J34436m406L5801N6694p4692O6918
5168a81865K63819j68984M9456J27394K6318l99736J41739K88213l08388J8282
5158a43752j68952q8765J00826K13390m27192k19045K26999R5610J20731k5293
5148c15443r2401k24122K01090K70386k0446o8366J63747J04392o1527l29650
5138c72340n6983J79517K87886l2156r1565k92468Q8306l5906j99751J41193L9089
$$ y = [1332177, 1344283, 932079, 912588, 792708, 428354, 204235, -19268, -409428, -565102, -789962, -1151676, -1141807, -1268963, -1303217, -1135897, -873749, -747498, -599201, -576324, -417900, -376395, -407118, -519443, -369214, -398206, -287075, -141759, -212345, -338396, -306760, -219414, -276015, -430925, -286411, -461571, -396616, -262180, -266586, -230785, -174091, -248783, -181865, 81954, -87030, -37574, 89820, 116138, -283598, -141859, 146354, -162034, -143752, -312704, -401469, -300643, -87253, -514445, -733490, -506491, -410881, -290150, -315443, -407844, -631966, -430876, -160490, -180936, -249302, -85555, 18837, -42690, -372340, -429323, -249806, 38080, 5924, -85641, -378109, -289803, -325709, -525460, -384267, -345178]
5127c45178r9677L7929P3472K10443q6717L5286K41328M001l27554n0655J71291
5116a36031n2722o5052R2138n6506q1247J52976k03795M0855n1046j8955P5910
5105c03475K27473L9980p0187K8619o5189J34239R3822q6264o0801k51106o4583
5094c77472j72925L45474J22968j38687K38849K60282q9111l143o3626j42474
5084a9865k8802j3887J50082k31411Q0124j86551j94176m9576q5365j33919k09746
5073i23092j93135j87281j31344k872M7489P1743J84215J65796r0684M05772J63584
5062d89809n8449L54348K0304K94699Q6510j1664N3503J6383k2037P1057q1838
5051B33007k84962O1218j16870N6699K39083o7485k45765k7221r5934n6992J28795
$$ y = [-345178, -444855, -406926, -333454, -123011, -209728, -174442, 66886, 70887, -256667, -307322, -136031, -188753, -253805, -161667, -218173, -299420, -146444, -350239, -309384, -360430, -379385, -303475, -76002, -36022, -106209, -77590, -142779, -8540, 85282, -982, -61783, -312889, -377472, -550397, -204923, -81955, -220642, 18207, 278489, 189378, 186235, 122609, -19865, -48667, -62554, 87528, -143883, -63759, -250310, -444486, -494062, -579427, -713346, -923092, -1116227, -1303508, -1434852, -1437724, -1390235, -1318492, -1134277, -968481, -1059165, -653393, -489809, -548258, -193910, -173606, 121093, 207603, 195939, 249442, 265825, 243788, 314845, 233007, -51955, 9263, -107607, -50908, 188175, 120690, -125075, -152296, -248230, -305222, -176427]
5040a76427l125L2473O2347L113J81283N7402K4022l02761O3303q5937k95196
5029d39503j67621k50273q8561j83682R031p3456K59655p3306q6191K09564L9983
5018h44360N086R3212J53098L44471K74393J91831n0474j86066J11822k24030
5008a31017Q4532n0136k0809m8644k01251l28102k65994q7659m3634J55611j06313
4997a043416K74009K29952P0323K05350R6850K22644J11527K54401J20453k06424
4987C35669J89785Q3933j39535l81051J9096j52604j6602K47292j62464k8843
4977e324K76313l07481j88650r7243R7269J33744J7611J6421j03307M2889L1087
4966h6671J25038l11982j86177J99421o8686j75117k9999N7216K8090l42333L0982
$$ y = [-176427, -179552, -147079, -84732, -81619, 99664, 157066, 181088, -121673, -58370, -144307, -439503, -607124, -857397, -945958, -1129640, -1120609, -1194065, -934410, -1007716, -1093907, -884343, -844360, -839274, -746062, -592964, -248493, 25900, 217731, 167257, -18809, 93013, -131017, -46485, -96621, -117430, -166074, -367325, -695427, -961421, -1049080, -1092714, -937103, -1043416, -769407, -539455, -469132, -263782, -166932, 55712, 167239, 421640, 542093, 335669, 525454, 609387, 469852, 88801, 107897, -44707, -61309, 185983, 23519, -5324, 270989, -36492, -225142, -322385, -225116, -91372, -73761, -57340, -160647, -117758, -86671, 38367, -273615, -459792, -260371, -329057, -504174, -534173, -476957, -448867, -791200, -760218]
4955g60218p501l3577Q7667j98218K87286j15303j9550J00155K81145K45798K05474
4944G3158N15445l28569J2127K5926N7983K71174j28542o8635k74910k25052j87219
4933b57114j44081j6196L3949j4298p5355k31876l0042k3012k05564M63790j27436
4922f27235L7021K97662M37030K46188K12255k85363k28768J29162P350o2891
4912A62411j30465j51279R6523k34587k92762K47325L04607k30296j73596J55742
4902b46377P5661J62045K13493j49021J37417Q2047j68378L2269r8515K67619
4892C08260J16406l41538Q3722N1650j14881R8767k86598l3459j54265o6736N2580
4881b86092p1617k88288r1872o8810n2232p5014J14337k53724J07428M6660J29667
$$ y = [-760218, -767719, -801296, -713629, -911847, -624561, -739864, -759414, -659259, -378114, -132316, 73158, 588603, 260034, 272161, 298087, 356070, 627244, 498702, 430067, 155157, -69895, -257114, -401195, -417391, -383442, -397740, -473095, -704971, -735013, -758025, -963589, -499799, -627235, -590214, -292552, 144478, 390666, 602921, 317558, 88790, 217952, 225302, 162411, 31946, -119333, -22810, -257397, -550159, -302834, 1773, -228523, -402119, -246377, -170716, -8671, 204822, 55801, 193218, 275265, 106887, 139156, 40641, 308260, 424666, 83128, 166850, 218500, 103619, 202386, -84212, -117671, -271936, -338672, -286092, -357709, -645997, -737869, -806679, -858911, -933925, -819588, -1073312, -965884, -919224, -789557]
4870g89557o7173j04148L60180K29398j15022K68336l5728j47065J39849M8421
4860b12509J16685n5066q7116K70858O1297Q9966J07149M4601J35948k91172j05850
4849G4791L2541L2802j48513J41924K27295j06040j23845q5689L5227m8360M7233
4838G9366p6671l80404J63578J45895N9213o1303j23973m6501J69300m5285k20493
4827c37278Q2824j49880O5915l87563J3291K6081Q4003q0219P1619J67717m5417
4816d88907N4349j9057J67171J11825l9231q4770Q3032P4138o425k16421J24577
4805b39719l4088K42933j8157M6228k82652J68896j27920l45548l22186O9947
4795h42266K19737J50634j10963l4871J64767J64406q0836J57152p898K84256
$$ y = [-789557, -856730, -960878, -600698, -371300, -486322, -217986, -253714, -400779, -260930, -212509, -95824, -150890, -238006, 32852, 94149, 184115, 291264, 335865, 471813, 180641, 74791, 107332, 140134, -8379, 133545, 360840, 254800, 130955, 45266, 80493, 32133, 79366, 2695, -377709, -214131, -68236, -9023, -70326, -194299, -240800, -71500, -116785, -337278, -254454, -404334, -338419, -725982, -712691, -686610, -602607, -682826, -611207, -443490, -488907, -434558, -453615, -286444, -174619, -213850, -298620, -215588, -141450, -147875, -364296, -239719, -273807, -30874, -49031, -2803, -285455, -116559, -244479, -590027, -912213, -842266, -622529, -471895, -582858, -617729, -452962, -288556, -369392, -212240, -220138, 64118]
4785F4118J79255r8919J65470j0966R4989m2874P918k31086j92087Q4910R1718
4774A12446j98594j44950J39558j52294k39894J46780N7969N2945j68061m96405
4764h90500l11392j32375J61160Q5298k02282J21360R6911j27564J652l9993Q2466
4753a155259M77039K21289P8179J00329k6929K19184P4657K47517K2196j3922
4743B44280J51407J26598k99985j60501n6294k53262j9540j7271J66072M591K3253
4732i0652j96871k34645j48129J51160M9874Q5364m9823k53480P054M47011o4181
4721b97318K56685R809L71904k35224j95176m5015J70975k71390r6876j16649
4711d48275k97610l3086q6391l87302q7899Q9003L57050K35995O6003K7351q6464
$$ y = [64118, 243373, 144454, 309924, 298958, 393947, 351073, 358991, 127905, -64182, 20728, 112446, -86148, -231098, -91540, -243834, -483728, -336948, -278979, -226034, -394095, -890500, -1201892, -1334267, -1173107, -1087809, -1290091, -1168731, -1071820, -1199384, -1197732, -1237725, -1155259, -678220, -456931, -378752, -278423, -305352, -86168, -11511, 236006, 258202, 244280, 395687, 522285, 222300, 61799, 5505, -247757, -267297, -284568, -118496, -113905, -90652, -287523, -522168, -670297, -519137, -469263, -383899, -433722, -687202, -680148, -233137, -297318, -40633, -30824, 341080, 105856, -89320, -134335, 36640, -234750, -331626, -448275, -745885, -778971, -865362, -1252664, -1340563, -1251560, -894510, -658515, -592512, -565161, -651625]
4700f51625L10030J11400K22562J99621J36722J25094L19708k26732K5258O6522
4690F38560M6522j44902o1567j68991k8439j49804k66985m64568q9550R5594p3452
4679f67582j23401q4000l2887j26405L43497N1022j22153L1310j65606j7050q9612
4668a002867K11471q9003J49805Q1132q7515J91034j43306M2702J43954J23670
4658c78923J75539l3437J05347J56184M9597N08635K9050j26811k91222j27594
4648F6365m4202k18594J18662J09951q2694o3901l8816j69964p2800j31858q6633
4637f14484Q7295j39430Q848M9359M2358o3853j4205L34903K15238o476k5479
4626a25926L09419q9069j57368j8289j7380q6398j32301J3140p3931m13932K58772
$$ y = [-651625, -341595, -230195, -7633, 191988, 328710, 453804, 773512, 546780, 572038, 638560, 685082, 540180, 478613, 309622, 281183, 131379, -135606, -600174, -689724, -594130, -667582, -790983, -874983, -907870, -1034275, -690778, -639756, -761909, -730599, -896205, -913255, -1002867, -791396, -880399, -730594, -649462, -736977, -545943, -689249, -646547, -502593, -378923, -203384, -236821, -131474, 24710, 74307, 582942, 611992, 485181, 193959, 66365, 22163, -196431, -77769, 32182, -50512, -114413, -153229, -323193, -395993, -527851, -614484, -527189, -666619, -657771, -608412, -566054, -629907, -644112, -309209, -93971, -100447, -125926, 183493, 94424, -62944, -81233, -98613, -185011, -317312, -304172, -378103, -792035, -533263]
4615e33263K41116k50727j0352j46118P7506J97373J21904J2932l88829k31150
4605i09608J57458K70337n1465j00457l2921q935m2635J93997l1357O0297j88764
4594f84053j5821M4542J99940J1675j6896J04990J72523M8019K89518J73196n9691
4583B67942k25424j5570J77515k80149K5970K85166N0179k65903l454M8120J1745
4572G6137j99035o0702l50544K34625j91575j80639P0100k31797j98930q4691
4562a117051o7295j93288K19357J08002p7657j95071n4872J85695M11396J92249
4552e88535J29077r3749K864L06207K20062L25532r285J01755J50146L08387l69736
4541D82725j05920R2603k66713l254J37601k45510k66184l45120j85098k48726
$$ y = [-533263, -292147, -542874, -553226, -699344, -621838, -424465, -302561, -289629, -678458, -909608, -752150, -481813, -533278, -633735, -666656, -675591, -718226, -524229, -555586, -495289, -684053, -699874, -655332, -455392, -443717, -460613, -355623, -183100, -135081, 154437, 327633, 267942, 42518, 26948, 204463, -75686, -49716, 235450, 285629, 19726, 16272, 64392, 76137, -122898, -183600, -534144, -299519, -491094, -671733, -601633, -833430, -1032360, -1117051, -1184346, -1377634, -1158277, -1050275, -1127932, -1323003, -1377875, -1192180, -780784, -588535, -459458, -553207, -550343, -244136, -24074, 301458, 292173, 393928, 544074, 852461, 482725, 376805, 469408, 202695, 199441, 337042, 91532, -174652, -519772, -704870, -953596]
4531i53596j33506j64674J9494P5667l14947M841K28057J55419p1101K15821R0818
4520h47707M9318J29879J62547J45705L40234J51203Q6861r6488Q1886J00236
4510C03674m7950j98417m6931Q2886O4486n3660k68444m6092j27005Q6670Q1140
4499a69643K5011k49461j9697J72770k37028p6060L6967j34254L5926n7228k13598
4488h86295N8417j62004k13492J67347J4982o5835N2382l9296k22939J04389L87628
4477h04716J77981q5125K87269K08026L17964K87735J08747R726M5979J07280
4467F60866k1340k57946P1533k03302p0441k02078m50702Q8523O6184m39009J22198
4456f35514J09221M5088k87978k61000J12242j24814j69895m6913K03887K9721
$$ y = [-953596, -1087102, -1251776, -1232282, -1156615, -1471562, -1466721, -1238664, -1083245, -1154346, -938525, -847707, -798389, -668510, -505963, -360258, -20024, 131179, 218040, 121552, 203438, 303674, 255724, 57307, 10376, 93262, 157748, 104088, -164356, -210448, -337453, -250783, -169643, -144632, -394093, -413790, -241020, -478048, -554108, -517141, -651395, -615469, -672697, -886295, -827878, -989882, -1203374, -1036027, -1021045, -1086880, -1034498, -1073794, -1296733, -1192344, -804716, -626735, -711860, -424591, -216565, 101399, 389134, 497881, 507607, 553586, 660866, 639526, 381580, 453113, 249811, 179370, -22708, -473410, -384887, -318703, -757712, -635514, -526293, -481205, -769183, -1030183, -917941, -1042755, -1212650, -1259563, -1055676, -1025955]
4446a025955K88654r0590J68894l3815q5483L39818L8831J49388K88344O1178
4436I9264N6651l63183n2063K10642J4288M235P3917l20817n458p5404m5910K23162
4424a80676L52854K5728m93169o6124O5711K12590M9006J49810Q4332k94190R4853
4413G25j12345r8936j93270J15804n2744O1354n6909m37314k73435K24446J39099
4402f83525Q9565N4422l09591j72075m4936K19902K63782k4732k44214J27287
4392g24115j37977q5624L17306j93878Q0405K38766M0521M4768k6474k9319J83913
4381b91708m8596k44074J62988K441J08617K48935o2363L83385j01608K15630
4371C73647l251j13500K2618m30069R2850M2701j48313l16592j33385Q4183P3095
$$ y = [-1025955, -737301, -827891, -658997, -692812, -778295, -438477, -399646, -250258, 38086, 99264, 155915, -207268, -259331, -48689, -34401, -30166, 43751, -277066, -282524, -357928, -403838, -180676, 172178, 197906, -295263, -361387, -295676, -83086, -34080, 115730, 200062, -94128, 725, -111620, -210556, -403826, -288022, -340766, -279412, -336321, -773635, -1047070, -822624, -683525, -593960, -539538, -849129, -1021204, -1066140, -846238, -582456, -607188, -851402, -724115, -862092, -947716, -630410, -824288, -743883, -505117, -464596, -419828, -446302, -475621, -291708, -340304, -584378, -421390, -418949, -310332, -61397, -123760, 259625, 158017, 373647, 370396, 256896, 279514, -150555, -57705, -15004, -163317, -479909, -613294, -529111, -456016]
4360d56016k91849m9914K2251L9336k6298J24324M17144K3766p9505j40286O8892
4349c48155m2566n6299o511K71429R5407k7588q8655j39244j93866K78149k9922
4338b87821l61914J38128m03029j82964J45036K6928n5075L38348K29534J27760
4328b85069j57572K9385K0019L537N07838J84276p2425K96190n4403J0479J35794
4317F18049J13832m98169P1921R5277l08865n6652j44377l23135j68803l67293
4307i68215J09060p4732M127J6279J47029m5852q6549K23663r9343k3661Q0433
4296g17761K9937P9462J36686n2618J11376K45294L34040J95500o1986k98302
4286A628J3763M12142M47668j749j44882K71576j56964L5328J95648J71806K51786
$$ y = [-456016, -747865, -797779, -775528, -736192, -762490, -638166, -221022, -197256, -276761, -417047, -348155, -390721, -447020, -453531, -182102, -86695, -114283, -202938, -342182, -536048, -257899, -287821, -649735, -511607, -914636, -1097600, -952564, -925636, -980711, -642363, -412829, -285069, -442641, -413256, -393237, -389700, 118138, 302414, 229989, 526179, 471776, 482255, 618049, 731881, 233712, 305633, 400910, 92045, 35393, -108984, -432119, -600922, -968215, -859155, -933887, -929760, -913481, -766452, -812304, -898853, -675190, -774533, -798194, -717761, -687824, -608362, -471676, -524294, -412918, -167624, 166416, 361916, 299930, 1628, 15391, 427533, 875201, 873452, 728570, 1000146, 843182, 878510, 1074158, 1245964, 1497750]
4275A497750l84807j69793k77134l58633l16168k56266l4749j59275j46876J49654
4265d56297R2126m72050p1428J77281k64641L78738K71581n4123M53293J90400
4255B44880j95591j1343j48742J00294k50936J3353K17676k3830m20969j15162
4245e90370l8529j53098q476J0281N8674J67913M39307L9511j86959J26075J68282
4234C2611o6824K37552K40387L5606J75715J92535L42819k20008m31620K360n2144
4223D88989j57097p0234J40782J58434O2582p7424l32995j30795J13072j5994
4213A79320l1837k603q9231K11051J82757l4276n681J65585J17942J07501j02663
4202F97865j64982m52651m19729j00879k1290J69398L3807j10991J33802M9345
$$ y = [1497750, 1112943, 943150, 666016, 307383, -8785, -265051, -299800, -459075, -605951, -456297, -364171, -836221, -907649, -730368, -995009, -616271, -344690, -398813, 54480, 244880, 49289, 37946, -110796, -10502, -261438, -248085, -30409, -54239, -475208, -590370, -628899, -781997, -790473, -780192, -721518, -553605, -114298, -74787, -261746, -135671, 32611, -34213, 203339, 443726, 479332, 655047, 847582, 1190401, 970393, 538773, 541133, 488989, 331892, 261658, 402440, 560874, 623456, 546032, 213037, 82242, 195314, 179320, 147483, 144880, 55649, 266700, 449457, 415181, 409500, 575085, 693027, 800528, 697865, 532883, 80232, -339497, -440376, -461666, -292268, -258461, -369452, -235650, -186305]
4192a86305q0288P6593l524J63355L20709J82020m3938P1203J89448M423k86845
4181D06851O4685J25228j56192l02188J73247j82490k11214J03431j96604k66996
4171d42242r1274J33034K7361M11058j79870M7665L92667L1991n6778K2519J49151
4160D45282j5435P3773R0610o521m33262m85705J37509M19557j79180n49904j62249
4149f65525L1761L7268J70499O8426j45218O7297l652L18409J68932k8699J96592
4138B16090p9337K65595N239p2772j37562n9177P0826K29768k24817Q387j44467
4127G7773j70595K99945p3340R0531K84394J48614k0471p9000Q4836J03655k5435
4116G20907J91290K03143j06533j09100J19636J37533l99984N8218k130l88165
$$ y = [-186305, -266593, -190000, -193524, -30169, 290540, 472560, 428622, 499825, 689273, 693696, 406851, 471536, 596764, 440572, 138384, 311631, 129141, -82073, 21358, -175246, -442242, -533516, -400482, -373121, 37937, -141933, -94268, 298399, 330390, 273612, 296131, 445282, 429847, 503620, 594230, 587709, 154447, -331258, -193749, 225808, 46628, -503276, -665525, -633764, -596496, -425997, -357571, -502789, -435492, -439144, -120735, 48197, 19498, 216090, 136753, 402348, 407587, 334815, 197253, 138076, 208902, 438670, 213853, 222240, 77773, -92822, 207123, 133783, 224314, 508708, 657322, 636851, 557851, 642687, 746342, 720907, 912197, 1115340, 1008807, 899707, 1019343, 1156876, 756892, 815110, 812980, 424815]
4106D24815l93610R5172j91365j95782J96377J48439j1580j24904M79924R3496
4096E20982M3139k40884M48791J29044r3090r5617r1020k7721K52666k39308R313
4085F16295K33446j4403K1124k84113j65522J3500J07563r7721M0553j6860L07219
4074G61081K01081p1882J13606L97351L75270p0357K47777L15646J84256r5862
4064B357967l34941k32403k50195K39408K95N0720r8579L76382o1816k83499J43156
4053A906495K1415J79276R1520m2217J25189J86699J83953K21930J97729J35484
4043C207473k9553j13742j93643l42913j94150k10092k0677j48161k43693l3121
4033A677728k6554J14664L163k068K81902K45006O9968J79027n1580R4013K22365
$$ y = [424815, 31205, 126377, -64988, -260770, -64393, 84046, 72466, -52438, 427486, 520982, 564121, 323237, 772028, 901072, 807982, 712365, 621345, 593624, 846290, 606982, 616295, 849741, 835338, 856462, 572349, 406827, 420327, 527890, 430169, 470722, 453862, 761081, 962162, 890280, 1003886, 1401237, 1776507, 1706150, 1953927, 2269573, 2453829, 2357967, 2023026, 1790623, 1540428, 1779836, 1780131, 1830851, 1732272, 2108654, 2046838, 1763339, 1906495, 1927910, 2107186, 2198706, 2156489, 2281678, 2468377, 2652330, 2874260, 3071989, 3207473, 3177920, 3064178, 2870535, 2527622, 2333472, 2123380, 2102703, 1954542, 1710849, 1677728, 1651174, 1765838, 1769001, 1766933, 2048835, 2293841, 2363809, 2542836, 2491256, 2585269, 2807634]
4022B807634K69029L02038J39337K31000L49454r7448k5426K83682K7202K14465
4012D500967K10701M3610J23463N7585L76439J73161J78008M19813K3102L09794
4002F416643M31869P2144M91936Q48700O03668N88681J102440J158279Q02808
3993A2517168J466973K016787K041509K780705L739244M966302P373957J0440008
3985D7342653J3563965J5000315J3177188Q269975J050825n802167r508304j0255772
3977G2838678q932385o619944m512844j824554J328497N009663R061610J2065008
3969G8413729J3090984R594648L004284m344538j0537111j2858280j2426097j0377735
3961E3559884r011983o680511m997978m248689l451703k892691k249596j560695
$$ y = [2807634, 3076663, 3378701, 3518038, 3749038, 4098492, 4001044, 3975618, 4259300, 4286502, 4500967, 4711668, 4755278, 4878741, 4936326, 5312765, 5485926, 5663934, 6083747, 6106849, 6416643, 6848512, 6920656, 7412592, 8261292, 8864960, 9453641, 10556081, 11714360, 12517168, 13984141, 16000928, 18042437, 20823142, 24562386, 29528688, 36902645, 47342653, 60906618, 75906933, 89084121, 97354096, 98404921, 92602754, 83094450, 72838678, 63906293, 57286349, 52773505, 50948951, 52277448, 57287111, 66348721, 78413729, 91504713, 101099361, 104103645, 99759107, 89221996, 76363716, 63937619, 53559884, 44547901, 37867390, 32869412, 28620723, 25169020, 22276329, 20026733, 18466038]
3953A8466038j289135j320637j021835r79966o94665o79845m21812k46397m97503
3944A1314243l57854J65998N0513J86377L08849J81143J32338L17589N76576O20230
3934A3496002M87946M87106K22744N01275Q96188J082365N68659J037098Q98809
3925A9678192J074627J591504J936261K354714K942480L586556M282766N967202
3917D3414302Q485396J2460221J8001207K4004151K7723202K6784416J8828203
3910A79701098O280035p123518j5904353j9578399j7974713j4417576r593887
3903A01388687n095159K19949O861583J4330537K0733681K3165174J9062931Q865607
3895A89532990m549661j6241893k2175636k3078891k0488247j7265721j3916929
$$ y = [18466038, 17176903, 15856266, 14834431, 13854465, 13159800, 12479955, 12058143, 11811746, 11314243, 10956389, 11122387, 11172900, 11359277, 11668126, 11849269, 11981607, 12299196, 12875772, 13496002, 13983948, 14471054, 14693798, 15195073, 16091261, 17173626, 17742285, 18779383, 19678192, 20752819, 22344323, 24280584, 26635298, 29577778, 33164334, 37447100, 43414302, 51899698, 64359919, 82361126, 106365277, 134088479, 160872895, 179701098, 185981133, 178857615, 162953262, 143374863, 125400150, 110982574, 101388687, 96293528, 96513477, 103375060, 117705597, 138439278, 161604452, 180667383, 189532990, 184983329, 168741436, 146565800, 123486909, 102998662, 85732941, 71816012]
3888G1816012j1218883r129153p416211n861332m533604l839417l184197k580466
3880B4052749k304960j852591j243323q89996j164007p71286n31906q07376p08309
3871A3778995k55839l62477j32430j43498o55072m89280k89195k88746n20176
3862A0642282n72721p7011l45870n67410n77565l50719j58203p4010j64898m35145
3852G318730j16181j84473K41012j10112J12506J60278K559K10482j5204J54821
3842G774418j35911j14987N7503J36833l20960M1724k41047j90787J23678L261
3832G133725j06248J03173j44974k9825L1881j72507J27939N2816j49146J43126
3822F989960o0085P9216J5817n5651q3579L0471K38424k43880k71133L18685j60189
$$ y = [71816012, 60597129, 51467976, 44051765, 38190433, 33656829, 29817412, 26633215, 24052749, 21747789, 19895198, 18651875, 17761879, 16597872, 15826586, 15294680, 14487304, 13778995, 13523156, 13160679, 13028249, 12884751, 12229679, 11740399, 11451204, 11162458, 10642282, 10069561, 9992550, 9646680, 9079270, 8501705, 8150986, 7992783, 7918773, 7753875, 7318730, 7202549, 7018076, 7259088, 7148976, 7261482, 7421760, 7424319, 7634801, 7619597, 7774418, 7638507, 7523520, 7581023, 7717856, 7396896, 7438620, 7197573, 7006786, 7130464, 7133725, 7027477, 7130650, 6985676, 6955851, 6987732, 6815225, 6943164, 6995980, 6846834, 6989960, 6929875, 7009091, 7024908, 6969257, 6885678, 6916149, 7154573, 6910693, 6639560, 6958245, 6798056]
3811F798056j00001O0688J08926L76176j28051j28184L14006O39951m4219K03268
3801H100616N60131R0206L58955M85956M54517J78069N24122N93902J36882M33216
3791A1916572Q49163M62320N39285P37926P5282J52563r8604p7908l43961K3066
3781A4235704K87826L71139L47275N27091O33446Q12186J244571J244595R08050
3772B0611883J469669J895987J780409K204379K546981L398185M330266N295384
3764D3533143P726659J0953930J5542385K1424994K6176701K7163692K1874303
3757A74395807J0595932m259751j5714510k0747896k0786568j7478069j3804146
3750I2200799j0841601q016550n583199l636175k237305r73930M69696J842555
$$ y = [6798056, 6698055, 6758743, 6867669, 7243845, 7115794, 6987610, 7301616, 7941567, 7897348, 8100616, 8660747, 8750953, 9109908, 9595864, 10050381, 10228450, 10752572, 11346474, 11483356, 11916572, 12765735, 13228055, 13767340, 14505266, 14580548, 14733111, 14634507, 14556599, 14212638, 14235704, 14523530, 14894669, 15241944, 15769035, 16402481, 17214667, 18459238, 19703833, 20611883, 22081552, 23977539, 25757948, 27962327, 30509308, 33907493, 38237759, 43533143, 51259802, 62213732, 77756117, 99181111, 125357812, 152521504, 174395807, 184991739, 180731988, 165017478, 144269582, 123483014, 106004945, 92200799, 81359198, 73342648, 67759449, 64123274, 61885969, 60912039, 61381735, 63224290]
3742F3224290M739006Q235351J3464753J9512328K4633425K6925215K2246264
3735A82980632R752168n711198j7482714k2890796k3024854j9817322j6443460
3728H7362456j2972726j0289310q041767o521691n062457l454143k842297j263668
3720C6914397o37772n37690j30355j31988m48670j061362j353138j484749j653294
3711B9475379j825013j428954j015752j019573l95755k70739k43030r7936J95815
3702B3374442L29918M31184J46513O23182R19770J603133J716519J912492K724282
3693C3781435L056531M928650P319722J0175455J3168654J4937127J3055685P443029
3685A07866288m57121p750912j1196577j1453193j0339367p833856o015433m748931
$$ y = [63224290, 67963296, 76198647, 89663400, 109175728, 133809153, 160734368, 182980632, 192732800, 187021602, 169538888, 146648092, 123623238, 103805916, 87362456, 74389730, 64100420, 56058653, 49536962, 44474505, 41020362, 38178065, 36914397, 36276625, 35738935, 35608580, 35476592, 35027922, 33966560, 32613422, 31128673, 29475379, 27650366, 26221412, 25205660, 24186087, 23790332, 23519593, 23276563, 23178627, 23374442, 23704360, 24135544, 24282057, 24905239, 25825009, 27428142, 29144661, 31057153, 33781435, 36837966, 41766616, 49086338, 59261793, 72430447, 87367574, 100423259, 107866288, 107409167, 99658255, 88461678, 77008485, 66669118, 58835262, 52819829, 48070898]
3677D8070898k974442k190788j233801j4624K40740J262292K439026M364298P005961
3668E6969560J0240212J3726211J5292586J3998146Q674220q4769p587285j2304666
3660I8924215j2670107j1293058r217033p439079o724868m948843l838873l068866
3652C9723488k816787k100888j914789j475282j279907j153123j003127n16263
3644B7463322k31886L22253N73364P47092Q13574L32482j79065m88724o94260
3635B8658152j122323j414414j578134j493438j711613j380639j210897m02834
3627A8343860l65515m25689m38277n33968j6248q4632m26752l99722l08891m62285
3617A4881881p3110k12517j8991L56195L23166J89837K59797J30408K04457N05660
$$ y = [48070898, 45096456, 42905668, 41671867, 41657243, 41897983, 43160275, 45599301, 49963599, 56969560, 67209772, 80935983, 96228569, 110226715, 118900935, 118816166, 111228881, 98924215, 86254108, 74961050, 65744017, 58304938, 51580070, 46631227, 42792354, 39723488, 36906701, 34805813, 32891024, 31415742, 30135835, 28982712, 27979585, 27463322, 27231436, 27553689, 28127053, 28874145, 29687719, 30020201, 29841136, 29352412, 28658152, 27535829, 26121415, 24543281, 23049843, 21338230, 19957591, 18746694, 18343860, 17978345, 17552656, 17114379, 16580411, 16564163, 16479531, 16052779, 15653057, 15344166, 14881881, 14808771, 14596254, 14577263, 14933458, 15256624, 15446461, 15706258, 15836666, 16041123, 16546783]
3607A6546783M64728O3966R5905k760J8644j13228j90206K67558L13360J47879
3597A7612629O53261O41302N04729Q45656P95251L12462L95609K10029j93834
3588B1777094m15549k86149k91740p56741p62938j037127j058428j091311j264068
3579A4813043j053388q88089q63550q77479q10930J2338j51234j74101k02028
3570I804582l31484J7037j6171q3467l58921o56689k72049n71266o44419p60294
3560F126859m10795k72099n29953J52231n8644m5213k6836l72497K25756k54306
3550D534503n77090J21785K07448J86211l86594k78689L12780J7304j92996N55476
3540D500138L37804L59712N29577Q08720M91971J67160j72897l92898j8053n14513
$$ y = [16546783, 17011511, 17075477, 17171382, 17168622, 17187266, 17074038, 16883832, 17151390, 17464750, 17612629, 18265890, 18907192, 19411921, 20257577, 21052828, 21365290, 21760899, 21970928, 21777094, 21361545, 21075396, 20783656, 20026915, 19263977, 18226850, 17168422, 16077111, 14813043, 13759655, 12871566, 12008016, 11130537, 10319607, 10331945, 10180711, 10006610, 9804582, 9473098, 9490135, 9473964, 9390497, 9031576, 8374887, 8102838, 7531572, 6887153, 6126859, 5716064, 5443965, 4914012, 5066243, 5007599, 4962386, 4935550, 4563053, 4788809, 4534503, 3957413, 4079198, 4286646, 4472857, 4086263, 3807574, 4120354, 4137658, 3944662, 4500138, 4837942, 5197654, 5727231, 6535951, 7027922, 7195082, 7022185, 6629287, 6611234, 6096721]
3530F096721l12886o0890J05644l97729l69441J83112L86854N21456K80872k40570
3520F193143n28405m41674p90861k40044o22909l88895j71607m64426l24754l45713
3510A873855m77841l34105M12278j33019j48126J3922J81696K01049p7074R5728
3500A608363K5181J46688J30506J17288K1710k16573L67734m47786q0554k7187
3490A645370k21634k21998j77788j03274q5142l6853j38892p0463o0390J51110
3480F80046k9996K6194j57363j9354J89923l238K84915L42501N9515j07471K89857
3469A555529J59080K54070k34591k33471k7562j73370J22460k70019j3232K24861
3459A363755L85682K1550j4582l42025k66957l28222o4876q1240q8208L62053
$$ y = [6096721, 5783835, 5722945, 5828589, 5430860, 5061419, 5244531, 5631385, 6152841, 6433713, 6193143, 5664738, 5223064, 4432203, 4192159, 3569250, 3180355, 3008748, 2544322, 2219568, 1873855, 1396014, 1061909, 1474187, 1341168, 1193042, 1206964, 1388660, 1589709, 1512635, 1608363, 1633544, 1780232, 1910738, 2028026, 2049736, 1833163, 2200897, 1753111, 1672557, 1645370, 1423736, 1201738, 1023950, 920676, 835534, 798681, 659789, 589326, 528936, 680046, 650050, 676244, 518881, 499527, 689450, 686212, 971127, 1313628, 1373143, 1265672, 1555529, 1714609, 1968679, 1734088, 1500617, 1473055, 1299685, 1422145, 1152126, 1138894, 1363755, 1749437, 1770987, 1756405, 1414380, 1147423, 819201, 754325, 673085, 584877, 946930]
3449I46930J061M0955L3389L13015K09652k117j39521j42173j25010k35222J11770
3438A012729o107k9488J47328J03749j23497K91601O3o5819k87974q4955M48302
3427A405932r4093P7043j20418o8074J56055N80352K46326j87381N3931m2288
3417B007385j73856m7689q2451j19761j74573k22959K70912Q2009J89832j0694
3407A718155M6275K94818k0155J23591r6138k91798q1863l65995j36748p6716
3397A113426j37034P871l9918P4484r8023k53634q3290J1837K81991n9869k29617
3386E88224M13691k40329q8447o2740k17018O3895N9891m8175K52002l4255j18166
3375E68573K72739J10733n9621n50123Q8798Q9821r2505R2330J38231K22264j18306
$$ y = [946930, 947991, 988946, 1022335, 1335350, 1545002, 1542885, 1403364, 1261191, 1136181, 900959, 1012729, 1006622, 977134, 1124462, 1228211, 1104714, 1396315, 1396378, 1330559, 1042585, 957630, 1405932, 1311839, 1388882, 1268464, 1200390, 1356445, 1936797, 2183123, 1995742, 2049673, 2007385, 1833529, 1785840, 1703389, 1583628, 1409055, 1186096, 1457008, 1539017, 1728849, 1718155, 1764430, 2059248, 2039093, 2162684, 2066546, 1774748, 1692885, 1326890, 1190142, 1113426, 976392, 984263, 944345, 1018829, 920806, 667172, 583882, 595719, 877710, 817841, 588224, 1001915, 761586, 673139, 610399, 393381, 457276, 517167, 468992, 720994, 686739, 568573, 841312, 952045, 892424, 342301, 431099, 520920, 428415, 520745, 658976, 881240, 762934]
3364G62934J91923L12079j06627M5761K28304K6900N569j18731k00498J01884
3354A249498O4193N9389J42486j31503l15704j84127j83039k87929p1751K52305
3344E93818j47131j88546j84982M4991K58090k25359K01254P3815N5066J39787
3334F20803k8271L89788L11549J75344m19J54651j29158O2599k09350l90221k05160
3323G52155p305K09723L82368l40503j64004M1914r6736J58586P2757p3156l3679
3312I02120J94530k7493K231n7536q9161J50438M3527j11379r3940j82121J76366
3301I07582j324r6655p0842m0785R9101O2261J84936J12522k17379o2319J09590
3290I86688R1621L506l0127p6278M39Q7074L15146L01076Q115J2831K55486K10968
$$ y = [762934, 954857, 1266936, 1160309, 1206070, 1434374, 1461274, 1466843, 1348112, 1147614, 1249498, 1313691, 1373080, 1515566, 1384063, 1068359, 884232, 701193, 413264, 341513, 593818, 446687, 258141, 73159, 118150, 376240, 150881, 352135, 425950, 481016, 620803, 592532, 982320, 1293869, 1469213, 1468794, 1623445, 1494287, 1556886, 1347536, 957315, 752155, 744850, 954573, 1336941, 996438, 832434, 874348, 777612, 936198, 1008955, 935799, 902120, 1096650, 1069157, 1071388, 1013852, 924691, 1075129, 1118656, 1007277, 913337, 731216, 907582, 906258, 809603, 738761, 697976, 797077, 859338, 1044274, 1156796, 939417, 877098, 986688, 1078309, 1081815, 1051688, 975410, 975849, 1062923, 1378069, 1679145, 1687260, 1700091, 1955577, 2166545]
3278B166545K9055R5950K98062L00524K23872J96266j76873m46544k16525l07482
3268B162850m81836l25936J59752j16295l38038j94303M95497k43355k68525k55204
3258E94607J37588Q2525j19103L86188K56519M69093K23143K49500J90045L49464
3248B819569K32238k67275P9145j02807n82559l59782J64813l75812m84105r0521
3238A032904n9227j96412j56980l81871l03114k60034l97968k24859J29769N3865
3228g63927M5825j8865k11036K25034K51393J8959J13945N19247N94766M1915
3218H17256R2067M41012K94316J39407k68537q4038k82263k75150l18686j34749
3208D20635k78261k73055l68629m4935l53698J00588R8304l6006J43250J68103
$$ y = [2166545, 2195600, 2291550, 2589612, 2890136, 3114008, 3310274, 3133401, 2686857, 2470332, 2162850, 1681014, 1355078, 1514830, 1398535, 1060497, 866194, 1361691, 1118336, 849811, 594607, 732195, 814720, 695617, 1081805, 1338324, 1807417, 2030560, 2280060, 2470105, 2819569, 3051807, 2784532, 2863677, 2760870, 2178311, 1818529, 1983342, 1607530, 1123425, 1032904, 973677, 777265, 620285, 238414, -64700, -324734, -722702, -947561, -817792, -763927, -718102, -736967, -948003, -722969, -471576, -452617, -338672, 180575, 775341, 817256, 909323, 1350335, 1644651, 1784058, 1515521, 1431483, 1149220, 874070, 555384, 420635, 142374, -130681, -499310, -544245, -897943, -797355, -699051, -735057, -591807, -423704]
3198d23704R6451O1548M63467L25761K71030k06067M6919K58060L734L03435k33577
3187I67057m36207j70765k30673n3197k6038m70625l16906k39681J86408K66997
3177e23630j57091q2003Q1049K50595J59865M01793L7916j06514L64689M24841
3167H51510K71128Q3229J85653J37594l2421J90099L3041o7918n4590l68531k20868
3156A007926j64560j35994p4017k00528l38256J62124l3308o6217J27507R3561
3146C78238J9890l21299R587j79509Q7427j05253k32547K07962L42475Q4665r1551
3135B00085J05781K92843O4210K48597M6203q3142j48471J48244K5455j70265
3125G29540L8866J7724J61671j04767k34944j89909K98931J02419o9109q7191
$$ y = [-423704, -327253, -265705, 197762, 523523, 794553, 588486, 635405, 893465, 897199, 1200634, 967057, 530850, 360085, 129412, 76215, 50177, -420448, -737354, -977035, -790627, -523630, -680721, -762724, -681675, -431080, -271215, 130578, 168494, 61980, 426669, 851510, 1122638, 1205867, 1391520, 1529114, 1496693, 1686792, 1719833, 1651915, 1597325, 1228794, 1007926, 843366, 707372, 633355, 432827, 94571, 256695, 223387, 157170, 284677, 378238, 398128, 76829, 86416, -93093, -5666, -110919, -343466, -135504, 206971, 291636, 200085, 305866, 598709, 662919, 911516, 957719, 874577, 726106, 874350, 899805, 729540, 768406, 786130, 947801, 843034, 608090, 418181, 717112, 819531, 750422, 663231]
3115F63231L3812m21938m41329J24597K38747J21620J84781L66782K02636l1103
3105A041836J01121n2929K3778j1612r5944j09861k4231K2969K0820R3068j96391
3094H12624N8932n3786m65828J86953J56828l65244K09211j1104j68161j12278
3084B48147K3151Q230K62413M78038L80152O6644N2462j67372l13683j69568L9409
3073I08023n39139j08556L27398l0615j5870Q4214l38034m26817L45555J99600
3063D05759J23854M0821Q830K39458R5236j00337K24161K75582K55628J57875
3053A726867J96358l6811K04357J84302k1362N1601K30309l21305j11749J06361
3043B208928n5472j03147j52664j18575q4879j08214l33760j1126n3888k95417
$$ y = [663231, 697043, 275105, -166224, -41627, 197120, 318740, 503521, 870303, 1072939, 1041836, 1142957, 1090028, 1113806, 1102194, 1006250, 896389, 872158, 895127, 915947, 1009015, 812624, 871556, 817770, 351942, 538895, 695723, 330479, 539690, 528586, 360425, 248147, 271298, 279528, 541941, 1019979, 1400131, 1466775, 1519237, 1351865, 1038182, 868614, 908023, 368884, 260328, 587726, 557111, 541241, 625455, 287421, -139396, 206159, 405759, 529613, 570434, 579264, 818722, 913958, 813621, 1037782, 1313364, 1568992, 1726867, 1923225, 1886414, 2090771, 2275073, 2253711, 2305312, 2535621, 2214316, 2102567, 2208928, 2153456, 2050309, 1897645, 1779070, 1694191, 1585977, 1252217, 1241091, 1187203, 891786]
3033H91786j9068M17360Q0505q472J91960L82928M6656j27513k40997q3430q1646
3022A450069l79628k70142o5247j07504J44791J87299K52155o3793K2819K08903
3012A379722M07276K33824K54754L02943M67899L84072J53244J68101J7709M56051
3002D225595K55549k24215m0023j79575o2760K69591n2110o7648j79795k35589
2992C709020r3471m8306o8137L9142k98762J16895k0518P3635p2631K35038J46695
2981C718600J22205K77170J51934L61428L81880O23867K14692k09862j9611N49331
2971F171634K68024L94511K86763N73971M69493K18314J99629K82464P5773N62126
2961I502702P40002P51362O70158O89311J330356J627262K481884L350972M732328
$$ y = [891786, 872718, 1290078, 1370583, 1362111, 1554071, 1936999, 1983655, 1856142, 1615145, 1531715, 1450069, 1070441, 800299, 735052, 627548, 772339, 959638, 1211793, 1148000, 1170819, 1379722, 1786998, 2020822, 2275576, 2578519, 3046418, 3430490, 3583734, 3751835, 3769544, 4225595, 4481144, 4256929, 4216906, 4037331, 3974571, 4244162, 4192052, 4124404, 3944609, 3709020, 3615549, 3567243, 3499106, 3538248, 3239486, 3356381, 3335863, 3409498, 3336867, 3571905, 3718600, 3840805, 4117975, 4269909, 4631337, 5013217, 5637084, 5851776, 5641914, 5622303, 6171634, 6439658, 6834169, 7120932, 7694903, 8164396, 8382710, 8582339, 8864803, 8940576, 9502702, 10242704, 10994066, 11664224, 12353535, 13683891, 15311153, 17793037, 21144009, 25876337]
2952B5876337N884618O329745N342684K663778n83586k602205k707745j973857
2944C8229769n10390J301845L160072N829799Q543385J0369828J0769279R135400
2936H6828987O636281M858331K802991J947265Q70380l08540p84674j98806P38340
2927A03390555O82326R1794J670048L180740M256392M464954M600765N573083
2919A27910657O253163O136250M486304J066701l116993m660372m869123m033998
2911A29172589l167117k862747l612282l663884l081496k158213k186901k009897
2903A06430052j535382l02183Q49571Q43300P88685K65181j234564m202460p404159
2894I4498041j0168689j0542215r756872q151010n824219l936021k129580M33536
$$ y = [25876337, 31760955, 38090700, 43433384, 46097162, 45513576, 42911371, 40203626, 38229769, 37719379, 39021224, 42181296, 48011095, 56554480, 66924308, 77693587, 86828987, 93465268, 98323599, 101126590, 103073855, 103944235, 103635695, 102851021, 102652215, 103390555, 104072881, 104164675, 105834723, 109015463, 113271855, 117736809, 122337574, 127910657, 134163820, 140300070, 144786374, 145853075, 142736082, 138075710, 133206587, 129172589, 126005472, 123142725, 119530443, 115866559, 112785063, 110626850, 108439949, 106430052, 104894670, 104592487, 105442058, 106285358, 107074043, 107339224, 106104660, 101902200, 94498041, 84329352, 73787137, 64030265, 55879255, 50055036, 46119015, 43989435, 44422971]
2886D4422971K133121L440894K555775l20015l003271n430602n737418n060977
2878C3000478m341038l655294k966036k596004k382769j365220j214941j222087
2870A3257089n86668m88689p30187n47313n54948l28181L45680k23719m70792
2861I672272J06803k60898m70935l81240m05698m85207l6811k14368l29661k19849
2851F974408j11003l30310l81574m7016m20715j59843k69453m1373j45021j28588
2841D939512l0833J91839J28172J43289l26553k66669K16095j17798l6334M726
2831D845446j27303k55792j19589m07322l84945o509p4294n05086l03766l16298
2821B344542Q8659J91114k97136j41013j57752j035J51029J40096N5664k828p5631
$$ y = [44422971, 46556092, 49996986, 52552761, 52232746, 49229475, 43798873, 38061455, 33000478, 28659440, 25004146, 22038110, 19442106, 17059337, 15694117, 14479176, 13257089, 12670421, 12181732, 11451545, 10904232, 10349284, 10021103, 10366783, 10143064, 9672272, 9779075, 9518177, 9047242, 8666002, 8260304, 7775097, 7738286, 7523918, 7194257, 6974408, 6863405, 6533095, 6151521, 6104505, 5683790, 5523947, 5254494, 5213121, 5068100, 4939512, 4908679, 5100518, 5228690, 5371979, 5045426, 4778757, 4994852, 4877054, 4840720, 4845446, 4718143, 4462351, 4342762, 3935440, 3550495, 3543986, 3469692, 2964606, 2660840, 2344542, 2433201, 2624315, 2327179, 2186166, 2028414, 2027379, 2178408, 2318504, 2374168, 2371340, 2295709]
2810B295709K06391K24649L24378Q7301M40691R7160L5268K92238Q3863K3579
2800D111227N14814L18875K90688J049871Q99009J085312J172111M56855K08498
2791A0107260j41581p87579p89614q23938o51616m13963J33521j05052p2080M97171
2781F952529O66494R57795Q92073R38415N8062n60002j054413j061567q79168
2772F910218o51403o00346k84788j84702l88240K02397J6763k42824k24911p2886
2762D479278j83740l611q1579R2346M4769J3538j23940N6959J55451K1365K53655
2751D724491N1514K19704N47650K38138N44858J050732J384344J966158K320782
2742A3048371K087690J388142O08007l35513j177737j448731j178379r75167q11711
$$ y = [2295709, 2502100, 2726749, 3051127, 3138428, 3579119, 3676279, 3711547, 4003785, 4087648, 4111227, 4626041, 4944916, 5235604, 6285475, 7184484, 8269796, 9441907, 9898762, 10107260, 9965679, 9178100, 8388486, 7564548, 6912932, 6498969, 6632490, 6527438, 6455358, 6952529, 7619023, 8576818, 9468891, 10407306, 10465368, 9905366, 8850953, 7789386, 6910218, 6258815, 5658469, 5373681, 5188979, 4800739, 5003136, 5019899, 4777075, 4552164, 4479278, 4295538, 4291927, 4210348, 4302694, 4347463, 4361001, 4237061, 4294020, 4449471, 4470836, 4724491, 4776005, 4995709, 5543359, 5781497, 6326355, 7377087, 8761431, 10727589, 13048371, 15136061, 16524203, 17132210, 16796697, 15618960, 14170229, 12991850, 12016683, 11204972]
2733A1204972n88084l78224J15164P93245J255897J722608J446316J294542M71610
2724A7338046r66311j435132j858723j792636j258779j189400r73245j185311
2716F678509r68464J34357j78894l41321o37211k37477J47706r7469m0407l68865
2706D090464k24387M42972L86879j83459j6299L1315q2193K43403r4584l39907
2696D254204p6058N203O9670K10830j4881J61603k56352N7273K00689m6471J66521
2685D732231j54093L7643o9929P5888k64858j08203k31706k11848K47078N1987
2675D104190Q268O6548m8827K74975K60031K10349n673k29867R6484j34366N1883
2664D653995l4537K3655J73217L56976J1240N8777K31951j19623m295q6509R1262
$$ y = [11204972, 10616888, 10238664, 10353828, 11147073, 12402970, 14125578, 15571894, 16866436, 17338046, 16371735, 14936603, 13077880, 11285244, 10026465, 8837065, 7863820, 6678509, 5710045, 5844402, 5665508, 5324187, 4686976, 4449499, 4597205, 4499736, 4459329, 4090464, 3866077, 4309049, 4695928, 4512469, 4496170, 4527485, 4445292, 4688695, 4594111, 4254204, 4178146, 4183349, 4253019, 4463849, 4448968, 4610571, 4354219, 4411492, 4612181, 4565710, 4732231, 4578138, 4615781, 4545852, 4621740, 4356882, 4248679, 4016973, 3805125, 4052203, 4104190, 4112458, 4179006, 4130179, 4405154, 4665185, 4875534, 4869861, 4639994, 4736478, 4602112, 4653995, 4619458, 4643113, 4816330, 5173306, 5184546, 5243323, 5475274, 5355651, 5351356, 5264847, 5356109]
2653E356109L62501J36963J09533K63705J06704M1301Q1289Q4519j63141N3169
2643F432652N42067J86336k298k11335p0523J71413K04984J19032L3917K03157
2633G609402K34795N53489O60819O07467J148932Q87438J138931J460142K088114
2624A6389529J607787J046627N22456j64986j132580j343497j506630j173087
2616A4245619n39441o40638m86672o40776j89665J03355L18514k13272O8593J84188
2606A2209805J33579J26367O91852M23519P80489J226608J473655K111479K268883
2597B1446236J524576Q56318l61005q48725q58149j199125j072954r90453q07382
2588A7689337k11965r3425l1057L4644n3577L76219M78717L78963M64166L71915
$$ y = [5356109, 5718610, 5855573, 5965106, 6228811, 6335515, 6376816, 6458105, 6542624, 6379483, 6432652, 6974719, 7161055, 7158757, 6947422, 6876899, 7048312, 7253296, 7372328, 7406245, 7609402, 7844197, 8397686, 9058505, 9665972, 10814904, 11702342, 12841273, 14301415, 16389529, 17997316, 19043943, 19566399, 19401413, 18268833, 16925336, 15418706, 14245619, 13706178, 13065540, 12578868, 11938092, 11748427, 11851782, 12170296, 11957024, 12025617, 12209805, 12343384, 12469751, 13161603, 13585122, 14365611, 15592219, 17065874, 19177353, 21446236, 22970812, 23827130, 23466125, 22617400, 21759251, 20560126, 19487172, 18496719, 17689337, 17477372, 17383947, 17352890, 17387534, 17333957, 17710176, 18188893, 18567856, 19032022, 19403937]
2578A9403937L94000P99082J181862J059565J182977J958766J636761J223941
2570B8840891P93259N00054P92488k13289K57758N30383K89715J023331J152349
2561C3966939R07776J119701J653076K184463K090606L244838N128959O820400
2553E7116758J0066198J5421011K1907409K6929634K6656745J7915763L461719
2546A79475237j0088222j6872330j7536010j5481257j2502523r448140o761995
2539I0784760l940676j229282K036382N494545R777085J6107992K4076277L0695388
2531A73802471L3547339L0805905K4130126J7360105R726557k101985j6952439
2524B70318079k7481825k9837450k5691817j9590830j4113632q844437m044349
$$ y = [19403937, 19797937, 20597019, 21778881, 22838446, 24021423, 25980189, 27616950, 28840891, 29634150, 30134204, 30926692, 30713403, 30971161, 31501544, 31791259, 32814590, 33966939, 34874715, 35994416, 37647492, 39831955, 41922561, 45167399, 50296358, 57116758, 67182956, 82603967, 104511376, 131441010, 158097755, 176013518, 179475237, 169387015, 152514685, 134978675, 119497418, 106994895, 97546755, 90784760, 86844084, 85614802, 87651184, 93145729, 102922814, 119030806, 143107083, 173802471, 207349810, 238155715, 262285841, 279645946, 289372503, 287270518, 270318079, 242836254, 212998804, 187306987, 167716157, 153602525, 144758088, 140713739]
2517A40713739j02489L488832P438193J2393376J8665828K6518342L4335846L6949314
2509B80400981L1964659J6914329j886939j4843528k0240758j9256720j6084223
2502B56967801j4114020j2576433j1055080r294567p882657o308250m170973k273225
2494A89292596m06815J959300M444873P359727R929286J1959487J3589489J4639405
2486B52767348J5706070J7423889J9211417J9574668J8928562J5281143J1000203
2479C69893300N988256K462189L73208j438077k877855n047137p175360q844354
2471C53334170r646853r689973q600401o569700l358250J981K379855L040042
2463C20890871L377535L720065M278427M040781L588352K435365P04337n86345
$$ y = [140713739, 140611250, 144100082, 151538275, 163931651, 182597479, 209115821, 243451667, 280400981, 312365640, 329279969, 327393030, 312549502, 292308744, 273052024, 256967801, 242853781, 230277348, 219222268, 209927701, 202045044, 195736794, 191565821, 189292596, 188885781, 190845081, 195289954, 202649681, 212578967, 224538454, 238127943, 252767348, 268473418, 285897307, 305108724, 324683392, 343611954, 358893097, 369893300, 375881556, 378343745, 378716953, 377278876, 374401021, 369353884, 362178524, 353334170, 343687317, 333997344, 325396943, 318827243, 315468993, 315470974, 317850829, 320890871, 324268406, 327988471, 332266898, 336307679, 339896031, 342331396, 343035733, 342449388]
2455C42449388j652034k015561k451100k295656p74815J661737N319019Q285559
2447C48526537J0664191J1259988J0755684R969636P693782N842087N229130N184845
2439D15125880M542718K303351k398146q401339j3857887j7340463j9445873j9137855
2431C41390386j8342382j7486405j5788132j4858741j3268994j1512823r418991
2424B40713918p165802m494141k466890J47375J876442L409208L766335L436150
2416B39222595L182208K208488J863351J303165J59810k240063n903313r887609
2408B29908632j2621086j4150963j4128782j3441594j2518527j1670902j1039758
2401A40337020j0509806r635821r335042q332263p203627o365120n426025m657317
$$ y = [342449388, 340797354, 338781793, 336330693, 334035037, 333260222, 334921959, 340240978, 348526537, 359190728, 370450716, 381206400, 391176036, 398869818, 404711905, 409941035, 415125880, 419668598, 421971949, 419573803, 411172464, 397314577, 379974114, 360528241, 341390386, 323048004, 305561599, 289773467, 274914726, 261645732, 250132909, 240713918, 233548116, 229053975, 226587085, 226734460, 228610902, 232020110, 235786445, 239222595, 242404803, 244613291, 246476642, 247779807, 247939617, 245699554, 239796241, 229908632, 217287546, 203136583, 189007801, 175566207, 163047680, 151376778, 140337020, 129827214, 120191393, 110856351, 102524088, 95320461, 88955341, 83529316, 78871999]
2393G8871999m261275l303685l127972k867623k369712k211575j704607j971507
2385E7054043j271358j127914j210625j243878q93083j025403j158452r65257
2377D8158073n65228l27599p70481m05207p9871l95820m90096l01814q01389r93188
2367D3027380q79716o15131q47853j111449j117384j164771q88645n53029n2993
2358C5796409K34360L45492J01761n8281O2603m928j17348n68723p02203r09218
2348C4179924p98817m56506o14417o49844n55466q69184r6388n38245J10252r2834
2338B9618475o08197q73217j040966p97354r90696r07374k27982l4738J14989
2329B4252940l858O8967J81709j81505l57324k06148p22020r54058p47363j100136
$$ y = [78871999, 74610724, 71307039, 68179067, 65311444, 62941732, 60730157, 59025550, 57054043, 55782685, 54654771, 53444146, 52200268, 51307185, 50281782, 49123330, 48158073, 47592845, 47265246, 46494765, 46089558, 46009687, 45613867, 45123771, 44821957, 44020568, 43027380, 42147664, 41532533, 40684680, 39573231, 38455847, 37291076, 36402431, 35849402, 35796409, 36030769, 36376261, 36478022, 36419741, 36482344, 36477416, 36360068, 35791345, 35089142, 34179924, 33381107, 32924601, 32310184, 31660340, 31104874, 30235690, 30139302, 29601057, 29711309, 29618475, 29010278, 28137061, 27096095, 26298741, 25308045, 24400671, 24172689, 24137951, 24252940, 24249082, 24318049, 24499758, 24318253, 23960929, 23754781, 23032761, 22078703, 21331340, 20231204]
2319B0231204p81992o90523l18942j93153j08689M361O9544J6672L1506k47426
2309A8012562o30477l43137j14961k25544j81139l21621l32777J13409m21950
2300A5554365l15482P1033p5882J20919k65858l22866m21019M8622J06695K6054
2290A4526581k95425N1833j31414K50622L3643j27879M56093Q67258O95691J200140
2280A7527143J801026J979344K231374J051312J08238o43436j354633j360425
2272B1339943q36677n33643n35203q9865J84664M04639O20980P16700J197695
2263B2469233J571609K194240K481350L229721L422381L602730L263493L321810
2255D5556567L075598K271280L121486M818272P899703J3405308K0437572K6192474
$$ y = [20231204, 19449212, 18758689, 18439747, 18246594, 18137905, 18142266, 18211810, 18228482, 18259988, 18012562, 17382085, 17038948, 16923987, 16698443, 16517304, 16195683, 15862906, 15976315, 15554365, 15238883, 15309916, 15234034, 15354953, 15089095, 14766229, 14345210, 14393832, 14500527, 14526581, 14231156, 14282989, 14151575, 14402197, 14435840, 14307961, 14764054, 15631312, 16327003, 17527143, 19328169, 21307513, 23538887, 24590199, 24698437, 24055001, 22700368, 21339943, 20503266, 19969623, 19434420, 19344555, 19529219, 19933858, 20554838, 21271538, 22469233, 24040842, 26235082, 28716432, 31946153, 35368534, 38971264, 42234757, 45556567, 48632165, 50903445, 54024931, 58843203, 66742906, 80148214, 100585786, 126778260]
2247A26778260K7309923K0299589P069954p471600j6345228j7747234j3542377
2240A26351287p908776r97515P272686J5847005K1596025K1576026J3236070k36647
2232A96736161j2615426j8341220j7088042j0925995k211074P003853J3617066
2225A56175323J4951719Q693973k860683j3612026j8472357j7700572j3766485
2218A13408892q593760k773565N151095J2304635J6791627J5320456P248982n305334
2210A53553028j5533754k0145249j9713039j6295462j3378292j0867302q695986
2203D8923944o511484m907645m075970l020993k126573j528696j876714j186357
2195B3689512p64761q75107j053423q06782o17063o87737n43568q39340q56821
$$ y = [126778260, 154088183, 174387772, 181457726, 173986126, 157640898, 139893664, 126351287, 118442511, 117444996, 124717682, 140564687, 162160712, 183736738, 196972808, 196736161, 184120735, 165779515, 148691473, 137765478, 135554404, 142558257, 156175323, 171127042, 179821015, 176960332, 163348306, 144875949, 127175377, 113408892, 104815132, 102041567, 107192662, 119497297, 136288924, 151609380, 158858362, 153553028, 138019274, 117874025, 98160986, 81865524, 68487232, 57619930, 48923944, 42412460, 37504815, 33428845, 30407852, 28281279, 26752583, 24875869, 23689512, 22924751, 22049644, 20996221, 20189439, 19572376, 18884639, 18341071, 17501731, 16644910]
2186A6644910m71452n89772q01848n36269k78419p57421n99696m69719k28335
2177A1911979j75472l96140j57461J39161l89646J45792j92867j37858J29273
2168A0876761l98940l78556m5534L9198m65973j14830j12328p6548k76173k74826
2158H772251L6038j72937Q074k58237j73864K6613l47020K12125M64080j02429
2148H464694k10759o4716J20690M3728k20503m54787k32632k78373k69431l25182
2138F572729l64481j83790j08516o2990K38508K3672j47797P4043M2886o59K45213
2127F328818J84333J05425J06256K01948j0018j11589j8321k02860P5847k17874
2117F441965k63917m38155j68804K10493R5252l79584k30808j27735k29580k32614
$$ y = [16644910, 16173458, 15583686, 14781838, 14245569, 13967150, 13209729, 12610033, 12140314, 11911979, 11736507, 11340367, 11182906, 11322067, 10932421, 11078213, 10885346, 10747488, 10876761, 10477821, 10099265, 10053731, 10092929, 9626956, 9512126, 9399798, 9323250, 9047077, 8772251, 8808289, 8635352, 8643426, 8385189, 8211325, 8237938, 7890918, 8103043, 8567123, 8464694, 8253935, 8189219, 8309909, 8353637, 8133134, 7678347, 7445715, 7167342, 6897911, 6572729, 6208248, 6024458, 5915942, 5852952, 6091460, 6115132, 5967335, 6041378, 6084264, 6083605, 6328818, 6513151, 6618576, 6724832, 6926780, 6916762, 6805173, 6786852, 6583992, 6659839, 6441965, 6178048, 5739893, 5571089, 5781582, 5876834, 5497250, 5266442, 5138707, 4909127, 4676513]
2107D676513L6579n2224n13962j55457L34653j12547l17139o4967J53890j50216
2097C835123j15987J37039j76187J8977J40462m23011j55276J00857J00j92230
2087C169867N25538K18785K4785O10471N12340P67807N78378O5773m04777n06838
2077E562129l03641l16960k75241l22668l73192j45710j76676J78975j13434o5654
2067C647928M5614j70916J42410j95172j3345m6257j39790Q3067M854J47845K1736
2056C527974J85407J7763K65875o9829M37J81285j75773j08152o1500J06422j90642
2045C679267m04914j34356K56019K02862l84455l64111O4477l11130j04470K76904
2035B776093j96112o9051m4592J35678L06739J03773l7706M7343N96916K98666
$$ y = [4676513, 4713092, 4660868, 4146906, 3991449, 4326102, 4213555, 3896416, 3831449, 3985339, 3835123, 3719136, 3856175, 3679988, 3698965, 3839427, 3416416, 3261140, 3361997, 3362097, 3169867, 3695405, 3914190, 3938975, 4549446, 5061786, 5829593, 6407971, 6473744, 6068967, 5562129, 5258488, 4941528, 4666287, 4343619, 3970427, 3824717, 3648041, 3827016, 3713582, 3647928, 3693542, 3522626, 3665036, 3469864, 3456519, 3410262, 3270472, 3353539, 3358393, 3506238, 3527974, 3713381, 3731144, 3997019, 3927190, 3927627, 4108912, 3933139, 3824987, 3763487, 3869909, 3679267, 3274353, 3139997, 3396016, 3598878, 3214423, 2850312, 2914789, 2603659, 2499189, 2776093, 2579981, 2510930, 2466338, 2602016, 2908755, 3012528, 2974822, 3022165, 3619081, 3917747]
2025C917747Q8942k17453k13950k36867O1834J15697K01090Q3951j41166K7802
2015C687627j08673k14419j48724n3201j93548R8401j6598q7698K51346L94577
2005C609090L97286M7669q3857J61270j00478K32044M33995J61151P49063P34046
1995F341279Q76596P58214R42390J246990J772543J991108J774623N44830q42314
1986A5406259j472524j225667p53375o81623j28523l8977R16591J597184J454752
1977A5074097J569551O10317r02426j247414j204306j229171m33790M0739O25005
1968A2902602J173235R02308O32884k00643j183596j417964j128738j026907o77370
1959I975811l44973K67923N81751J476649J346345N80006k54647r18350j480170
$$ y = [3917747, 4006689, 3789236, 3575286, 3338419, 3400253, 3515950, 3717040, 3800991, 3659825, 3687627, 3578954, 3364535, 3215811, 3162610, 2969062, 3067463, 3050865, 2963167, 3214513, 3609090, 4006376, 4054045, 3970188, 4131458, 4030980, 4263024, 4697019, 4858170, 5607233, 6341279, 7217875, 7976089, 8918479, 10165469, 11938012, 13929120, 15703743, 16248573, 15406259, 13933735, 12708068, 11954693, 11273070, 11144547, 11105570, 12022161, 13619345, 15074097, 16643648, 17253965, 16351539, 15104125, 13899819, 12670648, 12236858, 12277597, 12902602, 14075837, 14978145, 15611029, 15410386, 14226790, 12808826, 11680088, 10653181, 9975811, 9630838, 9898761, 10480512, 11957161, 13303506, 13883512, 13628865, 12710515, 11230345]
1950A1230345j256036q93773j038793o55922n17771q39343n15275k31032K4349
1941E306749j21836j30354j2327J3602J17638J09277q7665l22444N3213M651P6574
1930E007078k88047j53346J10649j13790O4509k24549n9776j35883k91772k97763
1920C617310K83065N6865K22195K58533J13746J92327k75911o4548K34617L60518
1910D998717J23769L0671J54702J01991J9155Q2227K99079O5582l57837k08537
1900E309519J60820J934k75053L55478l45972k40849J79390J88513K36225K24448
1890E794453J56229J03905R7370K49378M78708K22437J03072L99112L13251L90106
1880H308021r7068j63413J23243K39540J21076K78723j06714n9219J26068P8462
$$ y = [11230345, 9974309, 9080536, 8041743, 7385821, 6868050, 6028707, 5513432, 5282400, 5306749, 5184913, 5054559, 5042232, 5055834, 5173472, 5282749, 5195084, 4872640, 4925853, 4930504, 5007078, 4719031, 4565685, 4676334, 4562544, 4627053, 4402504, 4342728, 4206845, 3915073, 3617310, 3900375, 3957240, 4179435, 4437968, 4551714, 4744041, 4468130, 4403582, 4638199, 4998717, 5122486, 5153157, 5307859, 5409850, 5429005, 5511232, 5810311, 5875893, 5518056, 5309519, 5470339, 5472273, 5197220, 5552698, 5206726, 4965877, 5145267, 5333780, 5570005, 5794453, 5950682, 6054587, 6151957, 6401335, 6880043, 7102480, 7205552, 7604664, 7917915, 8308021, 8210953, 8047540, 8170783, 8410323, 8531399, 8810122, 8703408, 8644189, 8770257, 8848719]
1870H848719l1784J66359L89498r7879J47076M63987K54983N85001M97079L54281
1860A1577320M42644O51300M46733M82823N84743J85925K45935O68544O96928
1851A5982895Q40503Q67216P42111J099471J420121J597924J655924K237365K439822
1842B8883352K790654L025159L281181K726142K440080J669085J264635P10064
1834D6790352K65084k14198j94302j69695j13948Q35230J884031K748623L667900
1825E5499077M730111N491452N400144M768458L228562K239804K059994J773763
1817H5191365K418889K700143K321419K398577K125351J649862J374152J470072
1809A01649830J781314K260390K272485J874341J004758K26679n58521P254J754572
$$ y = [8848719, 8816935, 8983294, 9372792, 9274913, 9421989, 9885976, 10140959, 10725960, 11223039, 11577320, 12019964, 12671264, 13117997, 13600820, 14185563, 14371488, 14617423, 15285967, 15982895, 16823398, 17690614, 18432725, 19532196, 20952317, 22550241, 24206165, 26443530, 28883352, 31674006, 34699165, 37980346, 40706488, 43146568, 44815653, 46080288, 46790352, 47055436, 46841238, 46646936, 46477241, 46363293, 47198523, 49082554, 51831177, 55499077, 60229188, 65720640, 71120784, 75889242, 79117804, 81357608, 83417602, 85191365, 87610254, 90310397, 92631816, 95030393, 97155744, 98805606, 100179758, 101649830, 103431144, 105691534, 107964019, 109838360, 110843118, 111069797, 110511276, 110518530, 112273102]
1800A12273102M092670O893751R545073J1519761J1833965R011833M758935J459109
1792A71388199n29467q91865M1408J048569J922693K006810J523956J403837J288773
1783A79202913J748896K076399J476279O29473n60255j816326k706721l357119
1775A76693539k912558j988759J97905L024275O592758R590118J1588418J1864257
1767B14649953J0582808Q037261O189865M785896M782952N424283O041619N046915
1759B65541552L649547K641908L061992K977627K483396J61447k390396m047836
1751B74079237m865416m202139l284096j117062J065383L841538O309971Q287648
1743B80115064R499106R082191P690200M231770K35905l314697n968887o302162
$$ y = [112273102, 116365772, 123259523, 132804596, 144324357, 156158322, 165170155, 169929090, 171388199, 170858732, 169966867, 170008275, 171056844, 172979537, 174986347, 176510303, 177914140, 179202913, 180951809, 183028208, 184504487, 185133960, 184573705, 182757379, 180050658, 176693539, 173780981, 171792222, 171990127, 175014402, 181607160, 191197278, 202785696, 214649953, 225232761, 233270022, 239459887, 244245783, 249028735, 254453018, 260494637, 265541552, 269191099, 271833007, 274894999, 277872626, 280356022, 280517469, 278127073, 274079237, 269213821, 265011682, 261727586, 260610524, 261675907, 265517445, 271827416, 280115064, 289614170, 298696361, 306386561, 310618331, 310854236, 307539539, 301570652, 295268490]
1735B95268490n540623m152735k547832j53991J917824L147464M025315L762075
1727B95725987K156347j10939j474724j644240j031252l83446l40806j317431
1719B91579496k611493l222922k349582r56989j492195m089920p651461j1116536
1711B58088398j2546223j2149388j1111728q767872n909107k949058n80014J157944
1703B05232952J795850K830223J889959J498092J152822k44804j350891k487956
1695B10316247l928678m240857n119634m740069l462905j432984J247352K856615
1687A91495087K756573J28067l335464p609341r561966j0191997r161955p514081
1679A47004923n941220l756427k155306j344706j738716k307398k903589l108264
$$ y = [295268490, 289727867, 285575132, 283027300, 282873309, 284791133, 287938597, 291963912, 295725987, 297882334, 297771395, 296296671, 294652431, 293621179, 293237733, 292896927, 291579496, 288968003, 285745081, 283395499, 282438510, 280946315, 276856395, 269204934, 258088398, 245542175, 233392787, 222281059, 213513187, 207604080, 204655022, 204075008, 205232952, 207028802, 209859025, 211748984, 213247076, 214399898, 214155094, 212804203, 210316247, 206387569, 202146712, 197027078, 192287009, 188824104, 187391120, 188638472, 191495087, 194251660, 194379727, 191044263, 183434922, 173872956, 163680959, 154519004, 147004923, 141063703, 137307276, 135151970, 133807264, 132068548, 129761150, 126857561, 123749297]
1671A23749297k683903k383199k626920k386067k488239k653948k337414k601552
1663A03588055j853903j300053j411635j544711k282721l314739m549184n128465
1655H2202644n015210m737473m122373l387109k504306j396739j281863j491177
1647E8266394j198830q93204j008722q54480q21590r49911j459902k172881k912942
1638D5993932k681224k885896k843177k571575k202117j610119j733845j782622
1630B7683357j609354j107843p93509j150941j075417n80773n83147r36891o97743
1621A9147739n00310m34348n81795m04071q3527l44667n23001o13958k22723l00396
1611A5138943l11864n51099j07558j15920m34148o48712l21046j07272k53121
$$ y = [123749297, 121065394, 118682195, 116055275, 113669208, 111180969, 108527021, 106189607, 103588055, 101734152, 100434099, 99022464, 97477753, 95195032, 91880293, 87331109, 82202644, 77187434, 72449961, 68327588, 64940479, 62436173, 61039434, 59757571, 58266394, 57067564, 56174360, 55165638, 54311158, 53489568, 52539657, 51079755, 48906874, 45993932, 43312708, 40426812, 37583635, 35012060, 32809943, 31199824, 29465979, 27683357, 26074003, 24966160, 24172651, 23021710, 21946293, 21365520, 20782373, 19845482, 19147739, 18647429, 18213081, 17631286, 17227215, 17143688, 16799021, 16276020, 15662062, 15439339, 15138943, 14827079, 14275980, 14168422, 14052502, 13618354, 12969642, 12648596, 12541324, 12288203]
1602A2288203m42236n64512n02975l56271q5705k97913m14147r5779n17848o44157
1592H366660k08851l23065m291J68363j69487l85948j49908J23654J41334l9551
1582G518910k5214K36284j35754P3193J89712L62335k08094J71699k06800k23911
1572G752360j68327K1412j60601m83040l6518q1472n9314j19596l23111j69350
1562F172443q8460l2109Q2140l86350k09059o1513j15210O3759J57562k84051
1552E299152J25315J39223n3010l36298l70262J3347j46668m01755j03393j39944
1542D025707l258J69760L8728o1477j33069L35454j1985J29439n2525J0301J28310
1531D575385R5789J32286j42563J07093j487j24975j91314j26744q9428k65425
$$ y = [12288203, 11845967, 11281455, 10778480, 10422209, 10336504, 10038591, 9624444, 9528665, 9010817, 8366660, 8157809, 7834744, 7830453, 7998816, 7829329, 7443381, 7293473, 7417127, 7558461, 7518910, 7493696, 7729980, 7594226, 7667419, 7857131, 8219466, 8011372, 8183071, 7976271, 7752360, 7584033, 7605445, 7444844, 6961804, 6925286, 6843814, 6784500, 6664904, 6341793, 6172443, 6083983, 6051874, 6134014, 5747664, 5538605, 5477092, 5361882, 5425641, 5583203, 5299152, 5424467, 5563690, 5510680, 5174382, 4804120, 4817467, 4670799, 4269044, 4165651, 4025707, 4022449, 4192209, 4230937, 4169460, 4036391, 4371845, 4359860, 4489299, 4436774, 4447075, 4575385, 4671174, 4803460, 4660897, 4767990, 4766503, 4641528, 4450214, 4323470, 4234042, 3968617]
1521C968617M1530j21291J47206l9428j7494L37044q703L25798K05410J72672
1511E011361m264L10593K40866Q7337o1185k18482k3018K22312q768k06628k89313
1500E060811J14500R430j63207k13590k55508K1292R2550L19971K16131N9622
1490E262002p8339M05119P10118Q92111N62502J73920N90697N88861P64606N94510
1480A0466107P17522J174539K126032K960371N220781R429529J3656208J5564626
1472F1315715J2386927J479209q588707j0453069q987145q441192p938180o068472
1464B4705086m157377l455718k589354j741647j684971r05942q36667p13249m57786
1455H162375n34011l42175j61773p84315m92483j28145k23274J21164k16988k33830
$$ y = [3968617, 4010147, 3888856, 4036062, 3996634, 3979140, 4316184, 4307481, 4633279, 4838689, 5011361, 5007097, 5317690, 5558556, 5645893, 5584708, 5366226, 5343208, 5565520, 5556752, 5350124, 5060811, 5175311, 5184741, 5021534, 4807944, 4552436, 4573728, 4666278, 4986249, 5202380, 5262002, 5183663, 5588782, 6298900, 7191011, 7753513, 7927433, 8518130, 9106991, 9871597, 10466107, 11183629, 12358168, 14484200, 17444571, 22665352, 32094881, 45751089, 61315715, 73702642, 75181851, 66593144, 56140075, 47152930, 38711738, 30773558, 24705086, 20547709, 17091991, 14502637, 12760990, 11076019, 10170077, 9333410, 8620161, 8162375, 7628364, 7286189, 7124416, 6340101, 5847618, 5719473, 5496199, 5617363, 5400375, 5166545]
1445E166545q7325J71984K68122K46271J50207j6496K70371l1254k02677K2687
1435E958435l7506J48662l31752m30127j52521R4511L2455m64688k95308m9990
1425D472171J42220j51085m5827j27561r2786K1535L4699j61229o5659k54959
1415C771519j04844K66656K37681J8213m16004J05622k89734k58773J03485o4553
1405C369268o3707O3058q2675O0704k44332J03742L22856k96735R1330J60543
1395C484052p8171k7298J99690J05138j91894l2568j22045K533Q6414k98266J57689
1384C285274j37859k68777M3108k15410o1724m00j8797j74476j64969m841p1558
1373B209571J07474J1209Q4482j88552L11786J22584l44282j64349L6729j21296
$$ y = [5166545, 5079220, 5251204, 5519326, 5765597, 5915804, 5899308, 6169679, 6138425, 5935748, 5958435, 5920929, 6069591, 5737839, 5307712, 5155191, 5249702, 5282157, 4817469, 4522161, 4472171, 4614391, 4463306, 4417479, 4289918, 4197132, 4218667, 4253366, 4092137, 4026478, 3771519, 3666675, 3933331, 4171012, 4189225, 3773221, 3878843, 3589109, 3330336, 3433821, 3369268, 3305561, 3368619, 3285944, 3346648, 3102316, 3206058, 3528914, 3232179, 3323509, 3484052, 3405881, 3378583, 3578273, 3683411, 3491517, 3458949, 3336904, 3339437, 3425851, 3127585, 3285274, 3147415, 2878638, 2921746, 2706336, 2644612, 2644212, 2625415, 2450939, 2285970, 2281129, 2209571, 2317045, 2328254, 2412736, 2224184, 2535970, 2658554, 2314272, 2149923, 2186652, 2065356]
1363B065356k22047K91846j74160j43793J19205K59481J01780m49110p1537K67241
1353B044262o7680o5299K08534O7837K14175M9473k65487j12980P6768n02826
1343A646777K14260Q61j39847m18675J42150K34302j73145j90275j45083j56647
1333A014678n9504L29921j06153R8823K7407j7186K87605Q1588q4667N54065K28905
1322B355482q043O8582Q4389J76340L04674k82376k7965k79771J19247L35435
1312B845994O2032k69281j86151p0995k99838J32337J34242q6368J19817K10600
1302B592389K0586O7057q4440J30033J96095K12417L57693k2625N4404k2144J95132
1291C696597R9598Q7772K96713O2714J32019L34607Q2488k9798P6481j23296k67694
$$ y = [2065356, 1843309, 2135155, 1960995, 1817202, 1936407, 2195888, 2297668, 1848558, 1777021, 2044262, 1976582, 1911283, 2119817, 2187654, 2401829, 2451302, 2185815, 2072835, 2149603, 1646777, 1861037, 1861898, 1722051, 1303376, 1445526, 1679828, 1506683, 1316408, 1171325, 1014678, 955174, 1285095, 1178942, 1277765, 1305172, 1287986, 1575591, 1657179, 1572512, 2126577, 2355482, 2347439, 2416021, 2500410, 2676750, 2981424, 2699048, 2671083, 2391312, 2510559, 2845994, 2908026, 2638745, 2452594, 2381599, 2081761, 2214098, 2348340, 2261972, 2381789, 2592389, 2612975, 2680032, 2595592, 2725625, 2921720, 3134137, 3491830, 3469205, 3523609, 3501465, 3696597, 3796195, 3883967, 4180680, 4243394, 4375413, 4710020, 4792508, 4762710, 4839191, 4715895, 4448201]
1280D448201K2894M1207j45864J07418J08919k0573J69140J70570J90100J4500
1270E106512K08738K48962L79880L99069J79741M14149L36068M13794L77167J38076
1260H202156J68782J79050L72903N23037M50234Q4151l2442L01949j54065o7469
1250A0028286J49814L208J45446M39893J73185K25133J00180K18015M94722K80235
1240A2258117K77000L69429M41870O07286N43699P89366Q65847O93249M36195
1231A7282058O81078P77914O11572L20265Q11806N23808M54495Q01353N87552
1222B2851901M95096O00975N81059M57226O51757L27796M11934L89858O96633
1213B7464235O36810P77307J093169R95245J234267J662037J739232K074060J899219
$$ y = [4448201, 4471095, 4512302, 4366438, 4473856, 4582775, 4562202, 4731342, 4901912, 5092012, 5106512, 5315250, 5564212, 5944092, 6343161, 6522902, 6937051, 7273119, 7686913, 8064080, 8202156, 8370938, 8549988, 8922891, 9445928, 9896162, 9980313, 9947871, 10249820, 10095755, 10028286, 10178100, 10181308, 10326754, 10766647, 10939832, 11164965, 11265145, 11483160, 11977882, 12258117, 12535117, 12904546, 13346416, 13953702, 14497401, 15286767, 16152614, 16845863, 17282058, 17963136, 18741050, 19352622, 19672887, 20484693, 21008501, 21462996, 22264349, 22851901, 23346997, 23947972, 24529031, 24986257, 25638014, 25965810, 26377744, 26767602, 27464235, 28101045, 28878352, 29971521, 30966766, 32201033, 33863070, 35602302, 37676362, 39575581]
1204C9575581J509640J349351J217580J490985J424047J472086J530199J693089
1196E1262558J734932K638409L288362L638905M836014N979932O709450P405441
1188H7494003P968367Q206037P945436P580918O682313M949103K502824K75940
1180A33604941j537109l688096m814518n814237o151842o244444n372456m983234
1172I4999005m697295m478806m312038m499024m181641l898622l895802l842378
1164F1193399l629333l424860l320924l013568l025766k869218k774926k598184
1156C6536620k226478k008962j838390j474637j678900j736139j136610j033571
1148B3402933r86354r23376r20866j046257r98454q10271o12010o63823p35246
$$ y = [39575581, 41085221, 42434572, 43652152, 45143137, 46567184, 48039270, 49569469, 51262558, 52997490, 55635899, 58924261, 62563166, 67399180, 73379112, 80088562, 87494003, 95462370, 103668407, 111613843, 119194761, 125877074, 130826177, 133329001, 133604941, 132067832, 128379736, 123565218, 117750981, 111599139, 105354695, 99982239, 94999005, 90301710, 85822904, 81510866, 77011842, 72830201, 68931579, 65035777, 61193399, 57564066, 54139206, 50818282, 47804714, 44778948, 41909730, 39134804, 36536620, 34310142, 32301180, 30462790, 28988153, 27309253, 25573114, 24436504, 23402933, 22416579, 21493203, 20572337, 19526080, 18527626, 17717355, 17105345, 16441522, 15706276]
1139A5706276n03551q85873q29940o91287l10644m08359j66288j74000m20137
1130A1316197l20919M9773o6307o00157m17181k40404k33862j27731j70034m34213
1120H755162n18376l01367k45520q8423l04735l63417l97789k76225l43109m14417
1110E501784j65897j0950R1549N3532j50268k45178m28596j88575M8960k67235
1100D239126j0668n4029m5296K6430j64598n6082k39974J31613K46000J37790
1090D210312m00909j68793J92419o6986M58562N5108j00677k45362l1952L61897
1080D263619k3226n22172l53638j97718j96288o27867j45722J618k39894k85314
1070A673398k54477O0606j90435k22295L36196L20543j56232j44305M58382L76672
$$ y = [15706276, 15202725, 14316852, 13486912, 12795625, 12484981, 12076622, 11910334, 11736334, 11316197, 10995278, 11045051, 10978744, 10378587, 9961406, 9721002, 9487140, 9359409, 9189375, 8755162, 8236786, 7935419, 7689899, 7601476, 7296741, 6933324, 6535535, 6259310, 5916201, 5501784, 5335887, 5324937, 5416486, 5470018, 5319750, 5074572, 4645976, 4457401, 4506361, 4239126, 4228458, 4174429, 4129133, 4155563, 3990965, 3934883, 3694909, 3826522, 4072522, 4210312, 3809403, 3640610, 3833029, 3766043, 4224605, 4279713, 4179036, 3933674, 3901722, 4263619, 4240393, 3718221, 3364583, 3166865, 2970577, 2342710, 2196988, 2198606, 1958712, 1673398, 1418921, 1479527, 1289092, 1066797, 1402993, 1723536, 1567304, 1422999, 1881381, 2258053]
1060B258053j14430J20775k34528M93453J53174o6877j43190j37494k6554k45572
1050B056810k80886k83643J53841j774m8016k66808r966L3274k32268K36912L42255
1039A699731J26026j11349J14707P5530l8124J22849J37395J98297K28580L0080
1029B583722o9930K8274j81827j89237J77842j09687k55823R561k4381k41803
1019A726711k49938n2898R7099j97208J10773j62412j7120j76379l79666K00810
1009H99772R1625l18232J5886N270k37744L9881M5829N23643q4220j84141L31390
998A128959K12633l08425J74302p4710J05083J80Q4253R5336K09484r8502j41965
987A386628N2073j4182P08k0831J41282K31512K61507j23375J45534R7932L99790
$$ y = [2258053, 2143623, 2264398, 2029870, 2523323, 2676497, 2609620, 2466430, 2328936, 2302382, 2056810, 1775924, 1492281, 1646122, 1644348, 1596332, 1329524, 1319558, 1352832, 1120564, 1357476, 1699731, 1825757, 1714408, 1829115, 1904645, 1866521, 1989370, 2126765, 2325062, 2553642, 2583722, 2513792, 2542066, 2360239, 2171002, 2348844, 2239157, 1983334, 1992895, 1968514, 1726711, 1476773, 1423875, 1520974, 1323766, 1434539, 1272127, 1255007, 1078628, 698962, 899772, 991397, 673165, 689051, 694321, 456577, 496458, 542287, 1065930, 981710, 797569, 1128959, 1341592, 1033167, 1207469, 1132759, 1237842, 1238022, 1322275, 1417611, 1627095, 1528593, 1386628, 1438701, 1424519, 1425227, 1404396, 1545678, 1777190, 2038697, 1915322, 2060856, 2158788, 2558578]
976B558578K1642l50887K40972r6567j22754N4689m979Q323m17519l84074l6279
965A471145l99333m06648l4319l69099r2931j89863j47140N481O9112L26973K0351
954B53729K92616N35626M45555l0109L51619M74171L95159L01792k80887j24402
944B614869J37083L11562k17714l34699J93675o5089j41690K842m1823o3708j90548
933B204760K7932J15262j3448O1801J00650K63170r9647Q2641J75757K64333P6701
922C259912K49134j18466k54896J55295j59777j26835o3022K22430J55748o9793
912C249730q4803j37028J21207N72452M1042p2429J84932K66072K33691M16435
902D791301N6576P039K48790K36906j65417K12797O4275j00128L1452J34982J46147
$$ y = [2558578, 2580220, 2229333, 2470305, 2373738, 2250984, 2305673, 2300694, 2309017, 1891498, 1507424, 1471145, 1071812, 665164, 630845, 261746, 168815, -21048, -168188, -162707, -93595, 233378, 253729, 546345, 1081971, 1527526, 1497417, 1849036, 2323207, 2718366, 3020158, 2739271, 2614869, 2751952, 3063514, 2845800, 2511101, 2704776, 2639687, 2497997, 2500839, 2459016, 2395308, 2204760, 2232692, 2347954, 2334506, 2396307, 2496957, 2760127, 2660480, 2743121, 2918878, 3183211, 3259912, 3509046, 3390580, 3135684, 3290979, 3131202, 3004367, 2941345, 3163775, 3319523, 3249730, 3164927, 3027899, 3149106, 3721558, 3762600, 3690171, 3875103, 4141175, 4374866, 4791301, 4847877, 4854916, 5103706, 5340612, 5175195, 5387992, 5452267, 5352139, 5383591, 5518573, 5664720]
891E664720K52611L11223J46526L98572O11398K34281M63299J077128Q05335J112354
881A1077447J191817P28325R52698O34507R50782J076510Q33399J047408J383447
872A9876340J812353J990357K117592K186419K599890K598090K930888K773352
864C8885281J800090J054772N00187k06702j00252l76492j11550M8209J09345
855D1602888m312K48659P3210m3029J16587j8722K24131K92114L69830M16272
845D3277628Q15497R83393J791627K534475L973780N889443R354839J2385638
837H1006320J3770528J1139511M494775l158010p721429r718202r997250r028304
829G0787939q057144o529659n238790m181760l611498l171391k201492j574266
$$ y = [5664720, 5917331, 6228554, 6375080, 6773652, 7385050, 7619331, 8082630, 9159758, 9965093, 11077447, 12269264, 12997589, 13950287, 14584794, 15535576, 16612086, 17445485, 18492893, 19876340, 21688693, 23679050, 25796642, 27983061, 30582951, 33181041, 36111929, 38885281, 40685371, 41740143, 42240330, 42033628, 41933376, 41556884, 41445334, 41493543, 41602888, 41598576, 41847235, 41920445, 41877416, 41994003, 41975281, 42199412, 42491526, 42861356, 43277628, 44093125, 45076518, 46868145, 49402620, 53376400, 59265843, 68620682, 81006320, 94776848, 105916359, 110411134, 107253124, 99531695, 89813493, 79816243, 70787939, 62730795, 56201136, 50962346, 46780586, 43169088, 39997697, 37796205, 36221939]
821C6221939j918850j681911j127523j093310k44660K13645j87688J68554N54624
812C0904820R14368J178948J598000J932265K437481K003538J986676J313409
804D4269505l41778j605226k314426k785828k990265l077807k767883k358674
796B6027618k363724j967970j935002j647291j297114j174650j008719p81440
788A3851708r90199q90708n35996q08593m71490m47493l54867l69481o00714j44642
778H237525j1142o43332n17852j88960l12556k13604n40653m06241k76794o9186
768E057205j77631m17994m7595j40671q1569q0794J60647K85889m29820k26083
758C901584J10856k1413M7221j51870O8644j65818k68843j18647J27461k03414
$$ y = [36221939, 34303089, 32621178, 31493655, 30400345, 30155685, 30369330, 30181642, 30350196, 30904820, 31819188, 32998136, 34596136, 36528401, 38965882, 40969420, 42956096, 44269505, 43927727, 42322501, 40008075, 37222247, 34231982, 31154175, 28386292, 26027618, 23663894, 21695924, 19760922, 18113631, 16816517, 15641867, 14633148, 13851708, 12861509, 11970801, 11434805, 10626212, 10154722, 9707229, 9352362, 8982881, 8382167, 8237525, 8226383, 7583051, 7065199, 6876239, 6563683, 6350079, 5809426, 5403185, 5126391, 5057205, 4879574, 4461580, 4413985, 4273314, 4191745, 4110951, 4271598, 4557487, 4127667, 3901584, 4012440, 3991027, 4038248, 3886378, 3955022, 3789204, 3520361, 3401714, 3529175, 3325761]
748C325761m59321j30261J11194n15400l18564j32186k8308N58k31069J45124
738A767528K32231n4825j45172o3736K04094K41687J51990L1342J41076n2854
728B453361k9488j43970q6853p9838q0389j49916k44857k27667n3238K13623l13780
717A256988n08713m1701J84599j14152r4989L56141r1827k77100J74727j19424
707G24549K72270m235J69503K28465M4922j14864q0644n5844k92246j80038P199
696G19037r9416M908R7417K2497j28747J74634M651j48374k5692L34892K45231
685A201038m1239M8429L7617O9521l06875P2242j00470j91095q6426j64410k22831
674C15501k67392J73633k28710L1109P0996J78505J35202o1175p0547m686L43910
$$ y = [3325761, 2866440, 2736179, 2847373, 2331973, 2013409, 1881223, 1852915, 1853473, 1622404, 1767528, 1999759, 1944934, 1799762, 1736026, 1940120, 2181807, 2333797, 2365139, 2506215, 2453361, 2423873, 2279903, 2193050, 2113212, 2032823, 1882907, 1638050, 1410383, 1357145, 1570768, 1256988, 748275, 706574, 891173, 777021, 682032, 1038173, 946346, 669246, 843973, 724549, 996819, 992584, 1162087, 1390552, 1435474, 1320610, 1239966, 1184122, 891876, 711838, 719037, 619621, 624529, 721946, 744443, 615696, 790330, 794981, 646607, 620915, 955807, 1201038, 1159799, 1208228, 1245845, 1315366, 1008491, 1080733, 980263, 789168, 702742, 538332, 315501, 48109, 221742, -6968, 24141, 95137, 273642, 408844, 347669, 277122, 272436, 616346]
663F16346K92984K19566j11914K83365k1813j91074O8315k35007l27056j73666
653D20046O285k52592L3481j34880l96623j58791J16627j66434Q90q7895j55957
642g75843J64048J46997j35194J01023L62926K3209o7222J04547J74133K58858
632C57482O2020j10358J38204q2120m1453O4470N5426L1050k89083K37737K45657
621F69032L1423J60113k1739k01296p7678L29072Q2791k33731n2977K55900p4469
610H66441k35650J01274j55602k22257k10297k18286p5035j92058M5415J47026
600a49029j20010l4679l03506k28306J34877n0200l2427J46238K36795P9801J7154
589c03292r8105j70555Q2295R6410j19898J34513J90069Q8531j44837J10070K63373
$$ y = [616346, 909330, 1128896, 1016982, 1300347, 1278534, 1087460, 1155775, 920768, 593712, 420046, 426331, 173739, 207220, 72340, -324283, -483074, -366447, -532881, -531991, -619886, -775843, -611795, -464798, -599992, -498969, -136043, -112834, -180056, -75509, 98624, 357482, 419502, 309144, 447348, 365228, 323775, 388245, 443671, 474721, 185638, 423375, 669032, 700455, 860568, 838829, 637533, 559855, 888927, 971718, 737987, 685010, 940910, 866441, 630791, 732065, 576463, 354206, 143909, -74377, -149412, -341470, -296055, -149029, -269039, -303718, -607224, -835530, -700653, -750853, -783280, -637042, -400247, -320446, -303292, -401397, -571952, -489657, -393247, -513145, -378632, -188563, -100032, -244869, -134799, 128574]
578A28574j1781m82071R7570K40343K34625K77476M1667j82979J3209J36274J83486
567F76393k54756j78727L53158J7423k14892k53376j86949j58812K22290j5260
557F492R9179K2452m8215J13038M10836J83698O0882j9549j24639N7234o3335
546F98073J29814K7624k37699k8460J30688m93920j80209k08325o38474j60746
536i61634p5690L829r2625l3583q2592Q7787J70889M0917L5559J05867L10209
525d91067o6249K59994N1964M18516K59385R4118L5765l13954M3391Q5484j96000
514A81347j36387j74674j21143L4470N8472M5015R4781J29286K40306P3100o3954
503C60619n5145j13524k10581J22674J27987j18247k34691K473M6823o6996k20488
$$ y = [128574, 116793, -365278, -267708, -27365, 207260, 484736, 526403, 343424, 356633, 492907, 676393, 421637, 242910, 596068, 613491, 398599, 145223, -41726, -200538, 21752, 6492, 105671, 128123, 79908, 192946, 603782, 787480, 848362, 828813, 704174, 761408, 698073, 827887, 855511, 617812, 589352, 720040, 226120, 45911, -162414, -800888, -961634, -1037324, -1033495, -1126120, -1159703, -1242295, -1154508, -983619, -942702, -907143, -801276, -491067, -557316, -297322, -245358, 173158, 432543, 526661, 562426, 248472, 291863, 377347, 181347, 44960, -129714, -250857, -216387, -157915, -112900, -18119, 111167, 351473, 424573, 360619, 305474, 191950, -18631, 104043, 232030, 113783, -120908, -118435, -71612, -138608, -359096]
492c59096J82511n5837J50828p1180m4566p9139L2422K08717L4853j12298j97827
481c10612N7052j92080r8764j17571K20462l86122R1689j87510j20779k40299
471a284534p5018L82256K47216K97249K6491K47371Q2951J0748N33038j0828J77001
460F33941P7358M44921o511n8384k88441p9764j88635Q6207j74061l49438j50887
449e3694n85926k3678j58146p43337l04576k4508n6480J79541j88280M38469L72360
438a148255j84421K44828L58149L03808M38666K96344K84946M04276j90301j14482
428F93558J01683k62284j03406j50455P0609l57142m48543l6383K5583j15263
418e82043k6966o3938r1411J04355q6372o3901K9813O34217K81152o5680K24301
$$ y = [-359096, -176585, -232422, -81594, -152774, -197340, -276479, -244057, -35340, -487, -112785, -310612, -253560, -445640, -544404, -661975, -441513, -827635, -735946, -923456, -1044235, -1284534, -1359552, -977296, -730080, -432831, -406340, -158969, -76018, -65270, 467768, 456940, 633941, 711299, 1156220, 1149709, 1091325, 802884, 723120, 534485, 620692, 446631, 97193, -53694, -639620, -663298, -821444, -1564781, -1869357, -1893865, -1950345, -1770804, -1959084, -1520615, -1148255, -1332676, -1087848, -729699, -425891, 12775, 309119, 594065, 998341, 808040, 693558, 795241, 532957, 429551, 279096, 349705, -7437, -455980, -492363, -466780, -582043, -609009, -672947, -764358, -660003, -746375, -810276, -780463, -146246, 134906, 69226, 293527]
407B93527M04034L14306K739L70775j86884r2207J72041j07754m86896j23102
397E60579q694j14376k00989k47534j80618j05534q0245O0078l8701l8442j86316
386e80792j50461M26201L53156j22907M1780K45453J40040l1196M14145J46945
376H82364N3234J12424M40395O5244j47619J60864J34243p7719l48548l7695o1086
365A176101P1470l2290j03093k28708j8672l23664L6527l87145K9843K35208k71396
354A84181J17017K6313o6398J44670K45948L41721J35622r1965k76288j23646
344F37175M49513J60634l2409O1969p6495L9250K40285m21242k96313q8157k6386
333F47824k7421k21067j88328k33685P3127q6435n5151l10482M4981q1569k49056
$$ y = [293527, 697561, 1011867, 1014606, 1385381, 1198497, 1106290, 1278331, 1170577, 683681, 560579, 551885, 437509, 236520, -11014, -191632, -297166, -377411, -317333, -356034, -394476, -580792, -731253, -305052, 48104, -74803, -33023, 212430, 352470, 321274, 735419, 882364, 935598, 1048022, 1488417, 1553661, 1406042, 1566906, 1701149, 1623430, 1274882, 1237187, 1176101, 1247571, 1215281, 1112188, 883480, 864808, 541144, 577671, 190526, 220369, 455577, 184181, 301198, 327511, 261113, 405783, 651731, 993452, 1129074, 1037109, 760821, 637175, 1086688, 1247322, 1214913, 1276882, 1200387, 1239637, 1479922, 1058680, 762367, 674210, 647824, 620403, 399336, 211008, -22677, 50450, -35985, -91136, -401618, -356637, -438206, -687262]
322f87262K64499j38764J26047L92398j79735J98560N6051K3949L33060o259L256
311C85800L3709K16603J45385R6860m09471L08738J37730R4452K88266J66831
301A464903j80228k3484l75628J42772j09694k95292j10606l4018m4287O894J25504
290E66836k17225J24462n0492o0784K902J57594J04496K02250l66865l11362r1915
279E9897p0268P4139L75177k02952j51941m6233k87499K15998j3273p3628j8454
268a39037j83571K68437K79791o9654j66414L4235J06703j77835k4403m1720q7227
257b00695j13131J35983O245N4824J08943j48752O3686k43089L5973K66218L85521
246C51726l7723k5299J16635n6825J75706K19746L72532J83769l80086K14604
$$ y = [-687262, -422763, -561527, -435480, -43082, -222817, -24257, 31794, 55743, 388803, 382544, 385800, 419509, 636112, 781497, 878357, 468886, 777624, 915354, 1009806, 1298072, 1464903, 1284675, 1261191, 885563, 1028335, 918641, 623349, 512743, 478725, 434438, 441332, 566836, 349611, 474073, 423581, 362797, 365699, 523293, 627789, 830039, 463174, 151812, 59897, -10371, 63768, 438945, 235993, 84052, 37819, -249680, -33682, -46955, -120583, -139037, -322608, -54171, 225620, 155966, -10448, 23787, 130490, -47345, -71748, -113468, -200695, -313826, -177843, -171598, -116774, -7831, -156583, -92897, -335986, -300013, -33795, 351726, 314003, 288704, 405339, 348514, 524220, 743966, 1116498, 1300267, 920181, 1134785]
236A134785L41753m05644l96545K02507J13902j70699k75163j71289k55417J68531
226B86721n9155l22419j28809J38055Q3708N3498l3131m7437k59768K94458K68686
215B74407j58664o7522O0518M42538p7891j79717k1645k1208K50947L77316J0627
204H89706k6181p866O8716J09996Q1619l63129j58921J22535L01297l14587k42862
193D60323K55361j2026k9422o8287n9638l249m35023L02994J50533j90500K90539
182F61605N8716j69177j6279L38034J75388p0463j28062J04327r7770j22409Q3293
171H17203L5545P2919j42651j99841J49638l2149j7287j90656j95859J66763j29380
160C34245J10622M9750l9946l0361K38000j72658J04696L14660K3419k03418l29574
$$ y = [1134785, 1476538, 1070894, 674349, 876856, 990758, 820059, 544896, 373607, 118190, 286721, 227566, -94853, -223662, -85607, -1899, 51599, 18468, -28969, -288737, 5721, 274407, 115743, 48221, 108739, 551277, 473386, 293669, 272024, 250816, 501763, 879079, 889706, 863525, 855659, 924375, 1034371, 1115990, 752861, 593940, 716475, 1017772, 703185, 460323, 715684, 703658, 674236, 605949, 546311, 543062, 108039, 411033, 561566, 371066, 661605, 720321, 551144, 534865, 872899, 1048287, 977824, 849762, 954089, 856319, 733910, 817203, 852748, 925667, 783016, 583175, 732813, 700664, 683377, 492721, 296862, 463625, 334245, 444867, 494617, 454671, 424310, 662310, 489652, 594348, 909008, 932427, 729009, 399435]
149C99435M40416K00379k54095j76952j56108J03160N07409k6859l24392j09540
139F02853K18629J78177k56164k88169J38999J01330L24415m89939k19161p4180
129B36790L8325K42369n5051j7666J20666J11296l06902j25558k1583j66946j64571
118a08831j47243k02069r795J45013P7707O908k52538o7455J66842k643J04903
107b89201J21599J76858J47630r2892k79595j75038J01335M8590J59278P6667
97d769m10820j74780J09081l6371m452J46927m1436q8757k32976j35071j66040
86a039464O2282l5189L81808j61023K10353J22053J8600q6493o3167n2477Q3904
75e58813r4238n0786j27926p1756j22542l94217K6612K88016K93l42588J78412
$$ y = [399435, 839851, 1040230, 786135, 609183, 453075, 556235, 1063644, 1036785, 712393, 602853, 821482, 999659, 743495, 455326, 594325, 695655, 1020070, 530131, 310970, 236790, 275115, 517484, 462433, 444767, 565433, 676729, 369827, 244269, 222686, 55740, -108831, -256074, -458143, -467938, -322925, -245218, -238310, -490848, -558303, -391461, -394104, -289201, -167602, 9256, 156886, 63994, -215601, -390639, -289304, -240714, -81436, -4769, -415589, -590369, -481288, -517659, -522111, -375184, -416620, -505377, -738353, -873424, -1039464, -977182, -1012371, -630563, -791586, -581233, -459180, -440580, -527073, -590240, -642717, -558813, -653051, -703837, -831763, -903519, -1026061, -1420278, -1393666, -1105650, -1105357, -1447945, -1269533]
64a269533J17402j14321o6641K49214O7619K18920L48517L66114L42809L44040
54F04140P86256J133913J260537J325738M64452K50100K48167M86971Q17658J044952
44H422884J144100K407249L550854M973462Q589058J6289935K4025142K7906106
36I7308790K3418993L242004j4793983j8791061j9137188j6395411j2529354j0412350
28C1910440p956978n843600m506619l206136k053752j466319j015948n32054q30957
19D498077j253435r44905j026540r51946q19233m02830n05688m25810j64823k59770
9b256903j13077m70209k85238l25600j38636N5901k43190k76220l43615
0d396787
$$ y = [-1269533, -1152131, -1266452, -1333093, -1083879, -1016260, -797340, -448823, -82709, 260100, 604140, 1390396, 2524309, 3784846, 5110584, 5575036, 5825136, 6073303, 6560274, 7377932, 8422884, 9566984, 11974233, 15525087, 20498549, 29087607, 45377542, 69402684, 97308790, 120727783, 123969787, 109175804, 90384743, 71247555, 54852144, 42322790, 31910440, 23953462, 18109862, 13603243, 10397107, 8343355, 6877036, 5861088, 5329034, 4498077, 3244642, 2299737, 1273197, 321251, -497982, -900812, -1406500, -1832310, -1997133, -2256903, -2369980, -2840189, -3125427, -3451027, -3589663, -3533762, -3776952, -4053172, -4396787]
$$ Imaginary data points
##PAGE= N=2
##DATA TABLE= (X++(I..I)), XYDATA
16383b0536251M82218N07025N91586M41937L82961N07370N20197J99072L43639
16374a6560246O39245K98591K00680J62905J89234M75657L15733J13157J9358
16365a4145686P375Q6244Q7667J77972J73777L41716L91178Q9732K06957L01963
16355a2281105L33776J81783K10883M15297M50018J19383P5253L23859L5712J48292
16345i986849K18053P6179k22196m6908k7715K0921J71735J82086L16686K69632
16335i028376M95139L5033L2704K72051M63570L46828K88977K25558K86196J28730
16325f453590k4994O0679J30075m5658J32684j2928p1031R3269j07011J26795
16315f171710J28410j6157J83176O4062J3195K80645J75107K18854L46279L54990
$$ y = [-20536251, -20054033, -19547008, -18955422, -18513485, -18130524, -17623154, -17102957, -16903885, -16560246, -15921001, -15622410, -15421730, -15258825, -15069591, -14593934, -14278201, -14165044, -14145686, -14138311, -14052067, -13964400, -13786428, -13612651, -13270935, -12879757, -12790025, -12583068, -12281105, -11947329, -11765546, -11554663, -11139366, -10689348, -10569965, -10494712, -10170853, -10135141, -9986849, -9768796, -9692617, -9914813, -9961721, -9989436, -9968515, -9796780, -9614694, -9298008, -9028376, -8533237, -8498204, -8465500, -8193449, -7729879, -7383051, -7094074, -6868516, -6582320, -6453590, -6478584, -6417905, -6287830, -6333488, -6200804, -6213732, -6284763, -6191494, -6298505, -6171710, -6043300, -6059457, -5876281, -5812219, -5799024, -5518379, -5343272, -5124418, -4778139, -4423149]
16305d423149L58957P6095J86575J34178J79262P1524k04211j6202l4838p9591
16295c751400j71679n3843J36548m1644o4465j21466k55204K22991K91869L01337
16285c506956L33368L55005N22674N4868K12426K97518K02633J65837Q2127J52300
16275a128200P3141Q1559L67054j14610j82083q6337j00227j83710Q9255N2105
16265a132053k90659j31403J98065q8269l14119q8977M0115J40461N17116j5080
16255a164803j24296J51858J01975L20422K67994K42586J17980J53977K31277
16246B98970J90815J73518K11270K51609K43379j65258M9708l3521N0318r1169
16236A179639o4979K4483Q4592k32980j69245r8570Q047N5282r6548k40490j32539
$$ y = [-4423149, -4064192, -3988097, -3801522, -3667344, -3488082, -3416558, -3620769, -3636971, -3671809, -3751400, -3923079, -3976922, -3840374, -3882018, -3946483, -4067949, -4323153, -4100162, -3808293, -3506956, -3173588, -2818583, -2295909, -2241041, -2028615, -1731097, -1528464, -1362627, -1280500, -1128200, -1055059, -973500, -606446, -721056, -903139, -989476, -1089703, -1273413, -1184158, -1132053, -1422712, -1554115, -1356050, -1444319, -1758438, -1847415, -1807300, -1666839, -1149723, -1164803, -1289099, -1137241, -1035266, -714844, -446850, -204264, -86284, 67693, 298970, 489785, 663303, 874573, 1126182, 1369561, 1204303, 1254011, 1220490, 1270808, 1179639, 1114660, 1139143, 1223735, 990755, 821510, 722940, 730987, 786269, 689721, 449231, 316692]
16225C16692k6773K07139J26093l4543r1806M86033n6308j01622K33381J72653
16215A230939N4248L4647L70922J15868J10746K05797j67360r3895N3643q9362
16205A826193k5774Q4412J3161Q1301q0550R2696R7651J94811p1689O1594j9017
16194B254789j96508K25291K45180j67173m2623K6509L9733L49323k58145k33515
16184B242861J90768j44751r5597J24373J84267O1349M926K12915J16279j20214
16174B777176k77555K24748J75096k6177J18977K60588k48289j09579J23827K41628
16164C260440L64456J45692r4940R014l7609K07237J12253j83531l2531L922l748
16153C750655j855j89304Q7538m07097l50072q2690K0837l35615k66436j11256
$$ y = [316692, 289919, 497058, 623151, 588608, 496802, 982835, 926527, 824905, 1058286, 1230939, 1285187, 1319834, 1690756, 1806624, 1917370, 2123167, 1955807, 1861912, 1915555, 1826193, 1800419, 1884831, 1897992, 1979293, 1898743, 1991439, 2089090, 2283901, 2212212, 2273806, 2254789, 2058281, 2283572, 2528752, 2361579, 2318956, 2345465, 2385198, 2734521, 2476376, 2242861, 2433629, 2288878, 2193281, 2317654, 2501921, 2563270, 2568196, 2781111, 2897390, 2777176, 2499621, 2724369, 2899465, 2873288, 2992265, 3252853, 3004564, 2894985, 3018812, 3260440, 3624896, 3770588, 3675648, 3684662, 3647053, 3854290, 3966543, 3783012, 3750481, 3754403, 3750655, 3748800, 3559496, 3647034, 3239937, 2889865, 2807175, 2828012, 2492397, 2225961, 2114705]
16143B114705K47287K16604L4177M7908P720J23655K35053J06222L11608K36399
16133C681338l130k4633K26071N559J35263J71531k64668Q1413k86888k2001o1880
16122C637975l18251l7926J05550j8512j54303J63886J19640p9289L19548k3474
16112C714844K76436K48057N2633K1914K72563K45355n3977j67401m3504L04344
16102D871264k27242m39589l90125n378J17172j65479k31875n0466j92253l03126
16092B982903j47777j63334k8320K12325K14633K16490J73809K82035k4609J37292
16082C855447l5292L53941K99031j66390k9040j09032o0054p8843Q6746K85211
16072D401725J1796j04172l02442j27674J02965k27016q032l2572O7980L6345
$$ y = [2114705, 2361992, 2578596, 2612773, 2660681, 2668401, 2792056, 3027109, 3133331, 3444939, 3681338, 3678208, 3653575, 3879646, 3885205, 4020468, 4191999, 3927331, 4008744, 3721856, 3699855, 3637975, 3319724, 3281798, 3387348, 3368836, 3214533, 3378419, 3498059, 3418770, 3738318, 3714844, 3991280, 4239337, 4291970, 4313884, 4586447, 4831802, 4777825, 4610424, 4566920, 4871264, 4644022, 4204433, 3814308, 3808930, 3926102, 3760623, 3528748, 3478282, 3286029, 2982903, 2835126, 2671792, 2643472, 2855797, 3070430, 3286920, 3460729, 3742764, 3718155, 3855447, 3820155, 4174096, 4473127, 4306737, 4277697, 4168665, 4108611, 4029768, 4116514, 4401725, 4413521, 4309349, 4006907, 3879233, 3982198, 3755182, 3747150, 3714578, 3782558, 3818903]
16062C818903K37867k33172L08613j69028k12226J62139K7456l22762J83168L2847
16052C833805n4083J82935q8931K27691O9482o2630n8315o5985K70288J96575
16042D450832J17318n4801l58799R8183j82834N5183J62932j68169l0702n8224
$$ y = [3818903, 4056770, 3823598, 4132211, 3963183, 3750957, 3913096, 3940552, 3617790, 3800958, 3833805, 3779722, 3962657, 3873726, 4101417, 4170899, 4108269, 4049954, 3983969, 4254257, 4450832, 4568150, 4513349, 4154550, 4252733, 4069899, 4125082, 4288014, 4119845, 4089143, 4030919]
$$ [...]
##END NTUPLES=NMR SPECTRUM
##END=
