##TITLE=1H_DE-80H_X3
 200.13MHz, d2o
 8 sc
 
 19ns.26.2.2025
##JCAMPDX= 6.0         $$ Bruker NMR JCAMP-DX V2.0
##DATA TYPE= NMR SPECTRUM
##DATA CLASS= NTUPLES
##ORIGIN= UXNMR, Bruker Analytische Messtechnik GmbH
##OWNER= pz
$$ XWIN-NMR		Version 3.5
$$ Fri Apr  3 10:13:07 2026 Russian Standard Time (UT+4h)  Yarkov@DPX200
##.OBSERVE FREQUENCY= 200.1313
##.OBSERVE NUCLEUS= ^1H
##.ACQUISITION MODE= SIMULTANEOUS
##.ACQUISITION SCHEME= undefined
##.AVERAGES= 8
##.DIGITISER RES= 18
##SPECTROMETER/DATA SYSTEM= spect
##.PULSE SEQUENCE= zg30
##.SOLVENT NAME= CDCl3
##.SHIFT REFERENCE= (INTERNAL, CDCl3, 0, 15.4494)
##AUDIT TRAIL= $$ (NUMBER, WHEN, WHO, WHERE, WHAT)
$$ ##TITLE= Audit trail, XWIN-NMR		Version 3.5
$$ ##JCAMPDX= 5.01
$$ ##ORIGIN= Bruker BioSpin GmbH
$$ ##OWNER= Yarkov
$$ C:/Bruker/XWIN-NMR/data/yarkov2/nmr/H-C/1/pdata/1/auditp.txt
$$ ##AUDIT TRAIL=  $$ (NUMBER, WHEN, WHO, WHERE, WHAT)
(   1,<2026-04-03 10:12:15.48 +0400>,<Yarkov>,<DPX200>,
      <created by zg, POWCHK disabled, PULCHK disabled
       configuration hash MD5:
       00 E9 B6 7A A2 85 ED C7 34 08 36 98 17 FE 4E 26
       data hash MD5: 16K
       43 E8 71 EB 86 93 A9 06 4C 67 CD 01 E4 F6 B2 F1>)
(   2,<2026-04-03 10:12:21.46 +0400>,<Yarkov>,<DPX200>,
      <Start of raw data processing
       efp BC_mod = 2 LB = 0.25 FT_mod = 6 PKNL = 1 PHC0 = -5301.948 PHC1 = 6.821927 SI = 16K 
       data hash MD5: 16K
       08 16 CD 79 C4 D0 76 18 8B 65 3B 03 D1 B8 AB 03>)
$$ ##END=
$$ 
$$ hash MD5
$$ EC 36 17 D6 AA 36 DE DF 0B 67 C3 1F 69 92 17 C2
##$RELAX= 
##$RELAX= 
##$RELAX= 
##$RELAX= 
##$RELAX= 
##$RELAX= 
$$ Bruker specific parameters
$$ --------------------------
##$DU= <C:/Bruker/XWIN-NMR>
##$EXPNO= 1
##$NAME= <H-C>
##$PROCNO= 1
##$TYPE= <nmr>
##$USER= <yarkov2>
##$AMP= (0..31)
100 100 100 100 100 100 100 100 100 100 100 100 100 100 100 100 100 100 
100 100 100 100 100 100 100 100 100 100 100 100 100 100 
##$AQSEQ= 0
##$AQ_mod= 1
##$AUNM= <au_zg>
##$AUTOPOS= <>
##$BF1= 200.13
##$BF2= 200.13
##$BF3= 200.13
##$BF4= 200.13
##$BF5= 200.13
##$BF6= 200.13
##$BF7= 200.13
##$BF8= 200.13
##$BYTORDA= 1
##$CFDGTYP= 0
##$CFRGTYP= 5
##$CHEMSTR= <none>
##$CNST= (0..31)
1 1 145 1 1 1 1 1 1 1 1 1 1 1 1 1 1 1 1 1 1 1 1 1 1 1 1 1 1 1 1 1 
##$CPDPRG= <>
##$CPDPRG1= <>
##$CPDPRG2= <>
##$CPDPRG3= <>
##$CPDPRG4= <mlev>
##$CPDPRG5= <mlev>
##$CPDPRG6= <mlev>
##$CPDPRG7= <mlev>
##$CPDPRG8= <mlev>
##$CPDPRGB= <>
##$CPDPRGT= <>
##$D= (0..31)
0 0.7 0 0 0 0 0 0 0 0 0 0.03 0 0 0 0 0 0 0 0 0 0 0 0 0 0 0 0 0 0 0 0 
##$DATE= 1775196734
##$DBL= (0..7)
120 120 120 120 120 120 120 120 
##$DBP= (0..7)
150 150 150 150 150 150 150 150 
##$DBP07= 0
##$DBPNAM0= <>
##$DBPNAM1= <>
##$DBPNAM2= <>
##$DBPNAM3= <>
##$DBPNAM4= <>
##$DBPNAM5= <>
##$DBPNAM6= <>
##$DBPNAM7= <>
##$DBPOAL= (0..7)
0.5 0.5 0.5 0.5 0.5 0.5 0.5 0.5 
##$DBPOFFS= (0..7)
0 0 0 0 0 0 0 0 
##$DE= 6
##$DECBNUC= <off>
##$DECIM= 32
##$DECNUC= <off>
##$DECSTAT= 4
##$DIGMOD= 1
##$DIGTYP= 9
##$DL= (0..7)
0 120 120 120 120 120 120 120 
##$DP= (0..7)
$$ [...]
##$SUBNAM2= <"">
##$SUBNAM3= <"">
##$SUBNAM4= <"">
##$SUBNAM5= <"">
##$SUBNAM6= <"">
##$SUBNAM7= <"">
##$SUBNAM8= <"">
##$SUBNAM9= <"">
##$SW= 18.0517328524113
##$SWIBOX= (0..15)
0 0 2 0 0 0 0 0 0 0 0 0 0 0 0 0 
##$SW_h= 3612.71676300578
##$TD= 16384
##$TD0= 1
##$TE= 0
##$TE2= 300
##$TE3= 300
##$TEG= 300
##$TL= (0..7)
0 120 120 120 120 120 120 120 
##$TP= (0..7)
150 150 150 150 150 150 150 150 
##$TP07= 0
##$TPNAME0= <>
##$TPNAME1= <>
##$TPNAME2= <>
##$TPNAME3= <>
##$TPNAME4= <>
##$TPNAME5= <>
##$TPNAME6= <>
##$TPNAME7= <>
##$TPOAL= (0..7)
0.5 0.5 0.5 0.5 0.5 0.5 0.5 0.5 
##$TPOFFS= (0..7)
0 0 0 0 0 0 0 0 
##$TUNHIN= 0
##$TUNHOUT= 0
##$TUNXOUT= 0
##$USERA1= <user>
##$USERA2= <user>
##$USERA3= <user>
##$USERA4= <user>
##$USERA5= <user>
##$V9= 5
##$VALIST= <valist>
##$VCLIST= <CCCCCCCCCCCCCCC>
##$VD= 0
##$VDLIST= <DDDDDDDDDDDDDDD>
##$VPLIST= <PPPPPPPPPPPPPPP>
##$VTLIST= <TTTTTTTTTTTTTTT>
##$WBST= 1024
##$WBSW= 4
##$XGAIN= (0..3)
0 0 0 0 
##$XL= 0
##$YL= 0
##$YMAX_a= 187173
##$YMIN_a= -147171
##$ZGOPTNS= <>
##$ZL1= 120
##$ZL2= 120
##$ZL3= 120
##$ZL4= 120
##$ABSF1= 0
##$ABSF2= 0
##$ABSG= 0
##$ABSL= 0
##$ALPHA= 0
##$AQORDER= 0
##$ASSFAC= 0
##$ASSFACI= 0
##$ASSFACX= 0
##$ASSWID= 0
##$AUNMP= <proc_1d>
##$AZFE= 0.1
##$AZFW= 0.1
##$BCFW= 0
##$BC_mod= 2
##$BYTORDP= 0
##$COROFFS= 0
##$CY= -3
##$DATMOD= 1
##$DC= 0
##$DFILT= <>
##$DTYPP= 0
##$F1P= 0
##$F2P= 0
##$FCOR= 1
##$FTSIZE= 16384
##$FT_mod= 6
##$GAMMA= 0
##$GB= 0
##$INTBC= 1
##$INTSCL= 3.241238e-09
##$ISEN= 128
##$LB= 0.25
##$LEV0= 0
##$LPBIN= 0
##$MAXI= 10000
##$MC2= 0
##$MEAN= 0
##$ME_mod= 0
##$MI= 1.114404
##$NCOEF= 0
##$NC_proc= -8
##$NLEV= 6
##$NOISF1= 3.799351
##$NOISF2= 2.8
##$NSP= 0
##$NTH_PI= 0
##$NZP= 0
##$OFFSET= 15.4494
##$PC= 1
##$PHC0= -5301.948
##$PHC1= 6.821927
##$PH_mod= 1
##$PKNL= yes
##$PPARMOD= 0
##$PSCAL= 0
##$PSIGN= 0
##$REVERSE= no
##$SF= 200.13001446902
##$SI= 16384
##$SIGF1= 3
##$SIGF2= 2
##$SINO= 0.751879
##$SIOLD= 32768
##$SREGLST= <19F.Aceton>
##$SSB= 0
##$STSI= 16384
##$STSR= 0
##$SW_p= 3612.71676300578
##$SYMM= 0
##$S_DEV= 0
##$TDeff= 16384
##$TDoff= 0
##$TI= <>
##$TILT= no
##$TM1= 0
##$TM2= 0
##$TOPLEV= 0
##$USERP1= <user>
##$USERP2= <user>
##$USERP3= <user>
##$USERP4= <user>
##$USERP5= <user>
##$WDW= 1
##$XDIM= 16384
##$YMAX_p= 421964503
##$YMIN_p= -1965066
$$ End of Bruker specific parameters
$$ ---------------------------------
##NTUPLES= NMR SPECTRUM
##VAR_NAME=  FREQUENCY,     SPECTRUM/REAL,   SPECTRUM/IMAG
##SYMBOL=    X,             R,               I
##VAR_TYPE=  INDEPENDENT,   DEPENDENT,       DEPENDENT
##VAR_FORM=  AFFN,          ASDF,            ASDF
##VAR_DIM=   16384,         16384,           16384
##UNITS=     HZ,            ARBITRARY UNITS, ARBITRARY UNITS
##FACTOR=    0.220516191357247, 1,           1
##FIRST=     3091.88863515496, 0,            0
##LAST=      -520.828127850824, 0,           0
##MIN=       -520.828127850824, -1965066,    0
##MAX=       3091.88863515496, 421964503,    0
$$ Real data points
##PAGE= N=1
##DATA TABLE= (X++(R..R)), XYDATA
$$ [...]
7650i4985j08402k10346j91661J23479J13660L11719K35292k36059k35565P1306
$$ -94985 -203387 -413733 -605394 -481915 -368255 -56536 178756 -57303 -292868 -221562
7640b21562P9275J53942J89043j78342l43755L33687L6726j87832R5011l13481
$$ -221562 -142287 11655 200698 22356 -321399 12288 49014 -138818 -43807 -357288
7630c57288j8054L56514j1748R3734k67206l2590j53229q0410J42682j2832J58555
$$ -357288 -375342 -18828 -30576 63158 -204048 -236638 -389867 -470277 -327595 -340427 -181872
7619a81872j84502j3350M03586q776J19570K61650l49263N339O282j36900O3391
$$ -181872 -366374 -379724 23862 15086 134656 396306 47043 52382 58664 -78236 -14845
7608a4845k01220J39770o0763K6129l14068p6560J31667p2496k7788J22846j34698
$$ -14845 -216065 -76295 -137058 -110929 -424997 -501557 -369890 -442386 -470174 -347328 -482026
7597d82026J72316p1028j10694m1094K53710J9950n9650p1947k1982J22571k4277
$$ -482026 -309710 -380738 -491432 -532526 -278816 -258866 -318516 -390463 -412445 -289874 -314151
7586c14151j92929J13797K7295J22917J3760m2934M00339j72618k83508O9338
$$ -314151 -507080 -393283 -365988 -243071 -229311 -272245 128094 -44524 -328032 -258694
7576b58694J00367J95017j31521J15345r290o8129k3267j76630K37935o26646
$$ -258694 -158327 36690 -94831 20514 11224 -56905 -80172 -256802 -18867 -645513
7566f45513Q1564L46646k09575k1101K95792K70594k3965k44789J93986P1790
$$ -645513 -563949 -217303 -426878 -447979 -152187 118407 94442 -150347 43639 115429
7556A15429M8166l56209j42912l5366j48531L47775k04720l35597N03906J04290
$$ 115429 163595 -192614 -335526 -370892 -519423 -171648 -376368 -711965 -208059 -103769
7546a03769J35700k38332K9373J78083m3127J17229j56975K1515q9671j43641
$$ -103769 31931 -206401 -177028 1055 -42072 75157 -81818 -60303 -149974 -293615
7536b93615K46704R7371j55976L56011q1991k53684J7462J03974j26748j62756
$$ -293615 -46911 50460 -105516 250495 168504 -85180 -67718 36256 -90492 -253248
7526b53248P3659J5494j3644n1705j23572J50829r4971K52589n2396P9583J00171
$$ -253248 -179589 -164095 -177739 -229444 -353016 -202187 -297158 -44569 -96965 -17382 82789
7515H2789m3766j12257k00862r1623K56995k48483q4290J09036J08691j857k19230
$$ 82789 39023 -73234 -274096 -365719 -108724 -357207 -441497 -332461 -223770 -225627 -444857
7504d44857K30363L5839l9712o860J33055P4981p4908L0611M87750k06803k16983
$$ -444857 -214494 -178655 -218367 -225227 -92172 -17191 -92099 -61488 426262 219459 2476
7493B476j58886r9265j8844r7440J42797J87846q9645k05037R5348J38016o7122
$$ 2476 -156410 -255675 -274519 -371959 -229162 -41316 -130961 -335998 -240650 -102634 -169756
7482a69756J89712j46745n6391O8061m2994P3051J54478j79730j62319J02936
$$ -169756 19956 -126789 -183180 -115119 -158113 -85062 69416 -110314 -272633 -169697
7472a69697K36114j99840O853q2755j42191J00848J21687J19631J84900m9406
$$ -169697 66417 -133423 -126570 -209325 -351516 -250668 -128981 -9350 175550 126144
7462A26144m58262j47223K75806J70607j04014j77562r8480j13041J73695P6609
$$ 126144 -332118 -479341 -203535 -32928 -136942 -314504 -412984 -526025 -352330 -275721
7452b75721J69172p7911k07874J36638K9295J63557L3429j60554k01243J26796
$$ -275721 -106549 -184460 -392334 -255696 -226401 -62844 -29415 -189969 -391212 -264416
7442b64416K18113j47935l1967J33934N1664m4331l05497Q9805n6010k41381L99024
$$ -264416 -46303 -194238 -226205 -92271 -40607 -84938 -390435 -300630 -356640 -598021 -198997
7431a98997p549K3398j17188K73458K29535J4390m3234k00374M1614l16853K51434
$$ -198997 -206546 -183148 -300336 -26878 202657 217047 173813 -26561 15053 -301800 -50366
7420e0366J15262l61405L1688K02020K98330o0818p5208k26833j42447J9821K72362
$$ -50366 64896 -296509 -264821 -62801 235529 174711 99503 -127330 -269777 -249956 22406
7409B2406j45995J9528K7837O7477j5839l76134K91476k14729j0075N9794J98866
$$ 22406 -123589 -104061 -76224 -8747 -24586 -400720 -109244 -323973 -334048 -274254 -75388
7398g5388J85626n9657J53135O9829k27686m20139j74642J52707j29806J55347
$$ -75388 110238 50581 203716 273545 45859 -374280 -548922 -396215 -526021 -370674
7388c70674J28232j4632L08667O2110j20213R3859k34622N0122o2695M5561l6547
$$ -370674 -242442 -257074 51593 113703 -6510 87349 -147273 -97151 -159846 -114285 -150832
7377a50832r3691J90875k2029r0251J6632j19603l9877k58296K59935N5413R4158
$$ -150832 -244523 -53648 -75677 -165928 -149296 -268899 -308776 -567072 -307137 -251724 -157566
7366a57566k2056q8621j51894k9036l2817J7452N9150J5076J48594r7727K53741
$$ -157566 -179622 -268243 -420137 -449173 -481990 -464538 -405388 -390312 -241718 -339445 -85704
7355h5704K21103J803o6630j92242P2118k93980J71224Q8629K1919J83575l1106
$$ -85704 135399 137202 70572 -121670 -49552 -343532 -172308 -83679 -61760 121815 90709
7344I0709q7022J61466L6928J81248m12326l87553J06707J08494K87590j52756
$$ 90709 3687 165153 202081 383329 -28997 -416550 -309843 -201349 86241 -66515
7334f6515j16641N7806o3495N9428P6350j19725q6234l9154q8860J04119J24264
$$ -66515 -183156 -125350 -188845 -129417 -53067 -172792 -259026 -298180 -387040 -282921 -158657
7323a58657J40285J78601p2908n3657k09881R4758R3355O5573k54514j56067K94772
$$ -158657 -18372 160229 87321 33664 -176217 -81459 11896 77469 -177045 -333112 -38340
7312c8340M8942l57264R874K31340m5013M0325O4824K6740L8443q7026n5670J3214
$$ -38340 10602 -346662 -336788 -105448 -150461 -110136 -45312 -18572 19871 -67155 -122825 -109611
7300a09611J11242m33165Q2189K94817k4013k1081J44742l6273J52190j70945
$$ -109611 1631 -431534 -349345 -54528 -78541 -99622 45120 8847 161037 -9908
7290i908K8571k09278Q6846n7359k26858p8818K71516N27733K0411m74103k6934
$$ -9908 18663 -190615 -103769 -161128 -387986 -466804 -195288 332445 352856 -121247 -148181
7279a48181l3096r3479J43847j02253L60880K25304l76219k9610k55192q2950
$$ -148181 -181277 -274756 -130909 -233162 127718 353022 -23197 -52807 -307999 -390949
7269c90949J5173J56947l6202Q1226O1522k47874m5410J96972j23018n5824Q4438
$$ -390949 -375776 -218829 -255031 -173805 -112283 -360157 -405567 -208595 -331613 -387437 -302999
7258c02999j31261R1050J65104L95026j78762L096J31278j62171k16392J21794
$$ -302999 -434260 -343210 -178106 216920 38158 41254 172532 10361 -206031 -84237
7248h4237l434n513k3911N5189J4870k29294l0924K30763K08561j14965r0248
$$ -84237 -87671 -93184 -117095 -61906 -47036 -276330 -307254 -76491 132070 17105 -73143
7237g3143r7514j18925J06840K22741J01984R5049j82228k07212j79651J67912
$$ -73143 -170657 -289582 -182742 39999 141983 237032 54804 -152408 -332059 -164147
7227a64147J9266l6363J00291J43155j43745O7947K79169R1038j49936m32187
$$ -164147 -144881 -181244 -80953 62202 -81543 -13596 265573 356611 206675 -225512
7217b25512j18086j70281l5013J44166K86647j07080M865J87678J40999q8033
$$ -225512 -343598 -513879 -548892 -404726 -118079 -225159 -220294 -32616 108383 20350
7207B0350j93399q0722L72326j28163m8426k5496j02863l65003K45474J66944
$$ 20350 -173049 -253771 118555 -9608 -58034 -83530 -186393 -551396 -305922 -138978
7197a38978k3389L44614Q904m496j67268O0728j26711k50064R2476l5583J86117
$$ -138978 -162367 182247 191151 186655 19387 80115 -46596 -296660 -204184 -239767 -53650
7186e3650K68265p53J01221k46272k04990Q0443J71777L24120k7044n1283k2115
$$ -53650 214615 213862 315083 68811 -136179 -55736 116041 440161 413117 361834 339719
7175C39719J77962j44561l52620J13326K97089k67313N0118R2536P1203j39846
$$ 339719 517681 373120 20500 133826 430915 163602 213720 306256 377459 237613
7165B37613J58163j09610j75642K74829k593j62968j13035m489j2951j5307M0841
$$ 237613 395776 286166 110524 385353 382760 219792 106757 102268 89317 74010 114851
7154A14851K49429R5281K99157O13293R32330N00035R8936m79270n46163l36224
$$ 114851 364280 459561 758718 1372011 2304341 2804376 2903312 2424042 1877879 1541655
7144A541655m93731j20319k7480j53466Q0293k79081l08763j91584l6866K57612
$$ 1541655 1047924 927605 900125 746659 826952 547871 239108 47524 10658 268270
7134B68270k6282O4694l5751k99320K0363J26009q0087k92309J34950n7049j45034
$$ 268270 241988 306682 270931 -28389 -8026 117983 37896 -254413 -119463 -176512 -321546
7123c21546L20750j04446P8220K16078L036J73767j20332m13240J71953K0986
$$ -321546 -796 -105242 -27022 189056 192092 365859 245527 -167713 4240 25226
7113B5226k17322J31205k74708M98208j0065l42041K64888J25022j69268k21026
$$ 25226 -192096 -60891 -335599 162609 152544 -189497 75391 200413 31145 -189881
7103a89881J92875L47650r6624j68879J31034J08267j05545r5288J16699J28147
$$ -189881 2994 350644 254020 85141 216175 324442 218897 123609 240308 368455
7093C68455k10505j50976j04863j653J08622O2127Q2836j9669j19470J16497M2254
$$ 368455 157950 6974 -97889 -99542 9080 71207 154043 134374 14904 131401 173655
7082A73655L12771N2411J95096p6854k62738L91615l214j28441j66990n1300k32650
$$ 173655 486426 538837 733933 657079 394341 785956 782742 654301 487311 436011 203361
7071B03361j03573k21965M9527K23755R8468j57192J3187J16393j15401K5893
$$ 203361 99788 -122177 -72650 151105 249573 92381 105568 221961 106560 132453
7061A32453R5756j6503m87135j68375N38988J04050J59751K8202r2357j89762
$$ 132453 228209 211706 -275429 -443804 95184 199234 358985 387187 294830 105068
7051A05068k21236J36132O9114J99818j65694l46417R7622K52331p6801j3952
$$ 105068 -116168 19964 89078 288896 123202 -223215 -125593 126738 49937 35985
7041C5985k13062l3331L64350j40301k26342j51799K54336J35555l9188j10949
$$ 35985 -177077 -210408 153942 13641 -212701 -364500 -110164 25391 -13797 -124746
7031a24746J01811K33567j59418J10834k19669l03075J90808J57473j23765k23
$$ -124746 -22935 210632 51214 162048 -57621 -360696 -169888 -12415 -136180 -136403
7021a36403J08314M5645j40654K78379P6723l41042N1417M6828j06734K67645
$$ -136403 -28089 17556 -123098 155281 232004 -109038 -57621 -10793 -117527 150118
7011A50118k6872k05956N7751J3817q3081J5953O3830p8331o390J72495l11221
$$ 150118 123246 -82710 -24959 -11142 -94223 -78270 -14440 -92771 -99161 73334 -237887
7000b37887J01228k17215q5725j12799K58513J85432k10687L94612L6835k30338
$$ -237887 -136659 -353874 -439599 -552398 -293885 -108453 -319140 75472 112307 -118031
6990a18031k32056j17816p6015R1439l7282J94312J05987K09630Q2850L407k96625
$$ -118031 -350087 -467903 -543918 -452479 -489761 -295449 -189462 20168 103018 106425 -190200
6979a90200k9204R7348j17210p6354J3956q0363R3820K68860O972j0758P85J47317
$$ -190200 -219404 -122056 -239266 -315620 -301664 -382027 -288207 -19347 -12375 -23133 -22348 124969
6967A24969k05378L8292o7535j88078K50202j87864J25752j59611J96195p3867
$$ 124969 -80409 -42117 -109652 -297730 -47528 -235392 -109640 -269251 -73056 -146923
6957a46923J12134L55264j04455k24664k03354O3338k3360K0471j8154M5349k31311
$$ -146923 -34789 320475 216020 -8644 -211998 -148660 -172020 -151549 -169703 -124354 -355665
6946c55665n6574M18231j70690j6205J13995L81657l3247k69086Q9454k73847
$$ -355665 -412239 5992 -164698 -180903 -66908 314749 281502 12416 101870 -171977
6936a71977J61991o7726N9243k0575K6363N6631p3885L8218J7758L2641j67650
$$ -171977 -9986 -77712 -18469 -39044 -12681 43950 -29935 8283 26041 58682 -108968
6925a08968j77836J23278J56537l6029j73201R0689J61185k39408l3675L81305
$$ -108968 -286804 -163526 -6989 -43018 -216219 -125530 35655 -203753 -237428 143877
6915A43877l05299O4839L4266k69036K49331J43772J25337j56410j66495n5810
$$ 143877 -161422 -96583 -62317 -331353 -82022 61750 187087 30677 -135818 -191628
6905a91628j39785k452P8553O0096J11546j74938j27781L08291j66843J73492
$$ -191628 -331413 -333865 -255312 -195216 -83670 -258608 -386389 -78098 -244941 -71449
6895g1449R4288j70729L54462p9473N4808J6320K18670l32314j7181R1683j09684
$$ -71449 22839 -147890 206572 127099 181907 198227 416897 84583 67402 159085 49401
6884D9401o4173j37355j04812K09564K2942k02196j01416M4086K42335J8666J93702
$$ 49401 -14772 -152127 -256939 -47375 -24433 -226629 -328045 -283959 -41624 -22958 170744
6873A70744l03623Q5404R6916j24176j16209j17438L88657k38644K5799J82990
$$ 170744 -132879 -47475 49441 -74735 -190944 -308382 80275 -158369 -132570 50420
6863E0420m09884L68148l57276p5661J63843J09058Q165k063J37398P739j65465
$$ 50420 -359464 8684 -348592 -424253 -260410 -151352 -143187 -145250 -7852 -113 -165578
6852a65578M1059J26211J05568j61869N4978K37118k77654N6597J10256n7737
$$ -165578 -124519 1692 107260 -54609 369 237487 -40167 16430 126686 68949
6842F8949N5231j60593K88587j3319l26628o3784n6403K34400r1795N8485J00494
$$ 68949 124180 -36413 252174 238855 -87773 -151557 -207960 26440 -65355 -6870 93624
6831I3624j66626J08788m08393O5432J49819r7985Q2839k29424J7074P9859O3214
$$ 93624 -73002 35786 -372607 -307175 -157356 -255341 -172502 -401926 -384852 -304993 -241779
6820b41779k40623J75299L76271j99135k12540L08201j78328P2907m3895m7527
$$ -241779 -482402 -307103 69168 -129967 -342507 -34306 -212634 -139727 -183622 -231149
6810b31149K94257j49941K2211o3350k62206J68998m1760m6313j54132J39602
$$ -231149 63108 -86833 -64622 -127972 -390178 -221180 -262940 -309253 -463385 -323783
6800c23783N5725K14924K3626j22613J37733j4024j78049L47834P5670k58991
$$ -323783 -268058 -53134 -29508 -152121 -14388 -28412 -206461 141373 217043 -41948
6790d1948m28298o4380M35854j8126R9954m2241j88124j75326j40286M95047J19403
$$ -41948 -470246 -534626 -98772 -116898 -16944 -59185 -247309 -422635 -562921 -67874 51529
6779E1529l2462J89136l94065K15483K1705o1877m5678l96118L45212K51026k31924
$$ 51529 19067 208203 -185862 29621 51326 -10551 -56229 -452347 -107135 143891 -88033
6768h8033L5326o9193J24453o4922j02599K21600k64043K09106L744l3323J26613
$$ -88033 -52707 -121900 2553 -62369 -164968 56632 -207411 1695 5439 -27884 98729
6757I8729k57363K76284j42560p386k02899l7506L23591j19804o9050j19443J42117
$$ 98729 -158634 117650 -24910 -32296 -235195 -272701 50890 -68914 -137964 -257407 -115290
6746a15290R1549j94176Q901P4975J54639l069K232J06337j67369j77429L96340
$$ -115290 -23741 -217917 -209016 -134041 20598 17529 19761 126098 -41271 -218700 177640
6735A77640l26997M7192j25579J60697J69210k39268J69381k5091m25257K4228
$$ 177640 -149357 -102165 -227744 -67047 102163 -137105 32276 7185 -418072 -393844
6725c93844Q9250J15471J02396J158J08775j23750J47086j65566k1140O3390j46923
$$ -393844 -304594 -189123 -86727 -85569 23206 -100544 46542 -119024 -140164 -76774 -223697
6714b23697J65410K6678L26244K5573l14236k903L1161n3153O9769q7548K14819
$$ -223697 -58287 -31609 294635 320208 5972 3069 34230 -18923 50846 -36702 178117
6703A78117q8146j05798k1803k19150K19690k89184J18879J1112J84329R762k54048
$$ 178117 89971 -15827 -37630 -256780 -37090 -326274 -207395 -196283 -11954 -2192 -256240
6692b56240K1172p0131j00892K97321J5607M37692l69408o7609J5510M7855J18073
$$ -256240 -235068 -305199 -406091 -108770 -93163 344529 -24879 -92488 -76978 -29123 88950
6681H8950J63632L1440k1416j75747k20765J09303k32360K99690q5066K2985P6107
$$ 88950 252582 284022 262606 86859 -133906 -24603 -256963 42727 -42339 -19354 56753
6670E6753J50793Q3635j35984o6372k26123M26211o1986l29162O0444J52292J97250
$$ 56753 207546 291181 155197 88825 -137298 288913 226927 -102235 -41791 110501 307751
6659C07751L8806l5564N2993j90456J67j499N2593k2392Q9437L79908l70820j91312
$$ 307751 346557 310993 363986 173530 173697 172198 224791 202399 291836 671744 300924 109612
6647A09612N8670J63641K49885j02955n6733j29829j22030K33965k83701J16566
$$ 109612 168282 331923 581808 478853 422120 292291 170261 404226 120525 237091
6637B37091n9504k33973m6474J6920L18758L4703j05007K93087j01162L12875
$$ 237091 177587 -56386 -102860 -85940 232818 267521 162514 455601 354439 667314
6627F67314l44579J78958K77629k65598J7362j90142J55001Q5109m306J09232
$$ 667314 322735 501693 779322 513724 531086 340944 495945 581054 576748 685980
6617F85980j20311R3185N2326k01268L41196J17460j76454k61461J38510J91563
$$ 685980 565669 658854 711180 509912 851108 968568 792114 530653 669163 860726
6607H60726K5268L75417p1989j95559J23359J05952M02288R3471l2005N4099k15257
$$ 860726 885994 1261411 1189422 993863 1117222 1223174 1625462 1718933 1686928 1741027 1525770
6596A525770o5558J2724j08045p9584m39819M3397j85951J95835O64660j5967
$$ 1525770 1460212 1472936 1364891 1285307 845488 888885 702934 898769 1563429 1547462
6586A547462J06532J34404K4958n5876m54472K3438J37077j10850k77460k57340
$$ 1547462 1653994 1788398 1813356 1757480 1303008 1326446 1463523 1352673 1075213 817873
6576H17873N7780k30795m7282J42205j09267q3620j08419K9721k7353m929J60823
$$ 817873 875653 644858 597576 739781 630514 546894 438475 468196 440843 435914 596737
6565E96737q4915k52781j22775L83434K44793J954J31287K22594j01481k29621
$$ 596737 511822 259041 136266 519700 764493 766447 897734 1120328 1018847 789226
6555G89226j46874J58126J11615q9551K75357l2935P412q2796J08752L28723P4482
$$ 789226 642352 800478 912093 822542 1097899 1064964 1072376 989580 1098332 1427055 1501537
6544A501537q4850j35303l2651k735j65604J16158J67550K25236o6916J54874
$$ 1501537 1416687 1281384 1248733 1245998 1080394 1196552 1364102 1589338 1522422 1677296
6534A677296L61741m39980K21783J25953K35851J86707J44664M22563q8855k62707
$$ 1677296 2039037 1599057 1820840 1946793 2182644 2369351 2514015 2936578 2847723 2585016
6524B585016k34093n77154m1965O0502q8317m7234K65183N10080K0337P8649K20035
$$ 2585016 2350923 1773769 1731804 1792306 1703989 1656755 1921938 2432018 2452355 2531004 2751039
6513B751039J61030k8802l29829n27326j40703m05362m52119r1430N2494j59638
$$ 2751039 2912069 2883267 2553438 2026112 1885409 1480047 1027928 936498 988992 829354
6503H29354M2220k6710j79507K42318O2221Q8952R8925k65660k27743K6104N5211
$$ 829354 871574 844864 665357 907675 969896 1058848 1157773 892113 664370 690474 745685
6492G45685N8949l75394J89103m5461k37867J73119N9174j74435j0475J27102
$$ 745685 804634 429240 618343 572882 335015 508134 567308 392873 382398 509500
6482E09500M3533j43111P0792J92488N8864l1700j23505J33466K66725j06056
$$ 509500 553033 409922 480714 673202 732066 700366 576861 710327 977052 870996
6472H70996j60128j07357M2795k85926L29514J67314j66201J86935l4379N3182
$$ 870996 710868 603511 646306 360380 689894 857208 691007 877942 843563 896745
6462H96745r8704j1640N9630n6216m5425P4124j15858K26391O7993j32281r4548
$$ 896745 798041 786401 846031 789815 744390 818514 702656 929047 997040 864759 770211
6451G70211N6274j9668O7736l1597L0840L86219l63277l42837L57863o1J02634
$$ 770211 826485 806817 874553 842956 873796 1260015 896738 553901 911764 911703 1014337
6440A014337o4463K7245J24451K689J09533J3338n1103k11979k11731K47624O622
$$ 1014337 949874 977119 1101570 1104259 1213792 1227130 1176027 964048 752317 999941 1006563
6429A006563k24566j24134J10880N0648J27708O3924K50781j01146j25537j26015
$$ 1006563 781997 657863 768743 819391 947099 1011023 1261804 1160658 1035121 909106
6419I09106K45625K37430K2899P6106N6768J52170j07711O8093j32135L9806j86904
$$ 909106 1154731 1392161 1415060 1491166 1547934 1700104 1592393 1660486 1528351 1568157 1381253
6408A381253k17375J96581L27098K48433P5058j49267O4109K70859J17637K10141
$$ 1381253 1163878 1360459 1687557 1935990 2011048 1861781 1925890 2196749 2314386 2524527
6398B524527L2178J86886j05895l93482J10106j19360P548Q9278m0959K14540
$$ 2524527 2556705 2743591 2637696 2244214 2354320 2234960 2242508 2331786 2290827 2505367
6388B505367j35235o2525L8919J54957j9108n4583K2398Q5999J31804K37889J82792
$$ 2505367 2370132 2307607 2346526 2501483 2482375 2427792 2450190 2536189 2667993 2905882 3088674
6377C088674K22126L06361J89167l19168k60009K0103J29592q7113o2428K04607
$$ 3088674 3310800 3617161 3806328 3487160 3227151 3247254 3376846 3289733 3227305 3431912
6367C431912Q723k81009L789L05974L0940m283R8272L60911j28155M6049K11249
$$ 3431912 3440635 3159626 3163415 3469389 3500329 3496046 3594318 3955229 3827074 3873123 4084372
6356D084372m987P831K33012J1725J1859K36202L36107R1876r5839K74119R6455
$$ 4084372 4079385 4087216 4320228 4331953 4343812 4580014 4916121 5007997 4912158 5186277 5282732
6345E282732J90126J41124J88554N06630K98108J86658j02272K78434M17676O50839
$$ 5282732 5472858 5613982 5802536 6309166 6607274 6793932 6691660 6970094 7387770 8038609
6335H038609K91891M59329P00502O12886N18172Q78530J045618R80964O66994
$$ 8038609 8330500 8789829 9490331 10103217 10621389 11499919 12545537 13526501 14193495
6326A4193495Q45759J251100J449572J468684J779776K461097K939814L533419
$$ 14193495 15039254 16290354 17739926 19208610 20988386 23449483 26389297 29922716
6318B9922716N084763P262040J0662763J5122797J7917870J7047606J1243003
$$ 29922716 35007479 42269519 52932282 68055079 85972949 103020555 114263558
6311A14263558J104634p624221j3283689j3539940j1239032p874403m606323k428736
$$ 114263558 115368192 107743971 94460282 80920342 69681310 61806907 57200584 54771848
6303E4771848Q01905N007577R784840J3905363J6097785J3262286M714115n393330
$$ 54771848 55573753 60581330 70366170 84271533 100369318 113631604 118345719 112952389
6295A12952389j3524385j6388164j4972445j2293970r133605o822404m908030
$$ 112952389 99428004 83039840 68067395 55773425 46639820 39817416 34909386
6288C4909386m411304l895393l305651k364963j983488j510862j113987o60251
$$ 34909386 30498082 26602689 23297038 20932075 18948587 17437725 16323738 15663487
6280A5663487m28165k89911m56554k48302n14110k58351J20919K35261J45034
$$ 15663487 15235322 14945411 14488857 14240555 13726445 13468094 13589013 13824274 13969308
6271A3969308J72353L53143j34661K34290O35060M56339N89015L70283P53004
$$ 13969308 14141661 14494804 14360143 14594433 15229493 15685832 16274847 16645130 17398134
6262A7398134N64115J126866J289997J062759J177816J470618J330259J441658
$$ 17398134 17962249 19089115 20379112 21441871 22619687 24090305 25420564 26862222
6254B6862222K252899K561584L008225L050205L984688M910631O126964Q088227
$$ 26862222 29115121 31676705 34684930 37735135 41719823 46630454 52757418 60845645
6246F0845645J2244153J8654500K6284961L2479309L3008179K4833811Q137203
$$ 60845645 73089798 91744298 118029259 150508568 183516747 208350558 216487761
6239B16487761j0269625k2302101k5827107k2599441j6855646j1354702o081963
$$ 216487761 206218136 183916035 158088928 135489487 118633841 107279139 101197176
6232A01197176m64335O500963J4508666K3494942K8678369K5009385J2954332
$$ 101197176 100732841 107233804 121742470 145237412 173915781 198925166 211879498
6225B11879498m421843k0265768k8903547k9014066k4217180j9136306j4517130
$$ 211879498 207457655 187191887 158288340 129274274 105057094 85920788 71403658
6218G1403658j1304543r037797p501601o062345m908456m043185l321059k291987
$$ 71403658 60099115 51061318 43559717 37497372 32588916 28545731 25224672 22932685
6210B2932685j884964j632762j310434j141880j227011q06598o84596n68886p28693
$$ 22932685 21047721 19414959 18104525 16962645 15735634 14929036 14244440 13675554 12946861
6201A2946861l68510m05195k62891k85380n64319k06440k99645o40362k81588
$$ 12946861 12578351 12173156 11910265 11624885 11060566 10854126 10554481 9914119 9632531
6192I632531q5889m48327m66111l08140j72561j74975n2666m20978l46879l27607
$$ 9632531 9546642 9098315 8632204 8324064 8151503 7976528 7923862 7502884 7156005 6828398
6182F828398o0047j78666k3767k53589k16650J08943J53876q8518K1561k45256
$$ 6828398 6768351 6589685 6565918 6312329 6095679 6204622 6358498 6269980 6291541 6046285
6172F046285k25769q4279J2139n7509P6818J65589k33725j60372r4878P9745j11983
$$ 6046285 5820516 5736237 5748376 5690867 5767685 5933274 5699549 5539177 5444299 5524044 5412061
6161E412061j76040J02529k3902M26016j42520j37432O4141q4942n2643J81515
$$ 5412061 5236021 5338550 5314648 5740664 5598144 5460712 5524853 5439911 5387268 5568783
6151E568783j86463K3098J37825K85044N4132j15044K02129J44150R5530k8655
$$ 5568783 5382320 5405418 5543243 5828287 5882419 5767375 5969504 6113654 6209184 6180529
6141F180529J24623k06333l05774J35829m0073L05789N7642m3998K88473L23930
$$ 6180529 6305152 6098819 5793045 5928874 5888801 6194590 6252232 6208234 6496707 6820637
6131F820637K86168L9088r0183K45042L62295N2510Q9004K52658K71626K08489
$$ 6820637 7106805 7145893 7055710 7300752 7663047 7715557 7804561 8057219 8328845 8537334
6121H537334K68357J11554N14232K66626M43532M06625N22445P68785N39749N39127
$$ 8537334 8805691 8917245 9431477 9698103 10141635 10548260 11070705 11839490 12379239 12918366
6111A2918366Q38756J002106P36830P97415J176752J388746J217244J375832J938270
$$ 12918366 13757122 14759228 15496058 16293473 17470225 18858971 20076215 21452047 23390317
6102B3390317J673642K117681K580054K963954L576815M694925N600526P522824
$$ 23390317 25063959 27181640 29761694 32725648 36302463 40997388 46597914 54120738
6094E4120738J1155651J7014869K4811576L1228442L2740110K5098673Q488496
$$ 54120738 65276389 82291258 107102834 138331276 171071386 196170059 204658555
6087B04658555j0821312k3940187k7945672k4564659j8924860j4285819j0435999
$$ 204658555 193837243 169897056 141951384 117386725 98461865 84176046 73740047
6080G3740047p652613n785445l673327j825895o46110J235049L483284N974373
$$ 73740047 66087434 60301989 56628662 54802767 54156657 55391706 58874990 64849363
6072F4849363R551839J6014329K4268110L1804933L3446829K5227343P676116
$$ 64849363 74401202 90415531 114683641 146488574 179935403 205162746 212838862
6065B12838862j3019387k7408801l0875829k7354905k1460826j6741794j3057480
$$ 212838862 199819475 172410674 141534845 114179940 92719114 75977320 62919840
6058F2919840j0013278p920601o738629n245171m073739l011028k287785j926119
$$ 62919840 52906562 44985961 38247332 33002161 28928422 25917394 23629609 21703490
6050B1703490j327410j124663q08622p42335n00051n86895p57772j69794J83530
$$ 21703490 20376080 19251417 18442795 17700460 17200409 16613514 15855742 15685948 15869478
6041A5869478l04265K19208l898p6120L31695L8302M47605O00899M02948M08108
$$ 15869478 15565213 15784421 15780523 15704403 16036098 16074400 16522005 17122904 17525852 17933960
6031A7933960M11399P65884P57741J264931J704754J881951K391980K922069N048259
$$ 17933960 18345359 19111243 19868984 21133915 22838669 24720620 27112600 30034669 35082928
6022C5082928P238281J1523322J6337947J8161173J5694926P616145k782405j1833327
$$ 35082928 42321209 53844531 70182478 88343651 104038577 111654722 108872317 97038990
6014I7038990j5462514j4086209j1113401q118577n824388n005001l168758k206155
$$ 97038990 81576476 67490267 56376866 48258289 42433901 37428900 34260142 32053987
6006C2053987j538322n75762Q69911J319264K338567M470382P480768J1936902
$$ 32053987 30515665 29939903 30809814 32129078 34467645 38938027 46418795 58355697
5998E8355697J6069568J8449047J5995635P687674l543055j3406467j7296778
$$ 58355697 74425265 92874312 108869947 116557621 113014566 99608099 82311321
5991H2311321j5742698j2922470r526855p595799n697579m604653m055381l197023
$$ 82311321 66568623 53646153 44119298 36523499 30825920 26221267 22165886 18968863
5983A8968863k487347j831511j417226j115686r56354p28700o69738o92416l81486
$$ 18968863 16481516 14650005 13232779 12117093 11160739 10432039 9762301 9069885 8688399
5974H688399o5916n79323j48467k26381k37780j58o02810m65946k18111j42931
$$ 8688399 8622483 8043160 7894693 7668312 7430532 7430374 6827564 6361618 6143507 6000576
5964F000576j03522k82685j91029k38286m07869J50149l54995j20695J35135j04892
$$ 6000576 5897054 5614369 5423340 5185054 4777185 4927334 4572339 4451644 4586779 4481887
5954D481887j76058k00485p2540j145k38293j01191k07250k26716j85337K7001
$$ 4481887 4305829 4105344 4032804 4031659 3793366 3692175 3484925 3258209 3072872 3099873
5944C099873n5154j29187J16870k71521R9375J767j59925L63102J01661l04877
$$ 3099873 3044719 2915532 3032402 2760881 2860256 2862023 2702098 3065200 3166861 2861984
5934B861984k93973k9724M80114k10866L09309J75208j75797J43911n35752J71348
$$ 2861984 2568011 2538287 3018401 2807535 3116844 3292052 3116255 3260166 2724414 2895762
5924B895762L20633k58097k21991j33728J63102M2133j76893J78696j67234N8287
$$ 2895762 3216395 2958298 2736307 2602579 2765681 2807814 2630921 2809617 2642383 2700670
5914B700670J37871j40862J09128m32739j10845l41179k84955L9435k44784K23929
$$ 2700670 2838541 2697679 2806807 2374068 2263223 1922044 1637089 1676524 1431740 1655669
5904A655669l2153k68083o6942m9532K96532q5733M7057Q1773l55972n5394o4321
$$ 1655669 1623516 1355433 1288491 1238959 1535491 1449758 1496815 1578588 1222616 1167222 1102901
5893A102901r9634N2313l8035M7288k32869K99410R4588l69995L4026J8941j44740
$$ 1102901 1003267 1055580 1017545 1064833 831964 1131374 1225962 855967 889993 908934 764194
5882G64194N7058N9917l5176j8827J94911j93908M6342K23488j84399J11680m14935
$$ 764194 821252 881169 845993 827166 1022077 828169 874511 1097999 913600 1025280 610345
5871F10345K78847J11145j91959l32203J33855m877K77768J2631K4022j37519
$$ 610345 889192 1000337 808378 476175 610030 605153 882921 895552 919574 782055
5861G82055l73482K23470J25261K61582k45520J04208M3695j43075j25168P5900
$$ 782055 408573 632043 757304 1018886 773366 877574 921269 778194 653026 728926
5851G28926j37246p7984J44589o5755j00009p3589q4055L8697J12149N2944o5490
$$ 728926 591680 513696 658285 592530 492521 418932 334877 373574 485723 538667 473177
5840D73177k63386J42552j75417j02921M8313O7072K06287J56401k95392j9018
$$ 473177 209791 352343 176926 74005 122318 189390 395677 552078 256686 237668
5830B37668n6204M307m5428K6004J76566k86266K88607K3763k53480k02623N4392
$$ 237668 181464 185771 140343 166347 342913 56647 345254 369017 115537 -87086 -32694
5819c2694L6314O3173L0716J91689J64024j68502j425j82504J85411J64502K6586
$$ -32694 3620 66793 97509 289198 453222 284720 283295 100791 286202 450704 477290
5808D77290n0621j27546J30467L1587K968j98451O6940R6006J67456J44666p3256
$$ 477290 426669 299123 429590 461177 464145 265694 332634 428640 596096 740762 667506
5797F67506j14676L42089q9417k21865j620k0847M4582j97653L6822m8290k221
$$ 667506 552830 894919 805502 583637 582017 561170 605752 408099 444921 396631 394410
5786C94410M7190K71001k78222r1045K69678J17695J34258r9235L52715k2881
$$ 394410 441600 712601 434379 343334 613012 730707 864965 765730 1118445 1095564
5776A095564N8761O0753J94324l00608n179Q7504m12623j73587j65815r2468J26243
$$ 1095564 1154325 1215078 1409402 1108794 1103615 1191119 778496 604909 439094 346626 472869
5765D72869J98598J90091J61654p9153Q5445k35411K1862M70301j6597k2439l1846
$$ 472869 671467 861558 1023212 944059 1029504 794093 815955 1286256 1269659 1247220 1215374
5754A215374n1958K75454q8486l39229m42703j32217J67254J12145q2069j28678
$$ 1215374 1163416 1438870 1350384 1011155 568452 436235 603489 715634 633565 504887
5744E04887m7802p1242J14911j66728j24059L86150p9881j69919J56027j95745
$$ 504887 457085 385843 500754 334026 209967 596117 516236 346317 502344 306599
5734C06599p1706n0875k8886K76900L6010k8123j20802N9748K59495k66164L6030
$$ 306599 234893 184018 155132 432032 468042 439919 319117 378865 638360 372196 408226
5723D08226J69868j14442j63512K60570J84049j42487p4693m35955K1833J22660
$$ 408226 578094 463652 300140 560710 744759 602272 527579 91624 113457 236117
5713B36117L09857R2134j06804N6146j25165N4579K05229P6707R9471L63504j50998
$$ 236117 545974 638108 531304 587450 462285 516864 722093 798800 898271 1261775 1110777
5702A110777M1020k78498m4617j6761m68020O3343l8663N7174K05839P9944k22543
$$ 1110777 1151797 873299 828682 811921 343901 407244 368581 425755 631594 711538 488995
5691D88995j25189O9283K38570J3459R885M7897J78265n3389J71865N4378l8163
$$ 488995 363806 433089 671659 685118 695003 742900 921165 867776 1039641 1094019 1055856
5680A055856p1942r1446k41684K99986K28055l32019j47918J2784j4566J19927
$$ 1055856 983914 892468 650784 950770 1178825 846806 698888 711672 697106 817033
5670H17033j00116m689M1721J13133o1037J00740q7410r5965N04563j60609m757
$$ 817033 716917 712228 753949 867082 806045 906785 819375 723410 1227973 1067364 1062607
5659A062607q0177j02638j30962N5532K90899o7933j01004J364k40228K40747
$$ 1062607 982430 879792 748830 804362 1095261 1027328 926324 927688 687460 928207
5649I28207l944M58146N4862l73334J0475J53053L12673j17298k00632j79206
$$ 928207 924263 1382409 1437271 1063937 1074412 1227465 1540138 1422840 1222208 1043002
5639A043002j034P9994J12595m6517p8194j07124J1381k6232Q3485K74871k67883
$$ 1043002 1041968 1121962 1234557 1188040 1109846 1002722 1014103 987871 1071356 1346227 1078344
5628A078344k10181j23526M22521K57029k64378l38062J24557O3534k97213O9887
$$ 1078344 868163 744637 1167158 1424187 1159809 821747 946304 1009838 712625 782512
5618G82512n1725j88892r1439j18199L89K16723j0166L00509K8414k08133j51083
$$ 782512 730787 541895 450456 332257 332646 549369 539203 839712 868126 659993 508910
5607E08910J11556m9908O718k09833L0284m9982J82063J65341k07375P309j09966
$$ 508910 620466 570558 577276 367443 397727 347745 529808 695149 487774 495083 385117
5596C85117j72730J06272J00278N5361K20122k66296J09721L340j55479J7098
$$ 385117 212387 318659 418937 474298 694420 428124 537845 541185 385706 402804
5586D02804m2163l00116J63302J58160k23944L10165k14228N9J57768K6926J07604
$$ 402804 360641 60525 223827 381987 158043 468208 253980 254039 411807 438733 546337
5575E46337j16116J12901p7341j2295L9152O5301J47400J28646k60516j43339
$$ 546337 430221 543122 465781 453486 492638 557939 705339 833985 573469 430130
5565D30130J45494L3803k92819J10548O2486k32079o7288L73898j36540J66456
$$ 430130 575624 609427 316608 427156 489642 257563 190275 564173 427633 594089
5555E94089n0020k00334P9536J09928K02730k9462j41532p704m6050J32280k77559
$$ 594089 544069 343735 423271 533199 735929 706467 564935 557231 511181 643461 365902
5544C65902J39633l7252J2193M7311L8530K8188q1996j8828r225m8160N043K15698
$$ 365902 505535 468283 480476 527787 566317 594505 512509 493681 484456 436296 441339 657037
5532F57037l25961J05922K74543P0467j79838K7753J86814j90667k30740J22790
$$ 657037 331076 436998 711541 782008 602170 629923 816737 626070 395330 518120
5522E18120J61141K82761r2276j84306K70894j61051n98539J64961M21780R1460
$$ 518120 679261 962022 869746 685440 956334 795283 196744 361705 783485 874945
5512H74945k19653j16762J9798K27234l54043L56505L3048n2877j25450n0390
$$ 874945 655292 538530 558328 785562 431519 788024 821072 768195 642745 592355
5502E92355K52351J49829l39980J30981K73400k42606p6399l21295L8363L2106
$$ 592355 844706 994535 654555 785536 1058936 816330 739931 418636 456999 489105
5492D89105j0042J67869J1966J56407o2776P5232M1608j45519P2738O0949j17608
$$ 489105 479063 646932 658898 815305 752529 827761 869369 723850 796588 857537 739929
5481G39929k83774J39319J90800J49344K6848n7455p2027q3032k68586J31178
$$ 739929 456155 595474 786274 935618 962466 905011 832984 749952 481366 612544
5471F12544M5983J11224R5270K45831j53171k11943P6147k25973J0471j43531
$$ 612544 658527 769751 865021 1110852 957681 745738 821885 595912 606383 462852
5461D62852K1970K50320K08193j75037m223j8137J29614k00611j99225O1351M57778
$$ 462852 484822 735142 943335 768298 764075 745938 875552 674941 475716 537067 994845
5450I94845J74148K595n0396O7463R0888j35609j54422j20409J26746q6962o7215
$$ 994845 1168993 1171588 1121192 1188655 1279543 1143934 989512 869103 995849 908887 841672
5439H41672L25769J35665N3746j10211l12159P7524K23748j06167J59079K70034
$$ 841672 1167441 1303106 1356852 1246641 934482 1012006 1235754 1129587 1288666 1558700
5429A558700n3752P4883q1640k4208j29960L77180q3492k45800J00657J71563
$$ 1558700 1504948 1579831 1498191 1473983 1344023 1721203 1637711 1391911 1492568 1664131
5419A664131J05234j77231R3149L2131M8603J16167r3803p9284j4P7863J04234
$$ 1664131 1769365 1592134 1685283 1717414 1766017 1882184 1788381 1709097 1709083 1786946 1891180
5408A891180J01302q3166j8145J83084K01945j07256K11334J1296j77045N9238
$$ 1891180 1992482 1909316 1891171 2074255 2276200 2168944 2380278 2391574 2214529 2273767
5398B273767j45467K23682L6766Q4472j6874M16335K05785k09251K01671j2134
$$ 2273767 2128300 2351982 2388748 2473220 2456346 2872681 3078466 2869215 3070886 3058752
5388C058752J69606J29535j82675m97r1739r509K63264j15614J50765p969j95660
$$ 3058752 3228358 3357893 3175218 3174721 3082982 3073473 3336737 3221123 3371888 3363919 3168259
5377C168259N2788K6295P8098M97224J34240J096k33180J43489l20538N601J17422
$$ 3168259 3221047 3247342 3325440 3822664 3956904 3958000 3724820 3868309 3547771 3553372 3670794
5366C670794L7398N2497j18286q4967k5327K22076o7914l36601j42618J26248
$$ 3670794 3708192 3760689 3642403 3557436 3532109 3754185 3686271 3349670 3207052 3333300
5356C333300L35164k32499k11764J27316Q1888j3827P2064K8094K34598l45222
$$ 3333300 3668464 3435965 3224201 3351517 3433405 3419578 3491642 3519736 3754334 3409112
5346C409112n0922K84328l30620O8206J77766j12025M1384J55706L14931J87611
$$ 3409112 3358190 3642518 3311898 3380104 3557870 3445845 3487229 3642935 3957866 4145477
5336D145477p7869j81922P4553q2309j97462K69813L03407L548o1784M999J0709
$$ 4145477 4067608 3885686 3960239 3877930 3680468 3950281 4253688 4257236 4195452 4200451 4211160
5325D211160J53698K55923q4336n6341Q6831j48086L46510K63553j41121J25293
$$ 4211160 4364858 4620781 4536445 4480104 4566935 4418849 4765359 5028912 4887791 5013084
5315E013084L36257L2017O1966J48010K46119M6474L46274J69412J77624K38378
$$ 5013084 5349341 5381358 5443324 5591334 5837453 5883927 6230201 6399613 6577237 6815615
5305F815615K61048M09650J28089K47039L35547J50094N84918L92316N45697M59004
$$ 6815615 7076663 7486313 7614402 7861441 8196988 8347082 8932000 9324316 9870013 10329017
5295A0329017M29559M74215Q15268O27639P68858P69201R93476R02544J444774
$$ 10329017 10758576 11232791 12048059 12675698 13444556 14213757 15207233 16109777 17554551
5286A7554551K079369K371029L116990M754618O550548Q256964P352080M264246
$$ 17554551 19633920 22004949 25121939 29876557 36427105 44684069 52036149 56300395
5278E6300395l9613l611094l953290k690184r51617Q44375K697829N711596Q780479
$$ 56300395 56260782 52649688 48696398 46006214 45054597 45898972 48596801 54308397 63088876
5269F3088876J1852489J2035302J1425881P806058M856607M250845J556199L70265
$$ 63088876 74941365 86976667 98402548 106208606 111065213 115316058 116872257 117242522
5261A17242522N05491j238008j389444J93150J107565l6324L26583L152217N188649
$$ 117242522 117748013 116510005 115120561 115313711 116421276 116384952 116711535 119863752 125052401
5252A25052401N341142L663059N446316P602737O794948N945458K728967l100025
$$ 125052401 130393543 134056602 139502918 147105655 153900603 159846061 162575028 159475003
5244A59475003o799791p324018n246164l987457l508144l344480n072725m859924
$$ 159475003 152675212 145351194 140105030 136117573 132609429 129264949 124192224 119332300
5236A19332300k271252j124395j919886l061348r41312J083132J957580O88301
$$ 119332300 117061048 115936653 114016767 110955419 110014107 111097239 113054819 113743120
5228A13743120P04528N4471m346877q065791j0594682j3296384j2285843r562790
$$ 113743120 114447648 114502119 110155242 102089451 91494769 78198385 65912542 56349752
5220E6349752o868454m636610k258056j06516K491371M308784M264274J797075
$$ 56349752 49481298 44844688 42586632 42480116 44971487 49280271 53544545 55341620
5212E5341620k550862o905328p662347o120142m818009l586912k793386k561486
$$ 55341620 52790758 45885430 38223083 32102941 27284932 23698020 20904634 18343148
5204A8343148j887732j671740j180046j381400p78933m94494m65627n73071l97147
$$ 18343148 16455416 14783676 13603630 12222230 11443297 10948803 10483176 9910105 9512958
5195I512958j05692k16184m31117m92167n48961k6286k32592n14635j2152l07433
$$ 9512958 9407266 9191082 8759965 8267798 7718837 7692551 7459959 6945324 6933172 6625739
5185F625739J56793j16997j56978m16637j85642K0215j44718j08511m33360P5783
$$ 6625739 6782532 6665535 6508557 6091920 5906278 5926493 5781775 5673264 5239904 5315687
5175E315687r4601r5312p4945l58799j81624K3651Q245r7641J39613l63950j03234
$$ 5315687 5221086 5125774 5050829 4692030 4510406 4534057 4542302 4444661 4584274 4220324 4117090
5164D117090r9881J36417n01663k64205J02754N497j12972r4117j14408J71453
$$ 4117090 4017209 4153626 3651963 3387758 3490512 3496009 3383037 3288920 3174512 3345965
5154C345965J7658R4800m0385j82379K95605k40780K7149j23338j95903J25661
$$ 3345965 3363623 3458423 3418038 3235659 3531264 3290484 3317633 3194295 2998392 3124053
5144C124053l25393L46183q9985p3629q1459J40597J58064N8327p2368l59854
$$ 3124053 2798660 3144843 3054858 2981229 2899770 3040367 3198431 3256758 3184390 2824536
5134B824536j73893K16984K54015J30650q6145j31729K98740k80319P4717J29842
$$ 2824536 2650643 2867627 3121642 3252292 3166147 3034418 3333158 3052839 3127556 3257398
5124C257398J2437M64844l0715j63576j11089n0632J2406j10082j13928K8621
$$ 3257398 3269835 3734679 3703964 3540388 3429299 3378667 3391073 3280991 3167063 3195684
5114C195684N9833j49678J9923K5322n896J16117M0589j39314J48832J60650J22512
$$ 3195684 3255517 3105839 3125762 3151084 3145188 3261305 3301894 3162580 3311412 3472062 3594574
5103C594574j1600j26496K69326Q2602J06245k04520J80419K06742k64717j08752
$$ 3594574 3582974 3456478 3725804 3808406 3914651 3710131 3890550 4097292 3832575 3723823
5093C723823l89121Q3511M97428J53052j87281J33119j26314q4419k46385n8568
$$ 3723823 3334702 3418213 3915641 4068693 3881412 4014531 3888217 3803798 3557413 3498845
5083C498845L53053J09952o2300k33209J35034j71589K8214J01495K44044K36988
$$ 3498845 3851898 3961850 3899550 3666341 3801375 3629786 3658000 3759495 4003539 4240527
5073D240527j94641j28483L87471K3820j9948p0674M2776M4448m29748L86568
$$ 4240527 4045886 3917403 4304874 4328694 4308746 4238072 4280848 4325296 3895548 4282116
5063D282116Q0537k40328j8250K1781L07833K03393M6423K52352k20277L93975
$$ 4282116 4362653 4122325 4104075 4125856 4433689 4637082 4683505 4935857 4715580 5109555
5053E109555M7589j66290k18263k19320L0005k62377N0851j02209N7467J08455
$$ 5109555 5157144 4990854 4772591 4553271 4583276 4320899 4371750 4269541 4327008 4435463
5043D435463l73201j52671J1982K22240K54525j54744k6440k91948j73394J11039
$$ 4435463 4062262 3909591 3921573 4143813 4398338 4243594 4217154 3925206 3751812 3862851
5033C862851J60075J26730k54818j30588M16988Q8346K4235N3061L7071K03589
$$ 3862851 4022926 4149656 3894838 3764250 4181238 4269584 4293819 4346880 4383951 4587540
5023D587540j71206o0840k44063K7357J16141k32771J21413q1373J60832L50349
$$ 4587540 4416334 4355494 4111431 4138788 4254929 4022158 4143571 4062198 4223030 4573379
5013D573379j62873L029P9227l4301J38989j07837l5551p5951L60816p1176k89261
$$ 4573379 4410506 4413535 4492762 4458461 4597450 4489613 4454062 4378111 4738927 4667751 4378490
5002D378490K20792p3834N8231P0073K50643N1852k65530k6872K49690k3644j02757
$$ 4378490 4599282 4525448 4583679 4653752 4904395 4956247 4690717 4663845 4913535 4889891 4787134
4991D787134Q4420J48990K40757K17874J1542k32568K35348K01467J64745j6822
$$ 4787134 4871554 5020544 5261301 5479175 5490717 5258149 5493497 5694964 5859709 5842887
4981E842887j12505K96877r1359K34381P694J76810J3664J11730N06746L05846
$$ 5842887 5730382 6027259 5935900 6170281 6177975 6354785 6368449 6480179 6986925 7292771
4971G292771J88091O3229l20308j3351R6685K40012L25334j39517L81160l44847
$$ 7292771 7480862 7544091 7223783 7210432 7307117 7547129 7872463 7732946 8114106 7769259
4961G769259q6989M59152K38182L49257N7154R8438L36515k0589N37675J63447
$$ 7769259 7682270 8141422 8379604 8728861 8786015 8884453 9220968 9200379 9738054 9901501
4951I901501J69179j38487k73575K66261K44688J94939p5888K6079k6099R3859
$$ 9901501 10070680 9932193 9658618 9924879 10169567 10364506 10288618 10314697 10288598 10382457
4941A0382457J77273N16466R6667N72926K1440M06245L39874o5192J45219j18539
$$ 10382457 10559730 11076196 11172863 11745789 11767229 12173474 12513348 12448156 12593375 12474836
4931A2474836N31401K05690p7098Q9732K91823L79108J08475N37438L10982m0973
$$ 12474836 13006237 13211927 13134829 13224561 13516384 13895492 14003967 14541405 14852387 14811414
4921A4811414L92482L64316L20782M35371O94627O55038M42943O75473J32903
$$ 14811414 15203896 15568212 15888994 16324365 17018992 17674030 18116973 18792446 18925349
4912A8925349p0284K40118J10596K96189K21820K82860R35622K57823P47120Q44822
$$ 18925349 18855065 19095183 19205779 19501968 19723788 20006648 20942270 21200093 21947213 22792035
4902B2792035J212777J179464O11531J226611J412520J731589J474506J366310
$$ 22792035 24004812 25184276 25795807 27022418 28434938 30166527 31641033 33007343
4894C3007343J368462J198058J155614J145160J074672J630918J895198K706878
$$ 33007343 34375805 35573863 36729477 37874637 38949309 40580227 42475425 45182303
4886D5182303L235274M683192N443435P683476J2954223K0427601K8590492L3771068
$$ 45182303 48417577 53100769 58544204 66227680 79181903 99609504 128199996 161971064
4878A61971064K8998264J4210431p802209k3738351k5002931k0199362j4843653
$$ 161971064 190969328 205179759 197377550 173639199 148636268 128436906 113593253
4871A13593253j0564874o726155m145360j521704J254504M175571P945905J3707489
$$ 113593253 103028379 96302224 92156864 90635160 91889664 96065235 104011140 117718629
4863A17718629K2481614L1959053L8220310L8600209L2797263K2312192J3235570
$$ 117718629 140200243 172159296 210379606 248979815 281777078 304089270 317324840
4856C17324840M498040j0357453k9553893l8764149l4636083k6267276j7876894
$$ 317324840 321822880 311465427 281911534 243147385 208511302 182244026 164367132
4849A64367132j1398703o079190j407590K144192N607091R468419J4776319K3040856
$$ 164367132 152968429 146889239 145481649 147625841 153232932 162701351 177477670 200518526
4841B00518526L3495042M3310949M3833533L2603444J0145100j5073887k6395404
$$ 200518526 234013568 277324517 321158050 353761494 363906594 348832707 322437303
4834C22437303k5318257k0503803j5439760j2475438j0413523r669329q930422
$$ 322437303 297119046 276615243 261175483 248700045 238286522 228617193 219686771
4827B19686771p874307o594635m543739k190496J8276K353600N196671Q215276
$$ 219686771 211812464 205217829 200674090 198483594 198501870 200855470 206052141 214267417
4819B14267417J0901388J3388120J5061454J6015178J7420228J8899173K0881987
$$ 214267417 225168805 238556925 253618379 269633557 287053785 305952958 326834945
4812C26834945K2156407K0884914J7568353J1065455M948206J29623k296741l154275
$$ 326834945 348991352 369876266 387444619 398510074 403458280 403587903 401291162 398136887
4804C98136887m386875o768885r805614j1131159j2525558j2752023j1244899
$$ 398136887 393750012 386981127 377175513 366044354 353518796 340766773 329521874
4797C29521874q837211n178244j278266J999536M251732M813639M930166N208065
$$ 329521874 320684663 315506419 314228153 316227689 320479421 325293060 330223226 335431291
4789C35431291N705791M936467L209620R37735j052493k492644l215416l838774
$$ 335431291 341137082 346073549 349283169 350220904 349168411 346675767 343460351 339621577
4781C39621577m284983l461117m69008L633391P294242R877883J0885287J0517251
$$ 339621577 335336594 331875477 331406469 335039860 342334102 352211985 363097272 373614523
4773C73614523Q689927O685138M375869L028461L207308M058748L131411k51808
$$ 373614523 382304450 388989588 393365457 396393918 399601226 403659974 406791385 406539577
4765D06539577p071049j4949335k0916306k2807549k2197309k0512741j8560314
$$ 406539577 399468528 384519193 363602887 340795338 318598029 298085288 279524974
4758B79524974j7422294j5831506j4121361j1952797r961190p633881n419032
$$ 279524974 262102680 246271174 232149813 220197016 210235826 202601945 197182913
4751A97182913k907448j4288K357880M081084N122765M553501L326204J929127
$$ 197182913 194275465 194261177 196619057 200700141 205822906 210376407 213702611 215631738
4743B15631738R05961J759713J212345n32819m537222r067250j2670866j5712354
$$ 215631738 216537699 218297412 219509757 218976938 214439716 205372466 192701600 176989246
4735A76989246j5581352j4787962j3113895j2005792j1163147j0449052r892615
$$ 176989246 161407894 146619932 133506037 121500245 110337098 99888046 89995431
4728H9995431q864785q204969p425787n802786m710930m314479l289914l004761
$$ 89995431 81130646 72925677 65499890 59697104 54986174 50671695 47381781 44377020
4720D4377020k486155k609796k081303k098351j529414j151186j466186j392051
$$ 44377020 41890865 39281069 37199766 35101415 33572001 32420815 30954629 29562578
4712B9562578j026709q47115p30453m99156p90484p22868q40625p43767k25194
$$ 29562578 28535869 27688754 26958301 26459145 25668661 24945793 24105168 23361401 23136207
4703B3136207r7311m03905n26474m33338n44097l58843l25889j17772k62265l70756
$$ 23136207 23038896 22634991 22108517 21675179 21131082 20772239 20446350 20328578 20066313 19695557
4693A9695557j89103p30245l18000m02887p32425n91527n94948n24729J689k95052
$$ 19695557 19506454 18776209 18458209 18055322 17322897 16731370 16136422 15611693 15613382 15318330
4683A5318330j67636j65496k01709k06042l3410k07844m55841j65205l65642l81982
$$ 15318330 15150694 14985198 14783489 14577447 14544037 14336193 13880352 13715147 13349505 12967523
4673A2967523l3129k3405K41557P1890K00829J79958M8992j45272m98371m97168
$$ 12967523 12934394 12910989 13152546 13224436 13425265 13605223 13654215 13508943 13010572 12513404
4663A2513404q3389n10369k97407m23615l51411K98303L56479M74888q329M1092
$$ 12513404 12430015 11919646 11622239 11198624 10847213 11145516 11501995 11976883 11968554 12009646
4653A2009646j42691q43680l86936j01182k78363J29557M13484o2109k77481k44235
$$ 12009646 11866955 11023275 10636339 10535157 10256794 10386351 10799835 10737726 10460245 10216010
4643A0216010J1389j38573l44099l96712k08517m6212L7195M88708K72780K80787
$$ 10216010 10227399 10088826 9744727 9348015 9139498 9093286 9130481 9619189 9891969 10172756
4633A0172756m5977Q9944k5101n32908j97323j43165j10399k80522j12741J92021
$$ 10172756 10126779 10216723 10191622 9658714 9461391 9318226 9207827 8927305 8814564 9006585
4623I006585j38920Q4723K0009L04182Q884m6355m156L48705J58392p4936J82848
$$ 9006585 8867665 8952388 8972397 9276579 9285463 9239108 9234952 9583657 9742049 9667113 9849961
4612I849961K27667K12951J16181O34581K43117k8109O64793J66075K23992M02278
$$ 9849961 10077628 10290579 10406760 11041341 11284458 11256349 11921142 12087217 12311209 12713487
4602A2713487N73699O91564M01165Q36727N56003Q04512J013278J131373J197088
$$ 12713487 13287186 13978750 14379915 15216642 15772645 16577157 17590435 18721808 19918896
4593A9918896Q21362J411603J385292J236264J802806J921692K302471K380986
$$ 19918896 20740258 22151861 23537153 24773417 26576223 28497915 30800386 33181372
4585C3181372K943695L729818M576033O144866P968862J2428298J9335160K7621689
$$ 33181372 36125067 39854885 44430918 50575784 58544646 70972944 90308104 117929793
4577A17929793L3840639L2614101J9838242l59231j8416141k5191690k1866476
$$ 117929793 151770432 184384533 204222775 203863544 185447403 160255713 138389237
4570A38389237j4170734p196861J138693J1043171K0986898K7723684K5067299
$$ 138389237 124218503 117021642 118160335 129203506 150190404 177914088 202981387
4563B02981387J2753947o614660k1721727k4736499j8693027q177718L453255
$$ 202981387 215735334 209120674 187398947 162662448 143969421 135791703 139244958
4556A39244958J3843704K1222814J8480222O106627j0816048k3160878k4507881
$$ 139244958 153088662 174311476 192791698 198898325 188082277 164921399 140413518
4549A40413518j9830604j2997296o172323J530736R979712J7940414K2072676
$$ 140413518 120582914 107585618 101413295 102944031 112923743 130864157 152936833
4542A52936833J7236052L286270j3613037k5107992k5962955k1351025j6257017
$$ 152936833 170172885 173459155 159846118 134738126 108775171 87424146 71167129
4535G1167129j2280996r755119p571490o153324m518772l571444k879161k093771
$$ 71167129 58886133 49131014 41559524 35406200 30887428 27315984 24436823 22343052
4527B2343052j853469j220078o81495r43747p11303p77847k83899m73324q11036
$$ 22343052 20489583 19269505 18588010 17644263 16932960 16155113 15871214 15397890 14586854
4518A4586854n94174m01100l74096l61911n30839l56012l81026l74204m22400
$$ 14586854 13992680 13591580 13217484 12855573 12324734 11968722 11587696 11213492 10791092
4509A0791092k45533l55656n52019j64468l01354k61437j51090n61027P2534m6077
$$ 10791092 10545559 10189903 9637884 9473416 9172062 8910625 8759535 8198508 8271042 8224965
4499H224965k16738j74680j52215k1544m73112J95619q7158R2765K0844k48959
$$ 8224965 8008227 7833547 7681332 7659788 7186676 7382295 7295137 7387902 7408746 7159787
4489G159787j83603m69628j50536p2809n7077o7602r6737K27664P4925j85029
$$ 7159787 6976184 6506556 6356020 6283211 6226134 6158532 6061795 6289459 6364384 6179355
4479F179355L79616J80898j42065l0477N5596k71695n9959k30486n59291k75941
$$ 6179355 6558971 6739869 6597804 6567327 6622923 6351228 6291269 6060783 5501492 5225551
4469E225551q3456O6210r1305k8511j87964j95803j18286M9014K2698J8825L98032
$$ 5225551 5142095 5208305 5117000 5088489 4900525 4704722 4586436 4635450 4658148 4676973 5075005
4458E075005J62585j12000K87002q5035K14880j75234j46033j74589l88795M3771
$$ 5075005 5237590 5125590 5412592 5327557 5542437 5367203 5221170 5046581 4657786 4701557
4448D701557k54154k65139q8618j2148j69039j06783n4824j40191j74560N6910
$$ 4701557 4447403 4182264 4093646 4081498 3912459 3805676 3750852 3610661 3436101 3493011
4438C493011K54908K67253J55574O100K003l01834k50050K01J82530J43159j40671
$$ 3493011 3747919 4015172 4170746 4176846 4178849 3877015 3626965 3627166 3809696 3952855 3812184
4427C812184j88664L6878N899Q5625J75486K20352p7294k02786M75231L0029k6220
$$ 3812184 3623520 3660398 3666297 3751922 3927408 4147760 4070466 3867680 4342911 4372940 4346720
4416D346720L90885N67037N00993J168315J896770K841897K556469J817291J6956
$$ 4346720 4737605 5304642 5805635 6973950 8870720 11712617 14269086 16086377 16103333
4407A6103333k100618k689483k180870j407903j292350q73825m26019n33560j91564
$$ 16103333 14002715 11313232 9132362 7724459 6432109 5558284 5132265 4598705 4407141
4398D407141j02639j76760k41131j09723j18493k69338j59693K24858q1523k58998
$$ 4407141 4304502 4127742 3886611 3776888 3658395 3389057 3229364 3454222 3372699 3113701
4388C113701p1888k36018K06371j55925q4944J8959O3808j47975K26103N0000
$$ 3113701 3041813 2805795 3012166 2856241 2771297 2790256 2854064 2706089 2932192 2982192
4378B982192m3917n2027J64863J39604j1706k38093J92862M16629K00900k34066
$$ 2982192 2938275 2886248 3051111 3190715 3179009 2940916 3133778 3550407 3751307 3517241
4368C517241k27281J86166k49150l5069j3415l62460L79464j29269j33469J15548
$$ 3517241 3289960 3476126 3226976 3191907 3178492 2816032 3195496 3066227 2932758 3048306
4358C048306K3263J54121k6446l41j62727R6426J65784j93989J97227R6857L92808
$$ 3048306 3071569 3225690 3199244 3198903 3036176 3132602 3298386 3104397 3301624 3398481 3791289
4347C791289J93272N991J94010k15468q2484l38438j35967K93156J56709K8772
$$ 3791289 3984561 3990552 4184562 3969094 3886610 3548172 3412205 3705361 3862070 3890842
4337C890842K6164j33775j27159o5679J15399n270Q5541o3162j03674j33121J1367
$$ 3890842 3917006 3783231 3656072 3590393 3705792 3700522 3786063 3722901 3619227 3486106 3497473
4326C497473j01582K48364K58464M01119J62473J86474K13861l64457j30254J06873
$$ 3497473 3395891 3644255 3902719 4303838 4466311 4652785 4866646 4502189 4371935 4478808
4316D478808j50955j85347l26879j37490o6156j06391J13274P3475L5379J15037
$$ 4478808 4327853 4142506 3815627 3678137 3611981 3505590 3618864 3692339 3727718 3842755
4306C842755L41321j0534k34420k9037J50946n7034j72042J03390J54870O1281
$$ 3842755 4184076 4173542 3939122 3910085 4061031 4003997 3831955 3935345 4090215 4151496
4296D151496M07347k63148n0759J75319l10877j04411J6738J20942q7065R9846
$$ 4151496 4558843 4295695 4244936 4420255 4109378 4004967 4021705 4142647 4055582 4155428
4286D155428J20125l29811j25175O6637k24403J26901J0159J19169J30154k08342
$$ 4155428 4275553 3945742 3820567 3887204 3662801 3789702 3799861 3919030 4049184 3840842
4276C840842q1633j00708J14111J08597J20434j58836r8638K28346l766p0646
$$ 3840842 3759209 3658501 3772612 3881209 4001643 3842807 3744169 3972515 3968749 3898103
4266C898103J89887J54839J30436k1156j84173J08433m5845q6279K03221K12723
$$ 3898103 4087990 4242829 4373265 4352109 4167936 4276369 4230524 4144245 4347466 4560189
4256D560189P5648k08029K17394l5319n4041R9308j70844M53794J92650O2726
$$ 4560189 4635837 4427808 4645202 4609883 4555842 4655150 4484306 4938100 5130750 5193476
4246E193476r8423k84139L46765L62966k91212K8605P2430L15443R9089J27153
$$ 5193476 5095053 4810914 5157679 5520645 5229433 5258038 5330468 5645911 5745000 5872153
4236E872153k98836J79834L85285L10812J55890n4999k71906M6938J18177J24787
$$ 5872153 5573317 5753151 6138436 6449248 6605138 6550139 6278233 6325171 6443348 6568135
4226F568135k3192K02086L65620k46365M8814J3445J41629P7463K89644J23011
$$ 6568135 6544943 6747029 7112649 6866284 6915098 6928543 7070172 7147635 7437279 7560290
4216G560290l2153K37899q7318K71735M76902j00998J64431J72283L34686R6001
$$ 7560290 7528137 7766036 7678718 7950453 8427355 8326357 8490788 8663071 8997757 9093758
4206I093758J88558L35712j7143P2929M37774k11977K92714Q0790M43844M31409
$$ 9093758 9282316 9618028 9600885 9673814 10111588 9899611 10192325 10273115 10716959 11148368
4196A1148368L04566J19088J22343L88154K31568J93425L36141L89669Q11243
$$ 11148368 11452934 11572022 11694365 12082519 12314087 12507512 12843653 13233322 14044565
4187A4044565N79261J63270N47637P77936O65116O39727J103396Q05481J015181
$$ 14044565 14623826 14787096 15334733 16112669 16777785 17417512 18520908 19326389 20341570
4178B0341570J093939J091765J162494J598906J635348K239988K661380K970151
$$ 20341570 21435509 22527274 23689768 25288674 26924022 29164010 31825390 34795541
4170C4795541L782692M023583L415523K649835K405972J352432O06885M80342
$$ 34795541 38578233 42601816 46017339 48667174 51073146 52425578 53032463 53512805
4162E3512805l09689m79912o84732n23700L0215Q02329K051093L234863M439180
$$ 53512805 53203116 52723204 52038472 51514772 51544987 52347316 54398409 57633272 62072452
4153F2072452O044403O099051N341415M748814L101610K228483J812624K119094
$$ 62072452 68116855 74215906 79557321 84306135 87407745 89636228 91448852 93567946
4145I3567946K688900L076660K575738K385927K029710J400447J040409J256516
$$ 93567946 96256846 99333506 101909244 104295171 106324881 107725328 108765737 110022253
4137A10022253K362432K675242K582165K236111O91675j067856j539792k99315
$$ 110022253 112384685 115059927 117642092 119878203 120569878 119502022 117962230 117662915
4129A17662915J443514M822730Q708760J2130061J4153543J3082541Q604090K833531
$$ 117662915 119106429 123929159 132637919 144767980 158921523 172004064 180608154 183441685
4121A83441685j512065l217265k188205J01576J610311K406311J771575J004468
$$ 183441685 181929620 178712355 176524150 176625726 178236037 180642348 182413923 183418391
4113A83418391P89704P73078J601506J759826J466581N31933j134448l300720
$$ 183418391 184208095 184981173 186582679 188342505 189809086 190341019 189206571 185905851
4105A85905851m110017m224769l572028k283285P55191M574156P955419J1663711
$$ 185905851 181795834 177571065 173999037 171715752 172470943 177045099 185000518 196664229
4097A96664229J3796678J3622681J0878801P309137M620304M104804N056064N942829
$$ 196664229 210460907 224083588 234962389 242271526 246891830 250996634 256052698 261995527
4089B61995527O257457M658424K599017J475781J928608K590003J720329j320013
$$ 261995527 268252984 272911408 275510425 276986206 278914814 281504817 283225146 281905133
4081B81905133m883725p180510o358007n357447l798314j046660J893549M876502
$$ 281905133 277021408 269840898 263482891 258125444 254327130 253280470 255174019 260050521
4073B60050521Q112438J0081997J0602032R502907O724169K426297k925500p469752
$$ 260050521 268162959 278244956 288846988 298349895 305074064 307500361 304574861 297105109
4065B97105109r315919q160205o830411m483361k007765K61116K709876M238459
$$ 297105109 287789190 279628985 272798574 268315213 266307448 266568564 269278440 273516899
4057B73516899M997817M128092J513735j296681l452245l212814j645573K69465
$$ 273516899 278514716 282642808 284156543 282859862 279407617 276194803 274549230 274818695
4049B74818695J20793k311504m051067m254316k581841l64485o88571m257828
$$ 274818695 274939488 272627984 268576917 264322601 261740760 261376275 260687704 256429876
4041B56429876r647055j4160112j5925349j5155352j2119821r305713m942181
$$ 256429876 246782821 232622709 216697360 201542008 189422187 180116474 175174293
4034A75174293j235891J375676L275642L688298L357710K827793K353678J197444
$$ 175174293 173938402 175314078 178589720 182278018 185635728 188463521 190817199 192014643
4026A92014643j27976j223135k403949l380245m423608n410297m596040l330376
$$ 192014643 191886667 190663532 188259583 184879338 180455730 175045433 170449393 167119017
4018A67119017m73460K648247M012258L770967L20560m713733r731640j2793003
$$ 167119017 166645557 169293804 173306062 177077029 177397589 172683856 162952216 150159213
4010A50159213j2220691j0415055p658351m620998k394535q99806l83790r00766
$$ 150159213 137938522 127523467 119865116 115244118 112849583 111949777 111565987 110665221
4002A10665221k086662l362896l093602l101176j847870j994888k038136j501030
$$ 110665221 108578559 105215663 102122061 99020885 97173015 95178127 93139991 91638961
3994I1638961k196236j843890k361172j248988j006634r15251r63702k348136
$$ 91638961 89442725 87598835 85237663 83988675 82982041 82066790 81103088 78754952
3986G8754952l804289n272965o107213n865448n136247l350968k687560j923049
$$ 78754952 74950663 69677698 63570485 57705037 52568790 49217822 46530262 44607213
3978D4607213q57916j276013n54741q56555j047688k79952k06189j90562p34087
$$ 44607213 43749297 42473284 41918543 41061988 40014300 39734348 39528159 39337597 38603510
3969C8603510j366775j767005k649157k647553k908935k555455k205923j952349
$$ 38603510 37236735 35469730 32820573 30173020 27264085 24708630 22502707 20550358
3961B0550358j325356j299864j442354q39772o02719n54815q61345o34169m87347
$$ 20550358 19225002 17925138 16482784 15643012 15040293 14485478 13624133 12989964 12502617
3952A2502617p01862j69407p69747l56157m53272n79939k00389n07909o321m43843
$$ 12502617 11800755 11631348 10861601 10505444 10052172 9472233 9271844 8763935 8757614 8313771
3942H313771m6872N1685m75896J39052j86824k74848l63527n50115N577n32605
$$ 8313771 8266899 8318584 7842688 7981740 7794916 7520068 7156541 6606426 6612003 6079398
3932F079398q0332J85512N559j78133p28026K2337R9423n39602n2999N5797Q1096
$$ 6079398 5999066 6184578 6190137 6012004 5283978 5306315 5405738 4866136 4813137 4868934 4950030
3921D950030j79010p3000L7794m16549l3243Q350j28764M3486j24654O2576k89351
$$ 4950030 4771020 4698020 4735814 4319265 4286022 4294372 4165608 4209094 4084440 4147016 3857665
3910C857665o6096J37076j22291r0769j78542J14912m2169O3664N0887k37143
$$ 3857665 3791569 3928645 3806354 3715585 3537043 3651955 3609786 3673450 3724337 3487194
3900C487194j04397j62926l51775K80288K32051K8412k48450j83143K37667n51098
$$ 3487194 3382797 3219871 2868096 3148384 3380435 3408847 3160397 2977254 3214921 2663823
3890B663823l4773J41744N6555J77504k64869j70876N9297P9197R928j06808J31465
$$ 2663823 2629050 2770794 2827349 3004853 2739984 2569108 2628405 2707602 2717530 2610722 2742187
3879B742187J09689j10616K5122j22140J03157l85143L32743j5721J18913Q8432
$$ 2742187 2851876 2741260 2766382 2644242 2747399 2362256 2694999 2679278 2798191 2886623
3869B886623M2112o4792m4271J7864J18988j3501l1255n2394r904J88633k02486
$$ 2886623 2928735 2863943 2819672 2837536 2956524 2943023 2911768 2859374 2849470 3038103 2835617
3858B835617M2884M1386K5299K49340l04594k31538J77814M7838J06651q4061
$$ 2835617 2878501 2919887 2945186 3194526 2889932 2658394 2836208 2884046 2990697 2906636
3848B906636q373m01416R0590K58419J85475K52513j11110J32418O1494L54571
$$ 2906636 2898263 2496847 2587437 2845856 3031331 3283844 3172734 3305152 3366646 3721217
3838C721217J76173J0442K64422q2623m1463p5727J77303J29908r7117O921M31711
$$ 3721217 3897390 3907832 4172254 4089631 4048168 3972441 4149744 4279652 4182535 4189456 4621167
3827D621167K90970K37002M0618M56179K44856K90431P07178J51902O73609O65522
$$ 4621167 4912137 5149139 5189757 5645936 5890792 6181223 6888401 7040303 7713912 8379434
3817H379434J78352M33115M60567J021491J267447J085575J964203J647485K694433
$$ 8379434 8557786 8990901 9451468 10472959 11740406 12825981 14790184 16437669 19132102
3808A9132102M068082P117812J1483204J5544335J5440316R994694j563254j3290110
$$ 19132102 23200184 30317996 41801200 57345535 72785851 82780545 81217291 67927181
3800F7927181j4739313j1725297q951354o598736n048058l788918k732211k409543
$$ 67927181 53187868 41462571 32511217 25912481 20864423 17075505 14343294 11933751
3792A1933751j855113j333797r28861l78454m87700n18166m79880n04913l18560
$$ 11933751 10078638 8744841 7815980 7437526 6949826 6431660 5951780 5446867 5128307
3783E128307l87432n3100j72094l08331L3517k18111k78508j84766l40580J29269
$$ 5128307 4740875 4687775 4515681 4207350 4240867 4022756 3744248 3559482 3218902 3348171
3773C348171k50722L34803j7131k7893k6803l41312K34143r330p2912k2949k38489
$$ 3348171 3097449 3432252 3415121 3387228 3360425 3019113 3253256 3243926 3171014 3148065 2909576
3762B909576j06731K5923Q1987o1157j00333j25836O0371J31362m17810J82626
$$ 2909576 2802845 2828768 2910755 2849598 2749265 2623429 2683800 2815162 2397352 2579978
3752B579978P9770n34305o0739Q9658K6083p7975J13447J53928o00412J48676
$$ 2579978 2659748 2125443 2064704 2154362 2180445 2102470 2215917 2369845 1769433 1918109
3742A918109J73542J00321L64978k90700n1198j34981j96245J51424J95118k18262
$$ 1918109 2091651 2191972 2556950 2266250 2215052 2080071 1883826 2035250 2230368 2012106
3732B012106j40695r7773J2151j14530j00234j32802J69652O1031O0505K95307
$$ 2012106 1871411 1773638 1785789 1671259 1571025 1438223 1607875 1668906 1729411 2024718
3722B024718k16456k19217K28232l72408J39119j0612k0072J62045N6386M8634
$$ 2024718 1808262 1589045 1817277 1444869 1583988 1573376 1553304 1715349 1771735 1820369
3712A820369k56998M6759j97080n8997j13579R4265L67210j32589j07486L93606
$$ 1820369 1563371 1610130 1413050 1354053 1240474 1334739 1701949 1569360 1461874 1855480
3702A855480j49490k41196N6841p1115o7685j46497O2890J9180r1411L59722n3482
$$ 1855480 1705990 1464794 1521635 1450520 1382835 1236338 1299228 1318408 1226997 1586719 1533237
3691A533237o0301m8335J12439j06988n4256j04693l7001j0137J71938k25015
$$ 1533237 1472936 1424601 1537040 1430052 1375796 1271103 1234102 1223965 1395903 1170888
3681A170888L05056j63330j61226J40698k34574l9790j83442m1358J59133J5285
$$ 1170888 1475944 1312614 1151388 1292086 1057512 1017722 834280 792922 952055 967340
3671I67340p6062K59108M6056l66085n2872K44069Q2309L35047j30665K3107k07054
$$ 967340 891278 1150386 1196442 830357 777485 1021554 1103863 1438910 1308245 1331352 1124298
3660A124298P2270K25576m89662q9052K22898J15551j9494j95553K15045K1368
$$ 1124298 1196568 1422144 932482 843430 1066328 1181879 1162385 966832 1181877 1203245
3650A203245q7261J14758j70385L00962k0805j54807k9203J25335M42692k55727
$$ 1203245 1115984 1230742 1060357 1361319 1340514 1185707 1156504 1281839 1724531 1468804
3640A468804l2569K82595n10819q2442R8207O223J53744j57467L20263n0599q259
$$ 1468804 1436235 1718830 1208011 1125569 1223776 1229999 1383743 1226276 1546539 1495940 1487681
3629A487681N1580k44230K14180K37646J63396N7694j43283J78041K14946K04627
$$ 1487681 1539261 1295031 1509211 1746857 1910253 1967947 1824664 2002705 2217651 2422278
3619B422278j90143k30161L38595J0927L00389K8249p7771L66731p2378J91893
$$ 2422278 2232135 2001974 2340569 2351496 2651885 2680134 2602363 2969094 2896716 3088609
3609C088609k39868J49122M29755O6619J78138j55795j53216K8765J69138J72913
$$ 3088609 2848741 2997863 3427618 3494237 3672375 3516580 3363364 3392129 3561267 3734180
3599C734180j39068M6608M6023m0563L80067J59322J60586L4821J75293P0007
$$ 3734180 3595112 3641720 3687743 3647180 4027247 4186569 4347155 4381976 4557269 4627276
3589D627276K04218M76602P0058j88823M65657K09022K91015K88283L44634K50759
$$ 4627276 4831494 5308096 5378154 5189331 5654988 5864010 6155025 6443308 6787942 7038701
3579G038701o17853J31779K31670j72839j44823K64732L58728J51782J81037L46542
$$ 7038701 6420848 6552627 6784297 6611458 6466635 6731367 7090095 7241877 7422914 7769456
3569G769456K89414K60267l0220J09754M48611K63403Q25976M96706P53628O69032
$$ 7769456 8058870 8319137 8288917 8398671 8847282 9110685 9936661 10433367 11186995 11856027
3559A1856027M66884P24350n149N41813L13644J62268P65803K72362L94963L87344
$$ 11856027 12322911 13047261 13042112 13583925 13897569 14059837 14825640 15098002 15492965 15880309
3549A5880309L82940N37859j19867N79976J46635J8691O57646M12036M95554K50070
$$ 15880309 16263249 16801108 16681241 17261217 17407852 17426543 18084189 18496225 18991779 19241849
3539A9241849O81127O07927M33707J157476R30755J415141J561624P74541J044205
$$ 19241849 19922976 20530903 20964610 22122086 23052841 24467982 26029606 26804147 27848352
3530B7848352J144542J036378J017535O91118J108361Q79531J260730J571204
$$ 27848352 28992894 30029272 31046807 31737925 32846286 33725817 34986547 36557751
3522C6557751J851191K174165K565613L670335L901514M241202M712486N033302
$$ 36557751 38408942 40583107 43148720 46819055 50720569 54961771 59674257 64707559
3514F4707559N255490M904194M538060L818362K267020J069670n93529k005168
$$ 64707559 69963049 74867243 79405303 83223665 85490685 86560355 85966826 83961658
3506H3961658l163911m011799m138572m009765l877068l419234l162002k758494
$$ 83961658 80797747 76785948 72647376 68637611 64760543 61341309 58179307 55420813
3498E5420813k841222l113768l000252k776347k664461k405475k510007k399486
$$ 55420813 52579591 49465823 46465571 43689224 41024763 38619288 36109281 33709795
3490C3709795k224685k063982k067762j675855j581003j705324j366206j417432
$$ 33709795 31485110 29421128 27353366 25677511 24096508 22391184 21024978 19607546
3482A9607546j670779j581570p61840o90014r41484j022127o34752r3419n51263
$$ 19607546 17936767 16355197 15593357 14903343 13961859 12939732 12304980 12211561 11660298
3473A1660298n10505m51572r31498o26086l6324P8478n15262n37945m95616n34559
$$ 11660298 11149793 10698221 9766723 9140637 9104313 9182791 8667529 8129584 7633968 7099409
3463G099409l70206q7775l16421k89532l21545j42690l15815l00703j09425j75287
$$ 7099409 6729203 6641428 6325007 6035475 5713930 5571240 5255425 4954722 4845297 4670010
3453D670010J9178n0454k93663l03851j42974k33786J16704k37401l22712j62114
$$ 4670010 4689188 4638734 4345071 4041220 3898246 3664460 3781164 3543763 3221051 3058937
3443C058937L96846k12748j77026p7284k00826p9843j00361j56076l3815j19645
$$ 3058937 3455783 3243035 3066009 2988725 2787899 2708056 2607695 2451619 2417804 2298159
3433B298159j99133k00996L9835Q1072k51620L5916k72151L94039r2216k48127
$$ 2298159 2099026 1898030 1937865 2018937 1767317 1803233 1531082 1925121 1832905 1584778
3423A584778j20035M4969K0488L52713m69808j14045J22092N0764l57868m88069
$$ 1584778 1464743 1509712 1530200 1882913 1413105 1299060 1421152 1471916 1114048 625979
3413F25979M94068L25539q7501Q453l41616P9853M6737Q3936N9486l35781q2283
$$ 625979 1120047 1445586 1358085 1366538 1024922 1104775 1151512 1235448 1294934 959153 876870
3402H76870k4209J45013q6509j38157J309j26969o2474Q9138p5289L0873P7685
$$ 876870 852661 997674 911165 773008 774317 647348 584874 674012 598723 629596 707281
3391G07281K93785N6052j92601j27434K7811K9058j75026n765j80858l2715K28385
$$ 707281 1001066 1057118 864517 737083 764894 793952 618926 613161 432303 399588 627973
3380F27973k57043j25832j19837K47141K85432j3508p6325J35151k43010J34033
$$ 627973 370930 245098 125261 372402 657834 644326 568001 703152 460142 594175
3370E94175j44186j03715O1495J86807q5286j02641L46964N4613k28766K4015
$$ 594175 449989 346274 407769 594576 509290 406649 753613 808226 579460 603475
3360F03475k19952K9911N0938O7135j62803R9961J65311J08590N9841l30106r1907
$$ 603475 383523 413434 464372 531507 368704 468665 633976 742566 802407 472301 380394
3349C80394K7286K17693j07819m7246J70928k44524j07754J36783J28705R659
$$ 380394 407680 625373 517554 470308 641236 396712 288958 425741 554446 564105
3339E64105j96020P189k1605j52414j00622J00822j0952L17975q246k56524K8345
$$ 564105 368085 375274 353669 201255 100633 201455 190503 508478 500232 243708 272053
3328B72053m1939o5058j00309J78140J37465j32951j10935N5904r0309O3189j42659
$$ 272053 230114 165056 64747 242887 380352 247401 136466 192370 102061 165250 22591
3317B2591N0576J16741K23122l72169k79402K87935J89658r4045R9890M28563
$$ 22591 73167 189908 413030 40861 -238541 49394 239052 145007 244897 673460
3307F73460j13937r0518J79125l05778J68408j00968k15759J19413j6612M30123
$$ 673460 559523 469005 648130 342352 510760 409792 194033 313446 296834 726957
3297G26957j10323N9254O6126j43164r0972o35j29372J93405R1899o6361l40775
$$ 726957 616634 675888 742014 598850 507878 507243 377871 571276 663175 596814 256039
3286B56039J99793J30588L9273M3470R4349l1297l49806Q4413J81358l85422N6118
$$ 256039 455832 586420 625693 669163 763512 732215 382409 466822 648180 262758 318876
3275C18876J65840n1566k7907L7218J60819J47127J34004J44485l14474K46896
$$ 318876 484716 433150 405243 442461 603280 750407 884411 1028896 714422 961318
3265I61318K28931j18754J19223p1571j635m1608K38238J95926N2111J3688j88097
$$ 961318 1190249 1071495 1190718 1119147 1117512 1075904 1314142 1510068 1562179 1575867 1387770
3254A387770K04793J50649J60377q6585l24384Q8255Q0704n3959O1689p1873L31516
$$ 1387770 1592563 1743212 1903589 1817004 1492620 1580875 1661579 1607620 1669309 1597436 1928952
3243A928952n1026L5848J68984j56585J63125K89155j27044L4584J32152J90779
$$ 1928952 1877926 1913774 2082758 1926173 2089298 2378453 2251409 2285993 2418145 2608924
3233B608924k41008J20450M12835j51691O0409j41112M57327L35251R5840J38125
$$ 2608924 2367916 2488366 2901201 2749510 2809919 2668807 3126134 3461385 3557225 3695350
3223C695350q9118K8638M26484J29350K10870K5407L03350Q0604K7064M70493
$$ 3695350 3606232 3634870 4061354 4190704 4401574 4426981 4730331 4810935 4837999 5308492
3213E308492N41153M36998L3471M32484N89873J02420L93324O66016O97688O32707
$$ 5308492 5849645 6286643 6320114 6752598 7342471 7444891 7838215 8504231 9201919 9834626
3203I834626N46517N23677P62835J402118J332575J559835J541540J626441K091750
$$ 9834626 10381143 10904820 11667655 13069773 14402348 15962183 17503723 19130164 21221914
3194B1221914J912311J878307J845019Q93992L08148j07235k72728k16796k76148
$$ 21221914 23134225 25012532 26857551 27751543 28059691 27952456 27679728 27462932 27186784
3185B7186784Q0896l17571m1279m5916o7028J75826k59207J89621K25914M7247
$$ 27186784 27267680 26950109 26908830 26862914 26795886 26971712 26712505 26902126 27128040 27175287
3175B7175287M29906L30537L33582L82951P75587J146672J508830K369578L612181
$$ 27175287 27605193 27935730 28269312 28652263 29427850 30574522 32083352 34452930 38065111
3166C8065111N963331Q323802Q807892P462197L281941l482347p658979p774527
$$ 38065111 44028442 52352244 61160136 68622333 71904274 68421927 60762948 52988421
3158E2988421o516087n849144m922169l781530l579630k386239j823527j410698
$$ 52988421 46472334 40623190 35701021 31919491 28339861 25953622 24130095 22719397
3150B2719397j071236j121300q99665o29700l23858K57467m41087k37589o7741
$$ 22719397 21648161 20526861 19627196 18997496 18673638 18931105 18490018 18252429 18184688
3141A8184688Q4974M24014K61298O96901P13526J213129J642298J286916J250563
$$ 18184688 18269662 18693676 18954974 19651875 20365401 21578530 23220828 24507744 25758307
3132B5758307O91992m03865j159027j876327k018905k181856j791739j724643
$$ 25758307 26450299 26046434 24887407 23011080 20992175 18810319 17018580 15293937
3124A5293937j646570j074898j461795r53611p86750q23232o96740n39983j50237
$$ 15293937 13647367 12572469 11110674 10157063 9370313 8547081 7850341 7310358 7160121
3115G160121l54180m92309j73363p43491j74154m06739l50479n94297n49850P4165
$$ 7160121 6805941 6313632 6140269 5396778 5222624 4815885 4465406 3871109 3321259 3395424
3105C395424j98989Q145k04999J92j90806k27727p7016j71420j61308p654l28163
$$ 3395424 3196435 3204580 2999581 2999773 2808967 2581240 2504224 2332804 2171496 2163842 1835679
3094A835679J68059K0480l11208O9114l85341k82099L49240Q9398o9171k68820
$$ 1835679 2003738 2024218 1713010 1782124 1396783 1114684 1463924 1553322 1484151 1215331
3084A215331K96821l92965j62624K29004j05248N1465k71928M3776J57050m13477
$$ 1215331 1512152 1119187 956563 1185567 1080319 1131784 859856 903632 1060682 647205
3074F47205Q4437K9782k88559J63321p614J73767j39888K02610j7871l12806N2347
$$ 647205 731642 761424 472865 636186 628572 802339 662451 865061 847190 534384 586731
3063E86731l14078K83355m7884n5809l3829j68711K32411j01742r7943K29495
$$ 586731 272653 556008 508124 452315 418486 249775 482186 380444 282501 511996
3053E11996j89508k70238j04942K90121J55159k83255P2187l1934q7495R5467
$$ 511996 322488 52250 -52692 237429 392588 109333 181520 149586 62091 157558
3043A57558m93981K12783J05449J54205k2560j81386K64770p0063J62052n1922
$$ 157558 -336423 -123640 -18191 136014 113454 -67932 196838 126775 288827 236905
3033B36905q7450K10947m26570p3451L7325L487K54829l21668N8883q2067o8337
$$ 236905 149455 360402 -66168 -139619 -102294 -98807 156022 -165646 -106763 -188830 -257167
3022b57167M25252j50258Q2002K32841j22672j68979l61870K25962j16494l2107
$$ -257167 168085 17827 99829 332670 209998 41019 -320851 -94889 -211383 -243490
3012b43490J08587q9300J97364k40910J41191K97627m61120N0935j51027n0597
$$ -243490 -134903 -224203 -26839 -267749 -126558 171069 -290051 -239116 -390143 -440740
3002d40740J2346j69462K89237j97794N6479n9161J39316J63942k27307l331K89750
$$ -440740 -428394 -597856 -308619 -506413 -449934 -509095 -369779 -205837 -433144 -436475 -146725
2991a46725P3542J21009j90409m7580K0166k03201Q1556l1176J51984j66598j25833
$$ -146725 -73183 47826 -142583 -190163 -169997 -373198 -291642 -322818 -170834 -337432 -463265
2980d63265L62252l04580J04728P2252r4216q6296m55745M27700l7236p1132J30167
$$ -463265 -101013 -405593 -300865 -228613 -322829 -409125 -864870 -437170 -474406 -545538 -415371
2969d15371J06028P389j29839K91894j38625k14410K81748k5623J12331J28071
$$ -415371 -309343 -301954 -431793 -139899 -278524 -492934 -211186 -236809 -124478 3593
2959C593k01415K2542j72027j0394J45189j68794l4774j06358L46585j10865k02618
$$ 3593 -197822 -175280 -347307 -357701 -212512 -381306 -416080 -522438 -175853 -286718 -489336
2948d89336N47608m8624P1576j03530l0348J25302o2192O5013k82241N755O4504
$$ -489336 58272 9648 81224 -22306 -52654 72648 10456 75469 -206772 -201017 -136513
2937a36513k64695P3286j06690j31414L30768r9813p6787l05640K91801m5590
$$ -136513 -401208 -327922 -434612 -566026 -235258 -335071 -411858 -717498 -425697 -471287
2927d71287j98877L97984j45281n7744Q6040p1227J70942k53656M37338J79769
$$ -471287 -670164 -272180 -417461 -475205 -389165 -460392 -289450 -543106 -105768 74001
2917G4001N015j47723r0522J71305k06822N7211J63199l38019J10762j0280n5885
$$ 74001 79016 -68707 -159229 12076 -194746 -137535 25664 -312355 -201593 -211873 -267758
2906b67758Q9148K1927k12474N7961l2511J6293k62287k3170J50237K72743q299
$$ -267758 -178610 -156683 -369157 -311196 -343707 -327414 -589701 -612871 -462634 -189891 -198190
2895a98190o4439K77193l52534J32312R0485q4862r2546j78648K77884r5725l5312
$$ -198190 -262629 14564 -337970 -205658 -115173 -200035 -292581 -471229 -193345 -289070 -324382
2884c24382L35612j36703K08402j81997M841R7669J91894l12947j84079K63222
$$ -324382 11230 -125473 82929 -99068 -94227 3442 195336 -117611 -301690 -38468
2874c8468K4532j64097j57448l329R8021j2541Q8236Q6981o9493J07540J15529
$$ -38468 -13936 -178033 -335481 -338810 -240789 -253330 -165094 -78113 -147606 -40066 75463
2863G5463l314n3362J8051j37892l8006L5474M8889q8756q1369J52957K6319J35364
$$ 75463 72149 18787 36838 -101054 -139060 -103586 -54697 -143453 -224822 -71865 -45546 89818
2851H9818k41356k53017J3475L335K96025M2057M6330O1886k84709N2742k39542
$$ 89818 -151538 -404555 -391080 -387745 -91720 -49663 -3333 58553 -226156 -173414 -412956
2840d12956Q5504l5003p0152r4877m7683J74473n7385J10649J98600J28087J47411
$$ -412956 -327452 -362455 -432607 -527484 -575167 -400694 -458079 -347430 -148830 -20743 126668
2829A26668l15942J79916J64310k55606k75758j0854J63273k2678J19615J06669
$$ 126668 -189274 -9358 154952 -100654 -376412 -387266 -223993 -246671 -127056 -20387
2819b0387l87978M3855J85172o5176j95244J06691K5229j24456j1505Q0944J78787
$$ -20387 -408365 -364510 -179338 -244514 -439758 -333067 -307838 -432294 -443799 -362855 -184068
2808a84068j05676j33325L225j49445j08936P6270N2490J63468R5750m7299R8674
$$ -184068 -289744 -423069 -419844 -569289 -678225 -601955 -549465 -385997 -290247 -337546 -238872
2797b38872j05966J64128j28621k1625p8896R2458J52148k76073j5566O9478J78312
$$ -238872 -344838 -180710 -309331 -330956 -409852 -317394 -165246 -441319 -456885 -387407 -209095
2786b09095p2056K6855j47069k9877o7236j64809M31546o2325p5463j42027K56176
$$ -209095 -281151 -254296 -401365 -431242 -498478 -663287 -231741 -294066 -369529 -511556 -255380
2775b55380J89493r5527Q2237k98883k31151j51816J91497L11000l8248q6143
$$ -255380 -65887 -161414 -79177 -378060 -609211 -761027 -569530 -258530 -296778 -382921
2765c82921j42939K16985P4352j1080L7793M9897r2660j25583N3695R8866L0500
$$ -382921 -525860 -308875 -234523 -245603 -207810 -157913 -250573 -376156 -322461 -223595 -193095
2754a93095j84458n9270L5265O2858j05774K81047q4060M8593p7521J205j73971
$$ -193095 -377553 -436823 -401558 -338700 -444474 -163427 -247487 -198894 -276415 -275210 -449181
2743d49181o0500j05779J62940j9075j53041J64777Q5643k03986L01422r749m2351
$$ -449181 -509681 -615460 -452520 -471595 -624636 -459859 -374216 -578202 -276780 -286529 -328880
2732c28880l8542r5405p7189O8666K9570j21231K85181J84364Q6579j17965m99924
$$ -328880 -367422 -462827 -540016 -471350 -441780 -563011 -277830 -93466 -6887 -124852 -624776
2721f24776L34293O0634k49065j95160k33572L42606K79187Q501N7473J32729
$$ -624776 -290483 -229849 -478914 -674074 -907646 -565040 -285853 -277352 -219879 -87150
2711h7150j17857J636P1811p1833R0437q1994k97302J50434l3745k30708J66820
$$ -87150 -205007 -203371 -131560 -203393 -112956 -194950 -492252 -341818 -375563 -606271 -439451
2700d39451J95703l8045J6434j08725k60314J14631J63878K91676r1107K6562
$$ -439451 -243748 -281793 -265359 -374084 -634398 -519767 -355889 -64213 -155320 -128758
2690a28758l93252K70756K40485l54763J1198N2371J18045j36105k21784K93831
$$ -128758 -522010 -251254 -10769 -365532 -354334 -301963 -183918 -320023 -541807 -247976
2680b47976j41336J58071J71665k97591J80666k83724o8579k86017J18613K40278
$$ -247976 -389312 -231241 -59576 -357167 -176501 -460225 -528804 -814821 -696208 -455930
2670d55930j0529M2881Q362J2049J8018N7395R5477N0751p9756L46815n433k24484
$$ -455930 -466459 -423578 -415216 -403167 -385149 -327754 -232277 -181526 -261282 85533 80100 -144384
2658a44384j40072K77347q4562j45637K01380o6457O2007o2201j61525J29820
$$ -144384 -284456 -7109 -91671 -237308 -35928 -102385 -40378 -102579 -264104 -134284
2648a34284L7430K03326M301l74476M40054j06396O9948k83922k03363K41507
$$ -134284 -96854 106472 110773 -263703 176351 69955 139903 -144019 -347382 -105875
2638a05875j36908M5692K11051K92772L05763K6196K45764K26310K88900K28418
$$ -105875 -242783 -197091 13960 306732 612495 638691 884455 1110765 1399665 1628083
2628A628083j28326k14832k83154o1448k84400n33798K93433k02021j05689m7326
$$ 1628083 1499757 1284925 1001771 940323 655923 122125 415558 213537 107848 60522
2618F0522J67271P6469l17206l3750r1820o9151K91386J02425K09381n0813l58353
$$ 60522 227793 304262 -12944 -46694 -138514 -207665 83721 186146 395527 344714 -13639
2607a3639M0785k37447k13400L97690M09959m07819k54533K11201p4390p0473
$$ -13639 27146 -210301 -423701 -26011 383948 -23871 -278404 -67203 -141593 -212066
2597b12066K74842N543N213k56743L33638O7965k85906J14388o7982K14212j52155
$$ -212066 62776 68319 73532 -183211 150427 218392 -67514 46874 -21108 193104 40949
2586D0949j59126o5160j5287J06494m6422k6301J29766J2335L9062Q4413Q8627
$$ 40949 -118177 -183337 -198624 -92130 -138552 -164853 -35087 -22752 16310 100723 189350
2575A89350l12936p0544J23148L47958k4520j53607J7340j25941j89420K30705
$$ 189350 -123586 -194130 -70982 276976 252456 98849 116189 -9752 -199172 31533
2565C1533J12278k71909R6431K18746k453k69240n8252N13793M082o8404k12722
$$ 31533 143811 -128098 -31667 187079 184626 -84614 -142866 370927 375009 306605 93883
2554I3883J04768K02477k17899j95099M5603l9679j39493j09847R6425J18093
$$ 93883 198651 401128 183229 -11870 33733 -5946 -145439 -255286 -158861 -40768
2544d0768J77112k572k69181J09375l58083K44775J68440J01272J36551j07375
$$ -40768 136344 133772 -135409 -26034 -384117 -139342 29098 130370 266921 159546
2534A59546J79416p3579j9761J10346L594j1265j31788p9924J64186J30380K31086
$$ 159546 338962 265383 245622 355968 359562 348297 216509 136585 300771 431151 662237
2523F62237Q4397l59951j9889P0379j30504k95197K49965J04504j97394K57542
$$ 662237 746634 386683 366794 437173 306669 11472 261437 365941 168547 426089
2513D26089O3843J73831j0319r7639j61441k17480K56655p8826N2099J39057j98645
$$ 426089 489932 663763 653444 555805 394364 176884 433539 354713 406812 545869 347224
2502C47224k7906l5010P1060k5512k18345J31647R3364K00659J29155m5839j03735
$$ 347224 319318 284308 355368 329856 111511 243158 336522 537181 666336 620497 516762
2491E16762J6207J46916j69370j30814K42215J19472l0777j20022Q8849k4797
$$ 516762 532969 679885 510515 379701 621916 741388 710611 590589 679438 654641
2481F54641j07700Q5094J45063q1676j41823J47J86849j09595J94239K56465J16378
$$ 654641 546941 632035 777098 695422 553599 553746 740595 631000 825239 1081704 1198082
2470A198082l77526m7297l794K41841P3243j27577n659K4490k19534J92953K08154
$$ 1198082 820556 773259 769465 1011306 1084549 956972 951313 975803 756269 949222 1157376
2459A157376K16076j32259J05115k784o4101L2732q7057k07920J28674L19073
$$ 1157376 1373452 1241193 1346308 1343524 1279423 1312155 1225098 1017178 1145852 1464925
2449A464925K65350M1133o3655j16791P7233k5875O985p5994J89245k12119K93451
$$ 1464925 1730275 1771408 1707753 1590962 1668195 1642320 1649305 1573311 1762556 1550437 1843888
2438A843888M25176l12504j66433L32313o3854J16979L06241n9969l3293L69079
$$ 1843888 2269064 1956560 1790127 2122440 2058586 2175565 2481806 2421837 2388544 2757623
2428B757623l52330j55939L67080j00423M3076J86379J49585o5139K68706L36187
$$ 2757623 2405293 2249354 2616434 2516011 2559087 2745466 2895051 2829912 3098618 3434805
2418C434805j69019K72253q800L81554J37399Q461K61486q5602Q4335n3987j5220
$$ 3434805 3265786 3538039 3529239 3910793 4048192 4056653 4318139 4232537 4316872 4262885 4247665
2407D247665L11015K42319L00615J81057P3919J63474J02413J86180L04856L63534
$$ 4247665 4558680 4800999 5101614 5282671 5356590 5520064 5622477 5808657 6113513 6477047
2397F477047J96768K39501M60474M46560M47558R95788L99803P45338K05284J269570
$$ 6477047 6673815 6913316 7373790 7820350 8267908 9263696 9663499 10408837 10614121 11883691
2387A1883691J238351J156314J171463J321962J506330K245962K555633L468337
$$ 11883691 13122042 14278356 15449819 16771781 18278111 20524073 23079706 26548043
2379B6548043L859660M129298K799939J490764m29621J118695J810068L476035
$$ 26548043 30407703 34537001 37336940 38827704 38398083 39516778 41326846 44802881
2371D4802881M571118P776763Q933344J3532254K1162734M1867447O9431388R3323337
$$ 44802881 49373999 57150762 66084106 79616360 100779094 142646541 212077929 305401266
2363C05401266P6272391M0290846m4817408r5299840o9121471n0828475l4778484
$$ 305401266 381673657 421964503 377147095 281847255 212725784 161897309 127118825
2356A27118825k8035377k1081739j6857070j1146733r916527n490309l725446
$$ 127118825 99083448 78001709 61144639 49997906 40081379 34591070 30865624
2349C0865624r62153r72257q26034k595831l631731l069327j921522j947131q76586
$$ 30865624 29903471 28931214 28105180 25509349 21877618 18808291 16886769 14939638 14063052
2340A4063052j229937n66032j057885p55298m25309m22412r48955k88784q06736
$$ 14063052 12833115 12267083 11209198 10453900 10028591 9606179 8657224 8368440 7561704
2331G561704J61388m19250M2493k70791k93529k27954o87331k52448k57188n31470
$$ 7561704 7723092 7303842 7346335 7075544 6782015 6554061 5866730 5614282 5357094 4825624
2321D825624R3578j09378k93745r4111j37954p5711l92013k75244m28795l61422
$$ 4825624 4919202 4809824 4516079 4421968 4284014 4208303 3816290 3541046 3112251 2750829
2311B750829R2568k72254j55671j96057m646J40281r4549J18122j74300K42000
$$ 2750829 2843397 2571143 2415472 2219415 2214769 2355050 2260501 2378623 2204323 2446323
2301B446323L40828m13649m929l00799N9182O0115l04165J96771k60605m2713
$$ 2446323 2787151 2373502 2368573 2067774 2126956 2187071 1882906 2079677 1819072 1776359
2291A776359P3963k05485K14859l40985r1681l76955k36488L51133k29904J33575
$$ 1776359 1850322 1644837 1859696 1518711 1427030 1050075 813587 1164720 934816 1068391
2281A068391M5560q3639K70077k43124J95497j57316J23453J75801m50171L21465
$$ 1068391 1113951 1030312 1300389 1057265 1252762 1095446 1218899 1394700 944529 1265994
2271A265994m99345j02909M5561o0337J99910J25012j7709j2235k43338N6382
$$ 1265994 766649 663740 709301 648964 848874 973886 956177 943942 700604 756986
2261G56986k03100J76005k94094m48545L97625K0249K7420J1699j92995J26196
$$ 756986 553886 729891 435797 -12748 384877 405126 432546 444245 251250 377446
2251C77446j85228M28599O1477p4520P8971l44822Q8226R642J56054o429l10465
$$ 377446 192218 620817 682294 607774 686745 341923 430149 439791 595845 589416 278951
2240B78951J60431j49857J00672k34466p2523M60322l63391R6193L7032p44290
$$ 278951 439382 289525 390197 155731 83208 543530 180139 276332 313364 -430926
2230d30926L13689o0626R6760r2606R1574K95683k09132J23431l8037j72667J47956
$$ -430926 -117237 -177863 -81103 -173709 -82135 213548 4416 127847 89810 -82857 65099
2219F5099l68165J79160k33734J00088L52999N4074R7165o69642l7198M19852
$$ 65099 -303066 -123906 -357640 -257552 95447 149521 246686 -422956 -460154 -40302
2209d0302l92648K22730j94052O0574K46847m09302J69050m4114J31986J08040
$$ -40302 -432950 -210220 -404272 -343698 -96851 -506153 -337103 -381217 -249231 -141191
2199a41191j85759l4856p590O2001k81028k04071L09107q8238j15064J20725K82563
$$ -141191 -326950 -361806 -369396 -307395 -588423 -792494 -483387 -571625 -686689 -565964 -283401
2188b83401J88606m4447J7090k03108K71197J29988j48924r3673k92482K17357
$$ -283401 -94795 -139242 -122152 -325260 -54063 75925 -72999 -166672 -459154 -241797
2178b41797k00145k73035L76443r5928o7891J05811p0118J38824P17K0676J07325
$$ -241797 -441942 -714977 -338534 -434462 -502353 -396542 -466660 -327836 -327119 -306443 -199118
2167a99118k61951N9247k47358K84037J58603j75782J3015j44339O7045J55090
$$ -199118 -461069 -401822 -649180 -365143 -206540 -382322 -369307 -513646 -446601 -291511
2157b91511j5307r6786m06650J34248K48069J52538M9485l7291M6283j98776J03148
$$ -291511 -306818 -403604 -810254 -676006 -427937 -275399 -225914 -263205 -216922 -415698 -312550
2146c12550L9557l13359J56352J57106J91286M0295k18079r5398O7857K80966
$$ -312550 -272993 -586352 -430000 -272894 -81608 -41313 -259392 -354790 -286933 -5967
2136e967n6099r2912K09416o4346J34753j02155l64468p0195K5219K74670k37085
$$ -5967 -62066 -154978 54438 -9908 124845 22690 -341778 -411973 -386754 -112084 -349169
2125c49169k55728K04953K29550J04541j26197k08906J93245p9650M57557p9539
$$ -349169 -604897 -399944 -170394 -65853 -192050 -400956 -207711 -287361 170196 90657
2115I0657j33591P6186Q7622j0679q4389o1093r0805m56684L30393j84095J56133
$$ 90657 -42934 33252 120874 110195 25806 -35287 -126092 -582776 -252383 -436478 -280345
2104b80345N7128l090J91615q1781J45368K51508j90658L14166J98355L20344
$$ -280345 -223217 -226307 -34692 -116473 28895 280403 89745 403911 602266 922610
2094I22610K19405J12073L41724k63911L0664m21206l56662r5839l34457K16340
$$ 922610 1142015 1254088 1595812 1331901 1362565 941359 584697 488858 154401 370741
2084C70741l15031l05049M3398R9826J8897l34581L7333J91025k5771J82407Q007
$$ 370741 55710 -249339 -205941 -106115 -87218 -421799 -384466 -193441 -219212 -36805 -28798
2073b8798j75290J49741J78487k8927j43005j10822J05071n584k57217o9446J60863
$$ -28798 -204088 -54347 124140 95213 -47792 -158614 -53543 -59127 -316344 -385790 -224927
2062b24927j21068J0213k07571k35566L41524P4089k7855J7958k81910K31165
$$ -224927 -345995 -335782 -543353 -778919 -437395 -363306 -391161 -373203 -655113 -423948
2052d23948j15028j5775J94526k79386M9434P3872P6255k67768K25615L15548
$$ -423948 -538976 -554751 -360225 -639611 -590177 -516305 -440050 -707818 -482203 -166655
2042a66655J44916p0409q7072k82711j8690l7511O5505k50846k13008J27864J97642
$$ -166655 -21739 -92148 -179220 -461931 -480621 -518132 -452627 -703473 -916481 -788617 -590975
2031e90975r938J76960K9929o1669j18694K4371J00973R1895j18567p8329L35856
$$ -590975 -600913 -423953 -394024 -455693 -574387 -550016 -449043 -357148 -475715 -554044 -218188
2020b18188j67204J53504j25824j55898Q4483j39149J08608j91286J75162J05069
$$ -218188 -385392 -231888 -357712 -513610 -429127 -568276 -459668 -650954 -475792 -370723
2010c70723o8372L29339l93040j04174r0494J67173j03583j73073M18811r2366
$$ -370723 -439095 -109756 -502796 -606970 -697464 -530291 -633874 -806947 -388136 -480502
2000d80502j89148J12705r8023J29298K42145k87613J73798k8568J15451J262
$$ -480502 -669650 -556945 -654968 -525670 -283525 -571138 -397340 -425908 -310457 -309195
1990c09195m11975k15479K24895J49634k21499j62427L40808J07391O4805l4805
$$ -309195 -721170 -936649 -711754 -562120 -783619 -946046 -605238 -497847 -433042 -467847
1980d67847j20498L01939k96304J43240r0772k53439J65159J21312J48208k1683
$$ -467847 -588345 -286406 -582710 -439470 -530242 -783681 -618522 -497210 -349002 -370685
1970c70685J01495m3692j8768p1036L6974J28141K54754l12829n7542Q4839j33016
$$ -370685 -269190 -312882 -331650 -402686 -365712 -237571 17183 -295646 -353188 -268349 -401365
1959d01365n4089K5208q1813p1290k3736J81233k87035N2871J08148J60395P6636
$$ -401365 -455454 -430246 -512059 -583349 -607085 -425852 -712887 -660016 -551868 -391473 -314837
1948c14837O2922L9393j20259k4427r0441J25041J71679j95935J9450r3289M7093
$$ -314837 -251915 -212522 -332781 -357208 -447649 -322608 -150929 -346864 -327414 -420703 -373610
1937c73610j0631j19292J68353j27721J63339J9361R2514J8209j69122q8682k48383
$$ -373610 -384241 -503533 -335180 -462901 -299562 -280201 -187687 -169478 -338600 -427282 -675665
1926f75665J32779K10137k01442J59178j46281K00079J67284k88175J06308k8027
$$ -675665 -542886 -332749 -534191 -375013 -521294 -321215 -153931 -442106 -335798 -363825
1916c63825q8174k39k52170K80966j06761K79130o8872r1110L27874l92064N5482
$$ -363825 -451999 -452238 -704408 -423442 -530203 -251073 -319945 -411055 -83181 -475245 -419763
$$ [...]
##END NTUPLES=NMR SPECTRUM
##END=
