##TITLE=1H_DE-80H_X3
 200.13MHz, d2o
 8 sc
 
 19ns.26.2.2025
##JCAMPDX= 6.0         $$ Bruker NMR JCAMP-DX V2.0
##DATA TYPE= NMR SPECTRUM
##DATA CLASS= NTUPLES
##ORIGIN= UXNMR, Bruker Analytische Messtechnik GmbH
##OWNER= pz
$$ XWIN-NMR		Version 3.5
$$ Fri Apr  3 10:07:48 2026 Russian Standard Time (UT+4h)  Yarkov@DPX200
##.OBSERVE FREQUENCY= 200.1313
##.OBSERVE NUCLEUS= ^1H
##.ACQUISITION MODE= SIMULTANEOUS
##.ACQUISITION SCHEME= undefined
##.AVERAGES= 8
##.DIGITISER RES= 18
##SPECTROMETER/DATA SYSTEM= spect
##.PULSE SEQUENCE= zg30
##.SOLVENT NAME= CDCl3
##.SHIFT REFERENCE= (INTERNAL, CDCl3, 0, 15.4351)
##AUDIT TRAIL= $$ (NUMBER, WHEN, WHO, WHERE, WHAT)
$$ ##TITLE= Audit trail, XWIN-NMR		Version 3.5
$$ ##JCAMPDX= 5.01
$$ ##ORIGIN= Bruker BioSpin GmbH
$$ ##OWNER= Yarkov
$$ C:/Bruker/XWIN-NMR/data/yarkov2/nmr/H-C/1/pdata/1/auditp.txt
$$ ##AUDIT TRAIL=  $$ (NUMBER, WHEN, WHO, WHERE, WHAT)
(   1,<2026-04-03 10:07:00.40 +0400>,<Yarkov>,<DPX200>,
      <created by zg, POWCHK disabled, PULCHK disabled
       configuration hash MD5:
       00 E9 B6 7A A2 85 ED C7 34 08 36 98 17 FE 4E 26
       data hash MD5: 16K
       0C E4 08 80 B9 7A AF 80 2E 17 D0 AE 9C 4A 0E AC>)
(   2,<2026-04-03 10:07:03.89 +0400>,<Yarkov>,<DPX200>,
      <Start of raw data processing
       efp BC_mod = 2 LB = 0.25 FT_mod = 6 PKNL = 1 PHC0 = -5301.948 PHC1 = 6.821927 SI = 16K 
       data hash MD5: 16K
       9E 18 29 3A BD 5C 32 9F 23 41 68 0D 41 1D EE E5>)
$$ ##END=
$$ 
$$ hash MD5
$$ 72 22 EC 01 1F A1 5F C6 AA B9 EC 15 DA 27 0B BD
##$RELAX= 
##$RELAX= 
##$RELAX= 
##$RELAX= 
##$RELAX= 
##$RELAX= 
$$ Bruker specific parameters
$$ --------------------------
##$DU= <C:/Bruker/XWIN-NMR>
##$EXPNO= 1
##$NAME= <H-C>
##$PROCNO= 1
##$TYPE= <nmr>
##$USER= <yarkov2>
##$AMP= (0..31)
100 100 100 100 100 100 100 100 100 100 100 100 100 100 100 100 100 100 
100 100 100 100 100 100 100 100 100 100 100 100 100 100 
##$AQSEQ= 0
##$AQ_mod= 1
##$AUNM= <au_zg>
##$AUTOPOS= <>
##$BF1= 200.13
##$BF2= 200.13
##$BF3= 200.13
##$BF4= 200.13
##$BF5= 200.13
##$BF6= 200.13
##$BF7= 200.13
##$BF8= 200.13
##$BYTORDA= 1
##$CFDGTYP= 0
##$CFRGTYP= 5
##$CHEMSTR= <none>
##$CNST= (0..31)
1 1 145 1 1 1 1 1 1 1 1 1 1 1 1 1 1 1 1 1 1 1 1 1 1 1 1 1 1 1 1 1 
##$CPDPRG= <>
##$CPDPRG1= <>
##$CPDPRG2= <>
##$CPDPRG3= <>
##$CPDPRG4= <mlev>
##$CPDPRG5= <mlev>
##$CPDPRG6= <mlev>
##$CPDPRG7= <mlev>
##$CPDPRG8= <mlev>
##$CPDPRGB= <>
##$CPDPRGT= <>
##$D= (0..31)
0 0.7 0 0 0 0 0 0 0 0 0 0.03 0 0 0 0 0 0 0 0 0 0 0 0 0 0 0 0 0 0 0 0 
##$DATE= 1775196419
##$DBL= (0..7)
120 120 120 120 120 120 120 120 
##$DBP= (0..7)
150 150 150 150 150 150 150 150 
##$DBP07= 0
##$DBPNAM0= <>
##$DBPNAM1= <>
##$DBPNAM2= <>
##$DBPNAM3= <>
##$DBPNAM4= <>
##$DBPNAM5= <>
##$DBPNAM6= <>
##$DBPNAM7= <>
##$DBPOAL= (0..7)
0.5 0.5 0.5 0.5 0.5 0.5 0.5 0.5 
##$DBPOFFS= (0..7)
0 0 0 0 0 0 0 0 
##$DE= 6
##$DECBNUC= <off>
##$DECIM= 32
##$DECNUC= <off>
##$DECSTAT= 4
##$DIGMOD= 1
##$DIGTYP= 9
##$DL= (0..7)
0 120 120 120 120 120 120 120 
##$DP= (0..7)
$$ [...]
##$SUBNAM2= <"">
##$SUBNAM3= <"">
##$SUBNAM4= <"">
##$SUBNAM5= <"">
##$SUBNAM6= <"">
##$SUBNAM7= <"">
##$SUBNAM8= <"">
##$SUBNAM9= <"">
##$SW= 18.0517328524113
##$SWIBOX= (0..15)
0 0 2 0 0 0 0 0 0 0 0 0 0 0 0 0 
##$SW_h= 3612.71676300578
##$TD= 16384
##$TD0= 1
##$TE= 0
##$TE2= 300
##$TE3= 300
##$TEG= 300
##$TL= (0..7)
0 120 120 120 120 120 120 120 
##$TP= (0..7)
150 150 150 150 150 150 150 150 
##$TP07= 0
##$TPNAME0= <>
##$TPNAME1= <>
##$TPNAME2= <>
##$TPNAME3= <>
##$TPNAME4= <>
##$TPNAME5= <>
##$TPNAME6= <>
##$TPNAME7= <>
##$TPOAL= (0..7)
0.5 0.5 0.5 0.5 0.5 0.5 0.5 0.5 
##$TPOFFS= (0..7)
0 0 0 0 0 0 0 0 
##$TUNHIN= 0
##$TUNHOUT= 0
##$TUNXOUT= 0
##$USERA1= <user>
##$USERA2= <user>
##$USERA3= <user>
##$USERA4= <user>
##$USERA5= <user>
##$V9= 5
##$VALIST= <valist>
##$VCLIST= <CCCCCCCCCCCCCCC>
##$VD= 0
##$VDLIST= <DDDDDDDDDDDDDDD>
##$VPLIST= <PPPPPPPPPPPPPPP>
##$VTLIST= <TTTTTTTTTTTTTTT>
##$WBST= 1024
##$WBSW= 4
##$XGAIN= (0..3)
0 0 0 0 
##$XL= 0
##$YL= 0
##$YMAX_a= 250864
##$YMIN_a= -212961
##$ZGOPTNS= <>
##$ZL1= 120
##$ZL2= 120
##$ZL3= 120
##$ZL4= 120
##$ABSF1= 0
##$ABSF2= 0
##$ABSG= 0
##$ABSL= 0
##$ALPHA= 0
##$AQORDER= 0
##$ASSFAC= 0
##$ASSFACI= 0
##$ASSFACX= 0
##$ASSWID= 0
##$AUNMP= <proc_1d>
##$AZFE= 0.1
##$AZFW= 0.1
##$BCFW= 0
##$BC_mod= 2
##$BYTORDP= 0
##$COROFFS= 0
##$CY= -3
##$DATMOD= 1
##$DC= 0
##$DFILT= <>
##$DTYPP= 0
##$F1P= 0
##$F2P= 0
##$FCOR= 1
##$FTSIZE= 16384
##$FT_mod= 6
##$GAMMA= 0
##$GB= 0
##$INTBC= 1
##$INTSCL= 3.241238e-09
##$ISEN= 128
##$LB= 0.25
##$LEV0= 0
##$LPBIN= 0
##$MAXI= 10000
##$MC2= 0
##$MEAN= 0
##$ME_mod= 0
##$MI= 1.114404
##$NCOEF= 0
##$NC_proc= -7
##$NLEV= 6
##$NOISF1= 3.799351
##$NOISF2= 2.8
##$NSP= 0
##$NTH_PI= 0
##$NZP= 0
##$OFFSET= 15.43508
##$PC= 1
##$PHC0= -5301.948
##$PHC1= 6.821927
##$PH_mod= 1
##$PKNL= yes
##$PPARMOD= 0
##$PSCAL= 0
##$PSIGN= 0
##$REVERSE= no
##$SF= 200.130017335587
##$SI= 16384
##$SIGF1= 3
##$SIGF2= 2
##$SINO= 0.751879
##$SIOLD= 32768
##$SREGLST= <19F.Aceton>
##$SSB= 0
##$STSI= 16384
##$STSR= 0
##$SW_p= 3612.71676300578
##$SYMM= 0
##$S_DEV= 0
##$TDeff= 16384
##$TDoff= 0
##$TI= <>
##$TILT= no
##$TM1= 0
##$TM2= 0
##$TOPLEV= 0
##$USERP1= <user>
##$USERP2= <user>
##$USERP3= <user>
##$USERP4= <user>
##$USERP5= <user>
##$WDW= 1
##$XDIM= 16384
##$YMAX_p= 303697767
##$YMIN_p= -1040217
$$ End of Bruker specific parameters
$$ ---------------------------------
##NTUPLES= NMR SPECTRUM
##VAR_NAME=  FREQUENCY,     SPECTRUM/REAL,   SPECTRUM/IMAG
##SYMBOL=    X,             R,               I
##VAR_TYPE=  INDEPENDENT,   DEPENDENT,       DEPENDENT
##VAR_FORM=  AFFN,          ASDF,            ASDF
##VAR_DIM=   16384,         16384,           16384
##UNITS=     HZ,            ARBITRARY UNITS, ARBITRARY UNITS
##FACTOR=    0.220516191357247, 1,           1
##FIRST=     3089.02274283785, 0,            0
##LAST=      -523.694020167927, 0,           0
##MIN=       -523.694020167927, -1040217,    0
##MAX=       3089.02274283785, 303697767,    0
$$ Real data points
##PAGE= N=1
##DATA TABLE= (X++(R..R)), XYDATA
$$ [...]
9918 -20310 -136586 -159682 -62731 36922 7131 -44951 33053 -236005 -178917 -45549 -49906
9907 -49906 -65837 -3533 33149 -40452 -126360 -135521 -109888 -103730 -148388 -132070 21190 99131
9895 99131 43352 -57152 76001 48429 -115191 -53473 119442 -65874 -256469 54851
9885 54851 59639 -213744 -74860 -6809 -161495 -138011 -60706 -102226 -271516 -230797 25109
9874 25109 -8689 -96742 -144276 5979 -33023 -125741 -92555 -50736 -30379 15473 24508 24765
9862 24765 -140883 -227081 -209426 -246471 -148881 -44875 26050 -167503 -142732 110221 39816
9851 39816 -113153 -91055 46725 -274429 -431190 -124647 -92255 -206701 38244 -11201
9841 -11201 -144148 -169027 28051 -27521 -321470 -204874 -140838 -79038 141831 127614 -92115
9830 -92115 -78755 150716 8559 -191069 4498 64545 -238624 -240781 30251 -48652 -277690
9819 -277690 -115273 97118 -65298 2787 78998 41948 -175322 -112431 -76102 -208137 -105503
9808 -105503 112919 -167115 -153929 143540 51294 -122512 6163 -37788 -94627 -111583 13640
9797 13640 -94973 -29168 179984 58536 -162880 -208637 -50146 -27632 -113936 -65802 -164445
9786 -164445 -166115 -110101 18064 -46364 24076 64883 12327 176034 60849 15235 105321
9775 105321 122895 -78124 -82695 79494 56023 -94492 31253 -121456 -100983 30922 134074
9764 134074 53443 -90413 -16029 -52406 -138559 854 50010 -105141 -126917 118245 90975
9753 90975 105272 114368 153776 -89428 -229499 53952 133512 -50294 52714 116741 57621
9742 57621 -9895 121602 66776 114127 153169 115993 -72678 -71532 12004 -76699 -47157 -1720
9730 -1720 -45638 -7214 46500 -74681 -121979 129377 256579 122733 -29574 75006 132676
9719 132676 -14938 33006 211944 65145 -165189 33512 6070 -177421 -198126 -13339
9709 -13339 -193740 -176033 -6133 48403 -106848 -122083 -78269 -84004 -257810 -7908 57693
9698 57693 -117382 -19845 118714 7592 -43615 112332 134811 106983 232258 160089 125976
9687 125976 84134 -33906 19378 196489 169743 190734 116883 144274 270631 168331 345698
9676 345698 249427 33587 94388 247522 233133 133458 128596 199213 158513 240518 511980
9665 511980 492717 371374 349608 377575 290454 375119 579441 524018 325818 312500 307245
9654 307245 242319 222002 137756 40929 -19161 77230 69262 -31626 175824 138775 -22107
9643 -22107 79691 210590 155007 64712 183784 270278 226644 305853 376917 372901 325577
9632 325577 437382 396032 233938 413132 597876 487224 438262 547271 457295 274601
9622 274601 368192 425586 357882 226783 41720 266466 203183 -16563 866 224226 285648
9611 285648 300161 412205 251064 192552 151516 273975 261650 115384 334544 287384 -4433
9600 -4433 1878 300677 237037 170135 327427 299121 -98314 11417 261043 109507 107981
9589 107981 305024 126653 38547 176901 240972 32667 108341 227670 -59012 -44414
9579 -44414 183259 149694 -20129 82506 222693 65316 50237 330725 361128 -105662
9569 -105662 -64123 53033 -60523 -84612 361046 338604 -47181 104462 196762 92641
9559 92641 59568 400669 469712 144660 214810 321531 223366 215481 288502 332648 239619
9548 239619 213052 288562 231860 261783 248739 328459 456161 304849 314902 571186 729643
9537 729643 471737 484040 501230 340368 177808 311818 500713 334763 372795 401741
9527 401741 267255 170277 238381 250175 223719 366605 402567 335898 289725 445177 351415
9516 351415 269968 374258 449294 298738 454482 469469 148847 106774 368824 316366 274723
9505 274723 525274 618746 307573 320056 630336 441797 172304 490245 583246 455823
9495 455823 542239 796578 530655 313320 681219 682032 371045 383238 561513 531788 239700
9484 239700 328223 546143 459019 439827 577669 723202 662426 621054 529128 603426 657076
9473 657076 742424 827084 942112 856443 767788 974621 831512 549713 800769 1040916
9463 1040916 675629 640002 940010 912302 623038 890483 1102409 761100 771277 1087135
9453 1087135 1067074 847005 1033143 1053496 805064 720301 869670 966250 883932 975822 1105836
9442 1105836 1097345 1008430 1026883 928865 851049 1176155 1050198 862110 1146261 1168557 919553
9431 919553 1119084 1297776 1204016 1111883 1380220 1429804 1268667 1315079 1585917 1476658
9421 1476658 1401253 1550832 1488269 1399440 1608534 1744820 1758182 1531645 1574056 1734059
9411 1734059 1541979 1698989 1849929 1823658 1898573 2005752 2062573 2188121 2245444 2457814
9401 2457814 2560781 2586091 2712364 2911326 3080875 2936156 2602747 2832587 2983856 2893755
9391 2893755 2859842 3066082 2985794 2815180 2989552 3150026 2920625 2937725 3284101 3208539
9381 3208539 3050471 3249045 3531857 3409222 3389351 3554714 3667797 3648797 3789737 4141283
9371 4141283 4310832 4257973 4376672 4607100 4875340 4837396 5007297 5273411 5496330 5508565
9361 5508565 5739318 5987277 6142894 6156012 6464487 6705702 6656162 6901308 7317728 7576311
9351 7576311 7588528 8066506 8466123 8416739 8383106 8862681 9271980 9311756 9635811 10043934
9341 10043934 10232047 10427794 10853159 11283536 11514005 11604156 11979317 12295850 12351749 12617044
9331 12617044 13119742 13241561 13240395 13540534 13746927 13687563 13710691 13914225 13925488 13875167
9321 13875167 13931860 13933993 13739757 13664247 13618974 13488285 13014981 12936996 12677967 12534289
9311 12534289 12328024 12114796 11697600 11283236 10875674 10722405 10408259 10037634 9845353
9302 9845353 9568000 9492088 9248785 8841835 8487565 8425055 8178560 7841305 7719643 7541750
9292 7541750 7190634 7091182 6969599 6629468 6431263 6344301 6190646 5904047 5667346 5754508
9282 5754508 5522025 5303178 5331371 5014493 4819355 4918882 4985949 4811394 4694328 4822355
9272 4822355 4698008 4481132 4497812 4475357 4072268 3953366 3920719 3721092 3509776 3571697
9262 3571697 3444935 3189188 3162236 3261567 3243789 2936870 3139539 3235089 2989450 3031379
9252 3031379 3189523 3164374 2929201 2988513 2913349 2602486 2591847 2581382 2476997 2221953
9242 2221953 2191013 2187668 2113152 2072952 2057151 2214776 2254240 2135659 2189294 2344964 2389413
9231 2389413 2384102 2303328 2282027 2159976 2068878 1942452 1916763 1892451 1787092 1867901 1876033
9220 1876033 1684048 1686456 1856037 1735737 1624990 1810904 2066241 2036003 1974566 2226344
9210 2226344 2147705 1776276 1838923 2067528 1900462 1613631 1876209 2042500 1809401 1950087
9200 1950087 2166595 2010713 1738982 1865246 1866729 1552536 1526062 1828818 1695633 1608116
9190 1608116 1873650 2003093 1979708 2036294 1909203 1845369 1808615 1631779 1334790 1298410
9180 1298410 1663945 1427741 1281547 1359646 1495724 1394296 1550681 1810874 1751865 1698278
9170 1698278 1819793 1860646 1549595 1708889 1895683 1645609 1489889 1515427 1530952 1547995
9160 1547995 1632555 1912489 1854847 1736093 1917073 1785103 1630673 1669287 1757847 1671367
9150 1671367 1728811 1856813 1837895 1929130 2039452 1926549 1771090 1892209 1848093 1726758
9140 1726758 1657098 1639150 1553649 1867683 2010589 1909216 1758736 1760305 1821789 1789089 1973652
9129 1973652 2188300 2046539 1990348 2271313 2195309 2124356 2286466 2430603 2220663 2398976
9119 2398976 2856955 2857784 2901705 3194627 3307147 3209940 3248463 3486262 3307049 3237933 3221433
9108 3221433 2896560 2524223 2360684 2203473 1882412 1866622 2225620 2154745 2065554 2219814
9098 2219814 2455495 2506985 2879413 3192544 3076987 3132697 3466346 3475834 3158834 3188660
9088 3188660 3337359 2927034 2727583 2729109 2671961 2537022 2788360 3170425 3207606 3368708
9078 3368708 3768104 4006760 3813252 3844329 3925309 3942201 3674712 3515228 3220056 2961460
9068 2961460 2934704 3054735 3125061 3090152 3224175 3457608 3452426 3670415 4169441 4425964
9058 4425964 4429227 4463176 4437920 4258414 4164784 4271006 4096451 3773630 3645335 3580069 3179842
9047 3179842 3087312 3209653 3121211 3129846 3508585 3609609 3535604 3616732 3780808 3596510 3485397
9036 3485397 3509985 3187269 2861557 2908322 2986323 2846780 3183810 3448248 3294897 3273101
9026 3273101 3678553 3688747 3590812 3984140 4153989 3885112 3758632 3853253 3452489 2958412
9016 2958412 3141150 3151530 2772000 2863153 3424376 3394950 3158566 3694879 4100512 3749469
9006 3749469 3885661 4379984 4053417 3844145 4167184 4144712 3728073 3641475 3680265 3494409
8996 3494409 3355079 3445357 3446645 3185063 3114248 3250501 3179585 3127553 3106455 3042601 3097705
8985 3097705 3288496 3294725 3425892 3661407 3602459 3629070 3785324 3771692 3562084 3899638
8975 3899638 4308493 4092201 4108530 4592405 4572469 4299323 4490787 4837579 4599197 4612571
8965 4612571 4982447 4843857 4485070 4673636 4924187 4662516 4554596 4880375 5086629 5031073
8955 5031073 5134467 5415261 5472911 5655571 5862529 6173955 6436239 6744810 7029652 7299071
8945 7299071 7516758 7730980 8043605 8408322 8684811 9226105 9751547 10179328 10698892 11355389
8935 11355389 12285033 13099446 14085820 15663275 17724392 20373351 25784594 36248698
8927 36248698 52360273 68331936 75868532 72989639 60405239 46629523 37973372 32338641
8919 32338641 29201415 27915869 28707211 31853131 38809509 50067071 64022445 76956665
8911 76956665 85256413 86148173 79938806 69176297 56753081 46416953 38857858 33239058
8903 33239058 29392264 27262205 26135553 25448238 25941934 27575760 30257336 35627733
8895 35627733 45693953 59534668 73778203 85327763 90691840 87620667 78354361 66475141
8887 66475141 54822144 45336909 38700785 34267824 31085060 29090648 28302894 27996817
8879 27996817 28587969 30560436 33785157 39743042 50265759 66035304 84803771 102093107
8871 102093107 113711519 115325246 106820476 92224470 75956440 62012545 51863143
8864 51863143 45003848 39928116 36376521 34655974 34210778 34673902 36845370 41374247
8856 41374247 49345943 62326898 80644079 100255500 116711778 126610035 127196025 119532612
8848 119532612 106858099 93361026 80471113 69551468 61172965 55289434 52803999
8841 52803999 54383452 60789715 71670426 84800779 96230030 102042823 101239451 94570949
8833 94570949 84722334 76593498 73194257 75644609 83451859 95826050 111129429 124142319
8825 124142319 131330849 131344961 124306686 112427835 99076618 87170824 76666636 67822798
8817 67822798 60464320 54490016 50559356 48858378 49754565 54152025 62234135 72283701
8809 72283701 80938253 84304519 81155100 73221649 63231125 54091733 47365329 42997547
8801 42997547 40360349 39200287 40050847 43440564 50489430 61724750 76145080 90422040
8793 90422040 100942263 106360469 106807630 103180181 98104867 94067488 90430139 88362408
8785 88362408 90519854 96895605 105986088 114105853 117552156 114799819 106132965 94808069
8777 94808069 84026431 74307321 65986225 58615947 51537418 45161222 40046502 37263467
8769 37263467 36159338 36451655 37690140 38817056 39101914 38402699 36753809 33676916 30198725
8760 30198725 27192267 23914205 20906614 18785515 17393518 15889350 14807583 14320542
8752 14320542 14189058 14063787 14020068 14243990 14495937 14457857 14114364 13615851 12957032 12287600
8742 12287600 11818685 11356802 11185113 11315886 11135473 10893567 10802791 10641081 10234273 9740065
8732 9740065 9406300 9020340 8733938 8304254 7776807 7649101 7695649 7591566 7558227 7680294
8722 7680294 8007942 8055174 8020372 8252339 8280544 8033612 7944212 8114899 7911553 7870329
8712 7870329 7976731 8192646 8407055 8782955 8867290 8857602 8812857 8460154 7884681 7362824
8702 7362824 6858925 6620583 6666591 6867734 6831414 6908400 7022720 6995156 6717483 6501726
8692 6501726 6464510 6078497 5857627 5870858 5801502 5829062 5936691 6093995 6089547 6199705 6572804
8681 6572804 6828934 6868349 6803555 6850323 6807586 6709006 7022183 7162850 7050490 7279254
8671 7279254 7627360 7585194 7713353 8159302 8288897 8246479 8511184 8724417 8867809 9085454
8661 9085454 9807947 10324273 10899569 12004044 13383850 15225064 18366832 24004636 32410788
8652 32410788 43264331 54356672 61521962 61261020 55017022 46628494 38549811 32791684
8644 32791684 30012698 29964137 33091487 39655293 48341478 55626347 57901954 54141886
8636 54141886 46339587 37639674 30430443 25143742 21577825 18973673 17217261 16124354
8628 16124354 15212757 14543271 14269271 14164285 14098494 14179322 14686497 15338765 16030804 16999433
8618 16999433 18550067 20311700 22485613 26012897 31789991 40462816 52518327 67024033
8610 67024033 81726394 93081068 98515072 97635812 91367526 82965416 75517208 70140565
8602 70140565 67635734 68630518 73992631 81916709 89331636 93829196 93607419 87522459
8594 87522459 77104598 66065296 56219638 47762846 41166575 35554471 30547201 26410199
8586 26410199 23247482 20909794 18776692 17521306 16689277 15897838 15477045 15552761 15731259
8577 15731259 15917204 16364390 17174357 18351879 20033930 23204793 28680681 36473413 45593323
8568 45593323 53492500 57374455 56766765 53723793 50514676 48715016 48619401 48962718 49396477
8559 49396477 50592060 52920791 56223296 58240045 57413354 53758566 49289793 45422221
8551 45422221 42360996 39613832 36429128 32465025 27914937 23411336 19591516 16723444
8543 16723444 14560945 12992568 11782478 10816015 9828566 9006390 8678668 8429550 7941062
8534 7941062 7649895 7482368 7368757 7006844 6944536 7188995 7175288 7394110 8075654 9414201
8524 9414201 11237637 13812123 16326680 17360295 16663897 15031787 13067779 11040812
8516 11040812 9707209 9158882 9096274 9623268 11196571 13279011 14622310 14647561 13481680
8507 13481680 11629904 9542721 7952877 6856476 6025602 5173498 4734314 4539905 4075308
8498 4075308 3744687 3621794 3446869 3114937 2957298 3073534 2743429 2600691 2752724 2701686
8488 2701686 2404859 2370510 2479013 2334205 2170779 2251083 2169986 1961711 1954509 2049302 2149966
8477 2149966 2133260 2316577 2291028 2229830 2173672 2155721 1980281 1997016 2009178 2002856 1856679
8466 1856679 1798565 1736896 1498716 1521111 1545361 1449657 1635178 1875226 1752388 1732657 1929416
8455 1929416 1819168 1520039 1654172 1651000 1342479 1335920 1785951 1681356 1320517 1466490
8445 1466490 1427510 926144 876039 1289488 1221115 904238 960012 1145900 947749 930712
8435 930712 1163909 1146799 807024 924662 1156426 932689 867761 1187727 1282209 1214560
8425 1214560 1085013 1166334 1126285 889984 848931 897138 934239 888558 879092 1089309 1099536
8414 1099536 939793 1088601 1138178 923465 621759 784154 697159 335150 464970 791943
8404 791943 443438 161871 589359 577939 285063 398124 589640 424455 397739 564574
8394 564574 573336 284898 350547 533387 376736 307838 433442 509623 395251 453529 331740
8383 331740 259190 401335 431592 464466 490463 264901 237961 219536 212923 43030 69702
8372 69702 268684 205679 129134 302740 394443 181361 52271 201885 266140 -4865 -2279
8361 -2279 466891 162583 -51970 213931 182011 29326 76693 301910 101729 -52982
8351 -52982 113109 237555 54845 77206 202110 134526 -93199 51732 111470 35611 94190
8340 94190 235891 175574 103035 308757 267682 37025 32235 95683 27738 -46706 -39300 116930
8328 116930 185451 152891 240397 128919 -30064 25591 251131 266066 203514 262697 341983
8317 341983 295199 351034 407886 350349 332041 487609 422921 237812 374036 399210 214403
8306 214403 210944 220038 143371 134679 269456 288691 63250 184647 391309 331674 274328
8295 274328 559994 649884 534424 555712 634615 486961 451483 534842 497237 347538 456194
8284 456194 521209 503143 548071 750459 728472 494964 443283 467008 362114 436960 670813
8273 670813 692988 685778 658287 734636 780267 696075 586080 383396 226886 258152 248537
8262 248537 267340 324217 172819 234317 433098 398939 451845 452955 549568 487436 519328
8251 519328 620472 534924 357416 352106 389964 182164 5802 372417 556104 450927
8241 450927 736196 1008265 795543 502719 693168 715298 537805 566519 823473 840138
8231 840138 619551 702552 968424 601033 496838 704473 576394 304632 314607 372819
8221 372819 153636 12583 216653 321161 139015 89927 153394 126491 84033 23055 120332
8210 120332 212094 138559 181925 194188 225206 29877 402661 487715 227476 262121 507371
8199 507371 374911 365467 462159 603481 182380 9771 -281550 -713543 98803 392288
8189 392288 448322 263797 398278 495808 363175 279037 318216 280272 175874 235054 170192
8178 170192 192300 212337 180350 60515 134947 301264 156408 60738 221835 154791 57869
8167 57869 291638 327054 118238 -56896 238650 244513 -94848 62920 346614 -51254
8157 -51254 -212622 150890 197649 -96596 91776 238184 -90314 -146020 176514 187650
8147 187650 -62298 40874 174448 135141 21890 220471 284535 121789 61023 151707
8137 151707 145837 34902 100986 207978 -25296 -132117 -49357 -11299 -76731 -120030 -216374
8126 -216374 -102987 -111777 -117674 -103298 -92035 -92696 -17990 -130163 -108846 149488 -6145 -177994
8114 -177994 -143617 -39245 4697 -29558 26721 -66264 -169961 -11176 200911 80037 26633
8103 26633 214282 140114 -35634 -127407 -74239 -257873 -237359 54836 72231 -33947 10456
8092 10456 98889 -42420 -197811 6709 121290 -21830 -111514 -91651 -148479 -118380 48280
8081 48280 -22215 -143479 -60307 -146256 -294204 -226676 35709 7852 68465 -74648 19799
8070 19799 242925 88899 81958 15189 186114 -7833 -20084 205796 41813 -130559 -90511
8059 -90511 19162 -189344 -152613 4148 -143236 -159994 36126 17705 -157949 -231521 36660
8048 36660 -77882 -142081 131333 42242 -165253 -129490 132454 -27441 -210743 20325
8038 20325 13909 -107166 -109187 77490 94901 -85772 -75590 -57316 -156300 -87182 -18032 61015
8026 61015 -3228 -34078 12712 -95772 -131966 -178858 -50753 1009 -69776 33521 114798
8015 114798 84443 -72314 73913 129063 -177481 -267949 -54365 74469 -23302 -75580 -91270
8004 -91270 -98783 -165903 -22956 -26530 -206233 -143911 -116139 -244844 -152228 -85416 -235094
7993 -235094 -301918 -194244 -179575 7266 29799 -73234 -147464 -117378 -168117 -161692 -193457
7982 -193457 -84146 -198639 -221852 -6216 -128453 -324413 3831 25750 -262171 -153116
7972 -153116 93526 1260 -336438 -234561 -141050 -73556 -43608 48135 6359 -165080 -152270
7961 -152270 -135555 -318078 -178184 -118804 -175240 -178166 -62905 -99303 -147405 -54815 -227653
7950 -227653 -274267 -78529 -148808 -316055 -231754 54258 -134192 -71748 252558 -25227
7940 -25227 -334162 -225431 52794 -372598 -415415 68227 15207 -363596 -87207 206624
7930 206624 -132676 -214744 50597 44815 -238027 -23492 144800 -89901 -121241 -34507 -62129
7919 -62129 -99533 34482 6334 -78138 16738 107878 26050 -151369 -151243 -87308 -102806 108288
7907 108288 -47064 -258317 -176225 -117304 -193722 -191382 -197509 -349674 -325681 -160324 -169260
7896 -169260 -213232 22224 -21575 -87037 -60492 28781 -35754 -264659 -115111 -104174 -57501
7885 -57501 77588 -72924 22897 -34833 -47261 -8828 48146 -38660 53432 14862 758
7874 758 1235 -118617 -75441 -56338 -126253 -58377 63008 -45338 26186 115087 37644 -167707
7862 -167707 -62955 26823 -150572 -103441 75918 -111024 -235356 73303 94372 -93843
7852 -93843 -90981 30835 -157931 -395623 -270831 -49643 -310708 -316766 45909 924 -169386
7841 -169386 -149078 -30593 -196918 -237146 164406 -16418 -135977 -28066 178612 68919
7831 68919 -100617 114230 83735 -190813 -181162 228435 200728 -50880 49464 216416 -88228
7820 -88228 -205065 -49723 130662 -15814 47741 267678 8378 -143061 38941 -11094
7810 -11094 -215993 -58795 86003 -94458 -130352 -83081 -65260 -110920 66825 43278 -52341
7799 -52341 -153918 -42767 -50053 -70392 -55531 -33637 -96517 35676 117234 -26050 111114
7788 111114 233090 -45900 -168919 171870 76857 -315374 -92586 210139 -156163 -270795
7778 -270795 176566 166643 -246205 10455 253525 -84221 -352504 18915 -1622 -396491
7768 -396491 -27241 234104 31850 27117 233066 45845 -148801 -71862 -34008 -162489
7758 -162489 -176949 -79907 -65539 -44738 46655 6890 -54312 66984 -38600 -50986 -36830
7747 -36830 68363 -57032 -123714 -8205 -70821 -205395 45324 158456 10756 -49300
7737 -49300 -34780 -24970 -68892 -68950 -53809 -123125 -191417 -74041 -9506 -88763 -82400 61675
7725 61675 26297 -63099 -63120 96681 40350 -75036 34349 150321 -102489 -212222 66310
7714 66310 104148 -148573 -74173 68906 -49224 -143870 100046 118815 -114431 -189467 -28790
7703 -28790 -35796 -269117 22619 -5692 -10562 80370 145822 -20570 -161739 -82643 -33707
7692 -33707 -119797 -80785 -81456 -134036 16229 -22153 -75912 -14251 69022 -88921 -49691 173276
7680 173276 119792 -11480 28519 85954 -174193 -213004 98147 -52793 -265829 -151012
7670 -151012 -48766 -165953 -65634 174936 -67292 -236569 -55167 31509 -92664 4034
7660 4034 84692 -160345 -300585 68780 -24059 -186278 22577 49873 -55272 52262 50314
7649 50314 52446 66586 14432 58679 -66797 36696 164590 46342 -117670 -24147 98368
7638 98368 13645 41061 13764 -83029 23799 3516 -182114 -216638 -121454 -97509 -106479 -15987
7626 -15987 -47294 -158205 -120930 -123622 -251363 -114912 -98276 -233639 -199160 89937 79893
7615 79893 -159225 -89707 142306 69049 -31333 68972 -5299 -98028 15494 70606 -108796
7604 -108796 -195041 -65406 -92693 -214969 45616 -6010 -160409 -133844 70244 -108731
7594 -108731 -21610 -103584 -183633 -130006 26466 -21516 -126037 -7127 -28586 4313 55447
7583 55447 40523 -183312 -123777 69418 -68620 -175018 -123013 120532 -86052 -171287 209634
7572 209634 63583 -183957 10499 110474 -54709 -132245 126934 93156 -196472 -53896
7562 -53896 46829 -39505 -82022 10026 -116072 -278986 -70809 -14426 -126320 -51399 28437
7551 28437 -30263 -148782 -39225 57942 -107444 -27535 -59918 -12002 -28117 -125998 -108582
7540 -108582 12291 24979 -224945 -129747 -36015 -13359 -146572 -75648 -46363 -134722 42654
7529 42654 109303 -4379 -67767 63574 112394 -97855 -245022 3322 -108308 -190769 -87357
7518 -87357 -62635 -55900 -80188 182024 103158 74709 -37532 -164724 -153285 -104638 -85249
7507 -85249 -34698 -234185 -54174 12151 -100630 -36472 16595 79369 -26039 -278366 -197389
7496 -197389 18602 -20735 -124916 90163 9688 -116707 -9125 53674 -35869 -37918 79833
7485 79833 25876 -11212 40300 109495 36506 -106711 90484 132191 -274537 -182553 -34519
7474 -34519 -152086 -307080 -215149 -59558 -134512 -204169 -109945 -24751 -70999 -241720 -222952
7463 -222952 -255311 -190294 -31137 27515 -16568 -100963 96025 241635 24721 -132461 22639
7452 22639 -11881 -148770 -83214 148555 -46696 -171372 -157027 -4592 -23372 -122622 110199
7441 110199 125649 -21156 79689 163172 11639 -25782 137391 80285 -71302 -145 1631
7430 1631 21830 -18235 -154631 -145937 -51789 -106818 -32136 18317 -99063 -274253 -56083
7419 -56083 69204 -85799 -171170 119330 166334 -260490 -171166 75339 -81137 -191175
7409 -191175 -28627 86960 -205134 -63986 200604 -119226 -314460 73867 109703 -209327
7399 -209327 -97063 19512 -141517 -177395 30685 25850 -245198 -125530 -57075 -125148 -101302
7388 -101302 21310 -147839 -256573 -168862 -234693 -337406 -86298 150784 -135155 -262819
7378 -262819 5224 11430 -142531 34387 69187 -222625 -135429 68562 -193408 -220413 36587
7367 36587 44115 -330467 -230451 17142 -224958 -243714 -31468 -96140 -245500 -68458 31652
7356 31652 -82915 -112821 76236 72838 -61951 -86571 -34610 -59253 52567 51508 84328
7345 84328 178480 44718 -115174 -87651 -20006 -149477 -38683 -1348 -59452 -87737 -100247
7334 -100247 -197787 -113897 -74420 30862 -6712 -544 87001 75355 -81825 -79570 -53661 -169318
7322 -169318 -62554 98301 -35021 -218698 41226 66225 -32189 115850 116974 -16080
7312 -16080 3413 30339 -68308 -127578 -63409 78162 -5002 -45185 47196 -89882 -235000
7301 -235000 28462 218320 47610 -56080 151100 38062 -164330 -77004 242872 139365
7291 139365 -24798 72578 -63499 -200751 -235499 -37309 225250 122161 73522 174756
7281 174756 -14486 -165360 -81848 92075 -16083 -222184 -87690 -13655 -134369 -173663
7271 -173663 -119675 -127796 -178836 1838 121199 -44713 -159762 -54883 -85405 -72017 938
7260 938 24686 836 -45309 18607 223678 174159 -16734 13934 88754 59647 -119016 -128355
7248 -128355 46706 -6490 -97401 79116 -1673 -118195 -43745 182096 140613 143264 174897
7237 174897 83068 -103583 -193873 2256 111174 117769 66694 157382 26248 470 147750
7226 147750 263413 72899 154659 283567 197237 168784 95362 93559 -114988 -208265 -135093
7215 -135093 17818 84336 -114321 62550 60974 -8925 142698 109100 55732 152957 274830
7204 274830 196153 66998 54687 22267 26190 154290 138657 168663 236813 285463 194795
7193 194795 203764 434482 437837 211546 237909 327343 196441 91539 234181 166460 128872
7182 128872 217786 361339 237650 130450 336584 225849 39181 66180 241510 90943
7172 90943 -5925 171042 281706 199187 292420 322234 172740 123516 157598 89789 167242
7161 167242 128635 118978 253229 222828 112312 170903 195738 22179 152844 408684 375855
7150 375855 621576 964486 1061123 659527 549818 492340 336783 158832 305304 319013
7140 319013 103132 115402 199666 96243 -12930 375219 159386 -96077 138782 289305
7130 289305 32979 62625 241091 51354 -158104 42052 -48422 -167324 -526 151534
7120 151534 21557 53465 163465 107778 -88356 94422 359971 140789 51150 282937
7110 282937 255357 67520 356716 347217 194888 378843 500877 408122 362612 522504 518383
7099 518383 384088 415629 501890 323085 228864 458720 454586 342683 459953 509846 407658
7088 407658 507929 580406 340152 347801 520332 638202 563187 698347 732309 654407 685387
7077 685387 578573 377769 451550 624207 440510 410861 450072 452611 469341 508131 450450
7066 450450 393420 560486 338331 67236 180794 242444 271714 210783 207354 359788 198445
7055 198445 135131 245796 108513 60591 171029 8136 -68173 185460 307365 44747
7045 44747 -50042 255538 205098 -62007 64233 117861 -71891 -8097 181351 288443 161089
7034 161089 209736 227366 -19522 -43906 147629 177648 80345 170025 285471 182133 241995
7023 241995 342172 222956 134173 300094 295972 228185 91373 214042 132585 76833 142958
7012 142958 61933 13791 80072 324558 301206 287527 205887 259939 345567 254269 231121
7001 231121 297705 160739 99080 200781 116585 -43913 -16151 218347 189403 92811 301047
6990 301047 261243 22694 35427 222356 135053 169737 275053 117047 106893 33102 96100
6979 96100 55023 73701 56728 19386 134195 187611 238380 328246 361743 312548 103470
6968 103470 -3706 117567 38578 -32347 110334 136771 -67777 101914 257143 140769
6958 140769 138998 205274 112466 29121 50291 51111 -72145 -32328 124938 166455 -631 149386
6946 149386 252134 143684 -6478 159575 144275 -230592 -178025 -68816 75211 148640
6936 148640 111873 58221 243624 91741 -111624 74464 176736 84796 101506 265743
6926 265743 122425 -56385 37602 154676 43195 112878 396094 346738 107032 155700
6916 155700 269119 69932 34903 208932 125455 -39814 100001 274826 29822 -128892
6906 -128892 136983 151869 -40845 14982 251605 54755 -116548 71 77747 -32840
6896 -32840 -88962 184773 73734 -36873 53230 52064 -25950 -90329 58301 51123 34639
6885 34639 117159 108133 4563 -8857 165360 23915 -89975 -71932 110615 16099 121636
6874 121636 313931 165087 53400 -3675 106652 173170 105849 128336 57478 70121 219863
6863 219863 66294 148947 199256 166746 171600 147005 191686 266964 209425 142931 49972 147158
6851 147158 140650 53333 84415 159946 234350 89723 149085 179504 -89817 -61125 68274
6840 68274 -4592 -76020 97445 146432 146660 -6812 128590 221303 36803 87421 173973
6829 173973 61950 -8514 53994 150797 107480 45011 208177 144425 65055 178305 96886
6818 96886 -14102 4564 161093 162706 168636 228088 186458 263511 155104 148571 115969 73999
6806 73999 80195 150290 191425 114044 112411 231763 147078 125503 207697 126498 65775 196241
6794 196241 125359 75158 189553 208224 81333 140642 332988 164174 -31694 333929
6784 333929 285378 54500 203465 368840 136988 139082 540391 546058 -2571 233999 533722
6773 533722 207868 25060 490400 369711 -76253 180294 447302 95919 -140965 312547
6763 312547 316337 122297 361519 608659 224205 123552 286969 221689 22322 267181
6753 267181 319165 48753 108827 220596 109228 81754 113269 135771 201857 360670 318919
6742 318919 195815 313116 375878 310668 188545 209777 79666 -75081 171039 192568
6732 192568 82456 205996 452085 204716 75418 257862 248848 68512 18032 208508
6722 208508 144049 -6992 245444 203871 38385 109132 306431 130386 -185021 44394
6712 44394 230643 71524 -169296 -14595 97255 119059 98663 270507 308494 127713
6702 127713 165351 210913 84131 -68515 124867 174969 73430 11692 134835 165246 255067
6691 255067 258628 212688 175712 131488 85510 39919 99790 207633 219228 275569 298911 293936
6679 293936 312277 273420 165633 130457 207631 223017 147402 58137 179757 157801 81812
6668 81812 26087 130488 183406 95261 169274 163877 159096 208389 256609 216746 287814 118873
6656 118873 128801 236977 210859 165551 23439 341197 397527 138651 170919 405433 219844
6645 219844 167181 317410 188683 11424 313390 450565 251092 198745 501302 390311
6635 390311 223450 323226 322097 258365 254299 297181 273815 175590 274071 326318 232132 393680
6623 393680 500093 538451 563898 605962 453706 304871 407837 331126 215787 306382 493737
6612 493737 336889 402122 647061 499352 442133 568023 551308 337791 378631 777285
6602 777285 649091 271055 472090 710412 461478 292006 662609 540139 388854 528151
6592 528151 736031 611802 375345 489462 531327 333096 488298 746356 572993 434470
6582 434470 656123 717055 428339 561959 694228 551516 439674 551200 570893 307181
6572 307181 375264 645432 575463 414816 464176 603742 463372 386212 460414 487563 470409
6561 470409 499806 487218 489054 648334 816967 823680 675199 689825 921235 882122 1008059
6550 1008059 1068348 1151078 1125360 1064701 1174043 997595 872224 867549 873386 864223 858732 878988
6538 878988 1053826 1073059 1199336 1131350 1150664 1027845 1016548 957616 701188 658399 687835
6527 687835 554823 627004 675311 719035 626570 574735 721171 873447 808669 701202 629547
6516 629547 519145 507856 606816 782244 626104 663174 825992 869324 833505 905762 805262
6505 805262 543793 538689 781565 673186 612803 648439 559292 478657 511023 640748 497424
6494 497424 472754 621883 735713 667859 746830 806616 774583 798792 738585 860464 979114
6483 979114 1040434 1012512 998417 944041 1046295 1032246 906066 864372 861887 774445 588951
6472 588951 782164 801947 695327 777504 910708 786870 707339 955648 889069 747438
6462 747438 766783 930538 920071 840972 848846 820483 705199 744333 758468 634629 702551
6451 702551 805850 926243 764800 672365 715101 583901 644516 729124 560766 577605 790394
6440 790394 754883 613509 740639 762446 584687 725473 866809 719635 759569 834143
6430 834143 784555 665986 744464 983507 841979 692797 944105 987622 669989 872640
6420 872640 975668 665471 795545 1123799 900209 784891 992777 1242445 1001778 976334
6410 976334 1288992 1177633 1033162 1168436 1236496 888778 1016654 1315292 1161559 1096797
6400 1096797 1310394 1452511 1312740 1234679 1522772 1517736 1409749 1771065 1748484 1429072
6390 1429072 1555622 1708580 1491574 1464108 1722690 1564346 1422241 1700380 1715751 1353020
6380 1353020 1416100 1718316 1647659 1601277 1799013 1763229 1768017 1930517 2321948 2276578 2114606
6369 2114606 2320580 2248408 1964377 1964093 2129797 1829162 1857030 2096432 2210153 2232201 2283908
6358 2283908 2330496 2261514 2374611 2465923 2277498 2300651 2521021 2460354 2326336 2504357
6348 2504357 2673069 2590337 2835131 2851436 2693232 2801055 3324573 3322087 3372825 3681114
6338 3681114 3938276 3848781 4050503 4511502 4419673 4428859 4945174 5175917 5259389 5758922
6328 5758922 6463809 6763656 6975576 7948920 8750452 9463350 10597383 12025961 13441901
6319 13441901 15488765 18772911 23347497 30274785 40274036 51491744 61183102 66603612
6311 66603612 66017990 59737636 51284422 43216927 36440014 31730272 29341738 28780835
6303 28780835 30023728 34333833 42039835 52052760 62128419 69156318 70097846 64430413
6295 64430413 55067789 44854367 35500691 28145217 23311231 19489783 16400508 14336923
6287 14336923 12861547 11439964 10231455 9676173 9060682 8420669 8276762 8124835 7886740
6278 7886740 7732861 7685907 7452946 7231897 7182243 7167021 7194025 7325902 7399476 7405747 7651150
6267 7651150 7691612 7713531 8101472 8345509 8452658 8762458 9318595 9728275 10011062 10681630
6257 10681630 11290681 11851722 12701719 13888503 15120503 16498535 18479896 20739898 23212147
6248 23212147 26720374 31686735 39090363 50504165 67662290 88433999 108123312 121365277
6240 121365277 123700274 115324541 100615549 84762735 71100683 61206993 55034748 52157195
6232 52157195 52911819 58578503 70048252 86575582 105016297 119634650 124482913 118289846
6224 118289846 103904476 85737559 68332902 54456675 43862035 35695312 29791809
6217 29791809 25426118 21543133 18432986 16403914 14642497 12837147 11779378 11214484
6209 11214484 10184411 9554573 9314588 8938345 8118250 7914494 7723777 7078089 6795163
6200 6795163 6877035 6394404 5937433 5825560 5857525 5531564 5461852 5396092 5267389 5030674
6190 5030674 5005882 5010653 4775982 4758476 4792106 4486325 4261332 4375429 4332363 4177548 4119231
6179 4119231 4120778 4014099 3965087 3873282 3816444 3722339 3834923 3775106 3623869 3600782 3578185
6168 3578185 3329806 3309024 3436437 3366885 3293270 3474246 3398681 3309230 3347876 3335952 3055643
6157 3055643 3030844 3039133 3194299 3208602 3100472 2923947 2781099 2966692 2888211 2945306 2998232
6146 2998232 2942756 2989871 3126152 3164407 3006013 3192406 3366571 3466665 3409658 3603187
6136 3603187 3621277 3371607 3339954 3455148 3261414 3200269 3560085 3528400 3393607 3569718
6126 3569718 3770287 3689158 3518136 3759754 4023214 4016791 4172187 4534653 4317507 4181319
6116 4181319 4675928 4901481 4899177 5099466 5600810 5625004 5504471 5892524 6384283 6494075
6106 6494075 6741100 7351607 7628348 7957577 8638818 9223414 9646198 10431093 11366086 12299109
6096 12299109 13472185 15145318 17029445 19150301 21910055 25609802 30724127 38667105
6088 38667105 51171319 68670962 89271956 107570988 117546999 115897668 104524750
6081 104524750 88415471 71851719 57796047 47658268 40418049 35068867 31244655
6074 31244655 28913784 27642623 27192044 27580458 29054981 31267908 35056321 42125358
6066 42125358 53671924 70667704 91602695 111387177 122416979 121261530 109986239
6059 109986239 92479157 73945415 58482427 46698772 37581114 30714452 25989662
6052 25989662 22077517 18751691 16485212 14903174 13305885 11820500 11264444 10557548
6044 10557548 9652226 9248893 9057993 8444927 7984705 8146035 8012278 7718983 7827768
6035 7827768 8119842 8010808 7885809 8333080 8232075 8227306 8521364 8703482 8766363 9014117
6025 9014117 9685909 10204524 10842345 11910590 13056259 14499155 16883541 20327575 25706668
6016 25706668 34351973 45626032 56670653 63998651 65354971 60478273 51692274 42403422
6008 42403422 34451856 28034660 23583616 20663364 18290909 16713607 16022074 15679194
6000 15679194 15543387 16086014 17194169 18856290 21756619 27357953 35846411 46885471
5992 46885471 58460868 66787582 68493620 63457527 54656236 44473732 35300636 28224003
5984 28224003 22686387 18668747 15528619 13086946 11330884 9816956 8759304 7847089
5976 7847089 7121386 6464272 5860212 5522775 5200980 4729248 4582851 4658977 4413926 4022181
5966 4022181 4080321 4044247 3741464 3547088 3613725 3445766 3105361 3192278 3072530 2872210
5956 2872210 3001320 3052399 2609916 2499469 2539083 2554901 2349983 2489530 2472652 2221124
5946 2221124 2194724 2416089 2448725 2151453 2252451 2193560 1984954 2118871 2188196 1892927
5936 1892927 1832243 1954384 1854277 1632623 1780281 1926872 1882926 1945634 2047064 1876396
5926 1876396 1812456 1970063 1960221 1734226 1900341 1955084 1671989 1600274 1859651 1784750 1689378
5915 1689378 1940098 2025486 1742502 1734537 1820837 1427768 1256636 1240286 1295382 1232828 1262630
5904 1262630 1236687 1026656 1048580 1080629 931280 900012 929280 955736 925916 909418 760407
5893 760407 732369 904752 920238 751211 728044 943373 961878 716071 855667 921020 670769
5882 670769 685322 920141 684477 597302 751569 662372 383387 637003 886298 661043
5872 661043 558734 715892 731000 499482 561754 737858 657242 632787 702043 636554 531797
5861 531797 571598 628347 422305 451705 588135 632419 558920 683045 704414 601004 714405
5850 714405 716322 620756 598703 732134 470703 466237 655974 571442 601982 678603 574263
5839 574263 438632 578720 653613 531421 570261 745872 558468 402963 561918 675114
5829 675114 360641 394863 547265 534797 427759 467376 570757 571853 584733 613669 571486
5818 571486 617228 725172 721485 475382 542532 766312 519474 464822 743952 773200 631932
5807 631932 562857 749722 846050 854708 1178020 1492832 1445386 1492696 1573758 1495889 1312884
5796 1312884 1208973 1122125 956687 855308 737519 718449 655348 690514 777340 645161
5786 645161 746182 842041 949037 893658 994980 1291878 1304184 1380634 1595317 1716675
5776 1716675 1577386 1397505 1307327 1218890 1057584 1133138 1214439 940108 915466 1051740
5766 1051740 870525 551456 522280 729621 623321 617110 779041 704749 498372 647009
5756 647009 591823 608568 717291 776891 764841 817375 915566 887109 726529 573745 637028
5745 637028 609770 611416 789163 678775 485683 551373 613109 409822 259869 462140 647009
5734 647009 559227 435181 443617 382574 375727 448615 544280 398726 370892 455597 374010 408215
5722 408215 541288 548111 444823 550234 694867 505137 372130 390485 454916 478865 379426
5711 379426 497606 364893 383645 414489 394431 454766 494254 618795 686319 687983 675944
5700 675944 572991 458821 572299 675518 604564 456786 544640 501491 405647 431479 594420
5689 594420 548626 460754 686528 584260 504527 605955 528128 496379 563384 681780 867479
5678 867479 955212 1044785 875465 604856 593644 645281 588789 659865 655043 602436 535942
5667 535942 663128 857414 737085 848541 1021804 949694 787820 876227 821324 662171
5657 662171 686984 720084 724694 551024 594362 702880 729304 820001 1004426 929702 681021
5646 681021 785814 1002173 977250 802261 858814 888366 874057 894076 850472 769975 692184
5635 692184 832220 904087 916330 788566 806115 857520 722169 710809 879197 879469 756680
5624 756680 859683 804277 681220 635630 754418 624027 387452 427819 754551 625924
5614 625924 376246 604551 792610 510544 505451 717725 627418 379634 400487 590383
5604 590383 444108 427521 793848 721447 360469 436990 538732 407803 260105 467913
5594 467913 460526 409879 531278 685123 564983 334688 446084 469399 400900 304305 558443
5583 558443 576992 388772 452309 434815 408783 536085 561147 425612 376154 476887 616552
5572 616552 587035 475808 447739 410957 543101 708527 636761 539340 492216 577741 452453
5561 452453 548753 614582 531629 347747 362182 435764 450860 398217 482453 538338 544452 520532
5549 520532 501015 566413 526295 569932 492800 463775 388331 452325 373806 401251 432437 433799
5537 433799 266286 387997 534122 585858 632818 720735 695620 607621 457842 468713 477344
5526 477344 518163 583545 596926 562234 587070 619492 518449 449555 489690 430845 441957
5515 441957 533730 544924 502085 529142 578149 480726 608702 499612 498203 534478 585865
5504 585865 593328 653065 683166 744973 752515 833414 813558 768308 749091 673296 566637 513296
5492 513296 580101 700447 645684 654121 673481 645332 750934 810453 619628 554558 663975
5481 663975 737168 559372 565393 612319 529937 642802 869458 809321 620063 803686 927768
5470 927768 701863 789031 929134 833287 867620 984020 1030539 816974 904982 994922 825736
5459 825736 763331 930909 949571 723530 711378 966157 971709 827997 916147 872039 779556
5448 779556 957716 992047 795905 856250 961691 998378 912133 977803 851650 870059 849663
5437 849663 794591 785575 773469 988729 847779 831007 867222 952640 980344 928290 951526
5426 951526 883579 996709 1019975 861121 911887 1105317 955065 749925 1043154 985599
5416 985599 958071 1130014 1183685 1026562 1072462 1301149 1145317 1054200 1159447 1317446
5406 1317446 1161666 1139219 1328537 1451260 1383580 1464137 1572356 1549318 1563945 1524920 1602074
5395 1602074 1611259 1633115 1675834 1716266 1759185 1787309 1925572 2060107 1858801 1803985 1959244
5384 1959244 1953820 1784914 1947267 2222928 2050387 1970643 2247444 2180519 2046924 2264246
5374 2264246 2513507 2193950 2213408 2367822 2343396 2018747 2166467 2533357 2305362 2116437
5364 2116437 2371129 2312784 2135402 2272027 2231108 2090080 2158717 2314254 2404177 2335015
5354 2335015 2205886 2230624 2230640 2466543 2425379 2378507 2405196 2501726 2496320 2402649 2479196 2354638
5342 2354638 2298798 2362963 2480068 2384267 2432337 2663188 2442376 2273326 2444959 2463594
5332 2463594 2437478 2469337 2494392 2476667 2470990 2589153 2649933 2662520 2698594 2694865 2775004 2747435
5320 2747435 2799590 2918524 2892171 2944883 3007014 3215865 3210806 3179450 3361896 3630045 3610273
5309 3610273 3653298 3828575 3950392 3800830 3807208 3892785 4211199 4304559 4472326 4651949
5299 4651949 4765046 5053297 5503180 5615058 5765035 6049106 6234707 6479420 7058047 7581477
5289 7581477 8120361 8834347 9803022 11097454 13086843 16584730 21029472 25906840 29562394
5280 29562394 30351848 28496671 25578379 23477268 22103415 21400754 22105243 24186150 28198705
5271 28198705 34361023 42285767 49602929 55489838 59179186 60633661 61528380 62180004
5263 62180004 61866590 60891193 59941510 59895882 60086244 60293451 60790201 62319073 64639124
5254 64639124 67200052 69611026 72254754 76013359 80761935 84970680 87789125 88023233
5246 88023233 85057958 80503813 75914296 73114827 71739274 69977473 67647391 65427570
5238 65427570 63864257 63094574 61645410 60076402 59218481 59236810 59754819 61016615 62554238
5229 62554238 63359708 63124517 60510253 54770738 47673343 39968815 33271599 28267345
5221 28267345 24909794 23003284 22122820 23026748 25569378 29006836 31453524 31590139 29040488
5212 29040488 24532570 20196499 16927833 14323971 12355361 11113598 9821363 8879541
5204 8879541 8271035 7889554 7453817 6955823 6789543 6646143 6156244 5878998 5841617 5549060
5194 5549060 5337948 5310001 5140947 4747476 4643848 4700839 4573649 4425435 4373228 4147647
5184 4147647 4049533 4002396 4031129 3853400 3854790 3686758 3553806 3405969 3411120 3385844 3377682
5173 3377682 3474901 3288179 3169070 3190811 3215029 3077503 3020891 3067173 2975341 2831184 2683618
5162 2683618 2746969 2609225 2564781 2591258 2628635 2711687 2607314 2517124 2369390 2223050 2315373
5151 2315373 2380031 2289064 2241316 2234488 2181634 2199301 2158296 2163173 2203716 2069170 2243516
5140 2243516 2458085 2263238 2172324 2224069 2349339 2337552 2362256 2475457 2545373 2167896
5130 2167896 2139109 2686629 2514602 2371998 2502295 2523159 2352548 2328683 2655390 2612941
5120 2612941 2336180 2444463 2665421 2586121 2591895 2787764 2708247 2552336 2518498 2801318
5110 2801318 2694183 2760870 2790033 2852548 2848576 2861343 2941327 2861106 2934875 3200297 3173119
5099 3173119 3010917 3013118 2964343 3000516 3019335 3087650 3218472 3188104 3141453 3114797 3222511
5088 3222511 3203191 3163201 3123740 3105346 3264078 3253983 3118554 3342787 3584804 3546601 3659597
5077 3659597 3622685 3416743 3574125 3783171 3599631 3536041 3789429 3901217 3771847 3891114
5067 3891114 3956820 3930152 3657743 3766933 3886741 3710356 3727817 4024424 3975728 3796149
5057 3796149 3900675 3984073 3946268 4037751 4157967 4081983 3816706 3750467 3705412 3599500 3511721
5046 3511721 3730877 3819622 3706907 3697393 3744854 3886783 3691771 3605260 3682835 3555210 3518628
5035 3518628 3618630 3693036 3704790 3567949 3696530 3740020 3452308 3402722 3632255 3635755 3498329
5024 3498329 3386182 3556022 3374080 3385824 3544748 3522149 3504119 3658218 3801928 3907599
5014 3907599 3845886 3636265 3600876 3613400 3612984 3592339 3585081 3718282 3734160 3756320 3692203 3692605
5002 3692605 3833740 3950131 3947315 3908721 3947667 4061681 3975734 4003883 3965016 4180260 4149173
4991 4149173 4102360 4230567 4177754 4183077 4382917 4674710 4623003 4810045 4964977 5111061
4981 5111061 5078688 5214180 5366454 5493542 5454118 5629856 5863028 5925234 5825846 5912524
4971 5912524 6068685 6054770 5932518 6006738 6109978 6046765 6078115 6420672 6496211 6455712 6649794
4960 6649794 7054567 7059342 7146880 7336026 7467457 7601457 7587711 7691489 7769807 7612369
4950 7612369 7652423 7799677 7701295 7717135 7828353 8054259 8076271 8285604 8635670 8639027 8673681
4939 8673681 8764179 8729188 8692288 8782270 8981667 8954214 9054999 9363319 9614361 9596453 9755768
4928 9755768 10093997 10251936 10230685 10609504 10936022 10831110 10960973 11458789 11786899 11995164
4918 11995164 12534027 12951745 13095360 13414907 13932499 14000362 14162853 14560210 14873725 15097986
4908 15097986 15517762 16040070 16403036 16912896 17619455 18338261 18801481 19561662 20381496
4899 20381496 20803816 21181040 21813220 22284193 22708772 23346235 24077567 24593312 25310959
4890 25310959 26426670 27615256 29162444 31365869 34311715 38609829 45412601 57191251
4882 57191251 75016428 96982071 115598375 122850002 117582483 103096853 86623808
4875 86623808 73243777 63766258 57040262 52695971 50423263 49399038 49827380 52008914
4867 52008914 56311977 63614093 76296646 95605814 120039384 143819118 163090312
4860 163090312 178354309 188646714 190939407 182722690 164358767 140566770 118791221
4853 118791221 102856204 92627278 86728587 84070433 83981678 86275293 90339311 96428467
4845 96428467 106074621 120618676 141587188 169272877 197810908 216677128 220232579
4838 220232579 210125298 192764295 175868817 162932082 153617009 145806925 138882314
4831 138882314 133137977 128240353 124264559 121660260 120700041 121359778 123747473 128315342
4823 128315342 135393193 144139356 153988913 164417271 175129763 186603621 199633124
4816 199633124 214719469 231312146 247966677 262522540 273426295 280368816 283864039
4809 283864039 285151322 284926870 282885481 278219379 271214017 262126843 252194298 243516897
4801 243516897 237280824 232739252 229076125 226513023 225628603 227056989 231384038 237741525
4793 237741525 244228056 249252547 252311252 254336002 256342013 258935546 262591908 266711938
4785 266711938 270728185 275028194 280157584 286561587 293658971 299774506 303082785 303697767
4777 303697767 302544471 300852860 299865071 299850791 298641781 294062986 286120578 275449905
4769 275449905 263729152 253303373 245242579 238430234 231530473 224554033 217679953 210838885
4761 210838885 204360436 198236158 191752304 185345719 180290760 177134655 175428375 174620636
4753 174620636 174091358 172511076 169849128 167611284 166018879 165002499 164140178 162159729
4745 162159729 158141389 151715461 143962716 135593613 127315192 119336548 111537263 103971658
4737 103971658 96469738 89148822 81877306 75366196 69502686 63904454 58685504 53990460
4729 53990460 49710369 45739236 42514480 39946742 37592748 35321454 33597832 31873415
4721 31873415 30132773 28561151 27535011 26696351 25550941 24815784 24181631 23304430 22335486
4712 22335486 21708083 21034030 20393885 19837765 19632176 19329201 18946695 18712769 18324842
4703 18324842 17827433 17385697 17039093 16642159 16123740 15753897 15462907 15085501 14607487
4694 14607487 14442258 14376357 14045386 13714787 13461947 13179913 12914522 12712587 12540058 12346558
4684 12346558 12145721 12047813 12026334 11913189 11619789 11519139 11459044 11098847 10936905 10816515
4674 10816515 10626627 10464675 10298092 10291257 10147430 10049241 10069020 9969160 9812081 9602976
4664 9602976 9210746 8910545 8682463 8451072 8448624 8479892 8475799 8504761 8537680 8402235 8350290
4653 8350290 8388152 8073286 7857094 7771452 7702824 7566974 7752608 7933613 7935514 7798384
4643 7798384 7963325 7903492 7670119 7583311 7627497 7492385 7468865 7727291 7930791 7957331
4633 7957331 8018222 8176712 8045904 7737894 7779864 7844697 7513297 7469357 7762380 7742209
4623 7742209 7541668 7758507 8002417 7879036 7956279 8279875 8345010 8328513 8618980 8768922
4613 8768922 8534708 8375880 8677453 8764315 8651323 8934079 9115151 9060132 9188748 9696573
4603 9696573 9983454 10149855 10645860 11056771 11243677 11504313 11765966 12001901 12250458 12759032
4593 12759032 13400185 14149616 15094457 16256062 17678548 19442833 21455992 24017535 27397087
4584 27397087 32312934 40053886 53037483 72002620 94285582 112778173 120638184 115528243
4576 115528243 100976463 84699420 71722684 63348102 59972792 62366067 71378685 87007720
4568 87007720 106390034 121594973 125624283 117961418 102827259 86947496 75764948
4561 75764948 72273208 76908501 88511041 103244321 113845597 114184418 104467157 89369199
4553 89369199 74433192 62740200 55535054 53088585 55222448 63774122 77886054 92983814
4545 92983814 102082432 101137530 90124200 73693424 58260265 46127954 36900957 30079263
4537 30079263 25462968 21804283 18850415 16875914 15455628 14068153 13101851 12680056
4529 12680056 11739781 10901504 10772293 10511765 9834183 9597327 9659971 9189166 8739578 8741815
4519 8741815 8624381 8009714 7886898 7953284 7406965 7110592 7218619 7194478 6866222 6720081
4509 6720081 6741139 6391640 6318427 6337033 6222948 5934330 5817538 5739061 5717785 5541859
4499 5541859 5440280 5442910 5351768 5196524 5247338 5164844 5048195 4919510 4819023 4956725
4489 4956725 4977083 4842165 4842036 4989412 4766614 4679735 4888223 4749107 4557265 4716131
4479 4716131 4816602 4673436 4690078 4677626 4470540 4168613 4194786 4162214 3898816 3865106
4469 3865106 4010501 3944328 3700742 3581902 3548781 3711403 3573899 3744616 3973549 4003398
4459 4003398 4045842 4113999 4143670 3898142 3627305 3788706 3564573 3168387 3115641 3113951 2920831
4448 2920831 2740067 2915777 3023791 2913190 3003358 3039149 2872647 2765297 3014599 3013705
4438 3013705 2769698 2847350 2990670 2860149 2698103 2964439 3061748 2884670 3006927 2964430
4428 2964430 2820931 2813335 2928300 2881239 2704444 2805251 3204167 3450583 4112640 5001326
4418 5001326 5487590 5584847 5300530 4714196 3918517 3528841 3380266 3171081 2942266 2986148
4408 2986148 2882175 2670804 2800326 2929836 2882515 2937347 3049585 3076577 3087171 3016742
4398 3016742 2981100 3061340 3096571 2942740 2872248 3076052 2988951 2941813 3166375 3382905 3248731
4387 3248731 3320107 3621442 3441760 3451552 3809882 3851077 3721652 3862389 4076105 3889404
4377 3889404 4017536 4355557 4294595 4065849 4240474 4412137 4264750 4154487 4479766 4328349
4367 4328349 4063673 4266093 4364275 4215771 4346389 4585471 4506148 4495940 4561564 4591461
4357 4591461 4564977 4638879 4691197 4697581 4772147 4883738 4737301 4747712 4941172 4774054 4652330
4346 4652330 4862816 4877455 4698557 4737127 4839730 4702052 4517250 4690030 4734397 4342357
4336 4342357 4467783 4849015 4624552 4445148 4905837 5001025 4760157 5070131 5424449 5036064
4326 5036064 5013544 5515250 5328950 4904358 5152028 5328299 4972599 5014637 5358286 5348987
4316 5348987 5002919 5290675 5591958 5317994 5385307 5588725 5446726 5178700 5274016 5462943
4306 5462943 5320258 5390450 5804650 5791218 5663845 6026709 6238807 6111617 5778942 5754125
4296 5754125 5757094 5392610 5209856 5238685 5175125 4932876 5042473 5276009 5210519 5120122 5343805
4285 5343805 5371024 5218212 5233776 5160923 4834764 4582316 4610836 4821925 4749610 4608775
4275 4608775 4593002 4652556 4536884 4602950 4686598 4511309 4375678 4351014 4350334 4430758 4230102
4264 4230102 4318968 4428690 4337187 4168716 4289960 4481545 4329976 4347020 4451064 4390190
4254 4390190 4279921 4462643 4577503 4479877 4553417 4764492 4780062 4841682 4907749 5053800
4244 5053800 4989769 4990825 5158330 5366742 5409561 5376879 5496732 5535485 5612628 5639049 5653427
4233 5653427 5660619 5654579 5768501 5829883 6015652 5994328 6110492 6258530 6368037 6234322 6355771
4222 6355771 6524891 6486793 6468112 6624165 6623171 6595055 6825946 6942620 6973347 7018879 7318465
4211 7318465 7425539 7483451 7642015 7857219 7847502 7746875 7917086 8188045 8178020 8233109
4201 8233109 8505353 8606561 8494713 8756237 9227080 9402347 9322811 9692519 10126269 10324919
4191 10324919 10501803 10841402 11241895 11637164 12300679 12959551 13637946 14160276 14955645
4182 14955645 15756871 16545408 17461653 18664904 20059013 21742928 23613985 25638786 27265647
4173 27265647 28957020 30399868 31382243 32089288 32581920 32728012 32469158 32009154 31422520
4164 31422520 31136802 31357822 32331773 33889770 36497487 40005863 43916745 47443249 50278379
4155 50278379 52220397 53350795 54331387 55575565 56745522 58081723 59587030 60936481
4147 60936481 61807540 62460315 63536391 64600710 66056671 68315945 70442462 72211433
4139 72211433 73009865 72794539 71757583 71089157 71789370 74045807 78704937 85935691 94746993
4130 94746993 102941566 108659378 111057305 110504108 109097291 108719119 109345358 110505206 112053910
4121 112053910 113326744 113951992 113985255 114491512 115258504 115875383 116587325 117018455 116574446
4112 116574446 115061046 113363500 111815452 110522788 110393207 112134165 115394255 120623808
4104 120623808 127600008 135904550 144538099 152404163 158961247 164102374 168849549 173829898
4096 173829898 179094908 183719460 186890767 188684886 190041333 192055613 194732694 196878667
4088 196878667 196979379 195225269 192239038 188924548 186535432 185499667 186516938 190399233
4080 190399233 197126134 206512905 217780230 229496781 239057305 243889760 243698571 239343082
4072 239343082 233037244 227214135 223076018 221222366 221509693 224151277 229046771 234768602
4064 234768602 239188240 241470801 241588443 240338271 238984746 238197422 237987437 237273313 235756646
4055 235756646 232499063 227449020 221732107 217869764 217022387 217482585 217302261 214288128
4047 214288128 206736494 195265850 182264678 170117637 159781515 151830462 147075653
4040 147075653 144972005 144605931 145705213 147224774 147685722 147146388 146315025 145069877 143093471
4031 143093471 140644771 138141391 134906678 131063984 127842011 125745841 124338942 124022845
4023 124022845 124813203 125321938 123915675 119571286 112735602 104468347 96705709 90345387
4015 90345387 85377745 82006346 79996820 78904092 77959993 76781203 74733711 72079570
4007 72079570 69509750 67346690 65679821 64206897 63187424 62367927 61667437 61172333 60724779
3998 60724779 60328922 60003887 59142495 57750024 55711115 52861335 49057083 45319903 41642767
3989 41642767 38642980 36112721 34191111 32924531 32144981 31827228 31539509 30920748 30230832
3980 30230832 29855512 29316096 28573106 27949264 27061811 25552658 23779632 22249257 20463912
3971 20463912 18776677 17480807 16486299 15464603 14551308 14072456 13292529 12523082 12023465
3962 12023465 11726234 10951474 10567246 10373412 9911981 9440094 9349773 9128082 8639384 8354864
3952 8354864 8452102 8203430 7684910 7617626 7500809 7261631 7087130 6835444 6620962 6544501
3942 6544501 6629893 6331575 6079762 6041839 5970694 5693418 5556209 5764169 5599794 5455215
3932 5455215 5599426 5257330 5165549 5190076 5188869 5036488 5219120 5237905 4979770 5036280 5065836
3921 5065836 4961092 4877048 5131459 5065585 4896046 4815423 4883926 4830719 4946156 5232875
3911 5232875 5220228 5155681 5272881 5433060 5456617 5465745 5573121 5694365 5884541 6057811
3901 6057811 6200542 6142943 6317156 6504737 6488158 6681824 6968725 7056179 7231395 7700048
3891 7700048 8059859 8273172 8668900 8950437 9367198 10017707 10661787 11212842 11793823 12747342
3881 12747342 13522852 14158549 15061927 15788172 16153740 16530630 16895558 16959032 16890789 16929647
3871 16929647 16994658 16800306 16750849 16639637 16217900 15652114 15126651 14550577 13734761 13132441
3861 13132441 12444850 11645166 10856200 10128942 9620911 8935339 8472355 8117678 7751722
3852 7751722 7468576 7233315 6924339 6755258 6746104 6703951 6548169 6337074 6220103 5941743
3842 5941743 5757484 5679719 5386933 5328867 5414839 5331041 5263432 5188969 5172672 4812691 4728733
3831 4728733 4821599 4736957 4515625 4569744 4601838 4302981 4203718 4354294 4306550 4222652 4451601
3820 4451601 4618127 4418710 4386272 4515298 4392267 4358593 4343072 4309775 4189806 4202692
3810 4202692 4191061 4225966 4166631 3905963 3866463 3920462 3895800 3754867 3605631 3550164 3491304
3799 3491304 3413983 3430279 3367142 3231705 3215673 3286127 3163452 3105836 3236536 3099473 2933182
3788 2933182 2888868 2894724 2772217 2598246 2602605 2526868 2431116 2360501 2453620 2421120 2397048
3777 2397048 2401921 2398364 2557926 2617985 2572659 2600315 2550769 2351867 2342530 2416028 2394170 2357313
3765 2357313 2421309 2409230 2388467 2407534 2484607 2443320 2452897 2577984 2298988 2109335 2160231
3754 2160231 2215963 2058714 1948530 2149824 2237953 2162249 2114747 2145306 2078573 2306612 2351580
3743 2351580 2246948 2246850 2359062 2461595 2316529 2116122 2148293 2073340 1960371 2062391 2081463
3732 2081463 1914285 2017566 2251816 2099004 1923470 2004124 1873676 1804391 1973523 2023281
3722 2023281 1950067 1819274 1925959 1906074 1935082 2127252 1944224 1858909 1942415 1952791 1909778
3711 1909778 1650199 1713470 1614514 1568389 1915849 2000784 1902651 2120212 2269253 2099226
3701 2099226 2167232 2472322 2445608 2179121 2162210 2129354 1936288 2023039 2045500 2035732 2004959
3690 2004959 2211562 2300162 2143256 2230465 2346843 2408093 2580481 2665816 2661606 2758153 2826947
3679 2826947 2683493 2653060 2483347 2283668 2230134 2200624 2187145 1989731 2132097 2297786
3669 2297786 2227029 2087690 2048100 1937882 1876780 1977780 2153854 1976313 1879202 2127936
3659 2127936 2135902 2018791 2104100 2319007 2206982 1990702 2139296 2234043 2103254 2162152
3649 2162152 2311691 2318351 2284041 2262722 2181528 2092561 2144084 2160159 2203940 2236635 2122046
3638 2122046 2074111 2200645 2182335 2094202 2304829 2492092 2401715 2476418 2644735 2695281 2646957
3627 2646957 2711658 2817368 2703198 2823044 3111405 3016869 3028498 3214630 3355432 3181327
3617 3181327 3408341 3890594 3682068 3637232 3977648 4073593 3796145 3832073 3763431 3311389
3607 3311389 3272889 3548895 3390219 3029886 3199932 3300544 3167307 3333963 3510407 3521606
3597 3521606 3752166 4201342 4528013 4457227 4543248 4608754 4342028 4180283 4155365 3929957
3587 3929957 3644271 3672962 3501865 3196794 3166738 3180091 3082929 3193796 3304269 3343925
3577 3343925 3417471 3743301 3771924 3881881 4275923 4545160 4512820 4587797 4831538 4815256
3567 4815256 4675079 5048407 5203044 4955446 4974487 5321258 5418444 5381507 5867386 6178758
3557 6178758 6097609 6219060 6555064 6731335 6859088 7381376 7730948 7810602 8203489 8634174
3547 8634174 8814721 8860270 9158629 9173067 9084547 9138671 9456864 9512728 9605205 9850991 10233695
3536 10233695 10602222 11149565 11898280 12666015 13514883 14622915 16013372 17415352 18774993
3527 18774993 20186398 21715760 23012423 24038476 25055975 26006661 26236452 25861402 25477689
3518 25477689 24809383 23675945 22505782 21389705 20045168 18788401 17869068 17093809 16167084
3509 16167084 15259090 14432495 13696635 12965409 12223674 11515264 10877106 10159739 9447237
3500 9447237 8781347 7983255 7527127 7106016 6678147 6263330 5930791 5467787 5223825 4972219
3490 4972219 4688851 4531392 4580408 4455707 4409033 4671338 4572428 4236046 4041816 3812414
3480 3812414 3513041 3283363 3326652 3220857 2916451 2861830 2980049 2936968 2843945 3033126
3470 3033126 3195823 3278379 3509878 3708074 3691606 3554419 3600494 3516668 3163660 2969103
3460 2969103 2820040 2543192 2362824 2423290 2127481 2079855 2227469 2250894 2107123 2092095
3450 2092095 2119376 2043216 1986301 2157078 2024824 1844729 1811357 1716339 1441420 1433655 1593522
3439 1593522 1341105 1056153 1083126 1176160 795815 700108 812896 699367 416925 816347
3429 816347 787353 455544 494639 519378 471264 360278 475290 478969 428414 430927 363110
3418 363110 291511 449013 478476 394719 480046 527591 476821 339562 416043 537276 428665
3407 428665 455656 640874 697744 679391 746591 735659 792134 837339 787607 627577 644889
3396 644889 618471 442385 476182 632855 643386 569496 677063 607298 517649 661812 744525
3385 744525 593341 583982 626417 535844 496911 606926 566126 290949 418600 406161 140417
3374 140417 83892 382426 198636 10241 216988 228149 -76311 -20882 188919 56733
3364 56733 -87473 233229 183170 -137003 127253 407475 121003 120322 458818 294428 99478
3353 99478 325455 344214 12247 34255 157861 68714 19991 275584 251975 -30720 110425
3342 110425 379395 123898 52842 178514 29214 -99851 194222 281485 43763 215503
3332 215503 491236 227891 240120 521493 348274 47623 193253 102196 97421 243480
3322 243480 459456 189572 24403 159546 146585 19582 234859 452421 178857 142994
3312 142994 357469 162258 171827 216516 61241 -148156 -66274 124906 53396 43279 202927
3301 202927 153916 2981 187152 416407 145517 138584 214376 -43438 -26545 106475 106952
3290 106952 15823 219518 303094 160086 87518 149392 165548 287659 244734 176429 189059
3279 189059 296656 184944 166121 122571 205445 71555 165273 202382 76153 -59686 258678
3268 258678 357134 306913 257752 379294 400882 199826 385235 228252 136070 428734 415518
3257 415518 409268 440115 485384 493216 443941 471424 563178 597742 447448 511526 547807 686919
3245 686919 693447 624419 626893 613442 581663 633282 669586 695714 651880 890778 699748 524501
3233 524501 737753 895950 658014 676909 1046671 1084837 1014208 1138376 1399586 1243736
3223 1243736 1230538 1457167 1651842 1490182 1818426 2177367 2134335 2178748 2732972 2927233
3213 2927233 2940394 3310715 3694701 4004875 4475922 5017926 5487817 5970512 6559717 7175166
3203 7175166 7610013 7597271 7374715 7298258 7288793 7148411 6986056 7033932 7093733 6928529 7126493
3192 7126493 7364341 6998261 6887757 7190778 7187122 6900506 7185061 7610334 7416429 7251384
3182 7251384 7986213 8477660 8988241 10369771 12433441 14810998 17638988 20391568 21122479
3173 21122479 19424251 17218173 14986305 12738786 10749076 9511000 8387845 7476709
3165 7476709 6880943 6464428 6091415 5709013 5407571 5242594 4983987 4782135 4669838 4734272
3155 4734272 4626672 4497685 4697174 4938791 4887390 5146064 5759734 6040118 6341157 6957656
3145 6957656 7645752 7558121 7294190 7127855 6475041 5570336 5150916 4837489 3989583 3627617
3135 3627617 3414582 2783042 2303766 2376481 2210644 1861307 1941492 1964685 1708820 1589442
3125 1589442 1672142 1261322 962116 1106221 1010359 789341 690236 971745 1009228 640805
3115 640805 729281 593752 318457 403566 613292 326642 133117 475269 476859 134489
3105 134489 231710 444278 130310 39821 212690 276091 161576 181294 350154 221224
3095 221224 107057 93144 79864 -291 -193534 -70817 -16869 -314053 -205478 -102576
3085 -102576 -88369 -296999 -136191 -5718 -239440 -298385 -94384 -186916 -359380 -281462
3075 -281462 -70639 -204381 -257617 134 -66596 -305436 -127364 -119159 -337760 -335031 -81842
3064 -81842 -318776 -510647 -96047 -156550 -442208 -273543 -131553 -305031 -318685 -11711
3054 -11711 -133012 -228775 -2939 -13277 -419762 -414817 -74076 -170589 -461697 -108366 -36039
3043 -36039 -520978 -413694 -178208 -292316 -545521 -419348 -150956 -463009 -458810 -186182
3033 -186182 -436428 -587594 -400601 -211808 -480875 -485588 -282083 -272462 -531763 -430896
3023 -430896 -222479 -212241 -329440 -359070 -499481 -625279 -470266 -192626 -319176 -486919
3013 -486919 -334820 -360191 -430451 -318021 -321062 -352378 -522785 -374950 -269205 -603038 -652992
3002 -652992 -400441 -365685 -489583 -395043 -312554 -528505 -427512 -215967 -462235 -541369
2992 -541369 -339066 -376752 -441034 -479576 -476162 -572952 -448098 -254782 -313610 -415563 -205234
2981 -205234 -218195 -399407 -337782 -234476 -396912 -555063 -403886 -345907 -464817 -403773
2971 -403773 -268645 -544269 -511540 -251265 -401478 -645085 -402126 -262433 -467882 -518528
2961 -518528 -303441 -582758 -625861 -337040 -387449 -492807 -451167 -318236 -508274 -630106
2951 -630106 -400412 -337144 -641403 -522579 -220649 -404199 -588189 -366714 -315868 -463836
2941 -463836 -299235 -199132 -408840 -456607 -261399 -367398 -529284 -502588 -410885 -453913
2931 -453913 -454553 -314246 -319963 -335525 -290878 -389373 -437452 -318456 -300973 -487744 -440898 -439909
2919 -439909 -490808 -377312 -345884 -475897 -499481 -353344 -486441 -506665 -395539 -423249 -452523
2908 -452523 -427988 -345979 -475351 -533953 -518971 -535558 -408393 -290094 -396684 -325995 -286410
2897 -286410 -309018 -295024 -431381 -551429 -539526 -392818 -269399 -416857 -457537 -295480
2887 -295480 -509383 -579766 -518039 -346802 -498811 -516842 -330243 -555615 -694829 -517223
2877 -517223 -342262 -584888 -599029 -379832 -429180 -601836 -478401 -329556 -379096 -388684 -273948
2866 -273948 -443925 -502726 -467954 -523284 -703170 -676721 -409080 -394420 -505223 -439120 -337195
2855 -337195 -352760 -357538 -274548 -416949 -487447 -354528 -407559 -392339 -455088 -542911 -503711
2844 -503711 -409666 -257996 -363344 -353710 -143577 -448637 -481571 -427910 -435057 -559963 -440528
2833 -440528 -327707 -288142 -447565 -309132 -194735 -462521 -471167 -309683 -373920 -492582
2823 -492582 -248525 -301291 -465108 -414355 -331852 -371389 -371954 -288121 -292519 -408679 -343968 -310081
2811 -310081 -443005 -347481 -398407 -400164 -443335 -351603 -218134 -187119 -240148 -375385 -466407
2800 -466407 -343612 -326652 -382652 -276238 -320314 -448846 -464416 -170321 -423571 -683692
2790 -683692 -558491 -350024 -426604 -530028 -406866 -318864 -592438 -399786 -168211 -392042
2780 -392042 -610884 -416811 -417785 -514921 -490123 -354120 -512311 -424869 -209705 -382802 -491893
2769 -491893 -347127 -344961 -507900 -401488 -255268 -366256 -522922 -450011 -547662 -516999 -180145
2758 -180145 -275539 -500593 -403505 -275076 -335891 -417244 -299865 -465145 -661246 -464532
2748 -464532 -332293 -546489 -510335 -234032 -210078 -370608 -252083 -270537 -409338 -327776
2738 -327776 -256575 -464333 -511047 -361196 -402851 -514880 -434898 -403996 -439034 -458485 -384034
2727 -384034 -338167 -409258 -333013 -185890 -336108 -355813 -397129 -424836 -422589 -290773 -323248
2716 -323248 -245936 -178177 -310730 -365251 -374998 -307478 -369332 -489378 -256732 -248797 -361539
2705 -361539 -287409 -131587 -302088 -323725 -158978 -230435 -374865 -365163 -314784 -368639 -413363
2694 -413363 -350698 -300396 -240060 -202278 -191338 -176742 -337095 -269815 -221755 -356107 -479029
2683 -479029 -417948 -264512 -348601 -253452 -228218 -270199 -292241 -204700 -66234 -235276 -148917
2672 -148917 -118146 -107130 -237943 -264979 -277618 -328417 -280684 -140976 -285670 -362047 -261107
2661 -261107 -283053 -239001 -158601 -149333 -266220 -274694 -177002 -194394 -179761 -101903 -117283 -203569
2649 -203569 -54496 -85052 -162114 -40939 215760 228985 257143 586311 632254 271286 186896
2638 186896 34688 -62952 -72362 98006 -29723 -225659 -93660 93429 -33348 -230144
2628 -230144 -300147 -391327 -256842 -100018 -219938 -270678 -156799 -258539 -279494 -458358
2618 -458358 -189519 -242896 -303439 -137868 -223025 -305351 -328086 -255458 -228525 -253929 -53056
2607 -53056 -135775 -285162 -171267 11419 -278713 -431158 -114019 -237571 -447942 -289918
2597 -289918 -132307 -317504 -360271 -126815 -175654 -298175 -156947 -171749 -380097 -218562
2587 -218562 1955 -157599 -178508 -90449 -85195 -228920 -186192 -123330 -128110 -117823 16302
2576 16302 -24139 -204570 -199583 -64533 -186990 -299226 -209949 -306249 -288354 -243961 -263827
2565 -263827 -151390 -131691 -45187 -27554 -156789 -152318 -11779 59174 -15637 -103929 -149646
2554 -149646 -141942 -279486 -261349 -150196 -179365 -78271 -58524 -155728 -82894 -103862 -128291
2543 -128291 -182348 -269970 -42085 10243 -186308 -60119 35340 -244152 -270079 67510 15001
2532 15001 -144776 -67716 118929 34258 -34542 219656 190477 173649 141513 247332 187918
2521 187918 1551 127023 287135 194201 95864 50721 6888 -177689 -147698 179756 153764
2510 153764 98082 75760 73284 55580 -2595 114593 103784 182551 29200 -70724 155044
2499 155044 172220 121566 170409 243508 255525 234590 7565 80687 12843 46357 177661
2488 177661 210927 86619 223931 274392 259201 150425 140163 123015 157159 132262 271645
2477 271645 393763 309743 285663 384078 441429 460531 443816 388728 383368 274636 350875
2466 350875 433373 350519 306131 511517 478319 504006 555928 531431 438506 477637 663927
2455 663927 679048 547891 542463 569769 696717 824995 761582 759025 728415 635255 788232
2444 788232 774007 610230 786402 837071 790350 753702 787683 772328 754756 808784 960778
2433 960778 996476 1053262 1134297 1228123 1270430 1315714 1368793 1393682 1407625 1358186 1408198 1663895
2421 1663895 1779431 1782989 1881723 2108965 2169626 2129985 2224504 2358095 2355423 2503907 2616733
2410 2616733 2541959 2493584 2678030 2834570 2997317 3342427 3474379 3583056 3753280 3910931
2400 3910931 4135027 4498199 4942331 5691431 6163679 6912330 7838729 9192171 10865603
2391 10865603 12546727 13563250 13534413 13509575 13947415 14928114 16578626 18945719 22178217
2382 22178217 26648709 33905717 46605184 70634132 107156116 151928750 194326819
2375 194326819 199362910 160590386 122164415 92311498 68605943 52702547 40576007
2368 40576007 32316429 26038056 21167249 17379244 15545280 14529194 14122917 14044203 13508506
2359 13508506 11809560 10234744 8883182 7748166 6788366 6372987 5960244 5796920 5506662
2350 5506662 5100543 4562050 4362826 4180087 3902595 3722587 3896743 3812520 3685522 3439532
2340 3439532 3360172 3159477 2926468 2811220 2657260 2560715 2585152 2568404 2465956 2238231
2330 2238231 2285682 2227073 2061564 2040327 2113098 1922660 1841988 1952761 1814700 1512463
2320 1512463 1444247 1626172 1262332 1112489 1509927 1306473 1030144 1123448 1264256 1103771
2310 1103771 904715 1055626 1007991 746747 882306 992207 756414 720941 982294 873908
2300 873908 684335 790720 889495 596080 608952 781017 613952 140959 292087 553846
2290 553846 375877 308683 458808 320638 236658 436573 271570 137663 167255 248622
2280 248622 305576 309898 310127 259794 187862 118163 109700 188900 312595 173996 113777 216433
2268 216433 281725 182749 96092 184412 6380 -58983 110302 107241 -156950 -169269 -17947
2257 -17947 -206636 -327324 -116318 -171496 -173388 -116231 94057 82977 40978 -42661 -150964
2246 -150964 -228156 -115121 -209672 -156817 -127275 -194332 -111133 -51995 -63440 -110027 -136246
2235 -136246 -55455 -220320 -377777 -135436 -219266 -471542 -330356 -179221 -379329 -496707
2225 -496707 -355679 -338412 -552226 -433221 -99804 -247233 -305294 -202090 -150558 -324464
2215 -324464 -389081 -166469 -201527 -321836 -246575 -182564 -200305 -300710 -257437 -176811 -176891 -251879
2203 -251879 -317681 -249432 -392635 -477134 -140871 -178584 -308404 -290729 -102464 -304983 -434883
2192 -434883 -128679 -179933 -386999 -269119 -126895 -364510 -413964 -139875 -132294 -425963
2182 -425963 -303964 -95181 -390602 -369710 -221075 -173908 -368553 -266764 -232292 -474062
2172 -474062 -358551 -191562 -427101 -430231 -212511 -217946 -345976 -335888 -273574 -488261 -423616
2161 -423616 -296327 -377450 -544786 -426959 -304157 -456048 -330697 -304425 -589216 -455015
2151 -455015 -297338 -392414 -588363 -279066 -182645 -299484 -223718 -166259 -472691 -463756 -371371
2140 -371371 -394613 -462412 -202668 -163656 -462740 -387396 -261138 -390765 -434153 -222274 -261250
2129 -261250 -475696 -429071 -316048 -429427 -460422 -357747 -528856 -555359 -271939 -225049
2119 -225049 -432938 -263758 -118725 -380283 -439698 -254032 -259874 -332641 -66337 211449
2109 211449 6734 209915 637848 641266 346272 547156 515458 -9432 -70802 62064
2099 62064 -138595 -334037 -48061 -6913 -503511 -376890 -104261 -393451 -470725 -308045
2089 -308045 -289855 -503436 -315034 -119808 -400917 -515271 -246481 -235137 -413899 -501434
2079 -501434 -450148 -570844 -551175 -369260 -320259 -461828 -425992 -321563 -320250 -323561 -340875
2068 -340875 -386172 -392106 -293240 -330369 -445339 -428619 -352082 -367459 -374464 -402251 -344576 -380837
2056 -380837 -388044 -306941 -280723 -383921 -491077 -512032 -417688 -360336 -172696 -179025 -392175
2045 -392175 -371344 -199345 -259283 -567199 -457153 -308017 -559769 -668604 -173059 -214226
2035 -214226 -594704 -513981 -295271 -463573 -495333 -183997 -213758 -458670 -261931 30906
2025 30906 -338429 -551759 -225218 -344559 -634210 -533165 -283168 -491868 -496638 -202678
2015 -202678 -208942 -514100 -408612 -100955 -389781 -452140 -144232 -137016 -385790 -336318 -176441
2004 -176441 -318450 -347720 -297313 -390320 -410575 -219084 -172597 -316255 -279871 -260291 -417777
1993 -417777 -358594 -235851 -322326 -421929 -283881 -261217 -379145 -287394 -130925 -318303 -490096
1982 -490096 -273597 -227908 -395703 -429784 -258060 -187904 -340820 -285153 -174443 -287901
1972 -287901 -432634 -307222 -217162 -420533 -505566 -439048 -553756 -593881 -214549 -130188 -380432
1961 -380432 -430065 -321480 -313227 -418739 -206645 -78593 -314016 -520445 -363053 -284174
1951 -284174 -429549 -334914 -287563 -313738 -295944 -259839 -285376 -384171 -382194 -218894 -168915
1940 -168915 -348503 -501316 -454911 -354666 -259163 -254086 -273777 -264409 -368144 -437751 -404973
1929 -404973 -311075 -427272 -380659 -212970 -289238 -295981 -309366 -276824 -359991 -379076 -155424
1918 -155424 -241011 -348076 -315251 -487345 -544598 -520824 -390588 -402051 -349006 -291945 -273219
1907 -273219 -368914 -354558 -399971 -421110 -417605 -301213 -219891 -327822 -287034 -224805 -206889
1896 -206889 -201949 -409093 -489090 -446620 -306065 -310297 -375778 -303458 -313648 -378988 -386924 -324050
1884 -324050 -322343 -417179 -403684 -362363 -343782 -339398 -387636 -334537 -418148 -519196 -321538 55906
1872 55906 -114946 -483694 -389448 -311894 -519872 -449691 -378906 -371056 -672497 -514844 -322390
1861 -322390 -633840 -677435 -413306 -238807 -519402 -588726 -315378 -340033 -672703 -329206
1851 -329206 -164436 -590679 -522144 -231460 -380925 -661885 -377808 -304283 -497137 -470881
1841 -470881 -396987 -264159 -446003 -511405 -257795 -390717 -563984 -558117 -384129 -423274 -449743
1830 -449743 -367096 -339549 -382550 -370533 -285519 -343224 -503831 -408409 -234382 -500722 -632894
1819 -632894 -363388 -73634 -306352 -556890 -345027 -239754 -583539 -501558 -280498 -381935
1809 -381935 -518855 -488551 -393618 -539917 -405615 -65278 -258669 -465491 -332905 -254906
1799 -254906 -453048 -438297 -151256 -188371 -317978 -426572 -325272 -482008 -548225 -322834
1789 -322834 -387842 -486081 -415008 -356185 -372841 -271116 -290563 -298417 -321130 -409600 -445263 -464124
1777 -464124 -365296 -501986 -560705 -283863 -216611 -447783 -427603 -269349 -406838 -519261
1767 -519261 -413312 -312719 -543635 -623335 -395129 -490928 -584674 -435063 -377543 -410141 -458208
1756 -458208 -375832 -265896 -272832 -306520 -371727 -499142 -464382 -295127 -342098 -320703 -264847
1745 -264847 -250769 -348128 -472075 -443727 -358340 -509179 -403765 -212866 -237961 -375045 -253451
1734 -253451 -200112 -386798 -348880 -282921 -394638 -457087 -339797 -289620 -459850 -363399 -127379
1723 -127379 -202364 -384578 -295721 -182445 -259696 -238188 -268625 -380759 -474071 -205195 -330950
1712 -330950 -451958 -396235 -368638 -497970 -492867 -285008 -461825 -543190 -437268 -291638 -403198
1701 -403198 -441112 -380435 -374401 -477177 -450497 -379159 -410659 -452374 -398764 -292364 -439408
1690 -439408 -337217 -267974 -294413 -353132 -303684 -322124 -429591 -547840 -464435 -338579 -231522
1679 -231522 -202721 -339329 -392496 -537608 -427661 -156907 -174677 -294143 -334849 -202570
1669 -202570 -295692 -483584 -357131 -302170 -457376 -538028 -399480 -468687 -431196 -286148 -223573
1658 -223573 -334258 -396296 -250482 -330188 -363838 -304589 -194073 -222740 -242094 -294235 -408648
1647 -408648 -507194 -491409 -290586 -226847 -292323 -278070 -236587 -370499 -386504 -349635 -291766
1636 -291766 -290738 -209396 -179041 -163858 -180775 -287571 -262210 -320125 -448125 -295756 -205596
1625 -205596 -342474 -271234 -267854 -341874 -502405 -388420 -371397 -404458 -474230 -392067 -263826
1614 -263826 -407312 -313147 -135158 -295526 -477933 -358117 -280327 -536720 -610466 -417270
1604 -417270 -472282 -576779 -322499 -132940 -501996 -511422 -338875 -399435 -378144 -323148 -136623
1593 -136623 -243199 -478454 -287068 -124658 -380866 -503701 -274847 -325952 -480858 -322037
1583 -322037 -139606 -372701 -561470 -393292 -330103 -448833 -439843 -357783 -431891 -495728 -446694
1572 -446694 -372081 -406958 -362929 -244712 -295466 -368134 -284934 -311765 -328133 -258533 -398554
1561 -398554 -451103 -425324 -319016 -188741 -141553 -218848 -372119 -274370 -337677 -248887 -117842
1550 -117842 -368985 -476318 -527208 -448879 -432039 -276877 -368692 -345789 -265609 -382458 -370885
1539 -370885 -330786 -412663 -222744 -186039 -236557 -311445 -416003 -302715 -157018 -245931 -328461
1528 -328461 -378232 -403397 -296700 -204208 -216413 -173461 -311703 -345432 -194355 -316235 -426509
1517 -426509 -347011 -312679 -432647 -562961 -399007 -258161 -383463 -193348 -261624 -513834
1507 -513834 -389866 -337073 -425459 -448330 -357728 -144081 -320622 -406197 -414091 -380419 -374940
1496 -374940 -249964 -306242 -410662 -541816 -480252 -319646 -303521 -242255 -318986 -450103 -547972
1485 -547972 -400893 -395456 -555183 -413686 -326097 -403252 -372369 -281878 -298394 -445847 -413965
1474 -413965 -336761 -379512 -489967 -444003 -434414 -535442 -386864 -329116 -256184 -439509 -389896
1463 -389896 -289217 -304193 -297552 -220881 -290199 -520416 -383728 -324352 -355314 -488058 -431588
1452 -431588 -343451 -433963 -397938 -409820 -294867 -249768 -156028 -192662 -365721 -367521 -411974
1441 -411974 -441852 -504145 -396601 -277825 -314851 -273436 -303699 -382315 -412334 -437296 -336507
1430 -336507 -215777 -317560 -347481 -368673 -402197 -302893 -277766 -286438 -331316 -365391 -303971
1419 -303971 -211908 -384348 -446570 -404977 -271122 -367131 -336158 -325175 -551827 -427097 -264075
1408 -264075 -195310 -360462 -354349 -294891 -281136 -298334 -175388 -161372 -320471 -305944 -296512
1397 -296512 -177624 -50703 -83816 -376627 -430014 -292481 -301948 -316343 -134580 -238747 -335336
1386 -335336 -204676 51275 -164644 -277728 -251706 -267968 -459332 -438674 -280078 -342070
1376 -342070 -510193 -329705 -297959 -499793 -454558 -341013 -212125 -329008 -320588 -296884 -330047
1365 -330047 -383816 -267340 -383766 -377552 -331945 -471578 -573094 -363683 -260852 -284377 -288187
1354 -288187 -224654 -329859 -252159 -206859 -259641 -301561 -309401 -282567 -466445 -436036 -251313
1343 -251313 -272676 -341373 -171945 -133199 -361407 -295525 -219567 -321148 -502806 -258607 -160116
1332 -160116 -328719 -377112 -218715 -230351 -365287 -181305 -257439 -257352 -289029 -183155 -269793
1321 -269793 -498685 -268895 -229176 -488246 -467850 -318019 -318104 -519504 -534766 -361759 -527504
1310 -527504 -652569 -374741 -341337 -470238 -292644 -132043 -191959 -288121 -306926 -240493 -180819
1299 -180819 -162804 -161694 -149251 -319688 -236110 -166059 -360415 -308088 -338887 -343703 -293394 -317047
1287 -317047 -268122 -294927 -258224 -252771 -195117 -213954 -177565 -92851 -139980 -354955 -407867 -372594
1275 -372594 -305890 -388763 -295980 -183626 -283652 -219467 -135006 -323216 -368506 -258178 -350053
1264 -350053 -237010 -268253 -289969 -285119 -358144 -335075 -354850 -463127 -434304 -355935 -402353
1253 -402353 -303876 -355947 -328182 -164957 -139722 -272899 -284263 -245306 -226462 -375545 -384012
1242 -384012 -329681 -445065 -417955 -305810 -87605 -223456 -264102 -248877 -464645 -398493 -296249
1231 -296249 -126368 -258283 -335489 -198820 -219337 -297268 -342664 -278061 -403140 -448433 -417395
1220 -417395 -189845 -381159 -536543 -438114 -304531 -420182 -320419 -215458 -364536 -526688
1210 -526688 -214450 -139860 -371249 -399078 -65673 -163112 -501405 -305290 -128962 -494090
1200 -494090 -492280 -98455 -149051 -484966 -352327 -76867 -410581 -495422 -139966 -172749 -371499
1189 -371499 -220204 -80090 -295766 -459266 -281730 -386279 -395380 -292931 -196230 -328892
1179 -328892 -390781 -237311 -350885 -398387 -247109 -186904 -336253 -353245 -286672 -438692 -301337
1168 -301337 -342105 -201530 -168840 -171388 -238166 -475061 -405960 -380068 -375915 -182133 -155168
1157 -155168 -310412 -366066 -416393 -570749 -487609 -393819 -436298 -457297 -315737 -215449 -314943
1146 -314943 -260121 -193344 -330348 -463668 -378544 -170347 -332633 -350104 -320645 -453095 -276487
1135 -276487 -146872 -354358 -566985 -375552 -265640 -439138 -399994 -223961 -386270 -515549
1125 -515549 -248240 -261412 -506262 -421276 -263944 -292214 -399148 -258118 -384407 -486964
1115 -486964 -278552 -413110 -594626 -320475 -118922 -321475 -366076 -165531 -220319 -472732
1105 -472732 -435751 -232655 -361146 -469394 -189122 -326302 -665922 -464865 -144163 -378237
1095 -378237 -371671 -244413 -357479 -530408 -242433 -129800 -386710 -230282 -2592 -159391
1085 -159391 -385811 -316909 -210740 -343361 -394595 -285756 -285298 -353711 -452860 -387644 -370041
1074 -370041 -386187 -441000 -367451 -235186 -398154 -411911 -270246 -369380 -433781 -331371 -226968
1063 -226968 -362329 -303937 -261067 -355164 -475609 -350576 -111670 -270422 -462211 -340591
1053 -340591 -453415 -435886 -299816 -218229 -464171 -620813 -409556 -297868 -485578 -357676
1043 -357676 -324209 -469173 -494512 -355283 -354496 -405250 -232147 -214821 -340462 -429275 -279691
1032 -279691 -182664 -228457 -173783 -246377 -422445 -221089 -264923 -433839 -427227 -244767 -225048
1021 -225048 -431959 -434802 -333197 -524712 -361671 -169540 -236570 -344079 -212671 19947
1011 19947 -337608 -271653 -115390 -196958 -370423 -439682 -323952 -309640 -282472 -209166 -158938
1000 -158938 -319649 -279361 -199165 -388561 -432949 -374696 -393964 -408158 -601297 -444853 -351154
989 -351154 -513865 -499054 -271195 -215368 -326262 -327977 -427723 -384189 -311219 -405998 -377671
978 -377671 -427880 -454093 -432854 -418155 -464879 -461347 -305308 -321275 -477775 -307329 -280352
967 -280352 -492833 -491572 -337538 -442359 -484201 -286610 -190388 -259218 -269088 -141175 -399150
956 -399150 -394264 -332595 -277928 -260597 -178480 -283696 -318999 -214531 -281767 -370429 -332287 -215840
944 -215840 -244792 -261303 -334462 -379757 -460952 -206024 -356917 -497707 -424678 -220357 -174509
933 -174509 -248085 -102961 -46992 -401230 -349361 -138747 -482422 -485126 -305211 -223981 -373983
922 -373983 -463911 -376468 -394327 -366423 -309696 -249887 -501421 -437554 -211016 -342583 -425454
911 -425454 -331302 -241287 -356743 -194239 -68793 -296388 -397396 -286828 -377911 -416996 -347189
900 -347189 -430689 -385132 -295069 -352070 -312255 -217921 -220472 -299182 -187692 -336928 -397567 -309183
888 -309183 -264562 -305212 -343857 -409509 -464598 -555096 -385305 -280284 -271782 -445713 -263757
877 -263757 -305486 -483221 -265894 -194505 -332437 -333060 -76608 -293968 -506850 -339831 -192684
866 -192684 -328675 -382533 -260278 -290964 -429618 -350125 -243003 -379833 -495913 -407539 -452362
855 -452362 -552846 -359293 -153434 -336421 -282557 -205599 -434416 -395740 -246819 -271332 -369636
844 -369636 -239177 -289316 -506316 -350212 -277809 -236272 -397751 -257791 -321512 -404622 -167242
833 -167242 -139408 -227753 -226184 -99986 -200531 -398662 -270314 -211195 -449608 -258348 -252165
822 -252165 -425888 -462622 -422013 -296621 -315228 -163003 -206156 -216577 -299249 -242129 -169573
811 -169573 -226242 -109694 -248274 -409117 -433620 -371176 -427593 -320801 -338135 -421047 -485069
800 -485069 -268888 -129069 -403358 -338034 -197547 -355916 -522673 -349160 -263354 -304738
790 -304738 -294023 -332575 -338516 -379188 -461523 -449058 -356984 -299021 -357376 -447773 -418707 -182112
778 -182112 -279580 -347299 -463302 -477771 -419738 -435066 -351929 -441784 -419542 -445007 -442947 -379575
766 -379575 -347578 -351246 -317356 -99248 -176145 -233429 -275879 -396210 -406438 -299862 -151142
755 -151142 -281793 -403606 -327116 -284956 -244377 -289177 -342147 -392086 -490593 -338748 -373252
744 -373252 -417055 -427400 -268326 -134205 -418172 -419784 -330757 -399843 -240520 -293268 -294690
733 -294690 -437740 -462133 -225301 -254833 -280591 -303574 -319496 -321484 -283778 -257495 -269400 -270578
721 -270578 -234691 -282008 -277807 -259127 -281876 -238806 -375759 -195160 -214084 -450587 -518843
710 -518843 -429358 -272831 -391451 -377600 -427752 -402930 -441197 -453514 -345005 -383991 -223774
699 -223774 -182537 -354911 -262138 -215648 -194591 -233975 -350991 -379856 -426209 -354376 -549917
688 -549917 -509911 -360413 -326173 -348098 -225318 -185601 -224083 -296067 -229432 -252151 -295299
677 -295299 -104756 -116098 -303270 -393166 -276433 -307277 -400192 -353180 -270572 -182508 -173591
666 -173591 -260619 -247165 -376337 -421702 -252616 -237382 -296151 -192116 -122202 -247278 -235204
655 -235204 -204269 -211328 -328587 -310659 -318869 -285940 -102941 -299996 -450253 -371657 -248852
644 -248852 -312337 -350607 -268666 -355992 -437559 -215838 -288183 -372613 -340894 -260581 -385711
633 -385711 -443592 -333786 -204733 -385320 -358370 -210440 -251679 -347297 -196245 -227920 -465829
622 -465829 -396745 -288684 -276048 -366929 -312418 -151786 -307117 -421618 -470844 -442537 -381117
611 -381117 -465603 -450221 -387722 -350104 -503558 -255144 -101792 -156461 -177103 -124205 -283842
600 -283842 -548432 -362614 -108168 -273110 -320582 -120776 -252278 -608090 -419339 -226895
590 -226895 -387748 -410466 -184141 -228742 -362422 -328442 -167041 -208811 -311232 -254322 -270305
579 -270305 -397915 -420060 -364723 -350257 -315294 -247775 -155028 -258498 -403751 -452238 -230378
568 -230378 -393000 -463426 -238253 -91643 -239503 -484334 -387457 -240278 -489779 -345217
558 -345217 -107300 -300397 -620322 -404289 -208216 -340993 -352839 -39016 -128182 -466932
548 -466932 -217963 -89310 -349485 -565305 -304163 -204651 -424206 -412498 -148605 -389031
538 -389031 -551883 -367261 -260640 -380362 -374917 -251521 -235949 -305561 -245536 -178697 -367797
527 -367797 -550627 -383605 -332336 -464810 -325381 -101350 -246936 -405920 -316002 -321692 -441534
516 -441534 -504350 -387150 -328531 -448243 -351997 -262864 -282259 -511422 -362615 -267486 -503079
505 -503079 -408027 -301637 -394989 -476194 -198974 -168702 -378489 -411395 -310472 -321055 -432327
494 -432327 -222435 -87170 -302967 -448506 -265612 -386353 -589633 -419156 -167542 -303761
484 -303761 -359250 -265615 -255608 -200503 -249101 -168807 -152229 -218376 -334162 -334744 -124098 -225676
472 -225676 -310620 -273950 -323199 -418843 -470781 -353801 -330623 -419392 -408356 -346873 -531846
461 -531846 -498298 -387417 -353329 -435838 -382004 -281342 -224643 -301909 -322741 -78507 -268651
450 -268651 -314942 -116573 -105615 -274224 -411595 -326717 -217802 -329315 -229171 -15029
440 -15029 -156698 -286482 -214207 -255026 -429270 -247017 -76868 -327814 -477423 -251122
430 -251122 -231218 -373895 -389573 -238114 -447481 -608164 -362686 -185035 -475282 -384385
420 -384385 -222321 -117379 -269605 -256655 -90176 -175062 -256925 -266764 -134063 -283924 -283964
409 -283964 -137398 -215058 -358164 -302553 -131295 -338649 -402104 -223202 -271756 -407673 -375167
398 -375167 -147367 -179246 -297591 -355632 -256493 -401534 -407676 -191211 -344649 -449247 -331713
387 -331713 -152402 -307574 -417949 -292097 -271692 -438343 -442829 -212967 -378449 -408520 -185944
376 -185944 -231296 -423840 -206650 -143190 -286543 -219680 -16100 -117416 -323937 -271018 -150728
365 -150728 -98084 -170167 -132222 -139423 -284295 -214427 -296843 -358013 -304126 -221229 -422406 -465289
353 -465289 -393915 -544877 -529098 -357958 -406163 -409228 -241521 -211464 -389943 -339708 -96252
342 -96252 -167171 -369891 -243057 -171542 -347111 -206164 -159198 -236003 -370036 -344474 -420679
331 -420679 -482993 -382078 -293041 -307593 -425762 -295230 -254229 -401458 -428520 -302440 -256403
320 -256403 -440768 -347203 -117013 -206512 -260309 -213214 -303749 -443398 -280632 -92148 -223006
309 -223006 -468449 -376796 -156854 -210331 -250495 -212019 -269919 -343676 -183390 -166076 -295356
298 -295356 -298811 -246449 -156898 -301833 -397736 -122557 -213787 -306401 -226272 -270956 -275431 -319010
286 -319010 -308279 -338186 -354282 -261520 -222594 -215795 -267444 -258656 -233356 -246794 -332638 -396289
274 -396289 -369845 -342608 -403455 -374735 -326070 -478984 -458483 -213120 -258422 -545139 -571900
263 -571900 -394089 -484273 -613952 -304694 -356640 -520721 -503034 -324270 -364022 -351297 -303801
252 -303801 -299601 -323397 -303368 -115818 -344065 -346816 -199107 -218386 -294922 -297032 -276825 -386591
240 -386591 -410929 -380270 -399981 -412154 -393207 -206882 -297775 -235741 -154674 -349562 -408547
229 -408547 -252356 -258360 -413372 -348098 -273024 -272865 -238737 -253783 -368897 -508440 -490613 -373862
217 -373862 -366419 -468814 -453539 -297857 -361295 -346670 -340836 -281826 -333127 -406270 -295160 -347596
205 -347596 -331859 -205500 -209062 -269537 -435934 -467198 -292694 -386659 -299572 -196161 -203758
194 -203758 -249403 -196906 -209282 -312231 -302266 -260198 -285752 -378709 -359594 -340369 -388802 -389569
182 -389569 -355104 -430989 -396923 -275463 -307119 -364619 -402924 -388293 -337689 -401657 -462562 -363810
170 -363810 -413441 -516779 -478543 -426681 -330608 -375817 -378603 -322309 -332462 -340848 -362056 -235514
158 -235514 -212548 -412647 -533636 -434339 -447569 -522522 -433840 -434128 -506244 -485438 -373216 -367853
146 -367853 -485879 -489453 -376006 -386326 -377112 -452719 -427778 -387599 -403899 -383489 -380377 -230616
134 -230616 -305071 -337808 -218036 -348305 -395857 -402177 -396217 -507476 -505247 -389951 -325048 -393124
122 -393124 -390301 -436354 -493976 -446578 -269083 -323678 -381745 -427521 -431991 -491620 -440806 -399213
110 -399213 -490336 -351043 -177317 -283840 -560879 -440680 -394461 -548781 -523669 -411170
100 -411170 -453004 -443012 -445345 -435192 -470710 -472815 -392437 -382780 -370088 -360206 -345069 -390860 -495023
87 -495023 -450370 -467270 -463123 -417117 -304513 -358117 -473633 -494715 -414756 -520672 -523002 -438629
75 -438629 -470722 -530480 -430184 -273899 -414879 -445277 -448511 -460376 -538790 -538321 -445237 -529574
63 -529574 -558478 -544264 -536118 -563159 -538613 -337409 -338621 -549077 -551657 -475248 -556622 -559166
51 -559166 -340649 -399139 -540968 -420081 -350751 -445100 -549833 -552454 -584831 -555925 -428110
40 -428110 -414696 -453639 -448379 -551572 -735732 -713382 -548629 -565151 -681794 -475761 -464364
29 -464364 -605624 -553315 -500643 -591807 -652662 -477902 -509785 -674235 -636858 -600373 -647107
18 -647107 -644243 -447344 -587780 -690455 -502139 -467952 -562999 -662889 -598705 -565504 -728417
7 -728417 -619669 -554608 -653389 -632841 -526300 -497429 -542414
0 -542414
$$ Imaginary data points
##PAGE= N=2
##DATA TABLE= (X++(I..I)), XYDATA
16383 -1588532 -1654754 -1657882 -1620936 -1635835 -1535663 -1438021 -1476111 -1430872 -1332410 -1303223 -1197482
16372 -1197482 -1175518 -1202135 -1195316 -1191741 -1148033 -1117745 -1027304 -989254 -866557 -1009595 -1016666
16361 -1016666 -849283 -797722 -782849 -833537 -788406 -769546 -816686 -668110 -624126 -779848 -686214
16350 -686214 -540290 -552035 -620530 -470974 -363070 -482946 -488440 -323783 -304955 -377979 -294904
16339 -294904 -185518 -332666 -388816 -170633 -167495 -204784 -125089 -151603 -103094 14881 2124
16328 2124 -64516 -88340 18981 19039 66228 110532 147803 168773 238481 305845 392488 407849
16316 407849 430838 434264 452575 528511 576434 469921 514376 615470 532047 520837 672335
16305 672335 572333 479807 574814 705940 652920 779017 875793 915298 874647 855150 1001767
16294 1001767 1000152 972509 1046967 1034143 1011752 958819 980945 991374 906071 1070951 1178650
16283 1178650 1159866 1135464 1160936 1189667 1257280 1283615 1431418 1490854 1388219 1338692 1399016
16272 1399016 1363460 1297673 1412350 1588137 1561050 1563821 1580996 1595827 1464538 1563530 1600623
16261 1600623 1519874 1540440 1708147 1760389 1748147 1805225 1884753 1853456 1769450 1841554 1806389
16250 1806389 1731090 1749849 1907906 2045933 1911931 1954546 1912631 1983359 1932202 1872885 1946835
16239 1946835 2133801 2109744 1896731 1981373 2088332 1960266 1970619 2284311 2131445 2095113
16229 2095113 2305703 2220075 2004584 2073048 2278968 2202359 2047433 2348768 2392438 2192758
16219 2192758 2216721 2264907 2343909 2181821 2275833 2498872 2400800 2336674 2521919 2537776 2244885
16208 2244885 2274936 2478474 2409540 2370768 2510549 2657721 2665192 2533337 2765735 2628890
16198 2628890 2393294 2460556 2824343 2716301 2590486 2717942 2773178 2580527 2538639 2684600
16188 2684600 2588120 2476919 2573306 2732548 2611323 2588463 2636718 2697193 2817395 2884088
16178 2884088 2874534 2808572 2856740 2903052 2892383 2845762 2848028 2849423 2887773 3070960 2917314
16167 2917314 2833601 2945914 3104754 3004160 2837741 2993340 2986820 2917344 3132952 3046152
16157 3046152 2777578 2918309 3133646 2892659 2790418 3052416 3025529 2811859 2908245 3018928
16147 3018928 2821920 2724250 3042079 3053293 2740679 2921178 3224815 3118614 2919786 3133305
16137 3133305 3183002 2980394 3077318 3308242 3132742 3103212 3277431 3073544 2850687 3023449
16127 3023449 3173164 2975917 2927548 2979291 3020651 2877513 2958112 3117007 2940506 2863061
16117 2863061 3179052 3295439 3146776 3156433 3115016 3084648 3084943 3139564 3127899 3121504 3135734
16106 3135734 3117589 3179261 3162755 3283166 3208629 3119200 3077792 3142338 3211529 3036414 3003888
16095 3003888 3167106 3315709 3205599 3202468 3366910 3327512 3177126 3116910 3339457 3228980
16085 3228980 3088142 3285732 3350850 3156624 3136326 3272619 3150742 3013966 3210737 3246745
16075 3246745 3050922 3145366 3220843 3243466 3187243 3239004 3222717 3089685 3140294 3330306 3481437
16064 3481437 3326701 3200275 3312826 3294602 3344145 3388904 3413224 3477132 3238244 3219326
16054 3219326 3223218 3085847 3078427 3158546 3277655 3120492 3041524 3311900 3353774 3181163 3264562
16043 3264562 3382557 3078728 2955693 3181256 3134705 3151745 3076982 3312957 3150730 3018439
16033 3018439 3278037 3428512 3263154 3223298 3347897 3276645 3137285 3276438 3273060 3081527
16023 3081527 3068993 3239140 3318400 3214055 3284842 3246278 3237596 3179826 3350396 3348077 3124580
16012 3124580 3134062 3357757 3306908 3154261 3152211 3259471 3204323 3187856 3276669 3224814 3185643
16001 3185643 3215817 3370665 3256373 3120333 3173168 3239945 3187352 3245858 3205915 3301622 3273994
15990 3273994 3147734 3111263 3072443 3295904 3247072 3156342 3043520 3217499 3276549 3372180
15980 3372180 3390114 3477480 3543674 3470435 3503118 3555266 3478346 3350644 3370644 3379476 3326264
15969 3326264 3352503 3402662 3279831 3238830 3244428 3204344 3138164 3170741 3137901 3325016 3262513
15958 3262513 3177060 3286762 3267702 3362071 3467838 3352317 3202096 3273337 3273026 3174814 3236189
15947 3236189 3405613 3375023 3264936 3273057 3385410 3297773 3283927 3240352 3311965 3262885 3225331
15936 3225331 3272295 3207320 3131299 3180639 3246401 3164455 3189340 3219969 3208793 3355787 3419641
15925 3419641 3225304 3157410 3308776 3436204 3349725 3280027 3339759 3414278 3433282 3477069 3377523
$$ [...]
##END NTUPLES=NMR SPECTRUM
##END=
