##TITLE=1H_DE-80H_X3
 200.13MHz, d2o
 8 sc
 
 19ns.26.2.2025
##JCAMPDX= 6.0         $$ Bruker NMR JCAMP-DX V2.0
##DATA TYPE= NMR SPECTRUM
##DATA CLASS= NTUPLES
##ORIGIN= UXNMR, Bruker Analytische Messtechnik GmbH
##OWNER= pz
$$ XWIN-NMR		Version 3.5
$$ Fri Apr  3 10:01:57 2026 Russian Standard Time (UT+4h)  Yarkov@DPX200
##.OBSERVE FREQUENCY= 200.1313
##.OBSERVE NUCLEUS= ^1H
##.ACQUISITION MODE= SIMULTANEOUS
##.ACQUISITION SCHEME= undefined
##.AVERAGES= 8
##.DIGITISER RES= 18
##SPECTROMETER/DATA SYSTEM= spect
##.PULSE SEQUENCE= zg30
##.SOLVENT NAME= CDCl3
##.SHIFT REFERENCE= (INTERNAL, CDCl3, 0, 15.4241)
##AUDIT TRAIL= $$ (NUMBER, WHEN, WHO, WHERE, WHAT)
$$ ##TITLE= Audit trail, XWIN-NMR		Version 3.5
$$ ##JCAMPDX= 5.01
$$ ##ORIGIN= Bruker BioSpin GmbH
$$ ##OWNER= Yarkov
$$ C:/Bruker/XWIN-NMR/data/yarkov2/nmr/H-C/1/pdata/1/auditp.txt
$$ ##AUDIT TRAIL=  $$ (NUMBER, WHEN, WHO, WHERE, WHAT)
(   1,<2026-04-03 10:00:43.92 +0400>,<Yarkov>,<DPX200>,
      <created by zg, POWCHK disabled, PULCHK disabled
       configuration hash MD5:
       00 E9 B6 7A A2 85 ED C7 34 08 36 98 17 FE 4E 26
       data hash MD5: 16K
       DB 76 87 9A FC B2 22 07 0F B7 0C 50 CC AC 8D 8B>)
(   2,<2026-04-03 10:00:58.20 +0400>,<Yarkov>,<DPX200>,
      <Start of raw data processing
       efp BC_mod = 2 LB = 0.25 FT_mod = 6 PKNL = 1 PHC0 = -5306.548 PHC1 = 6.821927 SI = 16K 
       data hash MD5: 16K
       AE 54 85 DC 43 C2 0D 4C 7E F7 91 8F CF CC 5E C8>)
(   3,<2026-04-03 10:01:12.76 +0400>,<Yarkov>,<DPX200>,
      <pk PHC0 = 4.6 PHC1 = 0 
       data hash MD5: 16K
       40 F4 AC 68 AB C0 23 F5 65 E9 05 24 DE D7 3F 06>)
$$ ##END=
$$ 
$$ hash MD5
$$ E5 CB EF 7B F6 91 4F 66 9F 1D 63 E8 A8 E4 62 1C
##$RELAX= 
##$RELAX= 
##$RELAX= 
##$RELAX= 
##$RELAX= 
##$RELAX= 
$$ Bruker specific parameters
$$ --------------------------
##$DU= <C:/Bruker/XWIN-NMR>
##$EXPNO= 1
##$NAME= <H-C>
##$PROCNO= 1
##$TYPE= <nmr>
##$USER= <yarkov2>
##$AMP= (0..31)
100 100 100 100 100 100 100 100 100 100 100 100 100 100 100 100 100 100 
100 100 100 100 100 100 100 100 100 100 100 100 100 100 
##$AQSEQ= 0
##$AQ_mod= 1
##$AUNM= <au_zg>
##$AUTOPOS= <>
##$BF1= 200.13
##$BF2= 200.13
##$BF3= 200.13
##$BF4= 200.13
##$BF5= 200.13
##$BF6= 200.13
##$BF7= 200.13
##$BF8= 200.13
##$BYTORDA= 1
##$CFDGTYP= 0
##$CFRGTYP= 5
##$CHEMSTR= <none>
##$CNST= (0..31)
1 1 145 1 1 1 1 1 1 1 1 1 1 1 1 1 1 1 1 1 1 1 1 1 1 1 1 1 1 1 1 1 
##$CPDPRG= <>
##$CPDPRG1= <>
##$CPDPRG2= <>
##$CPDPRG3= <>
##$CPDPRG4= <mlev>
##$CPDPRG5= <mlev>
##$CPDPRG6= <mlev>
##$CPDPRG7= <mlev>
##$CPDPRG8= <mlev>
##$CPDPRGB= <>
##$CPDPRGT= <>
##$D= (0..31)
0 0.7 0 0 0 0 0 0 0 0 0 0.03 0 0 0 0 0 0 0 0 0 0 0 0 0 0 0 0 0 0 0 0 
##$DATE= 1775196043
##$DBL= (0..7)
120 120 120 120 120 120 120 120 
##$DBP= (0..7)
150 150 150 150 150 150 150 150 
##$DBP07= 0
##$DBPNAM0= <>
##$DBPNAM1= <>
##$DBPNAM2= <>
##$DBPNAM3= <>
##$DBPNAM4= <>
##$DBPNAM5= <>
##$DBPNAM6= <>
##$DBPNAM7= <>
##$DBPOAL= (0..7)
0.5 0.5 0.5 0.5 0.5 0.5 0.5 0.5 
##$DBPOFFS= (0..7)
0 0 0 0 0 0 0 0 
$$ [...]
##$SUBNAM2= <"">
##$SUBNAM3= <"">
##$SUBNAM4= <"">
##$SUBNAM5= <"">
##$SUBNAM6= <"">
##$SUBNAM7= <"">
##$SUBNAM8= <"">
##$SUBNAM9= <"">
##$SW= 18.0517328524113
##$SWIBOX= (0..15)
0 0 2 0 0 0 0 0 0 0 0 0 0 0 0 0 
##$SW_h= 3612.71676300578
##$TD= 16384
##$TD0= 1
##$TE= 0
##$TE2= 300
##$TE3= 300
##$TEG= 300
##$TL= (0..7)
0 120 120 120 120 120 120 120 
##$TP= (0..7)
150 150 150 150 150 150 150 150 
##$TP07= 0
##$TPNAME0= <>
##$TPNAME1= <>
##$TPNAME2= <>
##$TPNAME3= <>
##$TPNAME4= <>
##$TPNAME5= <>
##$TPNAME6= <>
##$TPNAME7= <>
##$TPOAL= (0..7)
0.5 0.5 0.5 0.5 0.5 0.5 0.5 0.5 
##$TPOFFS= (0..7)
0 0 0 0 0 0 0 0 
##$TUNHIN= 0
##$TUNHOUT= 0
##$TUNXOUT= 0
##$USERA1= <user>
##$USERA2= <user>
##$USERA3= <user>
##$USERA4= <user>
##$USERA5= <user>
##$V9= 5
##$VALIST= <valist>
##$VCLIST= <CCCCCCCCCCCCCCC>
##$VD= 0
##$VDLIST= <DDDDDDDDDDDDDDD>
##$VPLIST= <PPPPPPPPPPPPPPP>
##$VTLIST= <TTTTTTTTTTTTTTT>
##$WBST= 1024
##$WBSW= 4
##$XGAIN= (0..3)
0 0 0 0 
##$XL= 0
##$YL= 0
##$YMAX_a= 261392
##$YMIN_a= -248251
##$ZGOPTNS= <>
##$ZL1= 120
##$ZL2= 120
##$ZL3= 120
##$ZL4= 120
##$ABSF1= 0
##$ABSF2= 0
##$ABSG= 0
##$ABSL= 0
##$ALPHA= 0
##$AQORDER= 0
##$ASSFAC= 0
##$ASSFACI= 0
##$ASSFACX= 0
##$ASSWID= 0
##$AUNMP= <proc_1d>
##$AZFE= 0.1
##$AZFW= 0.1
##$BCFW= 0
##$BC_mod= 2
##$BYTORDP= 0
##$COROFFS= 0
##$CY= -3
##$DATMOD= 1
##$DC= 0
##$DFILT= <>
##$DTYPP= 0
##$F1P= 0
##$F2P= 0
##$FCOR= 1
##$FTSIZE= 16384
##$FT_mod= 6
##$GAMMA= 0
##$GB= 0
##$INTBC= 1
##$INTSCL= 3.241238e-09
##$ISEN= 128
##$LB= 0.25
##$LEV0= 0
##$LPBIN= 0
##$MAXI= 10000
##$MC2= 0
##$MEAN= 0
##$ME_mod= 0
##$MI= 1.114404
##$NCOEF= 0
##$NC_proc= -7
##$NLEV= 6
##$NOISF1= 3.799351
##$NOISF2= 2.8
##$NSP= 0
##$NTH_PI= 0
##$NZP= 0
##$OFFSET= 15.42406
##$PC= 1
##$PHC0= -5301.948
##$PHC1= 6.821927
##$PH_mod= 1
##$PKNL= yes
##$PPARMOD= 0
##$PSCAL= 0
##$PSIGN= 0
##$REVERSE= no
##$SF= 200.130019540958
##$SI= 16384
##$SIGF1= 3
##$SIGF2= 2
##$SINO= 0.751879
##$SIOLD= 32768
##$SREGLST= <19F.Aceton>
##$SSB= 0
##$STSI= 16384
##$STSR= 0
##$SW_p= 3612.71676300578
##$SYMM= 0
##$S_DEV= 0
##$TDeff= 16384
##$TDoff= 0
##$TI= <>
##$TILT= no
##$TM1= 0
##$TM2= 0
##$TOPLEV= 0
##$USERP1= <user>
##$USERP2= <user>
##$USERP3= <user>
##$USERP4= <user>
##$USERP5= <user>
##$WDW= 1
##$XDIM= 16384
##$YMAX_p= 351349201
##$YMIN_p= -1157543
$$ End of Bruker specific parameters
$$ ---------------------------------
##NTUPLES= NMR SPECTRUM
##VAR_NAME=  FREQUENCY,     SPECTRUM/REAL,   SPECTRUM/IMAG
##SYMBOL=    X,             R,               I
##VAR_TYPE=  INDEPENDENT,   DEPENDENT,       DEPENDENT
##VAR_FORM=  AFFN,          ASDF,            ASDF
##VAR_DIM=   16384,         16384,           16384
##UNITS=     HZ,            ARBITRARY UNITS, ARBITRARY UNITS
##FACTOR=    0.220516191357247, 1,           1
##FIRST=     3086.81740275551, 0,            0
##LAST=      -525.899360250275, 0,           0
##MIN=       -525.899360250275, -1157543,    0
##MAX=       3086.81740275551, 351349201,    0
$$ Real data points
##PAGE= N=1
##DATA TABLE= (X++(R..R)), XYDATA
$$ [...]
7846a97436J29729k633p7517O1737J00915j40893j14749J29097R5980j13106q9771
7835b18647O8469R9046J5481N3392m5687K9548j43383l1660M0560M8606M8677
7824c5598m2271R2982K0354j538j47976N8544K3223L9957O157p7863M4128o3481
7812h3382j24276M3430J00675m5872J5567O1594J07378P3756n91547K06420O1166
7801a75091j75133K25556m8740m3132N2659J26405m193j7969j37311m7039K01845
7790d2143k9544l001O1003j7136o5358J06520M3707j30312J8269L766R5445r5258
7778e4042P2931j55141p0302J0333J01677J08671K97J4694r2137Q5434q969q3515
7766g0069j33079n5931P9489R5727l78n3227k9340N102M9234O0332K9796O2748
$$ plain form
7846 -197436 -67707 -70340 -147857 -86120 14795 -126098 -240847 -111750 -15770 -128876 -218647
7835 -218647 -150178 -51132 -35651 17741 -27946 1602 -141781 -173441 -132881 -84275 -35598
7824 -35598 -77869 15113 35467 33929 -114047 -55503 -32280 7677 13834 -64029 -19901 -83382
7812 -83382 -207658 -164228 -63553 -109425 -93858 -32264 75114 148870 -442677 -236257 -175091
7801 -175091 -350224 -124668 -173408 -216540 -163881 -37476 -41669 -59638 -196949 -243988 -42143
7790 -42143 -71687 -74688 -13685 -30821 -96179 10341 54048 -76264 -57995 -54229 41216 -54042
7778 -54042 18889 -136252 -206554 -196221 -94544 14127 14424 29118 -63019 22415 13446 -70069
7766 -70069 -203148 -259079 -179590 -83863 -84241 -137468 -166808 -161706 -112472 -52140 -22344 40404
7754D0404m2833j09790K3649J38881j6289m7497J21335K4551j08534j76652K6304
7743a26471j6544J6780J54741K8972m5147p6046J43019l437n5695K4953L2099
7732G7224m2035M1209P3482J0269n4513l4184J35377j29281q1974q6711j1386
7721a02523L0300M2697K7370k1436k7075R7910P6629O8641J6358j27249k6008
7710E5614l9168o5758J4168J03117j41044J11029J60562j34414j3145P7561q9010
7699C9512M8183N3623L8649j17046o2984J32959n711j40810R96R5253l4390J25827
7687A74061j32797N3957k6060m0813k9186O0336o6967N9990R3816o1451j07975
7676b3089N8433L4914k00318Q7377O3444k2019o4231M9673l7015m7196Q7996l8748
$$ plain form
7754 40404 -2429 -112219 -88570 50311 34022 -13475 107860 132411 23877 -152775 -126471
7743 -126471 -143015 -126235 28506 57478 12331 -63715 79304 75867 20172 45125 77224
7732 77224 35189 76398 149880 160149 105636 71452 206829 77548 -4426 -91137 -102523
7721 -102523 -72223 -29526 -2156 -23592 -50667 47243 123872 192513 208871 81622 55614
7710 55614 16446 -49312 -35144 67973 -73071 37958 198520 64106 50961 128522 39512
7699 39512 87695 141318 179967 62921 -63 132896 127185 -13625 -12629 82624 48234 174061
7687 174061 41264 95221 69161 28348 -838 59498 -7469 52521 146337 84886 -23089
7676 -23089 35344 70258 -130060 -42683 20761 -1258 -65489 -15816 -52831 -100027 -12031 -50779
7664e0779M7186J81094j64919q36J4926J5033j7428M9585J3415j60362k2990m467
7652a00542Q1433P9033p651K4455o3475R353k3760N5596j59841j01975k886P7749
7640a32511J43133j12173K8443J8443O1661N9482n9520K9149n0588j17515P3025
7629e8971P1738o1838j35928n4912J04281L1689o1762Q4575P4520l7612J10050
7618F5830L3228j5416K0259l2949J35760j46879j05724O6359n9844J32174j01962
7607i164j39334k0860J81037J83024j62782p0730M7752m2481l0150k3107J8571
7596f8224l1031m973K53970j33235o4950l8151n4918J54366M0669j53512R6552
7585c437R4674O6093n9071k4854p0963m4373J21727N7974j56877j8998L9844J9009
$$ plain form
7664 -50779 -3593 177501 12582 11746 26672 41705 24277 73862 87277 -73085 -96075 -100542
7652 -100542 -19109 59924 52273 76728 13253 22606 -1154 54442 -105399 -207374 -210260 -132511
7640 -132511 10622 -101551 -73108 -54665 6996 66478 6958 36107 -14481 -131996 -58971
7629 -58971 12767 -49071 -184999 -239911 -135630 -103941 -165703 -81128 -6608 -44220 65830
7618 65830 99058 83642 103901 70952 206712 59833 -45891 20468 -39376 92798 -9164
7607 -9164 -148498 -169358 11679 194703 31921 -38809 8943 -33538 -63688 -86795 -68224
7596 -68224 -99255 -104228 149742 16507 -48443 -86594 -141512 12854 53523 -99989 -3437
7585 -3437 91237 157330 98259 73405 2442 -41931 79796 137770 -19107 -38105 1739 20748
7573B0748M2526J08378Q2780k46851p0810J2274q9440J5224K2678j4360J9183
7562i7670j4795r592j7245n2451m6933R4810l3335j3841n3875J37605M982P9702
7550b2638K6542q1421J61828Q279m0166n0919q9603n9518j21577K16786J7438
7539c4969N7093o5186q1559J09982R3695j18223o5594K01786j02914l2048j0804
7528d8741j0789l4530L7998O1303L2971r7922j11184R9756j15309O4409J86817
7517F4779k9832L19q78j20292J1942J33700Q7990o9573p4731k2718k2968N9656
7505A7394q8831q943N1852K5523p7510N8324M3137O8847l2204J9495j79628q0260
7493a82804J32268P567J6963k4788p7650J15330P2963r7676j09499j26164j9095
$$ plain form
7573 20748 63274 171652 254432 7581 -63229 -50955 -140395 -125171 -102493 -116853 -97670
7562 -97670 -112465 -122057 -139302 -191753 -238686 -143876 -177211 -191052 -244927 -107322 -102340 -22638
7550 -22638 3904 -77517 84311 92590 52424 1505 -88098 -147616 -269193 -52407 -34969
7539 -34969 22124 -43062 -124621 -14639 79056 -39167 -104761 97025 -5889 -37937 -48741
7528 -48741 -59530 -94060 -56062 5241 38212 -59710 -170894 -71138 -186447 -122038 64779
7517 64779 34947 35266 34388 -85904 -73962 59738 147728 78155 3424 -19294 -42262 17394
7505 17394 -71437 -80380 -28528 -3005 -80515 -22191 20946 89793 57589 77084 -102544 -182804
7493 -182804 -50536 -42969 -26006 -50794 -128444 -13114 59849 -37827 -147326 -273490 -292585
7482b92585J15334J04286j40287N9605J96937l1209l9545j0044J66268J21985
7472B50745j15671j65821n951N1056O7863J17659j51081j44506j00836R6197J02731
7461B385l1366l9996j4762j00932L595l586J68815P539J09152M6461j02895Q9427
7449A33837k3539j10395r0890L9552l097r812Q2821j9335m6318N8151K4132k0843
7437A4264N611K8874l7476k7779J66322j3997k24665R7042P4745m346r74n0303
7425B7318J34105q8288P907J10822j92598K7680o8526K6604j17517j4874R511
7414a37856J49851N7614N4834R7469r2344p6624M7367k2283J4944J3601l7590
7403F8983k500o0794p6729n3524J83628O9171l180o4519j0412L2082P0024O4271
$$ plain form
7482 -292585 -177251 -72965 -213252 -153647 43290 12081 -27464 -37508 128760 250745
7472 250745 135074 -30747 -36698 14358 82221 199880 48799 -95707 -196543 -100346 2385
7461 2385 -28981 -68977 -83739 -184671 -181076 -184662 -15847 -8308 100844 147305 44410 133837
7449 133837 110298 -97 -90987 -51435 -54532 -64344 18477 -858 -47176 10975 35107 14264
7437 14264 19875 48749 11273 -16506 149816 135819 -88846 8196 82941 78595 77621 27318
7425 27318 161423 73135 81042 191864 -734 26946 -41580 -14976 -132493 -147367 -137856
7414 -137856 11995 69609 124443 221912 129568 52944 100311 78028 92972 106573 68983
7403 68983 66483 5689 -71040 -124564 59064 128235 125055 60536 50124 82206 152230 216501
7391B16501N5794k04463j08443r832J03121m5924j38172M6625L5475m6174M993
7380i0499R7551J78662m0113K3799j0334k6938M314p2397N2932o545J38025k85171
7368c6714j0781N4349j17617M1007Q9164k1193Q1308J6403r6373J6721P376n1269
7356b7619N2207o4079M4498P0078R448l8432J3711M1173j63569O9367J11005l2348
7344H5440K2297l3058r22j9714j27355o4734o687J76002n3435P1429J8383r4631
7332b6985R0729N8898J21224j6399o7590m3053M5745j06092j38539J90196J3962
7321A22096k068j12729j2461Q215L8795O700J11100j19691j30290J25703M0376
7310G5746j08943j0026J43305k9277p8141p6984J20747Q0691N4451l6063J1379
$$ plain form
7391 216501 272295 67832 -40611 -50443 52678 6754 -131418 -84793 -49318 -95492 -90499
7380 -90499 7052 185714 145601 169400 159066 132128 136442 64045 116977 110432 248457 -36714
7368 -36714 -47495 6854 -110763 -69756 19408 -1785 79523 95926 -447 16274 23650 -27619
7356 -27619 24588 -39491 5007 75085 84533 46101 59812 100985 -62584 6783 117788 85440
7344 85440 107737 74679 73757 54043 -73312 -138046 -144733 31269 -22166 49263 67646 -26985
7332 -26985 63744 122642 243866 227467 159877 116824 162569 56477 -82062 108134 122096
7321 122096 120028 7299 -5162 3053 41848 48548 159648 39957 -90333 35370 75746
7310 75746 -33197 -43223 100082 70805 -7336 -84320 36427 117118 171569 135506 146885
7299A46885m3502o5534k9635M1812K8660l5182N9122p4908q625j37470J50247
7288C1870J31915r027J19749j21263j22307M7574r4295R9348j4184m2315q933
7277A8132R8386P8941m8729j2179Q562L58M0793J83864n6285k19301j09521M2841
7265B5862N1037k7283k6786j06145P3749j7691q1148k5456J15319K818K987O1112
7253D8375n2582L9450m5932K82620R092r8802q3099P604k2170n2307R7882Q3072
7241B13203p337k13971O2251J16691n8560J18439k0746q6105j38071L169M9533
7230C8496J55677l2637k2891p129j7599n0021j43514J83633j4785k02398j2192
7219a25360J53486o8832Q0377L9312p5574K3883L4396P7853q1262J12384j2200
$$ plain form
7299 146885 103383 37849 8214 50026 78686 43504 102626 27718 19093 -118377 31870
7288 31870 163785 154758 274507 153244 30937 78511 -15784 83564 69380 27065 18132
7277 18132 116518 195459 146730 134551 143113 143471 184264 368128 311843 92542 -16979 25862
7265 25862 76899 49616 22830 -83315 -9566 -27257 -108405 -133861 -18542 -15724 -12737 48375
7253 48375 -4207 35243 -10689 271931 281023 182221 99122 106726 84556 32249 130131 213203
7241 213203 205866 -8105 54146 170837 112277 230716 209970 123865 -14206 -11037 38496
7230 38496 194173 161536 138645 131516 113917 63896 -79618 104015 89230 -113168 -125360
7219 -125360 28126 -40706 39671 78983 3409 27292 61688 139541 58279 170663 158463
7208A58463L9018j51399K7774P8057r7807J42205N6428j14135L1352Q0371j40564
7197A09763l7392R723q5972m1264J40156P748m2660M7714o6304N432n5790k6830
7185c5676P4801J22525r890J5663r7562Q3L7295J79079M5594k26717j22290K6371
7173I276L3413K9887k2186j9859L9771l8401P0510o058l3376K3473M6818L365
7161A36633r5589n616n2472N6748N7353P5581p2433j07568J72418o3350j56858
7150e5153R3987J09685j22007l4657K1180j4369k9058K3978p8702j5955j7859
7139a18930P5043R0109j35920K0733Q0360j69990L3356Q0956J25824M0350l2240
7128H9651p1790R1526j01669M2901q5225J10059O1683j23534n421P9762j00403
$$ plain form
7208 158463 197481 46082 73856 151913 54106 196311 252739 138604 169956 250327 109763
7197 109763 72371 82094 -3878 -45142 95014 102762 60102 107816 41512 46944 -8846 -35676
7185 -35676 39125 161650 151760 167423 69861 69944 107239 286318 331912 105195 -17095 9276
7173 9276 42689 72576 50390 30531 70302 31901 102411 96353 62977 86450 133268 136633
7161 136633 41044 35428 -17044 39704 97057 172638 100205 -7363 165055 101705 -55153
7150 -55153 38834 148519 26512 -8145 13035 -1334 -30392 -6414 -85116 -101071 -118930
7139 -118930 -43887 46222 -89698 -68965 11395 -158595 -125239 -44283 81541 121891 89651
7128 89651 17861 109387 7718 50619 -34606 75453 137136 13602 8181 87943 -12460
7117a2460N8939J27250j20961L8233k0480l3472J54963J47971m9059O130l0419
7106B66635j6138r0172j34898J8342J61P2326M1648j3938j1628j0875J02145N1278
7094B74886Q9225l5550j00133J9084o2945P547M1210m8603j05948J7192P0580
7083A66545N4825j2628P894n6580p7071M8316k8691M3968J20659Q625j35401K1110
7071A61571n4370n0861P5946O8633l9315m1686M8052N3119l1730j0133R1336K3013
7059B93575LP8803k70618r0987n220Q6453J5280J5905N4792j05675J8595l1933
7047E8973P7816p2204j20453R9188K7748j0355n1930J68073J03181n3446m3869
7036A82722P8756L1818o3877q89M025J5791n7367j1267R7258m9504J6222N5832
$$ plain form
7117 -12460 46479 173729 52768 91001 70521 37049 192012 339983 290924 297054 266635
7106 266635 250497 160325 25427 43769 43930 116256 157904 143966 132338 121463 223608 274886
7094 274886 364111 328561 228428 247512 184567 192114 233324 184721 78773 95965 166545
7083 166545 221370 208742 216636 160056 82985 131301 102610 146578 267237 275862 140461 161571
7071 161571 107201 56340 132286 200919 161604 119918 167970 221089 189359 179226 270562 293575
7059 293575 293578 372381 101763 10776 5556 92009 107289 123194 177986 72311 90906 58973
7047 58973 136789 64585 -55868 43320 71068 60713 8783 176856 280037 226591 182722
7036 182722 261478 293296 229419 228530 232555 248346 190979 179712 276970 227466 243688 299520
7024B99520m3773j8722K7297j708j24392n4559p2627K61366J42113o2288q9399
7013B62828l9086p2012q695R5651n0272m2106M7686o9179j92892J16218M9661
7002I7802M2898M5019J2704O8311q717j18743j8426J66711O435j75642m8027L8761
6990A09086m4177j19123J15655J30896l3061j31665Q9073k4106l2816P4239J28767
6979B62768n3523j13429K0280k7183L4732m5464J05635J24277M7737J31050j93782
6968B93098l1678o4876k0520R5676j25749K6838l9026l797J18148K015j53813
6957I6316j20330j55118K09887J93394J32953l4827j36111k5074N1797O0695j74333
6946I9249J80832j5183j44490J41426p5869R8343M1499K1156o8141m354K5569
$$ plain form
7024 299520 255747 237025 264322 262614 138222 83663 11036 272402 414515 352227 262828
7013 262828 223742 151730 143035 238686 188414 146308 193994 124815 -68077 48141 97802
7002 97802 140700 185719 198423 266734 258017 139274 120848 287559 293994 118352 70325 109086
6990 109086 64909 -54214 61441 192337 159276 27611 116684 92578 59762 134001 262768
6979 262768 209245 95816 116096 88913 123645 78181 183816 308093 355830 486880 293098
6968 293098 261420 196544 176024 271700 145951 172789 133763 129966 248114 250129 96316
6957 96316 -24014 -179132 30755 224149 357102 322275 186164 161090 212887 273582 99249
6946 99249 280081 264898 120408 261834 185965 284308 325807 346963 278822 274468 300037
6935C00037p3830k39636L7777K3933k8175J40870Q2209N4471o4753r6289j0098
6924A26516J08020o1867j0056l7681N5736o8593P2266m0857j60830M2876L6128
6913F1658J7540P244m9707l9214m5612N6944j2080m9992K07568M773q1140p352
6901G0630P2379L1915M3665n2265Q553n3102O0130j3153l43K9636J1137J18779
6889C27961j38219K6680q700j65281L450J11892O1092K2094O1591n3054m4971
6878B04535j10602Q4998K6780j04336j5462O8167N4027N2404j37693r6364J66237
6867A92691R5965j57323M400k4012j19702P5517N3940J7988J8448j21353k0739
6856A5820J4127R4639R7307l0739j7669m8196j5535L6568J71164l2856n4620J26353
$$ plain form
6935 300037 226207 -13429 24348 48281 20106 160976 243185 297656 232903 136614 126516
6924 126516 234536 172669 162613 124932 180668 112075 184341 143484 -17346 25530 61658
6913 61658 79198 86442 36735 -2479 -48091 8853 -3227 -53219 154349 159122 77982 70630
6901 70630 143009 174924 218589 166324 174877 121775 181905 168752 168409 198045 209182 327961
6889 327961 189742 216422 207722 42441 45891 157783 218875 240969 302560 249506 204535
6878 204535 93933 178931 205711 101375 85913 154080 208107 260511 122818 26454 192691
6867 192691 288656 131333 135733 111721 -7981 67536 121476 139464 157912 36559 15820
6856 15820 29947 124586 221893 191154 173485 125289 109754 146322 317486 284630 230010 356363
6844C56363j62028p8243N7396l3050k9878J8895J07068j22633K9114O3443j53865
6833E2582o3601Q9391j08360O7784J7225J4255m7307r6354J54270k9788r7683
6822d7586P7899k9716M6886K8245J4086j28771J88841j4206j20461o3239J08316
6811F0294M9783r2397o4224o0798J9092M5843J67097j37q2785K6319J3533R3283
6799A74903k4032j17174J66524m4414L7543m2991p3157M9982R3778j5229J01654
6788C07387P8053r1530j45644o3750N6454l0457R6738j4O2809p7768j1479J0834
6776A91633j08011r397L1457K9193j8154O8215J03471k4414j10070M2148q9475
6765A06596P2700o664j37757n5721J00282J42227R9789Q480k9983j84073j11781
$$ plain form
6844 356363 194335 116092 173488 140438 110560 129455 236523 113890 143004 206447 52582
6833 52582 -11019 78372 -29988 37796 55021 69276 21969 -74385 79885 50097 -47586
6822 -47586 30313 597 47483 75728 89814 -38957 149884 135678 15217 -48022 60294
6811 60294 110077 17680 -46544 -107342 -88250 -42407 124690 124553 41768 68087 81620 174903
6799 174903 150871 33697 200221 155807 193350 150359 77202 127184 220962 205733 307387
6788 307387 385440 293910 148266 84516 140970 110513 207251 207237 270046 192278 180799 191633
6776 191633 83622 74225 105682 134875 116721 184936 288407 263993 153923 196071 106596
6765 106596 179296 172632 34875 -20846 79436 221663 321452 329932 299949 115876 4095
6754D095P3339J6370P9546K3759j27613j4364J4862j6105Q7653n2072L9587J8255
6742A47312N2634J56224j04784j1056J1313n4023o2446K711J40221J41954l691
6731D16369j66655m6402n2522m3320R243k6076l814q364n9269J50500l4373k8557
6719A06760O7183J33308j44201o4656Q4627k3552N4298o8416j14221R0063K0724
6708A41917L2514k2726L6079r3778k091Q4487j4651K707Q3239J8487k02654m2180
6696B1350Q6926J44501r40j43338l4142J00744R2862o502J9559n3807k25401J10073
6684A11885j1601J0470o3578L5102j04165K43925m1500r355p9979j07495R1253
6673G4962R5631p3890J5889K7046j22573q8597m8268J48658L8738L4824O6201
$$ plain form
6754 4095 77434 93804 173350 197109 69496 55132 69994 53889 141542 89470 129057 147312
6742 147312 199946 356170 251386 240330 251643 197620 135174 137885 278106 420060 416369
6731 416369 249714 203312 150790 107470 116713 90637 86823 78459 19190 169690 135317 106760
6719 106760 173943 307251 163050 98394 183021 159469 213767 145351 31130 121193 141917
6708 141917 174431 151705 187784 94006 91915 176402 161751 164458 247697 266184 63530 21350
6696 21350 108276 252777 251837 108499 74357 175101 267963 261461 281020 227213 1812 111885
6684 111885 100284 110754 47176 82278 -21887 222038 180538 171183 91204 -16291 74962
6673 74962 170593 96703 112592 139638 17065 -71532 -119800 28858 67596 102420 168621
6662A68621P5353o8023P4752j27285L5130J5698m6360l57J34659L1357j63118
6651A30427L1869L3808n8560L4025P1835k4236M0288k866j8733m6591j00458R3964
6639A84772J6177q7020J46566m0482m830k7354O098P4908R5991M7270q1223l2470
6627B98403L3567J06131k178J9462l1103L5537K2107k05764p5448J11864P7726
6616C90304K3112L5052j20836J49041J41830k0049o4247L9383j3056k33463q251
6605C18820k8760L0799j1022L388p5633j0276K9303R4809j7830N6546m8765K7194
6593C68573M2733J1783j02553K1609N0053q1949J9080J5761N603j82296k7756
6582A40641Q6605Q7164O9550q742j02655p717J33822p9875j29028J47998N0418
$$ plain form
6662 168621 243974 175951 250703 123418 158548 174246 127886 127529 262188 293545 130427
6651 130427 162296 196104 137544 171569 243404 219168 259456 256590 237857 191266 90808 184772
6639 184772 200949 113929 260495 220013 215183 187829 193927 268835 364826 412096 330873 298403
6627 298403 331970 438101 435923 455385 424282 459819 481926 276162 200714 312578 390304
6616 390304 413416 448468 327632 476673 618503 598454 534207 573590 560534 327071 318820
6605 318820 290060 320859 309837 313225 237592 227316 256619 351428 333598 390144 341379 368573
6593 368573 411306 423089 320536 342145 392198 310249 329329 345090 350693 168397 140641
6582 140641 227246 314410 383960 375218 272563 264846 398668 318793 189765 337763 388181
6571C88181m958J3383L5079j6841l0461O3708P3806J23024j36466j42673p9247
6560B86535J33505N4688L0997K04108L9033N7911n6028l440k9392m4358M5817
6549G19376m4177j77501m5676M5495m7506O9195n1767J05202j584J51187k0170
6538G02074j4601M8445q8994k0423l3425P5645o3801o3261J0532n1999q049L4889
6526E27032q347m2740m578P7665M3287k41246m4049J02513k8934m1153o4796J08127
6514C82781N2837L0862n4560l554J13995p2929O4308k687k3830N254j17054O2854
6502D38277O9564p046k6935q987O349p2283p4654M8927J11838J51525j09830m1541
6490D85204M4049K0839l8633n742O9384l1521p6438J36785p4416K38067J2161
$$ plain form
6571 388181 383223 396606 431685 414844 384383 448091 521897 644921 508455 365782 286535
6560 286535 420040 474728 505725 709833 748866 806777 750749 747309 717917 673559 719376
6549 719376 675199 497698 452022 497517 450011 519206 467439 572641 571057 722244 702074
6538 702074 687473 735918 646924 626501 593076 668721 604920 541659 552191 500192 492143 527032
6526 527032 518685 475945 471367 549032 592319 351073 307024 409537 380603 339450 274654 382781
6514 382781 435618 466480 411920 408366 522361 449432 513740 511053 487223 492477 375423 438277
6502 438277 507841 500795 473860 464873 471222 398939 324285 373212 485050 636575 526745 485204
6490 485204 529253 550092 511459 505717 575101 543580 467142 603927 529511 767578 779739
6479G79739n3014j35445q6945M8433j01951N5564K5767K4163M2682l669l5525
6468E59799J00521Q9592j74475J28001J64565j50432o4731K4146j61331j87820
6458C27835J54648n7826P8705J33621m7803J01964m8334r1713p427J34885r7581
6447E80974m1763R2007O8979j7530m4803m8926J5310l7092K6432K4520m7001m3706
6435E27401K6102J0374M737J1745r9149O0790N8951l2140L6086K3056N2118J52731
6423H32802J22107m1296o3111m6706j17633k0446j04961k6331L0021J07790Q7669
6412G59905J18039n9073J27930j16858r7984J17035J33428N3282l4723m8899M1993
6401I94075J57078L9614k02884L0189J37473Q4247P4509R5297j29416J730l5192
$$ plain form
6479 779739 726725 591280 504335 552768 450817 506381 532148 556311 598993 595324 559799
6468 559799 660320 749912 575437 703438 868003 717571 652840 676986 515655 327835
6458 327835 482483 424657 503362 636983 589180 691144 642810 551097 543670 678555 580974
6447 580974 539211 631218 700197 682667 637864 588938 604248 567156 593588 618108 571107 527401
6435 527401 553503 563877 568614 580359 481210 542000 600951 568811 604897 627953 680071 832802
6423 832802 954909 913613 850502 803796 686163 665717 560756 534425 564446 672236 759905
6412 759905 877944 818871 946801 829943 731959 848994 982422 1035704 1000981 952082 994075
6401 994075 1151153 1190767 987883 1018072 1155545 1239792 1314301 1409598 1280182 1281912 1246720
6390A246720j49898n7418O0053O1953j0204J16228j210J64842k8973j35297n8496
6379A208300R1977J41107q5229J08741Q4057M0597P6776J35000j8952J27669j40486
6368A769557k38647R1434o1612k7829N9657J7699M6883J06562O6612k7243o9966
6357A733107J87080J04107M5863j0456O0112m6111J99166Q5492m738J56436k9435
6346B480623N5476J45962J26609n1490j9056J05856J85952J90530J77721J81118
6336C579301L34937J17762K35083J35190R5683M26784K82070M26791N97384M40636
6326F671621P62675R63407P79291J187523J634609K296812L917674O037801P836567
6317C2087980P874539N280335R01843l298773n613903n884979m807558l312758
$$ plain form
6390 1246720 1096822 1039404 1099457 1161410 1151206 1267434 1266224 1431066 1402093 1266796 1208300
6379 1208300 1300277 1441384 1356155 1464896 1548953 1589550 1666326 1801326 1782374 1910043 1769557
6368 1769557 1530910 1622344 1560732 1532903 1592560 1610259 1657142 1763704 1830316 1803073 1733107
6357 1733107 1920187 2024294 2070157 2059701 2119813 2073702 2272868 2358360 2353622 2510058 2480623
6346 2480623 2536099 2682061 2808670 2757180 2738124 2843980 3029932 3220462 3398183 3579301
6336 3579301 3914238 4032000 4267083 4402273 4497956 4924740 5206810 5633601 6230985 6671621
6326 6671621 7434296 8397703 9176994 10364517 11999126 14295938 18213612 24251413 32087980
6317 32087980 39962519 45242854 46144697 42845924 37232021 31347042 26539484 23226726
6309B3226726k128434j344071J24317J868468M268157O572430P712795O097136
6301D6397524K242271k683895o039620p137555o574125n056334l777110k613363
6293A4757793k187035j699061j436774r32242p32065q43504n62782j89261k28114
6284E946955l28349l3706m6745n4528j02509k7684J23027O2775J83200L8769j20018
6273E641187R4677R9121q8590O4895K11833K90975K93100K73054L13865K12234
6263G406351L39958K94783L70270M00681M50190M37435O93991J081723J109849
6254A2585231J334612J434253J761660K531293L780526O415744J0197335J3830552
6246E3871206J5031634J1848407M436252l616600r389184j0974521r617719p449422
$$ plain form
6309 23226726 21098292 19754221 19878538 21747006 26015163 32587593 40300388 46397524
6301 46397524 48639795 45955900 39916280 32778725 26204600 21148266 17371156 14757793
6293 14757793 12570758 10871697 9434923 8502681 7770616 6927112 6364330 6175069 5946955
6284 5946955 5618606 5584900 5538155 5483627 5381118 5353434 5476461 5539236 5722436 5761205 5641187
6273 5641187 5735864 5834985 5746395 5811290 6023123 6314098 6607198 6880252 7194117 7406351
6263 7406351 7746309 8041092 8411362 8812043 9262233 9699668 10393659 11475382 12585231
6254 12585231 13919843 15354096 17115756 19647049 23427575 29843319 40040654 53871206
6246 53871206 68902840 80751247 85187499 81570899 72181715 61207194 51589475 44140053
6238D4140053n046296l004106q70190J965154N894516J0413897J3228432J1994840
6230G8716300O204262k106814q990545j2046226j2096773r896447p496144n964123
6222B6323490m297481l525135k901470k198362j625702j374637j128179r82450
6214H290074q01851n46232m40047m68134l31043j84503J5631l32074k77592p8339
6204D845890j79523j94388k04671j50244l9189q6313j62262j06987j11264M5023
6194C656072J2068N3866J03377r1829k9210j87717l4990k0770j80822J4354j21279
6183C173120j62216k06487n2041j31125j33083R6638M0403q3883m6292N4991k7038
6172B522987j04231K3286R5960P0326p4558j05316J8607Q5570R3707P0742L1569
$$ plain form
6238 44140053 39093757 36089651 35219461 37184615 43079131 53493028 66721460 78716300
6230 78716300 84920562 82813748 73823203 61776977 49680204 39783757 32287613 26323490
6222 26323490 22026009 18500874 15599404 13401042 11775340 10400703 9272524 8290074
6214 8290074 7488223 6941991 6501944 6033810 5702767 5518264 5533895 5201821 4924229 4845890
6204 4845890 4666367 4471979 4267308 4117064 4077875 3991562 3829300 3722313 3611049 3656072
6194 3656072 3668140 3722006 3825383 3733554 3704344 3516627 3481637 3460867 3280045 3294399 3173120
6183 3173120 3010904 2804417 2752376 2621251 2488168 2584806 2625209 2541326 2495034 2550025 2522987
6172 2522987 2418756 2442042 2538002 2608328 2533770 2428454 2447061 2532631 2626338 2697080 2728649
6161B728649n6034K0168j10299J06045p6020o4887j10012J29555J52434q9939
6151B629660P7231K4853j09515k3713o1321m6045P5550K8861O0927l9064k8936
6140B588488K4030N2673N3333j1468J03841L4676M198J34405q0728J33900O966
6129C044314J6993J80245j9871o6802M5711P0578R5669J9474J18122P6954J91864
6118C773251K29271L6400j5734J78680J31224j3833j8686L08695K72454K49793
6108E131515J76847J41245K87677K66124K52184K60046L90323N40083O65066P12236
6098H823346P62289R66308J243251J215974J482966J934989K705618M085387O749966
6089B9970094J0743018J4217765J4839700J0265378J775129o495273j1119283
$$ plain form
6161 2728649 2672615 2692783 2582484 2688529 2612509 2547622 2437610 2567165 2719599 2629660
6151 2629660 2706891 2731744 2622229 2598516 2537195 2491150 2566700 2595561 2656488 2617424 2588488
6140 2588488 2612518 2665191 2718524 2707056 2810897 2845573 2849771 2984176 2903448 3037348 3044314
6129 3044314 3061307 3241552 3221681 3154879 3200590 3271168 3366837 3386311 3504433 3581387 3773251
6118 3773251 4002522 4038922 4023188 4201868 4333092 4319259 4300573 4609268 4881722 5131515
6108 5131515 5308362 5449607 5737284 6003408 6255592 6515638 6905961 7446044 8111110 8823346
6098 8823346 9585635 10551943 11795194 13011168 14494134 16429123 19134741 23220128 29970094
6089 29970094 40713112 54930877 69770577 80035955 81811084 75315811 64196528
6082F4196528j1650100r801908p445234n498182m012459k761062k164691j277726
6074A9585166o29703j08517M39478R47012J691698L223250N998364J0128858J4261626
6065E5537232J5641049J1576790L020894o181650j1963881j2872821j1125030
6058D3632583q648628o588528m999354l850123l057859k471461j839836j445789
6050A0731005q95345p23017o32273o93993l95560l24299l29383l30674l16607
6041F089854j83058p8731j0182q2621J0452k5504K7229K4300L3883k4360O313
6030E787575K79443J70661K50013L75647M06964N09974O54017O02571P48260R79980
6020A0765105J600135K849144N007944P257779Q407716P027919K863086k237698
$$ plain form
6082 64196528 52546428 42744520 35299286 29801104 25788645 23027583 20862892 19585166
6074 19585166 18955463 18846946 19286424 20233436 21925134 25148384 31146748 41275606 55537232
6065 55537232 71178281 82755071 85775965 79594315 67630434 54757613 43632583
6058 43632583 34983955 28395427 23396073 19545950 16488091 14016630 12176794 10731005
6050 10731005 9835660 9112643 8480370 7786377 7390817 7066518 6737135 6406461 6089854
6041 6089854 5906796 5828065 5817883 5735262 5745714 5720210 5747439 5771739 5805622 5781262 5787575
6030 5787575 6067018 6237679 6487692 6863339 7270303 7780277 8434294 9036865 9785125 10765105
6020 10765105 12365240 15214384 20222328 27480107 35887823 42915742 45778828 43541130
6012D3541130n797556o558351n755695m704422l193604k325742j691553j196576
6004A2317631q01867l79297j97929J61134L55932O57603J411653K669884M583540
5995B0778284P260807Q876209P578639L576941j758700n867926p298334o659237
5987B6486683n297289m068676k947526k377811j990604j323093j095797r36541
5979F449346o51375m41889k92647k66896k22183l26824k08344j35082j16667j88238
5969C599201j54478j66144l9905j95141q9428j23003q1964k34837j12025q0754
5959B321522p1662r9880m4124n1771N6524r6068j23654L8208R539k351p9325q4138
5947A772820Q3461J67396r6063j4252j18765J06162j24630P930j2078j09309N2222
$$ plain form
6012 43541130 37743574 31185223 25429528 20725106 17531502 15205760 13514207 12317631
6004 12317631 11515764 11136467 10938538 11099672 11455604 12113207 13524860 16194744 20778284
5995 20778284 28039091 36915300 44493939 48070880 46312180 40444254 33145920 26486683
5987 26486683 21189394 17120718 14173192 11795381 9804777 8481684 7385887 6449346
5979 6449346 5797971 5356082 5063435 4796539 4574356 4247532 4039188 3904106 3787439 3599201
5969 3599201 3444723 3278579 3238674 3043533 2954105 2831102 2749138 2514301 2402276 2321522
5959 2321522 2249860 2149980 2105856 2054085 2110609 2014541 1890887 1929095 1938634 1936283 1856958 1772820
5947 1772820 1856281 2023677 1927614 1913362 1794597 1900759 1776129 1784059 1771981 1662672 1714894
5936A714894m5797O5607J33318Q583k7220O1071K0434o4098p85j3213Q9210r0725
5924A851279j12652j8535L0641o8130r687r4656L7452J78347K5668q6970j86380
5913A546377m8288j94986N1170J3776p259k28987k19140J97263j9801j21498Q6671
5902A055298K0066J24039p921j73162n1641R1154j71585n8744Q2763p8976O4282
5891H95573k10285j49682J0238P6118N9665M5740O1955j06418j6419O9498J16454
5880H52437q2547j8034k6182n6065J01477j4904l5279j39157r2968J97526P6039
5869G62343j14214m2592Q6668l1615J1455m3731P0192R7854j08238k6370q5594
5858E76158J2000P4990J34556O825j30859o6176l6631J36696p3240k7912N4276
$$ plain form
5936 1714894 1669097 1734704 1868022 1876605 1849385 1910456 1930890 1866792 1866007 1852794 1942004 1851279
5924 1851279 1738627 1720092 1750733 1682603 1672916 1578260 1615712 1794059 1819727 1732757 1546377
5913 1546377 1498089 1303103 1354273 1368049 1360790 1131803 912663 1109926 1090125 968627 1055298
5902 1055298 1075364 1199403 1191482 1018320 966679 1057833 886248 827504 910267 831291 895573
5891 895573 685288 535606 545844 621962 681627 727367 789322 682904 666485 735983 852437
5880 852437 769890 751856 725674 669609 771086 756182 720903 581746 488778 686304 762343
5869 762343 648129 605537 692205 660590 672045 628314 698506 796360 688122 661752 576158
5858 576158 588158 663148 797704 804529 673670 607494 570863 707559 634319 606407 660683
5847F60683o9397Q051N853Q3607J05861j3737p5303N3590J28173L5792l2905k8914
5835H61354L2489q5179P5463N7680q1558L4302q0443k9537Q0959o1r1237O9590
5823H43822q1845n1541L3350n2104j19269J56050K1798k9673P7494k35M3568L5023
5811H76438P3007J54593j12526N3025j3157j10655l2640j19482j44571P612J19282
5800G50926K2307o7823n6207J1663K6997n0849J04040K376L5864J89864P9951
5789A049109M530J23090r9982o9970M6026m9201k13618q6387N1250L773Q6219
5778H44839j5094L578O43K2220M8908J63420P842j22573r6528j30394l0862n0046
5766F45953J02734Q1126m421L6509n7662k03647R3785O3620p8891J33505m6276
$$ plain form
5847 660683 591286 599337 605190 688797 794658 780921 705618 759208 887381 923173 890268 861354
5835 861354 893843 808664 884127 941807 860249 894551 814108 784571 865530 865469 774232 843822
5823 843822 761977 710436 743786 691682 572413 728463 750261 720588 798082 797847 841415 876438
5811 876438 949445 1104038 991512 1044537 1031380 920725 888085 768603 624032 631644 750926
5800 750926 773233 705410 649203 660866 687863 637014 741054 743430 779294 969158 1049109
5789 1049109 1053639 1176729 1076747 1006777 1052803 1003602 789984 703597 754847 758620 844839
5778 844839 829745 833323 833966 856186 905094 1068514 1076356 953783 857255 726861 695999 645953
5766 645953 748687 829813 825392 861901 804239 600592 694377 757997 679106 812611 766335
5755G66335O8016Q8181R6451k6373O2274j38677O7428l3097j05888l6330j00321
5744G07999p6569O9148p7438j80799J14705M7966M2077O5451m6548P134M9389
5733G22515l4393j01735P4497j06431n2660q3526J5261R7219O5339j00187m6618
5722D49281Q4473J55380j06003j19745O199J48977m0107r437N6160N5000N3672
5711G33850j66093q8031L6702K6554m651m3848Q2233N6876O2528n4130J2757R0608
5699G45355j47229j26124J76724m7267j25973J18277o2747J34802N6583K4490
5689G46891j61218n6879L3745M1817N4327j8587K327J70586n2800J04117n5479
5678H08847j31171K6889K855j70379M3424O3475N3209P5092K1514j51593O1912
$$ plain form
5755 766335 834351 922532 1018983 992610 1054884 916207 983635 950538 844650 808320 707999
5744 707999 631430 700578 623140 442341 557046 605012 647089 712540 665992 673126 722515
5733 722515 688122 586387 660884 554453 501793 418267 433528 530747 596086 495899 449281
5722 449281 533754 689134 583131 463386 469585 618562 578455 569018 625178 680178 733850
5711 733850 567757 479726 516428 542982 538331 494483 576716 633592 696120 641990 654747 745355
5699 745355 598126 472002 648726 601459 475486 593763 531016 665818 722401 746891
5689 746891 585673 528794 562539 604356 658683 640096 642423 813009 760209 864326 808847
5678 808847 677676 704565 707420 537041 580465 643940 697149 772241 793755 642162 704074
5667G04074j0066q0969J22355m1553k001J04577M9104k4352M1723p9577m8687
5656G34628n2364K9379p228P4194M8594m9904k1038R1946J5453j62596J4535j6943
5644F98656L7945k6425p2760j838K2250j08898J20796N7536O6442L7929l8216
5633G93417n2058N7703j9M9353n7993l9298J0605n3513N4663j11157o1850L5327
5621F25180p4425J18572l5426o6834J47396L8133m8535n9833j15272J1237M8913
5610E89106j7857M3306M9413L132n7196l5102o9427m2506L6250J18670N3647q7766
5598E83670k3425M9349j5166L2431n0179Q1950J11273j44866p9639J86112j80532
5587E50978j42532K4877J50218m427J8105l479o8465J46137L2752k11115K191
$$ plain form
5667 704074 694008 613039 735394 693841 691840 796417 845521 821169 862892 783315 734628
5656 734628 682264 711643 704415 778609 827203 777299 756261 848207 863660 701064 715599 698656
5644 698656 736601 710176 637416 635578 657828 548930 669726 727262 793704 831633 793417
5633 793417 741359 799062 799043 848396 790403 751105 761710 708197 762860 651703 589853 625180
5621 625180 550755 669327 633901 567067 714463 752596 704061 644228 528956 540193 589106
5610 589106 571249 614555 663968 667100 609904 574802 505375 462869 499119 617789 671436 583670
5598 583670 560245 609594 594428 626859 576680 658630 769903 625037 545398 731510 550978
5587 550978 408446 433323 583541 579114 597219 593740 525275 671412 704164 493049 495240
5576D95240m8998J52641M3760M1731N4778o3781o1506n9525N9348J55310j50160
5565F18838m432l1735N3383q668N8057k135n3105j05803p1977Q0114K0303L4105
5553E86945L9090Q8196j62701N7377J88795n1669o5428J7072o9360K5854L0938
5542F85109k0785L6030j1571n1542O5514j27083n7379j7732J06165L4204M4768
5531F85698j13680M1805Q7005L681J6476n7909r7377O8526O8208n8697J46360
5520G90096Q8313k8397r384P7729j87652j23275J95688J11943n0242o2944J3624
5509H15499p7217R5510L4233k4402M3167L8855l7250O2098R5913q6431m2239L6897
5497I54633M4919k2743N740J40867L1883P5804O0591P425K53949L63128L04839
$$ plain form
5576 495240 446242 598883 642643 684374 739152 675371 613865 554340 613688 768998 618838
5565 618838 614406 582671 636054 627386 685443 683308 630203 524400 452423 532537 552840 586945
5553 586945 626035 714231 551530 608907 797702 746033 680605 697677 628317 654171 685109
5542 685109 664324 700354 688783 637241 702755 575672 518293 500561 606726 640930 685698
5531 685698 572018 613823 700828 704509 720985 663076 565699 634225 702433 643736 790096
5520 790096 878409 850012 840628 918357 730705 607430 803118 915061 864819 801875 815499
5509 815499 738282 833792 868025 843623 886790 925645 888395 950493 1046406 959975 917736 954633
5497 954633 999552 976809 982549 1123416 1155299 1231103 1291694 1299119 1553068 1916196 2221035
5486B221035J23223p473k86429k80429k05858j73272p5121n8292m8931o0674j16223
5475A031556L2268o8917n6853M0981K21L0916p9212l9454R4213P5001j18438Q6307
5463A028589n8011P0296L8300p7166j67028M2802Q6814k6451J13129j09076n7713
5452H84485Q4638p244k7660L2035o4509P1481J6073j40003r2485J43786o6325
5441H34272K6685k958k0853N1657K6971k776J2429M9941p5445j15577P5312J10284
5429I69942n1004k655j90511L4155P0845O0330Q8414q0061j02725N2689l8872
5418H10547L3681O72N9553p312L9374J43601k4468n2193p9938L7943J36328J06424
5406A204212p612k9123k1359m2273J02008P8806j08528N593O3265j9919k6105
$$ plain form
5486 2221035 2344258 2336785 2050356 1769927 1564069 1390797 1315676 1257384 1208453 1147779 1031556
5475 1031556 1063824 994907 938054 979035 979256 1010172 930960 891506 985719 1060720 942282 1028589
5463 1028589 970578 1040874 1079174 1002008 834980 877782 964596 938145 1051274 942198 884485
5452 884485 969123 961879 934219 966254 901745 973226 989299 849296 756811 900597 834272
5441 834272 860957 857999 837146 888803 915774 912998 925427 975368 899923 784346 859658 969942
5429 969942 918938 916283 725772 759927 830772 891102 979516 899455 796730 849419 810547
5418 810547 844228 844900 904453 897141 936515 1080116 1055648 1003455 923517 961460 1097788 1204212
5406 1204212 1196600 1167477 1146118 1103845 1205853 1284659 1176131 1181724 1244989 1225070 1198965
5395A198965P9094Q6663k2147j4711N1276L2341k6118J46250q2795l479o7349
5384A377990p7253K2504Q3004M5645p3175J62688P5182k0413Q897J16304n4083
5373A667290j8438L2704q420p2109M9306m2238O3621O2795L66L2118J15475j65019
5361A717451p956K851k5771J19119J26201n5950q9747k7752L1236N7715P2387
5350A919784J83714n83j80759K5890Q7210N0838J61397n3138j1330j46279q8P8671
5338B115327J36104l9176j4257P3154l5820Q293o66K49797r2839R96J45884j09641
5326B437156M3701J44480P6619M4851k8114J37418N5051K01395L2007J12627m8071
5315C209120Q6141K61387k6685q4761q2587J43622N7132K8036J19944K07046P4708
$$ plain form
5395 1198965 1278059 1364722 1342575 1327864 1379140 1411481 1385363 1531613 1448818 1445339 1377990
5384 1377990 1300737 1323241 1406245 1451890 1378715 1541403 1616585 1596172 1605069 1721373 1667290
5373 1667290 1648852 1681556 1673136 1601027 1650333 1608095 1671716 1734511 1734877 1766995 1882470 1717451
5361 1717451 1709495 1712346 1686575 1805694 1931895 1875945 1786198 1758446 1789682 1847397 1919784
5350 1919784 2103498 2102915 1922156 1948046 2035256 2086094 2247491 2194353 2183023 2036744 2036656 2115327
5338 2115327 2251431 2212255 2197998 2271152 2235332 2243625 2242959 2492756 2399917 2400913 2546797 2437156
5326 2437156 2480857 2625337 2701956 2746807 2718693 2856111 2911162 3112557 3144564 3257191 3209120
5315 3209120 3295261 3556648 3529963 3445202 3362615 3506237 3563369 3591405 3711349 3918395 3993103
5304C993103J72187K70158J97036J80889L6035J32326L68117K95863J26087L86371
5294F158172N54435N74497O98293Q24905J474308K171523L451654L737892K540049
5285B2185728R98j720044j943645j548278r33492k88636N09561J399173K836925
5276B0498290M493821N498818N074720L451045J970920Q48465O34423M81969j28421
5267D2824050r29296p13915M30877N51964j21143l8072J212541J788078J294421
5258D6299505J157199K024795L006617L287537L146165J697822m65663k420149
5250E7733828l429153l004922j739475p32771o21089j904377j822676p34866n50559
5241D3193940j225311j589194m31644K85953L72586L71071J265845J363645k70338
$$ plain form
5304 3993103 4165290 4435448 4632484 4813373 4849408 4981734 5349851 5645714 5771801 6158172
5294 6158172 6712607 7287104 7985397 8810302 10284610 12456133 15907787 19645679 22185728
5285 22185728 22186726 20466682 18523037 16974759 16041267 15752631 16262192 17661365 20498290
5276 20498290 24992111 30490929 35565649 39016694 40987614 41836079 42470502 42952471 42824050
5267 42824050 41894754 41180839 41611716 42163680 42042537 42004465 43217006 45005084 46299505
5258 46299505 47456704 49481499 52488116 55775653 58921818 60619640 60153977 57733828
5250 57733828 54304675 51299753 49560278 48827507 48206418 46302041 44479365 43744499 43193940
5241 43193940 41968629 40379435 39947791 40233744 40606330 40977401 42243246 43606891 43336553
5232D3336553k285967l922165n393366n320906m190152l162701k207129j419172
5224A5434995k98795O11409J932851K649374J686052l66717k332458l079437k716437
5215A3520837k074590j512212j273872j000319o80192m71923l04674m51467m57517
5206E294071l69374j44956k59716j65050j55425j79983j64274k6014j43563k0456
5196C665260o0164j17955N817n4043j5327r4957j48367p5349M7478j79866o9397
5185B903130j57796q543Q4212m9666K04490p1368k2653j00083o613J05778J375
5174B882263k28428q7513M421j31185j22189l2230j1480j3532p3207J826J53151
5163B341897J32120k04628j43817k0578r8951J8344O447n073J05347J9997l5150
$$ plain form
5232 43336553 41050586 37128421 31735055 26414149 22223997 19061296 16854167 15434995
5224 15434995 15136200 15747609 17680460 20329834 22015886 21649169 19316711 16237274 13520837
5215 13520837 11446247 9934035 8660163 7659844 6979652 6507729 6203055 5751588 5294071
5206 5294071 4924697 4779741 4520025 4354975 4199550 4019567 3855293 3829279 3685716 3665260
5196 3665260 3605096 3487141 3492958 3438915 3423588 3328631 3180264 3104915 3152393 2972527 2903130
5185 2903130 2745334 2736791 2821003 2771337 2975827 2904459 2881806 2781723 2775110 2880888 2882263
5174 2882263 2653835 2566322 2570743 2439558 2317369 2285139 2273659 2260127 2186920 2188746 2341897
5163 2341897 2474017 2269389 2125572 2104994 2006043 2024387 2030834 2025761 2131108 2151105 2115955
5152B115955J06489J88525j24389j81794Q0821j21625P4563K7295J17509N7123
5142B340472r8555o9720J01294M0081J56214J44415j26941q0343J12946L5542
5132B555405N4829k3608j11135J48933r4125Q5232M0194J81820J57700N7072J24756
5121C177073m794m6083j23822j16886J04783j57276L2374K48505n0333j6284J59102
5110C206359J49574j25808J12454J28287m4274R6642K77723j10846n3843J87125
5100C823393l5441j10564M2326R444J57224p0815q7129j1750J21688j3229M0996
5089C866143j7224J6111J14462Q9418N4131K97350K8699j11736m2930j63751J05143
5078D235816K1763M9618K5314P8547q9448o7030J00878L8962O5180N0635j38508
$$ plain form
5152 2115955 2222444 2410969 2286580 2104786 2185607 2063982 2138545 2165840 2283349 2340472
5142 2340472 2241917 2172197 2273491 2313572 2469786 2614201 2487260 2406917 2519863 2555405
5132 2555405 2610234 2586626 2475491 2624424 2530299 2615531 2655725 2837545 2995245 3052317 3177073
5121 3177073 3172279 3126196 3002374 2885488 2990271 2832995 2865369 3113874 3063541 3047257 3206359
5110 3206359 3355933 3230125 3342579 3470866 3426592 3523234 3800957 3690111 3636268 3823393
5100 3823393 3787952 3677388 3719714 3729158 3886382 3815567 3728438 3716688 3838376 3825147 3866143
5089 3866143 3848919 3865030 3979492 4068910 4123041 4420391 4449090 4337354 4294424 4130673 4235816
5078 4235816 4257579 4307197 4332511 4411058 4321610 4254580 4355458 4394420 4459600 4510235 4371727
5067D371727P0333L7480j9660n2390P9664P7552q332J77336K5901l6214l400M5169
5055D765166J4580q1050r3873o8948P9026k69763j62854Q37j12669O599p4501
5044D002550O1823R8404q9431l9510J20331P752j47373l2696j15777j17182K36935
5033C985826n5329k6975j22348m755P9678J32N9848q396j3704J6176o8382J15169
5021C956940Q2525o7975l0611p1252m4077j68535J99512r5704p4581J04942k5915
5010C765269o748J53328j8050M0960J59232R4323q824j68502J24149j04784O0950
4999D091303L73281O8535p9369N6973J20511P3401K15940O7236o7506J04787K28440
4988E253532O5210M8744K5477l2451J01532J26223J56745O5701R2573p0828K3957
$$ plain form
5067 4371727 4442060 4479540 4459880 4407490 4487154 4564706 4556374 4733710 4759611 4723397 4719997 4765166
5055 4765166 4779746 4698696 4604823 4535875 4614901 4345138 4182284 4183121 4070452 4077051 4002550
5044 4002550 4064373 4162777 4073346 4033836 4154167 4161919 4014546 3981850 3866073 3748891 3985826
5033 3985826 3930497 3903522 3781174 3776419 3856097 3856229 3916077 3907681 3893977 3910153 3841771 3956940
5021 3956940 4039465 3971490 3940879 3869627 3825550 3657015 3856527 3760823 3686242 3791184 3765269
5010 3765269 3758521 3911849 3893799 3934759 4093991 4188314 4179490 4010988 4135137 4030353 4091303
4999 4091303 4464584 4533119 4453750 4510723 4631234 4704635 4920575 4987811 4920305 5025092 5253532
4988 5253532 5318742 5367486 5392963 5360512 5462044 5588267 5745012 5810713 5903286 5832458 5856415
4977E856415j11516J18730K35415N4574J18286j3539J33393J5415J30025N3909
4967F591107O6743K6535K8400K29030M9817J5621L28059j08821n4801q2220N8113
4956G147583J91003J18818J10939r588J00232J07496K26839J03834K9385P1766
4946H198307N6666l5748n5023K1806J78060K4599J74508J50885K18487L38444
4936I270991K25258K45912M23426J59519J54645L14133R9594J55611K34231L42560
4926A1625880J47416K01640J34508R1425J96617L77689K13391K43238L12315L61465
4916A3905584K78112L30089N98089M44130K03969N13546M97167J82969J04312
4907A7057967j933L70173L71333K66963L21746L01408N43866O14020O96011R03041
$$ plain form
4977 5856415 5744899 5863629 6099044 6153618 6271904 6258365 6391758 6407173 6537198 6591107
4967 6591107 6657850 6684385 6712785 6941815 6991632 7007253 7335312 7226491 7171690 7089470 7147583
4956 7147583 7338586 7457404 7568343 7558755 7658987 7766483 7993322 8097156 8126541 8198307
4946 8198307 8254973 8219225 8164202 8186008 8364068 8388667 8563175 8714060 8932547 9270991
4936 9270991 9496249 9742161 10165587 10325106 10479751 10793884 10893478 11049089 11283320 11625880
4926 11625880 11773296 11974936 12109444 12200869 12397486 12775175 12988566 13231804 13544119 13905584
4916 13905584 14183696 14513785 15111874 15556004 15759973 16273519 16770686 16953655 17057967
4907 17057967 17056034 17426207 17797540 18064503 18386249 18687657 19231523 19845543 20541554 21444595
4897B1444595O81011P25150Q06124J035556J458373J933514K352318L473876O162159
4888D0072676J0233689J4826424J5624316R472827j239933r631063j1438213r345495
4880E8575228o807828m767902l052291j946632q75883J32197R71652J949295L651833
4871D7829669O695380J1200613J6203829J8017364J5178816J1103773Q680325
4864A34909769N901069j688647j1158536j6280903j5162592j1739805p916245
4857G6864110n101213k784527p58250L91747J560504K912390M585731P331846
4849H5002338J2008547J7986880K2070906J9376401R054321l235221j0088779
4842A52175393j0338968q085303n986371m396131l537121k881715k424156k011049
$$ plain form
4897 21444595 22125606 22850756 23656880 24692436 26150809 28084323 30436641 33910517 40072676
4888 40072676 50306365 65132789 80757105 90229932 88989999 79358936 67920723 58575228
4880 58575228 51767400 46999498 43947207 42000575 41124692 41256889 42228541 44177836 47829669
4871 47829669 54525049 65725662 81929491 99946855 115125671 126229444 134909769
4864 134909769 140810838 139122191 127963655 111682752 96520160 84780355 76864110
4857 76864110 71762897 68978370 68220120 68611867 70172371 73084761 77670492 85002338
4849 85002338 97010885 114997765 137068671 156445072 165499393 162264172 152175393
4842 152175393 141836425 133751122 127764751 123368620 119831499 116949784 114525628 112514579
4834A12514579j074242j68839Q52214K293440L631276N560731P546603Q965876
4826A40121638J0011683J0251635J0234910J0419043J1539266J3796461J5919506
4819B22294142J7024417J6394160J3473740R279154N121162J510047j086197l012372
4811B80998253m838940n969795n860469m936520l420353j902073n03047J057707
4803B54624763L025241N725251Q673623J1402918J3083447J2727957J0214042
4796C19477242O510301L182884J811015K709806M352192N124453M570566L078983
4788C50817442N31759k139990m515845o260615o584570n457480l516331k162273
4780C20712097j998660k716902l923515m196580l146120j384925L02286J191990
$$ plain form
4834 112514579 111440337 111271498 112123712 114417152 118048428 123609159 131155762 140121638
4826 140121638 150133321 160384956 170619866 181038909 192578175 206374636 222294142
4819 222294142 239318559 255712719 269186459 278465613 283586775 285096822 284010625 280998253
4811 280998253 276159313 270189518 264329049 259392529 255972176 254070103 253567056 254624763
4803 254624763 257650004 263375255 272048878 283451796 296535243 309263200 319477242
4796 319477242 325987543 329170427 330981442 333691248 338043440 343167893 347738459 350817442
4788 350817442 351349201 349209211 344693366 338432751 331848181 326390701 322874370 320712097
4780 320712097 318713437 315996535 312073020 307876440 304730320 303345395 303647681 304839671
4772C04839671J305985J263484J170447N35213k042651n892432r625185j1468742
4764B80085790j1320750j0030940q625706p933787q505195r450015r683470q957570
4756B05578357p193351m821293l357106k948779l418546m235285m875900n058756
4748A69669341n409684o137129o746343p454772q087210q324007q310075q008722
4740A11191399p530398p569110p337407p133370o994597o071438n085238m275013
4732E9194828l525498l207259l127762k946497k733862k594745k039244j534797
4724C7485164j555517j533099j429721j331373j151709j127797j074480j025336
4716B7256132q75957o94988n80482o27667m62691o17267n47112o82847o18108
$$ plain form
4772 304839671 306145656 307409140 308579587 309114800 307072149 301179717 291554532 280085790
4764 280085790 268765040 258734100 250108394 242174607 233669412 224219397 214535927 205578357
4756 205578357 198385006 193563713 190206607 187257828 183839282 179603997 174728097 169669341
4748 169669341 164259657 158122528 151376185 143921413 135834203 127510196 119200121 111191399
4740 111191399 103661001 96091891 88754484 81621114 74626517 68555079 63469841 59194828
4732 59194828 55669330 52462071 49334309 46387812 43653950 41059205 39019961 37485164
4724 37485164 35929647 34396548 32966827 31635454 30483745 29355948 28281468 27256132
4716 27256132 26380175 25685187 25104705 24477038 24014347 23397080 22849968 22167121 21549013
4707B1549013n77932n00174n28457n16952m66645m54721k28795l83859o03412
4698A7288066m36626m48053m81235k79856j75115j50284m35426l35175l64082
4689A4182214k40922l55988l80952k95550l91316k43792j91915l94628o5119j39584
4679A1482448j65446j06737j07714k02793l14451k60874k35820l02643k28769
4670I557201j27819j77972j40411j67575k18694j89947L8575o118m9351k97695
4660H220194K7205j50033m5786j40790n5156k9063J25249J72381L6544O4504R4876
4649H320125P5908k75765r0821j29027j90511L7426m1727J15859j92789J45669
4639G774347J30810O4728J24663J24651N4275k43711q7699j56535j46262m1577
$$ plain form
4707 21549013 20971081 20470907 19942450 19425498 18958853 18504132 18275337 17891478 17288066
4698 17288066 16851440 16403387 15922152 15642296 15467181 15316897 14881471 14546296 14182214
4689 14182214 13941292 13585304 13204352 12908802 12517486 12273694 12081779 11687151 11622032 11482448
4679 11482448 11317002 11210265 11102551 10899758 10585307 10324433 10088613 9785970 9557201
4670 9557201 9429382 9251410 9110999 8943424 8724730 8534783 8573358 8567240 8517889 8220194
4660 8220194 8247399 8097366 8051580 7910790 7855634 7826571 7951820 8124201 8160745 8225249 8320125
4649 8320125 8396033 8120268 8029447 7900420 7709909 7747335 7705608 7821467 7628678 7774347
4639 7774347 7905157 7969885 8094548 8219199 8273474 8029763 7942064 7785529 7639267 7597690
4629G597690K5026j20710J52756K64538k549J2629P5006o6329J73181j4492j04090
4618G992656J5966O6493J69507J16597K709m9452L9257J26680K00962J56139K8421
4607H865935o658M3035J96868L13167K48031K22077M32566M14351O73282P26359
4597A2129013O98576P52603P49514J031911J320960J688699K462658L593722O394334
4588C0821990J0669272J5034535J5905767J0767042R90691p928860j1356024j0313208
4580E4591205p385249m319227j094621K935313Q165599J2876727J3588063Q192015
4572H7549825j262989r063171j1557686r432444n505861l95991N584699R999254
4564F5915636J0063166M491544l925114r774731j0851338q977395o221383l741395
$$ plain form
4629 7597690 7622716 7502006 7654762 7919300 7916751 7929380 8004386 7938057 8111238 8096746 7992656
4618 7992656 8008622 8075115 8244622 8361219 8363928 8314476 8353733 8480413 8681375 8837514 8865935
4607 8865935 8859277 8902312 9099180 9412347 9660378 9882455 10315021 10729372 11402654 12129013
4597 12129013 12827589 13580192 14329706 15361617 16682577 18371276 20833934 24427656 30821990
4588 30821990 41491262 56525797 72431564 83198606 84189297 76260437 64904413 54591205
4580 54591205 47205956 42886729 41792108 44727421 52893020 65769747 79357810 87549825
4572 87549825 86286836 77223665 65665979 56233535 50727674 50331683 55916382 65915636
4564 65915636 75978802 80470346 76545232 66770501 55919163 46941768 40720385 36978990
4556C6978990q61298L024867P588575J0893138R771506L671402m815569j0095934
4548E6155677j0820158r136320p041774n270179m043761l170632k320852j863258
4540A2488743j477627r89285n97344n99171n04475l45961k76559k16173k12294
4531G269854j67928k9193j00561n4780j56130j70450n5763m2035k44584k70209
4521E978221l29801j89047j3789n5081j27698r5360J15851R7036M5404j72367
4511E253369j75897N8866J3079m1215l5821r4586j57330O7899J62313m3796r2681
4500D914200n4116L1560l9004m2822n4929j02479o5382o3169o1381j08001Q0294
4489D434771N4440j9672Q849O8470P8301K9674R449m8528J7172j38398j77142
$$ plain form
4556 36978990 36117692 39142559 46731134 57624272 67395778 71067180 66251611 56155677
4548 56155677 45335519 36199199 29157425 23887246 19843485 16672853 14352001 12488743
4540 12488743 11011116 10021831 9424487 8825316 8320841 7974880 7698321 7482148 7269854
4531 7269854 7101926 7072733 6972172 6917392 6761262 6590812 6535049 6493014 6248430 5978221
4521 5978221 5648420 5459373 5445584 5390503 5262805 5167445 5283296 5380332 5425736 5253369
4511 5253369 5077472 5136338 5149417 5108202 5072381 4977795 4820465 4888364 5050677 5006881 4914200
4500 4914200 4860084 4891644 4852640 4809818 4754889 4652410 4587028 4523859 4462478 4354477 4434771
4489 4434771 4489211 4469539 4478388 4546858 4625159 4654833 4664282 4615754 4632926 4494528 4317386
4478D317386q1788m8902J1163j99129k23291P455N1951l4281N0203j06298P9667
4467C824136Q1343j13788Q528o6963m529m3086q3026Q0017j67040k50338J0621
4456C275875j21519j47434L4369L5886n7167L4907q3052M7568Q1425k8777M5851
4445C117932J00930J60409m1045j11854k18635J428J46103p177P757j9879J74571
4434C310540j6923k1810J12140l1349L50372M69948Q21648Q29588L08685j42692
4424E990147o40601o78135m70746m03754k99712n4821k09205q398L1905q3173
4414C173507k8450m0529N8779r3337L6399J84915M1766n9545M6428L5253j57666
4403C197520L4784P7033j16816N8112p2849N2616K10675J16375J14812K7211L5361
$$ plain form
4478 4317386 4235598 4186696 4197859 3998730 3775439 3782894 3834845 3800564 3850767 3744469 3824136
4467 3824136 3905479 3791691 3800219 3733256 3728727 3685641 3602615 3682632 3515592 3265254 3275875
4456 3275875 3154356 3006922 3041291 3077177 3020010 3054917 2971865 3019433 3100858 3072081 3117932
4445 3117932 3218862 3379271 3338226 3226372 3007737 3009165 3155268 3148091 3155848 3135969 3310540
4434 3310540 3293617 3271807 3383947 3352598 3702970 4172918 4994566 5824154 6132839 5990147
4424 5990147 5349546 4671411 4200665 3796911 3497199 3442378 3233173 3224775 3256680 3173507
4414 3173507 3145057 3104528 3163307 3069970 3106369 3291284 3333050 3273505 3319933 3355186 3197520
4403 3197520 3232304 3309337 3192521 3250633 3177784 3230400 3441075 3557450 3672262 3699473 3734834
4392C734834M0231O5337P2622J1090n1193R2086J46855Q4985P5712J97053K6034
4381D495646k532Q3967j08945o632N1082N1503k6812n2740j29786Q1456J37569
4370D573776Q2673J70776j2445J12941J41723J38387k5196L5949J0993j11133
4360E118444K024q7114P0788N1000P4418m6780m1410K86285o6234k8543k7882
4349E304996r830k044k0827p4862j8817m690j12742j7580J3437K45201Q931N3838
4337E365011J06277R0767N5283j60672L9180k1456m9692q3244k28181J12900K42081
4326E468254J84124J61310J34896R1001l9447r7271R3913m2848j14159J7663j4820
4315E842616q2936j5439M8748N6916J26479P2073J04076J78866L0775k870k23702
$$ plain form
4392 3734834 3775065 3840402 3913024 3924114 3872921 3965007 4111862 4196847 4272559 4469612 4495646
4381 4495646 4493114 4577081 4468136 4461504 4512586 4564089 4537277 4484537 4354751 4436207 4573776
4370 4573776 4656449 4827225 4814780 4927721 5069444 5207831 5182635 5218584 5229577 5118444
4360 5118444 5120468 5033354 5104142 5155142 5229560 5182780 5141370 5427655 5361421 5332878 5304996
4349 5304996 5295166 5293122 5272295 5197433 5178616 5173926 5061184 5043604 5057041 5302242 5311173 5365011
4337 5365011 5471288 5562055 5617338 5456666 5495846 5474390 5424698 5341454 5113273 5226173 5468254
4326 5468254 5652378 5813688 5948584 6039585 6000138 5902867 5996780 5953932 5839773 5857436 5842616
4315 5842616 5759680 5744241 5792989 5849905 5976384 6048457 6152533 6331399 6362174 6359304 6135602
4304F135602j38071N5723R1005j26774l54544R9032j12730n1793R666m0478j54604
4293E412034l7157L3620J59994O4242q610r0399j06891M1403j60187k0812l0799
4282E256438q4212j5710j51832P872K0317Q9438j20078j25915L6660k5502J21304
4271E008780o5153j87307j53329P4835o0517L2035O9950O1967o1597R5645K910
4260D818219j5153J5606J35147M4700q3457P0673M2438J86254L4815O8084L853
4249E321179J66901R5430L7027P166k7227J28021r292O2596J07905L8142l1481
4238E896367J00900m1862J70772J84326M3336Q8008M4787N1673N8418r816J02933
4227F689842J39721m3820j3791M7987K50217O6029J25898P6741O0417J07828L42310
$$ plain form
4304 6135602 5997531 6053254 6144259 6017485 5662941 5761973 5649243 5597450 5607116 5566638 5412034
4293 5412034 5374877 5408497 5568491 5632733 5624123 5533724 5426833 5468236 5308049 5287237 5256438
4282 5256438 5172226 5156516 5004684 5012556 5032873 5122311 5002233 4876318 4912978 4887476 5008780
4271 5008780 4943627 4756320 4602991 4677826 4617309 4649344 4719294 4781261 4719664 4815309 4818219
4260 4818219 4803066 4818672 4953819 4998519 4915062 4985735 5028173 5214427 5249242 5317326 5321179
4249 5321179 5488080 5583510 5620537 5627703 5600476 5728497 5719205 5781801 5889706 5927848 5896367
4238 5896367 5997267 5955405 6126177 6310503 6353839 6441847 6486634 6538307 6596725 6586909 6689842
4227 6689842 6829563 6785743 6771952 6819939 7070156 7136185 7262083 7338824 7399241 7507069 7849379
4216G849379J13359J04445J29270R3139O7060J03007K69822R0292J28523J57139
4206I105435O8192K09487L16783J36599L00430L40105J02477J33929K86384L55074
4196A1354895K90825K95535M06953L74348N13670N96317M68361N63708P10525
4187A5575137O82999P37371P03968R47648J146945J212064J332003J372271J304637
4178B5015043J033099P61508R05103P16100M25395J31925l0736j71033j13385
4169B8673019J94596N29189J058799J620706K156937K846779K848480K336109
4161D2264614J675585J300182J302586J359858J494209J477361J287934J195307
4153E3357636J370057J218498J316059J276837J320944J738718J939267K187596
$$ plain form
4216 7849379 7962738 8067183 8196453 8289592 8356652 8459659 8729481 8819773 8948296 9105435
4206 9105435 9173627 9383114 9699897 9836496 10136926 10477031 10579508 10713437 10999821 11354895
4196 11354895 11645720 11941255 12348208 12722556 13236226 13832543 14300904 14864612 15575137
4187 15575137 16258136 16995507 17699475 18647123 19794068 21006132 22338135 23710406 25015043
4178 25015043 26048142 26809650 27714753 28430853 28856248 28988173 28957437 28786404 28673019
4169 28673019 28867615 29396804 30455603 32076309 34233246 37080025 39928505 42264614
4161 42264614 43940199 45240381 46542967 47902825 49397034 50874395 52162329 53357636
4153 53357636 54727693 55946191 57262250 58539087 59860031 61598749 63538016 65725612
4145F5725612J706867Q66599j8455l46437J61304J177048K994526N049244O844743
4136H4161051P524037O150258L392508N68514n53761n50026L63467J379051J587176
4127A04022275Q98389L43217K74054K13562O57171J081946J386695J487114J569824
4118A11934247J428342J388783J444365J223628J059823J068038J601015L183538
4110A24331779N583594Q400457J0765282J1591395J0076369P416299N044066L879492
4102A87088733M549233N560200M458671J805559L25220J897664M606614N800432
4094B16092326M567197J520206n64051k40584J181435L215763O359669J0838459
4086B42970420J5499514J8963200J8401304J3157012N638378n58564l282300m050754
$$ plain form
4145 65725612 67432479 68299078 68280623 67934186 68095490 69272538 72267064 77316308 84161051
4136 84161051 91685088 97835346 101227854 101796368 101242607 100692581 101056048 102435099 104022275
4127 104022275 104920664 105263881 105537935 105751497 106408668 107490614 108877309 110364423 111934247
4118 111934247 113362589 114751372 116195737 117419365 118479188 119547226 121148241 124331779
4110 124331779 129915373 138315830 149081112 160672507 170748876 178165175 183209241 187088733
4102 187088733 191637966 197198166 201656837 203462396 203787616 205685280 210291894 216092326
4094 216092326 220659523 222179729 221615678 221375094 222556529 225772292 232131961 242970420
4086 242970420 258469934 277433134 295834438 308991450 314629828 314071264 310788964 306738210
4078C06738210m018643l408344j897852J138254N183604Q534604P943772K785353
4070C22998958k396430k176227K008412M520314K716745k326422n875388n963047
4062C13506915n992698p565732q510049o820949k084706L881616O769444L029805
4054B96213646o325265j5171975j9097416j8712781j7056092j4658779j1122124
4047A94069214o987817l320766q43053p06204k194152l995441m425978l627162
4039A67968641l067055l197106l151347l244166l328031l419000l783109m456824
4031A40322003m695308m233994l675450l302964l868759m952625o008063o096430
4023A03488410n688938n253817m746705l940671l059022k116587j979163k306275
$$ plain form
4078 306738210 302719567 299311223 297413371 298551625 303735229 312269833 320213605 322998958
4070 322998958 320602528 318426301 320434713 324955027 327671772 325345350 319469962 313506915
4062 313506915 307514217 299948485 291438436 284617487 282532781 286414397 293183841 296213646
4054 296213646 289888381 274716406 255618990 236906209 219850117 205191338 194069214
4047 194069214 187081397 183760631 182917578 182211374 180017222 176021781 171595803 167968641
4039 167968641 164901586 161704480 158553133 155308967 151980936 148561936 144778827 140322003
4031 140322003 135626695 131392701 127717251 124414287 120545528 115592903 109584840 103488410
4023 103488410 97799472 92545655 87798950 83858279 80799257 78682670 76703507 74397232
4015G4397232k648068k631418k155408j712582j181133q22684m81920k85850l74735
4006F2103434m40033l82117o80412j140783j641927k391998k656157l079652k956074
3997D6734281k925616k745518k546039j930645j603182j268581j068577r04065
3989C1742058q25190q94244o40431q48561r86910q60347q98269j038873j165663
3980B3583570j475597j471951j406768j449750j189766r35075q02210p56823n46965
3971A3548665n70119p52249n86562l75640l62065l01430l96546k90600j71918
3962I741536k83116k33789k7115l31289j90303k24145k33522j22747j7527j97500
3952G880483k33384l8529j81923k28968l9715j45300l9705j33647p7519l2622
$$ plain form
4015 74397232 71749164 69117746 66962338 65249756 64068623 63245939 62764019 62478169 62103434
4006 62103434 61663401 61281284 60600872 59460089 57818162 55426164 52770007 49690355 46734281
3997 46734281 43808665 41063147 38517108 36586463 34983281 33714700 32646123 31742058
3989 31742058 30916868 30022624 29382193 28533632 27546722 26686375 25788106 24749233 23583570
3980 23583570 22107973 20636022 19229254 17779504 16589738 15654663 14852453 14095630 13548665
3971 13548665 12978546 12226297 11639735 11264095 10902030 10600600 10204054 9913454 9741536
3962 9741536 9458420 9224631 9197516 8866227 8675924 8451779 8218257 8095510 8077983 7880483
3952 7880483 7647099 7608570 7426647 7197679 7157964 7012664 6972959 6839312 6761793 6729171
3942F729171j9754J05771j58514L9133j7004J09348n7331p2063r1095p0530O1406
3931F558538O7652L9989Q6761j09300J84544R6011j35968o3768O2950J5590l0787
3920F772212J47768J69437J9713J78853L37536K51625J13915J65717R1023o8833
3910H178966k1368J78735J77819J21256J1760j9119K06362K00382K00125K49688
3900I484606K86548K04747K51973K88497K80826K82985K39108J98711L05808K56662
3890A2080471K70150L12653K06218L24328K85212J16921J45545J71785k2493J03212
3880A3994002j23914j00924j41250j62810l29736m02284m23344k66607k29143
3871A1813990l02702l55567k14311k24673k74242k32602k76615m81149k88551
$$ plain form
3942 6729171 6709417 6815188 6656674 6695807 6678803 6788151 6730820 6658757 6567662 6497132 6558538
3931 6558538 6626190 6666179 6752940 6643640 6828184 6924195 6788227 6724459 6787409 6802999 6772212
3920 6772212 6919980 7089417 7109130 7287983 7625519 7877144 7991059 8156776 8247799 8178966
3910 8178966 8157598 8336333 8514152 8635408 8647168 8628049 8834411 9034793 9234918 9484606
3900 9484606 9771154 9975901 10227874 10516371 10797197 11080182 11319290 11518001 11823809 12080471
3890 12080471 12350621 12663274 12869492 13193820 13479032 13595953 13741498 13913283 13890790 13994002
3880 13994002 13870088 13769164 13627914 13465104 13135368 12733084 12309740 12043133 11813990
3871 11813990 11511288 11155721 10941410 10716737 10442495 10209893 9933278 9452129 9163578
3862I163578l01451k69851j23453m20668j85163q2970k42456j27089r259j85839
3852G215379J7838J10131j28157q0805j20668j62644j00938k00180k35023j89726
3842F125207K362j86701J34294m5809j71782r9993q9672r0838o8607K5099m6991
3831E486569j77803j18724R4975q5436l9877J49464r322j15335J4089K1983N7621
3820E278204K6768j0420j51887j82028L6599J9896o9130n6882p2867k03578k0337
3809D594338p6504j67688j71375k40458l7644m8380k2255M160P5112j01923Q939
3798C816322M5692p6721L3780j38027k7642J1657n3694j19185j98842o568K0076
3787C306848l9241M0705k7509J03298P4845l5044r6702k6959q8729q7740r663
$$ plain form
3862 9163578 8862127 8592276 8468823 8048155 7862992 7780022 7537566 7410477 7401218 7215379
3852 7215379 7233217 7343348 7215191 7134386 7013718 6851074 6750136 6549956 6314933 6125207
3842 6125207 6127569 5940868 6075162 6029353 5857571 5757578 5667906 5577068 5508461 5533560 5486569
3831 5486569 5308766 5190042 5285017 5199581 5159704 5309168 5299846 5184511 5198600 5220583 5278204
3820 5278204 5304972 5294552 5142665 4960637 4997236 5017132 4948002 4891120 4818253 4614675 4594338
3809 4594338 4517834 4350146 4178771 3938313 3900669 3852289 3830034 3834194 3909306 3807383 3816322
3798 3816322 3862014 3785293 3819073 3681046 3653404 3665061 3611367 3492182 3293340 3286772 3306848
3787 3306848 3267607 3308312 3280803 3384101 3458946 3423902 3327200 3300241 3211512 3123772 3114109
3776C114109O116r493k9504K7055j48007J02684J17852m5841j3793j3005J60867
3765C269040j44346j25644P0326N8594j00497P878M1765j49580m6219O9006m8933
3754B901390L5343k0732n1494o6202R9735J70418K0617k11195n6807Q1648k9689
3743B873032p8136P2256j45518j16682L0201n930M8555j78194n7641L0427J01323
3732B573693r5664P3682M4017L6912P6144j16232q0872j24990m1975O8291p8061
3721B334945k356q0110p6157J48511N2036O4133j5524p6209L0901J23830Q4212
3710B588212L5308q2803j18183q1815K519J48777j346l8217N7499j08624l6866
3699B364461J29186k693L094J24297M1621j67627Q2318O1779Q8035O3601N171
$$ plain form
3776 3114109 3120225 3110732 3081228 3108283 2960276 3062960 3180812 3134971 3121178 3108173 3269040
3765 3269040 3124694 2999050 3069376 3127970 3027473 3035351 3077116 2927536 2881317 2950323 2901390
3754 2901390 2936733 2916001 2864507 2798305 2898040 3068458 3089075 2877880 2821073 2902721 2873032
3743 2873032 2794896 2867152 2721634 2604952 2635153 2629223 2677778 2499584 2441943 2472370 2573693
3732 2573693 2478029 2551711 2595728 2632640 2708784 2592552 2511680 2386690 2344715 2413006 2334945
3721 2334945 2332589 2252479 2176322 2324833 2376869 2441002 2425478 2349269 2380170 2504000 2588212
3710 2588212 2623520 2540717 2422534 2340719 2343238 2492015 2490669 2452452 2509951 2401327 2364461
3699 2364461 2493647 2490954 2494048 2618345 2659966 2492339 2574657 2636436 2724471 2788072 2793243
3688B793243P7159n8023O3429O9014j86351l9654p3491R0343J01199j78442j64081
3677B494345n2066M5728J13133J25392P7371J40747K1002k10235k6835j43108
3667B585474J15808J36774j83847j06734n1461N4738K6137J87152J11807J01824
3657B977672K79684R2101P9834q5808K1728j16316q2758k0829r7683j20515k0747
3646B906363K77535Q6703P3806K5397J5868J60841J69420N7863K90299L4732J3296
3635D112123L0760K68435Q9672J10401J75113K3783J29741P8348J21934K40503
3625E380813K17026K20050J60649j63627j73316k37063l4810j09912l8234R3577
3615E315153K10070Q0646R3365K28535K05617o39O7027J92573L15724K94362J84948
$$ plain form
3688 2793243 2870402 2812379 2875808 2944822 2758471 2718817 2645326 2735669 2836868 2658426 2494345
3677 2494345 2442279 2488007 2601140 2726532 2803903 2944650 2965652 2755417 2728582 2585474
3667 2585474 2701282 2838056 2654209 2547475 2496014 2550752 2576889 2764041 2875848 2977672
3657 2977672 3257356 3349457 3429291 3343483 3365211 3248895 3166137 3145308 3047625 2927110 2906363
3646 2906363 3183898 3270601 3344407 3369804 3385672 3546513 3715933 3773796 4064095 4098827 4112123
3635 4112123 4142883 4411318 4500990 4611391 4786504 4810287 4940028 5018376 5140310 5380813
3625 5380813 5597839 5817889 5978538 5814911 5641595 5404532 5369722 5259810 5221576 5315153
3615 5315153 5525223 5605869 5699234 5927769 6133386 6132747 6199774 6392347 6708071 7002433 7187381
3604G187381K12869O4994K0240j42402j57545j4412j5911R8281R3673k2394j50765
3593G174009k00773j69104N0687j2397k4327N6943N5338J67840K54206L15713
3583G668135M79052M08255M85724O36217M16711P3410J29063L08272N8921K08600
3573A0872360L40320L02972K80665J96443J01132K30875J01870J46743O1062K54147
3563A2888589M21297N47398L60394M63444L97883N54734N22039M69612N41632
3554A7167022N50090N61493M12887L81825K80990M43098M65138N46664N62484
3545B1371691P09545R72570J120837J232875J704304K243853K405176K897674
3537C4658525L215030L299183L098546L023851K996016K622348K144745J009280
$$ plain form
3604 7187381 7400250 7465244 7485484 7343082 7185537 7171125 7155214 7253495 7347168 7324774 7174009
3593 7174009 6973236 6804132 6854819 6842422 6818095 6875038 6930376 7098216 7352422 7668135
3583 7668135 8147187 8555442 9041166 9677383 10094094 10167504 10296567 10604839 10663760 10872360
3573 10872360 11212680 11515652 11796317 11992760 12093892 12324767 12426637 12573380 12634442 12888589
3563 12888589 13309886 13857284 14217678 14681122 15079005 15633739 16155778 16625390 17167022
3554 17167022 17717112 18278605 18691492 19073317 19354307 19797405 20262543 20809207 21371691
3545 21371691 22081236 23053806 24174643 25407518 27111822 29355675 31760851 34658525
3537 34658525 37873555 41172738 44271284 47295135 50291151 52913499 55058244 56067524
3529E6067524q2398j026105j657721k299143k718227l037464k774323k279668
3521D0192475j967908j708775j603581j652178j678508j802994j805849j484252
3513B6488430j552873j512771j577267j665202j360394j277334j306355j010389
3505A5225845j098829j089035r53623p83273p83566n55607m09639m80288l17424
3496H754561j40112k17187l43406k88850l39494m54925l59380k50404l10784k03014
3486E847005j94290l31645k29984k85376p4676k9256j80522J88959J33682o1254
3476D782643K17494K57979p164k9328m1383k5478j76825k80755k87229l08538
3466D101416j34549l37706l22666j75428k35639Q1632j24323l9208K6941P03J82127
$$ plain form
3529 56067524 55985126 54959021 53301300 51002157 48283930 45246466 42472143 40192475
3521 40192475 38224567 36515792 34912211 33260033 31581525 29778531 27972682 26488430
3513 26488430 24935557 23422786 21845519 20180317 18819923 17542589 16236234 15225845
3505 15225845 14127016 13037981 12084358 11301085 10517519 9961912 9552273 9071985 8754561
3496 8754561 8614449 8397262 8053856 7765006 7425512 6970587 6611207 6360803 6050019 5847005
3486 5847005 5652715 5321070 5091086 4805710 4731034 4701778 4521256 4710215 4843897 4782643
3476 4782643 5000137 5258116 5250952 5221624 5180241 5154763 4977938 4697183 4409954 4101416
3466 4101416 3966867 3629161 3306495 3131067 2895428 2977060 2852737 2813529 2840470 2841173 3023300
3455C023300J1006J6492M6197k0427p0124j44081j01277j93780j43089j59151
3445B265066l01473j56425p6093K3182q0168j92305k50135p8224Q5951q9472j16274
3434A033630N6864M5041m2930K25292m2096k98926j17759K62449m2644o5901R1054
3423A104074Q4370m0437j73252J9595j07059k0786O5742O5854Q1642R420L3063
3412A122226J20584J71869J52400J71841j35136j37975j36365n029j48932l4468
3402A141015P7568j08822j2508p6567k8365N4124P7273P7396p2318l3003M3840
3391A139633K9523k069J12690r0114j72060j11148j38003P5731L2982l8970p6276
3380G61919j36636j22696O3430j4012Q2768J0658j566j11513O8726R4935o6502
$$ plain form
3455 3023300 3034306 3050798 3096995 3076568 3006444 2862363 2761086 2567306 2424217 2265066
3445 2265066 1963593 1807168 1731075 1754257 1674089 1481784 1231649 1153425 1239376 1149904 1033630
3434 1033630 1090494 1135535 1092605 1317897 1275801 976875 859116 1121565 1078921 1013020 1104074
3423 1104074 1188444 1148007 974755 994350 887291 866505 932247 998101 1079743 1089163 1122226
3412 1122226 1242810 1414679 1567079 1738920 1603784 1465809 1329444 1324415 1175483 1141015
3402 1141015 1218583 1109761 1097253 1020686 992321 1046445 1123718 1201114 1128796 1095793 1139633
3391 1139633 1169156 1167087 1279777 1189663 1017603 906455 768452 844183 877165 838195 761919
3380 761919 625283 502587 566017 552005 634773 645431 643865 532352 601078 696013 629511
3369F29511o0272l9577L8718k8341j0808Q7745O7128j20292r4639J0547K915M376
3357D87011m8967N8066P2215r1042o2553p0028r037K37624N8984j58365p8267
3346C95641M2021N3980q8068o8879L9677N6256m903Q5828n4318j37017M449K2733
3334C47400O9549j74048R7742K1225L00M9635J6320n5533O2228k7428l3255P5283
3322D49418j12990M9964K2911J3809j8836J1298L5180L3367k4856J3334Q6929
3311E59528n9823K2827q3371O1611R2194J6345p758m8957J4939m520J1755k0984
3299E53786N0016J3688o1326O6436R3282P9992K4683M307k0172p2583P1302n3263
3287G50148l0857Q8215o1204n8675N6038R0976k0222N3424J62683P9419l7329
$$ plain form
3369 629511 569239 529662 568380 540039 529231 616976 684104 563812 469173 479720 482635 487011
3357 487011 438044 496110 568325 477283 414730 344702 335665 573289 632273 473908 395641
3346 395641 437662 491642 403574 334695 374372 430628 425725 511553 457235 320218 324667 347400
3334 347400 416949 242901 340643 361868 362168 411803 428123 372590 434818 407390 374135 449418
3322 449418 336428 386392 409303 423112 404276 415574 450754 484121 459265 472599 559528
3311 559528 499705 522532 439161 500772 592966 609311 601553 552596 567535 563015 574770 553786
3299 553786 603802 617490 556164 622600 715882 795874 820557 824864 804692 732109 803411 750148
3287 750148 719291 807506 746302 687627 743665 834641 814419 867843 1030526 1109945 1072616
3276A072616j00240J19781k6642n8825L2208Q7168K2770N9813m6045R8899K62023
3265A523526j25553o5491J29139J2501L8188L5706p0385Q774P7663J83458M3960
3254A791486K31933j0216m4389J29418l3893K7644K16606m3896j5741K65958Q9653
3243B604563J0857k221O5218K2942J52866J2033J49345J23363K18416K16071J15342
3232C688795J59728K87296P8621L74918M49007K53064L75795M05129L61617N35605
3222F969575N72755P45500Q25305R78392J106160J061839J328663J356201J232620
3213A6177010R50014N68866r9608l31027k49200j21863j32294j43828Q323L6985
3203A6663378q4532o2563k23742j2364q2823O1493K30950K23072K45662L43702
$$ plain form
3276 1072616 972376 1092157 1065515 1006690 1038898 1126066 1148836 1208649 1162604 1261503 1523526
3265 1523526 1397973 1332482 1461621 1474122 1512310 1548016 1477631 1486405 1564068 1747526 1791486
3254 1791486 2023419 2013203 1968814 2098232 2064339 2091983 2308589 2264693 2248952 2514910 2604563
3243 2604563 2615420 2613199 2678417 2701359 2854225 2866258 3015603 3138966 3357382 3573453 3688795
3232 3688795 3848523 4135819 4214440 4589358 5038365 5291429 5667224 6072353 6433970 6969575
3222 6969575 7542330 8287830 9113135 10091527 11197687 12259526 13588189 14944390 16177010
3213 16177010 17127024 17695890 17596282 17265255 17016055 16894192 16761898 16618070 16626393 16663378
3203 16663378 16578846 16516283 16292541 16280177 16197354 16258847 16489797 16712869 16958531 17302233
3193A7302233L05087K25720O47719J093973J763444K983224M814197O816678O944665
3184D2896940M141902q34876m417454n306412n124058m443120l501213k976779
3176B0434930k356867j589640j195853r28718q25231p95829o18268l40490l71847
3167A1412187l52195k71784N9835L9791K32414J52900K53762L70487N18871O52008
3157A3068276R49589J113126Q92558N88923L21667n58345j246618j417561j478417
3148A2233198j445456j120814j103889q85012p57759o30066m83536m84562l35110
3139D986994m96850l82295l31216k04475j91026j98001j08119l14178k25014j34352
3129B401468k93594q1568k2537k35957k65762L8601j37038j33828k5698r1914
$$ plain form
3193 17302233 17607320 17833040 18480759 19574732 21338176 24321400 29135597 35952275 42896940
3184 42896940 47038842 46203966 41786512 36480100 31356042 26912922 23411709 20434930
3176 20434930 18078063 16488423 15292570 14363852 13538621 12742792 12124524 11784034 11412187
3167 11412187 11059992 10788208 10848043 10887834 11120248 11273148 11526910 11897397 12416268 13068276
3157 13068276 14017865 15130991 16023549 16612472 16934139 16375794 15129176 13711615 12233198
3148 12233198 10787742 9666928 8563039 7678027 6920268 6290202 5806666 5322104 4986994
3139 4986994 4490144 4107849 3776633 3572158 3381132 3183131 3075012 2760834 2535820 2401468
3129 2401468 2107874 2026306 2003769 1767812 1502050 1540651 1403613 1269785 1244087 1152173
3119A152173p9463J1116j17014n9633q8484p7734k8449M9775r8452j20883J7917
3108E60869j9717k0290M14N6563j51080L7762p2741q5855m4006j27132J3860K5953
3096A74600P5127L8594j38545P991J13344j27750K2096j62438m2443k5199O5124
3085E01l5549p3578j7298Q4498k6373k22010L5252O0916m329P2579l7544N3057
3073a09878K5038o729q7503j04203J7535J13886o1354o467N2710Q3931j49271
3062b32305n8683J6878R2274J3936q6053p2505o1916J62838j16904M6231O1530
3051b34679j9282j3178k3849q5922n9090r6308J19401M264j7711o3164K7575K841
3039d59102P1820k6811N2815J8627j11007q0551l90Q2567J3830L1209L7801L1389
$$ plain form
3119 1152173 1072710 1083826 966812 907179 818695 740961 712512 762287 663835 542952 560869
3108 560869 541152 520862 521276 577839 426759 464521 391780 305925 261919 134787 148647 174600
3096 174600 249727 288321 149776 157767 271111 143361 165457 3019 -39424 -64623 501
3085 501 -35048 -108626 -125924 -41426 -67799 -289809 -254557 -193641 -197970 -125391 -162935 -109878
3073 -109878 -84840 -91569 -179072 -283275 -265740 -151854 -213208 -219675 -166965 -83034 -232305
3062 -232305 -290988 -274110 -181836 -167900 -253953 -326458 -388374 -225536 -342440 -296209 -234679
3051 -234679 -253961 -267139 -290988 -376910 -436000 -532308 -412907 -408643 -426354 -489518 -461943 -459102
3039 -459102 -387282 -414093 -361278 -342651 -453658 -534209 -534599 -452032 -438202 -406993 -369192 -337803
3027c37803j01162J41382m8250j31049P4313j24006j4186J06777j9236K17454
3017b35766j12831j3336P2514r9166r9391l7747j67310p291J49079K2900J7331
3006e11014J09432M4171j96033K2627n3413j01851m070J21647m1314J57065R519
2995d43234p2258j02676J4176J57330m6233j719k9177J5562J04076o9836K57k5142
2983d98874J6448R721q2067J6723j929k8073J5772o7075l6484j9773m3227O3721
2971f55117k4323J4443P1658L4090l2030j5400P1773N2286J3955j97296j302j05505
2959g72768K3245Q6242Q9806N3726j68101r404J82978n6872k1975K7432M523J39708
2947d21460M7224j45550j38296M9040O0454J04528p6805l0275j08165K5054J21149
$$ plain form
3027 -337803 -438965 -297583 -345833 -476882 -402569 -526575 -540761 -433984 -453220 -235766
3017 -235766 -348597 -361933 -289419 -388585 -487976 -525723 -693033 -700324 -551245 -528345 -511014
3006 -511014 -401582 -357411 -553444 -530817 -584230 -686081 -690151 -568504 -609818 -452753 -443234
2995 -443234 -515492 -618168 -603992 -446662 -492895 -494614 -523791 -508229 -404153 -473989 -473732 -498874
2983 -498874 -482426 -472705 -554772 -538049 -539978 -568051 -552279 -619354 -655838 -675611 -718838 -655117
2971 -655117 -679440 -664997 -593339 -559249 -591279 -606679 -534906 -482620 -468665 -665961 -667263 -772768
2959 -772768 -749523 -663281 -573475 -519749 -687850 -697254 -514276 -571148 -593123 -565691 -561168 -421460
2947 -421460 -374236 -519786 -658082 -609042 -548588 -444060 -520865 -551140 -659305 -634251 -513102
2936e13102j41643K4835P5606P5449r638p4757j1519J16485J04075r6052j79153
2925f29414J72453P3335m681J21352j04238k578j36219m5169J04785J23259n1183
2914c78298J01073j22156j27315J7702o2763l6380J22627j37307O4773J01484
2904d56560P975K6117N0464J31860k3324j39199n1499j27568L0563M5585Q6250
2893d19336J29151j76060L2193K5558m758k279j24048K00057M2405j87999n775
2882d90891O8633J2920l7910j18392K0424N3058P2983Q6630j01275n5189l2827
2871e21836R9153l8179o0879J0627L2560J8265L6179j45565M7671J25986o6180
2860d62198p2812r9480J2932J19641M4415o7616K2600p4796k2894n4071j24879
$$ plain form
2936 -513102 -654745 -629910 -554304 -478855 -488493 -563250 -574769 -458284 -354209 -450261 -629414
2925 -629414 -456961 -383626 -388307 -266955 -371193 -373771 -509990 -555159 -450374 -327115 -378298
2914 -378298 -277225 -399381 -526696 -508994 -571757 -608137 -485510 -622817 -558044 -456560
2904 -456560 -448585 -422468 -372004 -240144 -263468 -402667 -454166 -581734 -551171 -505586 -419336
2893 -419336 -290185 -466245 -434052 -408494 -413252 -415531 -539579 -339522 -297117 -485116 -490891
2882 -490891 -422258 -409338 -447248 -565640 -545216 -492158 -419175 -332545 -433820 -489009 -521836
2871 -521836 -422683 -460862 -521741 -511114 -478554 -460289 -424110 -569675 -522004 -396018 -462198
2860 -462198 -535010 -634490 -621558 -501917 -457502 -525118 -502518 -577314 -600208 -654279 -779158
2849g79158J96239r0201n9707J14143J16852J9982j44889o9682J25231q7191M3668
2838f14713N7992j37830q46J25238J33225J07709M394J6746k14225j13312N4712
2827e80910l8356k0737J86083L909j96041J0775l2598O6298L9135O0266q8437
2816e90613Q729R8833l7647j8302J1687O4569q9840J7041J32470j57999n5647
2805f16719K0734J06217j10615M0464n0630J20971l3684m4305q8631P889O8479
2794e79830J30186j25713o9956P3084J08144P5428j80679J0057p5669J40534J9460
2783d74954L1712n2387J1917J1250j18372R5756p8970p2105N2078L6478Q3272
2772d74325R8324j17866q663J6170p3368j7351k9686N0180j0834n5507J6563L43
$$ plain form
2849 -779158 -582919 -673120 -732827 -618684 -501832 -481850 -626739 -696421 -571190 -658381 -614713
2838 -614713 -556721 -694551 -695397 -570159 -436934 -329225 -324831 -308085 -522310 -635622 -580910
2827 -580910 -619266 -640003 -453920 -450011 -646052 -635277 -667875 -601577 -562442 -502176 -590613
2816 -590613 -581884 -483051 -520698 -539000 -527313 -462744 -552584 -535543 -403073 -561072 -616719
2805 -616719 -595985 -489768 -600383 -559919 -610549 -489578 -523262 -567567 -656198 -648309 -579830
2794 -579830 -449644 -575357 -645313 -572229 -464085 -388657 -569336 -559279 -634948 -494414 -474954
2783 -474954 -443242 -495629 -483712 -472462 -590834 -495078 -574048 -646153 -594075 -557597 -474325
2772 -474325 -376001 -493867 -502530 -486360 -559728 -577079 -606765 -556585 -567419 -622926 -606363 -606020
2760f06020o8743M6052Q5427M1696j52914R1235L2941L8079n5699k8931M8652
2749e28225M2027r5205J10698K595l5297M2285O399J06478m8472n2582N2972m5833
2737d42160j7629k23183m4761K9500R973M1324J3881P3066J03861K5013j9779
2726d50894O286o0214k3465P4446j4395j41482j8448J9738R7630N2195r4635o4214
2714f17452J05365N5479j960k3246j7689q6975m2543j3652p1134J36489K1449
2703e55869r3686R7562R8808K0801l7953J41415k2221r081J08284p336o7307j88930
2691e15513M4522J00595m6014p6944N8531K4853j4422j3529M1430l7412Q2647
2680c51256n3338q4109n1915k8301J30790n6583J18814l5119L1715k9690k854
$$ plain form
2760 -606020 -674763 -628711 -543284 -501588 -654502 -563267 -530326 -492247 -547946 -576877 -528225
2749 -528225 -486198 -581403 -470705 -468110 -503407 -461122 -454723 -348245 -396717 -449299 -396327 -442160
2737 -442160 -459789 -682972 -727733 -698233 -688260 -646936 -633055 -559989 -456128 -431115 -450894
2726 -450894 -444608 -504822 -528287 -453841 -468236 -609718 -628166 -608428 -510798 -458603 -553238 -617452
2714 -617452 -512087 -456608 -458568 -481814 -499503 -586478 -629021 -642673 -713807 -577318 -555869
2703 -555869 -649555 -551993 -453185 -432384 -470337 -328922 -351143 -360224 -251940 -259276 -326583 -515513
2691 -515513 -470991 -370396 -416410 -493354 -434823 -409970 -424392 -437921 -396491 -433903 -351256
2680 -351256 -404594 -488703 -540618 -568919 -438129 -494712 -375898 -411017 -379302 -408992 -411846
2669d11846J7389k0108J7361j30721R2322L6980q9401Q3493O5013k463M3153L8848
2657b59980J07376Q0102Q9280J06605K62299R1273M669J0143k53566p5507p3341
2646H9353j68125j29501K069J4976j03292l3322r4923l5698N9521O1090k2118
2635c59970j1179K1885m4834N6584k1529k0216k3536K640q6954K9826P438K4948
2623d24897j3059P6352K2971n74P8811k5170l4615K4140k0873Q9325m3311j1415
2611b82315J7428r8782j1341R3588l9497O5072m8351N8367j10628Q9598m8504
2600c15365m4681R4705q79N8842n2234k3345K1589M8745P1600r9482L2684N2796
2588a55025q2631J8615O7938q9415j34463n701N0173R0008r1498m6082L5620j1943
$$ plain form
2669 -411846 -394457 -414565 -397204 -527925 -435603 -398623 -488024 -404531 -339518 -341981 -298828 -259980
2657 -259980 -152604 -72502 16778 123383 385682 476955 481624 491767 238201 162694 89353
2646 89353 -78772 -208273 -206204 -191228 -294520 -327842 -422765 -458463 -398942 -337852 -359970
2635 -359970 -371149 -349264 -394098 -337514 -359043 -379259 -402795 -400155 -487109 -457283 -449845 -424897
2623 -424897 -437956 -361604 -338633 -339207 -260396 -285566 -320181 -296041 -316914 -227589 -270900 -282315
2611 -282315 -264887 -363669 -375010 -281422 -320919 -255847 -304198 -245831 -356459 -266861 -315365
2600 -315365 -360046 -265341 -266220 -207378 -259612 -282957 -261368 -212623 -141023 -240505 -207821 -155025
2588 -155025 -237656 -219041 -151103 -240518 -374981 -380682 -330509 -240501 -331999 -378081 -342461 -354404
2576c54404n1336n8133J16371R9617m4284r1080O4582J15839o097J06790j45884
2565b48019n4767m7113j3632q6144R3762M3802J0346J01874m4005k7968L2627
2554b39237j08351m2213J38752j33176j2372R3674n8279N9537q8950J12633J183
2543b76799K8796p7198K1457J71879j74981L5859K65217j26446k4088L6975n7061
2532a76390j09749L7957J36557P1185q72N309r2584M8889l3553n4999r8823J79632
2520h7441O5657M8111Q718j32814N722J05988l8460m3300P0670m6067j9446r530
2508g2192N5153m6384j38386R8674Q9596K6964K5070m4109P1537o5493j28390
2497a27960J32071P4761R4868j2236p0240K5969O0261O274J21284Q5757k5788
$$ plain form
2576 -354404 -405740 -463873 -347502 -247885 -292169 -383249 -318667 -202828 -208925 -102135 -248019
2565 -248019 -302786 -349899 -363531 -449675 -355913 -312111 -301765 -199891 -243896 -271864 -239237
2554 -239237 -347588 -389801 -251049 -384225 -396597 -302923 -361202 -301665 -390615 -277982 -276799
2543 -276799 -248003 -325201 -303744 -131865 -306846 -270987 -5770 -132216 -156304 -119329 -176390
2532 -176390 -286139 -248182 -111625 -40440 -41312 -36003 -128587 -79698 -113251 -168250 -267073 -87441
2520 -87441 -21784 26327 35045 -97769 -92047 13941 -24519 -67819 2851 -43216 -62662 -72192
2508 -72192 -17039 -63423 -201809 -103135 -13539 13425 38495 -5614 65923 430 -127960
2497 -127960 4111 78872 173740 161504 91264 117233 177494 183768 305052 390809 365021
2486C65021K3920Q8788r6564M0067P0769n4017K3738k6526j4169P1123l2721Q7368
2474E46797J6626j00426P9627J3173j7306R4378O742n8734L1986K4413L1459J015
2462F69750M9154L9656n3360M2447J26281q0584J20330J67992K7127k5205J30318
2451A213906j40883j54922J35320M3299p7364J25329k9606m9919q1937J53379
2441A136602J61346K7595N4807L0804K3344J66527j6402J66184J0117J30662j49677
2430A741909K10622O4576M8953J08451J27623K2835L0097J67247K19037j1352
2420B729998K72277J45691L08130J06210Q1139J73393J26192L12851K12530L6194
2410D504605L95798L74759N19081N18522P70006O84209O92868J240220J610957
$$ plain form
2486 365021 388941 477729 381165 421232 492001 437984 461722 435196 421027 492150 459429 546797
2474 546797 563423 462997 542624 555797 538491 632869 639611 580877 612863 637276 668735 669750
2462 669750 718904 758560 705200 747647 873928 793344 913674 1081666 1108793 1083588 1213906
2451 1213906 1073023 918101 1053421 1096720 1019356 1144685 1115079 1065160 983223 1136602
2441 1136602 1297948 1325543 1380350 1411154 1434498 1601025 1584623 1750807 1760924 1891586 1741909
2430 1741909 1952531 2017107 2066060 2174511 2302134 2324969 2355066 2522313 2741350 2729998
2420 2729998 3002275 3147966 3456096 3562306 3643445 3816838 3943030 4255881 4468411 4504605
2410 4504605 4900403 5275162 5794243 6312765 7082771 7766980 8459848 9700068 11311025
2401A1311025J768251J361677M44319L54406K64808P82990J055332J717025K389749
2392B1449582L344965M703319P377396J4865979L3088781N2701442N1724191J9447376
2384B08703031k7886690m3676731l5087601k5165717j8235852j3409494j0315416
2377C4925530p875300n848678m218533k819403j240185p9034M6114j47911j256931
2368A1485669j801616j537489j200010q17267n96090l71685k80926l46363l57009
2359D177214k26928k83575k95110l69087k88074j75856j24935j22188q1564j5305
2349B194592R2288m7093j18287p8586p0479j38123L7921j95828j04110j42796
2339A429499j57460k4894j7527n1880O1988L8547K1898j28220o6648q6368l3164
$$ plain form
2401 11311025 13079276 14440953 14885272 15239678 15504486 16287476 17342808 19059833 21449582
2392 21449582 24794547 29497866 36875262 51741241 84830022 137531464 189255655 208703031
2384 208703031 180816341 137139610 102052009 76886292 58650440 45240946 34925530
2377 34925530 27050230 21201552 16983019 14163616 12923431 12844397 12890511 12742600 11485669
2368 11485669 9684053 8146564 6946554 6129287 5533197 5161512 4880586 4534223 4177214
2359 4177214 3950286 3666711 3371601 3002514 2714440 2538584 2413649 2291461 2209897 2194592
2349 2194592 2286880 2239787 2121500 2042914 1972435 1834312 1872233 1676405 1572295 1429499
2339 1429499 1272039 1247145 1229618 1177738 1239726 1278273 1300171 1171951 1105303 1018935 985771
2328I85771l6917k08944J1397o3845J00814j75144k01133q9901P2738o1609k4110
2317C09117M1700r089j8388j20534j12459k7467m0230R0964j8551J0631n7095
2306D8599R3748p017j5960k0042L5614j16408Q0738L4710L3201j46323r0639j09821
2294a79600J56729Q0509J227p5272L4148k4638r2967L1706o8098q8670L2406r6797
2282b89317J0401J60419j16526r3172m404m0013M6970Q5716j9099N1838K5316
2271a81871l014j9058J6138j07970J76204Q5726p0830L5082N1102j1730j54108
2260a84329j25771o2203Q059J72517O5589r7881o782l761M4790l3256K8832k2447
2248b16643l3374j2207k3473l576J4113M3684q1565j09034R1674j0970o1925j3400
$$ plain form
2328 985771 948854 739910 751307 687462 788276 613132 411999 322098 394836 333227 309117
2317 309117 350817 341728 323340 202806 90347 62880 22650 113614 95063 105694 48599
2306 48599 142347 135330 119370 99328 134942 18534 99272 133982 167183 20860 -69779 -179600
2294 -179600 -22871 57638 58865 -16407 17741 -6897 -99864 -68158 -136256 -224926 -192520 -289317
2282 -289317 -278916 -118497 -235023 -328195 -332599 -372612 -325642 -239926 -259025 -207187 -181871
2271 -181871 -184885 -203943 -187805 -295775 -119571 -33845 -104675 -69593 -18491 -30221 -184329
2260 -184329 -310100 -372303 -364244 -191727 -126138 -224019 -230801 -234562 -189772 -223028 -194196 -216643
2248 -216643 -250017 -262224 -285697 -289273 -275160 -231476 -313041 -422075 -330401 -341371 -403296 -416696
2236d16696O4328R5663j7037r379P119R828j29334q1269J09416N6918j1980N3439
2224b68984P2639k1133j47094m7601O9620R7088O6156m0803o5234n8444m2550
2213c86340r7297J42084N5057j70197J2222k6934l8465L0115O8013l2406q1509
2202e25657n55r462J00091N9264q3280j5532j8935j6596j0001j3420N2050O1373
2190d20660L352m1133k8530q6893L111K4476o882o963m4256r6710L1823J24689
2178e44576j35559p1504m7187J45014P5323L320L3826Q9960k1670o2295m1166
2167e76514R4146j9171q1655K1007L0507n8766P7629j2656o8491o219j4522J89091
2155d25614M456M2356k902k09790M1437j0326r4411r6Q720J32002l0738l9194
$$ plain form
2236 -416696 -352368 -256705 -273742 -283121 -276002 -266174 -395508 -476777 -367361 -310443 -322423 -268984
2224 -268984 -196345 -217478 -364572 -412173 -342553 -245465 -179309 -220112 -285346 -343790 -386340
2213 -386340 -483637 -341553 -286496 -456693 -444471 -471405 -509870 -479755 -411742 -444148 -525657
2202 -525657 -526212 -535674 -435583 -376319 -459599 -475131 -494066 -510662 -520663 -534083 -482033 -420660
2190 -420660 -417308 -458441 -486971 -573864 -570753 -546277 -553159 -560122 -604378 -701088 -669265 -544576
2178 -544576 -680135 -751639 -798826 -653812 -578489 -575169 -541343 -451383 -473053 -535348 -576514
2167 -576514 -482368 -501539 -583194 -562187 -531680 -590446 -512817 -525473 -593964 -600183 -614705 -425614
2155 -425614 -421158 -378802 -381704 -591494 -550057 -560383 -654794 -654890 -646170 -514168 -544906 -584100
2143e84100R6035k0934k3255r7672N878O3974l8264N4775M9635K5446j14015j09346
2131f91843K60433l140k0463j18145R1524L0133K0576R9762n6530O5813L4657
2120b87223O1887J22480K41583K40629L3627j38672m8932q3123j32659j98867
2110a89270j51297O7496j0303k4521Q645k64719m7465L9898l2926k070J4562J15900
2098d76070K5218r5894J6639J012L8505l1469j16781M4848J01512N5427o8519
2087e05572o5987k2137o3959J3915J44557m1795m0466J21989p3690m716N5984
2076d81877J27864M8295r0933N9010m4822j61128l6212n5082N6644J15794m6703
2065e09150K0007r865j71828O2689J34572O7021j23399M9296O9331m0249M7604
$$ plain form
2143 -584100 -488065 -508999 -532254 -629926 -624048 -560074 -598338 -543563 -493928 -468482 -582497 -691843
2131 -691843 -431410 -434550 -455013 -573158 -481634 -451501 -430925 -331163 -387693 -321880 -287223
2120 -287223 -225336 -102856 138727 379356 412983 274311 225379 142256 9597 -189270
2110 -189270 -340567 -273071 -283374 -307895 -299250 -563969 -611434 -571536 -604462 -606532 -591970 -476070
2098 -476070 -450852 -546746 -530107 -529095 -490590 -522059 -638840 -593992 -492480 -437053 -505572
2087 -505572 -571559 -593696 -657655 -643740 -499183 -540978 -581444 -459455 -533145 -537861 -481877
2076 -481877 -354013 -305718 -396651 -337641 -382463 -543591 -579803 -634885 -578241 -462447 -509150
2065 -509150 -489143 -499008 -670836 -608147 -473575 -406554 -529953 -480657 -411326 -451575 -403971
2054d03971j73279j07546Q9938J26231M4724j56120m2181K9955o0245m80R5204
2043e57770l2561J35255k852q8243J01106N9893p1860p2961K9114j0748j40088
2032f51715K09231M9505k74625L7727R4302K9726J62206n6555j11361p0980j4447
2021e96986k6359K9868p9114P8607N1210M346k5994j8125k4157p032p2804j3231
2009f99771N4720J3056J52818j20455j50355L1786J01883Q0993J96803p4986j17864
1998e31372L7700o3723N593O5002j5431n6028K9532n9138J01530J66699p4502
1987c94138j8632k1417n118q0290k6803K5116R2598j24882j7205O7389L9872N5479
1975d08031J01192j34403j1974j00189P5704j36194n4003n2524N6220R6428R1759
$$ plain form
2054 -403971 -577250 -684796 -594858 -468627 -423903 -580023 -622204 -592249 -652494 -652974 -557770
2043 -557770 -590331 -455076 -457928 -546171 -445065 -385172 -457032 -529993 -500879 -511627 -651715
2032 -651715 -442484 -392979 -667604 -629877 -535575 -505849 -343643 -400198 -511559 -582539 -596986
2021 -596986 -623345 -593477 -672591 -593984 -542774 -538428 -564422 -582547 -606704 -613736 -686540 -699771
2009 -699771 -645051 -631995 -479177 -599632 -749987 -718201 -616318 -535325 -338522 -413508 -531372
1998 -531372 -493672 -557395 -551802 -486800 -502231 -558259 -528727 -587865 -486335 -319636 -394138
1987 -394138 -412770 -434187 -439305 -519595 -546398 -521282 -428684 -553566 -570771 -503382 -463510 -408031
1975 -408031 -306839 -441242 -453216 -553405 -477701 -613895 -667898 -720422 -664202 -567774 -476015
1964d76015L1750J1469J7434r8084m3310N4300J38642j07082j01300n3475r149
1953f34820n7914P1067J06971R0792N6454j3772j6919j38044m6014P4645j5828
1942e23382n0734K9763O4733L8022M50M1334j60682j44303J13804j1885J5309
1931e87571J30963j917q749l4420o3972Q2617M4868q0785K8968J29070k05269
1920e66197o4744K6876M7415R0430m0150P9294n1846r9134J60196J92n5763M8380
1908d25051k840l5024r3225J62336Q8492j37592Q527P659m5316m6749K6673o5331
1896e57441l4053J072p2992K3184K0782R778J65306p7846r1496J40510O2914q9196
1884d99478Q7311q8154p4634J1040Q9588J9925r8283N4706o3227J10304J89795
$$ plain form
1964 -476015 -444265 -432796 -415362 -513446 -556756 -502456 -363814 -470896 -572196 -625671 -634820
1953 -634820 -692734 -621667 -514696 -423904 -367450 -381222 -398141 -536185 -582199 -507554 -523382
1942 -523382 -574116 -544353 -479620 -441598 -441148 -399814 -560496 -704799 -590995 -602880 -587571
1931 -587571 -456608 -458525 -467274 -501694 -565666 -483049 -438181 -518966 -489998 -360928 -566197
1920 -566197 -630941 -604065 -556650 -466220 -506370 -427076 -478922 -578056 -417860 -417668 -473431 -425051
1908 -425051 -427891 -462915 -556140 -393804 -305312 -442904 -434377 -426718 -472034 -518783 -492110 -557441
1896 -557441 -591494 -590422 -663414 -640230 -619448 -609670 -444364 -522210 -613706 -473196 -410282 -499478
1884 -499478 -412167 -500321 -574955 -563915 -474327 -454402 -552685 -497979 -561206 -450902 -261107
1873b61107l5451p3740r4431N2635o502j5016k8124r6314m9111J33818K2300j08920
1861e59963k0539K7093J18296n5247j4438J02752m8032M6969O258m0722R1480
1850c46093O7550J4589J1143q5680n8125l9892o4772p4485L8806k5400J22539
1839d39820l8089M7574K5334p4439P455j0729J23739r1844n071N7246r1374j1924
1827e01942J10971L2680l6789n3667q569P6587K1788l7650j5781j23986M1261
$$ plain form
1873 -261107 -296558 -370298 -464729 -412094 -418596 -433612 -461736 -558050 -607161 -473343 -451043 -559963
1861 -559963 -580502 -553409 -435113 -490360 -504798 -402046 -450078 -403109 -396851 -437573 -346093
1850 -346093 -278543 -263954 -252811 -338491 -396616 -436508 -501280 -575765 -536959 -562359 -439820
1839 -439820 -477909 -430335 -405001 -479440 -471985 -482714 -358975 -450819 -455890 -398644 -490018 -501942
1827 -501942 -390971 -358291 -395080 -448747 -457316 -380729 -358941 -396591 -412372 -536358 -495097
$$ [...]
##END NTUPLES=NMR SPECTRUM
##END=
