##TITLE=1H_DE-80H_X3
 200.13MHz, d2o
 8 sc
 
 19ns.26.2.2025
##JCAMPDX= 6.0         $$ Bruker NMR JCAMP-DX V2.0
##DATA TYPE= NMR SPECTRUM
##DATA CLASS= NTUPLES
##ORIGIN= UXNMR, Bruker Analytische Messtechnik GmbH
##OWNER= pz
$$ XWIN-NMR		Version 3.5
$$ Thu Apr  2 10:28:40 2026 Russian Standard Time (UT+4h)  Yarkov@DPX200
##.OBSERVE FREQUENCY= 200.1313
##.OBSERVE NUCLEUS= ^1H
##.ACQUISITION MODE= SIMULTANEOUS
##.ACQUISITION SCHEME= undefined
##.AVERAGES= 8
##.DIGITISER RES= 18
##SPECTROMETER/DATA SYSTEM= spect
##.PULSE SEQUENCE= zg30
##.SOLVENT NAME= CDCl3
##.SHIFT REFERENCE= (INTERNAL, CDCl3, 0, 15.445)
##AUDIT TRAIL= $$ (NUMBER, WHEN, WHO, WHERE, WHAT)
$$ ##TITLE= Audit trail, XWIN-NMR		Version 3.5
$$ ##JCAMPDX= 5.01
$$ ##ORIGIN= Bruker BioSpin GmbH
$$ ##OWNER= Yarkov
$$ C:/Bruker/XWIN-NMR/data/yarkov2/nmr/H-C/1/pdata/1/auditp.txt
$$ ##AUDIT TRAIL=  $$ (NUMBER, WHEN, WHO, WHERE, WHAT)
(   1,<2026-04-02 10:27:07.25 +0400>,<Yarkov>,<DPX200>,
      <created by zg, POWCHK disabled, PULCHK disabled
       configuration hash MD5:
       00 E9 B6 7A A2 85 ED C7 34 08 36 98 17 FE 4E 26
       data hash MD5: 16K
       86 E5 9F E1 9B AE 17 6D CC 97 E8 72 24 1C AD 1E>)
(   2,<2026-04-02 10:27:12.40 +0400>,<Yarkov>,<DPX200>,
      <Start of raw data processing
       efp BC_mod = 2 LB = 0.25 FT_mod = 6 PKNL = 1 PHC0 = -5299.148 PHC1 = 6.821927 SI = 16K 
       data hash MD5: 16K
       A9 E0 FD 90 6E 32 C7 23 88 EA CA 47 BF B5 35 A0>)
(   3,<2026-04-02 10:27:16.67 +0400>,<Yarkov>,<DPX200>,
      <abs ABSG = 5 
       data hash MD5: 16K
       A3 0C 98 31 6D 43 6D 38 93 B0 D3 84 DF A9 CF 9B>)
(   4,<2026-04-02 10:27:50.96 +0400>,<Yarkov>,<DPX200>,
      <pk PHC0 = -2.6 PHC1 = 0 
       data hash MD5: 16K
       F9 91 24 56 0E 97 79 ED 01 56 75 43 72 90 BC 0A>)
$$ ##END=
$$ 
$$ hash MD5
$$ A8 25 9B 86 AC A5 A8 5A EE EE 26 47 98 0E 48 1F
##$RELAX= 
##$RELAX= 
##$RELAX= 
##$RELAX= 
##$RELAX= 
##$RELAX= 
$$ Bruker specific parameters
$$ --------------------------
##$DU= <C:/Bruker/XWIN-NMR>
##$EXPNO= 1
##$NAME= <H-C>
##$PROCNO= 1
##$TYPE= <nmr>
##$USER= <yarkov2>
##$AMP= (0..31)
100 100 100 100 100 100 100 100 100 100 100 100 100 100 100 100 100 100 
100 100 100 100 100 100 100 100 100 100 100 100 100 100 
##$AQSEQ= 0
##$AQ_mod= 1
##$AUNM= <au_zg>
##$AUTOPOS= <>
##$BF1= 200.13
##$BF2= 200.13
##$BF3= 200.13
##$BF4= 200.13
##$BF5= 200.13
##$BF6= 200.13
##$BF7= 200.13
##$BF8= 200.13
##$BYTORDA= 1
##$CFDGTYP= 0
##$CFRGTYP= 5
##$CHEMSTR= <none>
##$CNST= (0..31)
1 1 145 1 1 1 1 1 1 1 1 1 1 1 1 1 1 1 1 1 1 1 1 1 1 1 1 1 1 1 1 1 
##$CPDPRG= <>
##$CPDPRG1= <>
##$CPDPRG2= <>
##$CPDPRG3= <>
##$CPDPRG4= <mlev>
##$CPDPRG5= <mlev>
##$CPDPRG6= <mlev>
##$CPDPRG7= <mlev>
##$CPDPRG8= <mlev>
##$CPDPRGB= <>
##$CPDPRGT= <>
##$D= (0..31)
0 0.7 0 0 0 0 0 0 0 0 0 0.03 0 0 0 0 0 0 0 0 0 0 0 0 0 0 0 0 0 0 0 0 
##$DATE= 1775111226
##$DBL= (0..7)
120 120 120 120 120 120 120 120 
##$DBP= (0..7)
150 150 150 150 150 150 150 150 
##$DBP07= 0
##$DBPNAM0= <>
##$DBPNAM1= <>
##$DBPNAM2= <>
$$ [...]
##$SUBNAM3= <"">
##$SUBNAM4= <"">
##$SUBNAM5= <"">
##$SUBNAM6= <"">
##$SUBNAM7= <"">
##$SUBNAM8= <"">
##$SUBNAM9= <"">
##$SW= 18.0517328524113
##$SWIBOX= (0..15)
0 0 2 0 0 0 0 0 0 0 0 0 0 0 0 0 
##$SW_h= 3612.71676300578
##$TD= 16384
##$TD0= 1
##$TE= 0
##$TE2= 300
##$TE3= 300
##$TEG= 300
##$TL= (0..7)
0 120 120 120 120 120 120 120 
##$TP= (0..7)
150 150 150 150 150 150 150 150 
##$TP07= 0
##$TPNAME0= <>
##$TPNAME1= <>
##$TPNAME2= <>
##$TPNAME3= <>
##$TPNAME4= <>
##$TPNAME5= <>
##$TPNAME6= <>
##$TPNAME7= <>
##$TPOAL= (0..7)
0.5 0.5 0.5 0.5 0.5 0.5 0.5 0.5 
##$TPOFFS= (0..7)
0 0 0 0 0 0 0 0 
##$TUNHIN= 0
##$TUNHOUT= 0
##$TUNXOUT= 0
##$USERA1= <user>
##$USERA2= <user>
##$USERA3= <user>
##$USERA4= <user>
##$USERA5= <user>
##$V9= 5
##$VALIST= <valist>
##$VCLIST= <CCCCCCCCCCCCCCC>
##$VD= 0
##$VDLIST= <DDDDDDDDDDDDDDD>
##$VPLIST= <PPPPPPPPPPPPPPP>
##$VTLIST= <TTTTTTTTTTTTTTT>
##$WBST= 1024
##$WBSW= 4
##$XGAIN= (0..3)
0 0 0 0 
##$XL= 0
##$YL= 0
##$YMAX_a= 197621
##$YMIN_a= -165594
##$ZGOPTNS= <>
##$ZL1= 120
##$ZL2= 120
##$ZL3= 120
##$ZL4= 120
##$ABSF1= 15.43288
##$ABSF2= -2.618969
##$ABSG= 5
##$ABSL= 3
##$ALPHA= 0
##$AQORDER= 0
##$ASSFAC= 0
##$ASSFACI= 0
##$ASSFACX= 0
##$ASSWID= 0
##$AUNMP= <proc_1d>
##$AZFE= 0.1
##$AZFW= 0.1
##$BCFW= 0
##$BC_mod= 2
##$BYTORDP= 0
##$COROFFS= 0
##$CY= -3
##$DATMOD= 1
##$DC= 0
##$DFILT= <>
##$DTYPP= 0
##$F1P= 0
##$F2P= 0
##$FCOR= 1
##$FTSIZE= 16384
##$FT_mod= 6
##$GAMMA= 0
##$GB= 0
##$INTBC= 1
##$INTSCL= 3.241238e-09
##$ISEN= 128
##$LB= 0.25
##$LEV0= 0
##$LPBIN= 0
##$MAXI= 10000
##$MC2= 0
##$MEAN= 0
##$ME_mod= 0
##$MI= 1.114404
##$NCOEF= 0
##$NC_proc= -8
##$NLEV= 6
##$NOISF1= 3.799351
##$NOISF2= 2.8
##$NSP= 0
##$NTH_PI= 0
##$NZP= 0
##$OFFSET= 15.445
##$PC= 1
##$PHC0= -5301.748
##$PHC1= 6.821927
##$PH_mod= 1
##$PKNL= yes
##$PPARMOD= 0
##$PSCAL= 0
##$PSIGN= 0
##$REVERSE= no
##$SF= 200.130015351042
##$SI= 16384
##$SIGF1= 3
##$SIGF2= 2
##$SINO= 0.751879
##$SIOLD= 32768
##$SREGLST= <19F.Aceton>
##$SSB= 0
##$STSI= 16384
##$STSR= 0
##$SW_p= 3612.71676300578
##$SYMM= 0
##$S_DEV= 0
##$TDeff= 16384
##$TDoff= 0
##$TI= <>
##$TILT= no
##$TM1= 0
##$TM2= 0
##$TOPLEV= 0
##$USERP1= <user>
##$USERP2= <user>
##$USERP3= <user>
##$USERP4= <user>
##$USERP5= <user>
##$WDW= 1
##$XDIM= 16384
##$YMAX_p= 464912203
##$YMIN_p= -1443835
$$ End of Bruker specific parameters
$$ ---------------------------------
##NTUPLES= NMR SPECTRUM
##VAR_NAME=  FREQUENCY,     SPECTRUM/REAL,   SPECTRUM/IMAG
##SYMBOL=    X,             R,               I
##VAR_TYPE=  INDEPENDENT,   DEPENDENT,       DEPENDENT
##VAR_FORM=  AFFN,          ASDF,            ASDF
##VAR_DIM=   16384,         16384,           16384
##UNITS=     HZ,            ARBITRARY UNITS, ARBITRARY UNITS
##FACTOR=    0.220516191357247, 1,           1
##FIRST=     3091.00802602201, 0,            0
##LAST=      -521.70873698377, 0,            0
##MIN=       -521.70873698377, -1443835,     0
##MAX=       3091.00802602201, 464912203,    0
$$ Real data points
##PAGE= N=1
##DATA TABLE= (X++(R..R)), XYDATA
$$ [...]
7638B94330J70191M11766l4784l42855K82526L5137k40674j70436M6248J59841
7628F11290q9523j44935K00492J72561k5199k84123K3832k39640m620O6016K11581
7617D97732J50565p9646O5926R2549Q3439L0956l40832n1109j72651O4165K70545
7606F11639k65277K80756J36813l43726n3070l3250J98150J90637k79943j45905
7596B96824J31617M6811n4996q6397K20852J9430L9144k18782q5293J08662p4780
7585C43092j67017L28639j4592J0978J16546k28646J2870L38674k18457m19410
7575A02677K19657L1581j41303R5690J93299J36788k25545j77072R0357N7271
7565C83400R5424Q1636m0069l12687J36639J87858K93861m2935j38016j67999
$$ y = [294330, 464521, 876287, 841503, 498648, 781174, 816311, 575637, 405201, 451449, 611290, 521767, 376832, 577324, 749885, 724686, 440563, 464395, 224755, 220135, 286151, 497732, 648297, 568651, 634577, 727126, 810565, 841521, 500689, 449580, 276929, 341094, 611639, 346362, 627118, 763931, 420205, 367135, 333885, 532035, 722672, 442729, 296824, 428441, 475252, 420256, 333859, 554711, 574141, 613285, 394503, 309210, 417872, 343092, 176075, 504714, 490122, 501100, 617646, 389000, 401870, 740544, 522087, 102677, 322334, 353915, 212612, 308302, 501601, 638389, 412844, 235772, 326129, 383400, 478824, 560460, 520391, 207704, 344343, 532201, 826062, 783127, 645111, 477112]
7555D77112P2213N0732J36603k87876M2201k28378M4488J89866J19401M9273q1353
7544E84282K21709j05348k56151j42202K49770p9025J44262p389J02600k51084
7534D61424R9019K59924k41982j59037k279K13920K88919k54424m28427K49651
7524D86708J74721o9401m6711K5073M2152K40961l53545p0978O8950J69075m6641
7513F20364j924J71234q2681l53609j8250Q6517M05276r6263k46342R6741o9263
7502E11800j84447r5538J71027P5984r0692j32704K31328O1905K02293p2788k46365
7491D31803k6567K31849o468l28799J92712l133O7994M9678J688k01062k20704
7480A88991k58478P1231L17689J51237M167J75462P5624q8971L8353P5085k9868
$$ y = [477112, 549325, 600057, 736660, 448784, 490985, 262607, 307095, 496961, 616362, 665635, 584282, 805991, 700643, 444492, 302290, 552060, 473035, 617297, 609908, 712508, 461424, 560443, 820367, 578385, 419348, 417069, 630989, 919908, 665484, 237057, 486708, 661429, 592028, 545317, 570390, 612542, 853503, 499958, 428980, 497930, 667005, 620364, 618440, 789674, 706993, 353384, 335134, 421651, 826927, 730664, 484322, 581063, 511800, 327353, 231815, 402842, 478826, 388134, 255430, 486758, 548663, 750956, 678168, 431803, 405236, 637085, 630617, 301818, 494530, 491397, 559391, 609069, 610757, 409695, 188991, -69487, 1744, 319433, 470670, 474837, 650299, 725923, 636952, 675305, 750390, 720522]
7469G20522r3517j6806k94428J86355K47786m1978J9969J02183j58435L24628
7459I96279m02538j61836J47146J62389r7808j64642J25660j18765k84750q6107
7449A15028J37447L36368M9508l2398r850J84563j84677j69344j3924J06698k6331
7438D93088J59025N3921K4968l00669j83693J44858J31608J11891l64120j78163
7428I2714J98187K83364R2688J96839j53602j71933M8805p3124O161L76176j7913
7417H78362n5810k72793r4817q1119j6173J64512m544k78323K603J33774J63347
7406E39019K84605j74894j73130J26462K13895m6449l6920O7366k3958k37488
7396E38508k90194J87056K04247J4270p565n7653N7843k74913J58889p5639j09341
$$ y = [720522, 627005, 610199, 315771, 502126, 749912, 707934, 727903, 830086, 671651, 996279, 593741, 431905, 579051, 741440, 643632, 478990, 604650, 485885, 201135, 115028, 252475, 588843, 638351, 605953, 596103, 780666, 595989, 426645, 412721, 519419, 493088, 652113, 706034, 731002, 430333, 246640, 391498, 523106, 634997, 270877, 92714, 290901, 574265, 666953, 863792, 710190, 538257, 587062, 513938, 520099, 896275, 878362, 822552, 549759, 454942, 373823, 357650, 522162, 517618, 239295, 241898, 375672, 539019, 823624, 648730, 475600, 602062, 815957, 769508, 732588, 799954, 775996, 538508, 248314, 435370, 639617, 653887, 646322, 588669, 646512, 371599, 530488, 454849, 345508]
7385C45508P7461J54652n8662r9532k4669r0638n1622J64924L37910J65454k10252
7374G10534j84396L951j5618K40639k88187j36523J26459j00693j58699P4671
7364B72138K10716L817o2844O8733p9923j74786k38584J30797K6402l1621J16119
7353B40964P9752O2022J90290k77802j29553q0188N5086L14583J07966K9119m4173
7342E48066j30251j53434n4102K800j67023P7504j33429K98870K4300j47132J14305
7331B80474K09582K5060m7952k62294J05013o3771L7812J93569j73106P1757j7793
7320C58351J66603J23988p3986j1074k9509m2592J71761j77878m6700j46679j92242
7309A00043L6530J59301n246J95430R5241M212j00161M5292L57609j36263k92448
$$ y = [345508, 422969, 577621, 518959, 419427, 394758, 304120, 252498, 417422, 755332, 920786, 710534, 526138, 530089, 514471, 755110, 466923, 330400, 456859, 356166, 197467, 272138, 482854, 486671, 423827, 492560, 412637, 237851, -733, 130064, 156466, 124845, 240964, 320716, 382738, 573028, 295226, 165673, 85485, 140571, 455154, 563120, 592239, 548066, 417815, 264381, 210279, 213079, 46056, 123560, -9869, 289001, 313301, 166169, 280474, 490056, 515116, 467164, 204870, 309883, 246112, 283924, 477493, 304387, 376144, 358351, 524954, 648942, 574956, 563882, 534373, 491781, 663542, 485664, 438964, 292285, 100043, 136573, 295874, 290628, 486058, 581299, 585511, 485350, 530642, 888251, 751988, 459540]
7298D59540j80400J49987k5246n28222M15030L78418j13767j01488k19525l5999
7288A98328M03235J47846k04753j25843J46722o2868l6508M7827k30501j21161
7278A62324j81356J78750K63664J03424j57858n3681J02815N0554k05618k22149
7268D0869j7229J55868l3826L4315K30242j22939J61262k62691r5730O9518o3084
7257I6575r5944K92367K24235n0664j5414j50267j03985J89733j95703J9691J51274
7246C61898j26138J79763J30078l8884o4904M2573k1113r3297o3786p823j34859
7235A63508n3736M02687k5383j82492R7365k53649J99955L8216j66127J24251
7225C44595r468N028N1303K0909j12750K0511K00057l2764j31316K50968j27179
$$ y = [459540, 279140, 429127, 403881, -124341, 290689, 669107, 555340, 453852, 234327, 198328, 601563, 749409, 544656, 418813, 565535, 502667, 466159, 513986, 283485, 162324, -19032, 159718, 423382, 526806, 368948, 315267, 418082, 468636, 263018, 40869, 23640, 179508, 145682, 179997, 410239, 287300, 448562, 185871, 90141, 159659, 96575, 631, 292998, 517233, 466569, 451155, 300888, 196903, 386636, 190933, 210624, 361898, 235760, 415523, 545601, 506717, 441813, 484386, 463273, 369976, 306190, 298367, 163508, 109772, 512459, 487076, 304584, 401949, 148300, 348255, 386471, 220344, 344595, 335127, 340155, 391458, 412367, 299617, 320128, 520185, 487421, 356105, 607073, 479894]
7214D79894j84662j02893K21426P0711l87255N2604J23277k41503N5384J75871
7204B62854r4096J60440R8004J89925J40169l87751m5292K36804j70654m3754
7194C46649K34016Q7367j33143K22098k58994N1130J84059p6070K74373J6513
7184I47998l2266K70098l66079k90010K10410K22908J70709j23144n8599l56635
7174E95390J74450N5257J63304K28220k17390j37783j40840o0410J28774K08139
7164I97111j9099j07990N3302j82914J6337N1809j06863k50268N1189p9955J08394
7153E31053j931j28553L30280k03173j40026m4664n2602j08526r6244Q5485K35069
7142D06168L6537j35275k72636L62234K3862l9045k81528o7488K33520o4003N7065
$$ y = [479894, 295232, 192339, 413765, 484476, 97221, 149825, 273102, 31599, 86983, 262854, 168758, 329198, 427202, 617127, 757296, 369545, 324253, 561057, 390403, 346649, 580665, 668032, 534889, 756987, 497993, 549123, 733182, 657112, 931485, 947998, 915732, 1185830, 819751, 529741, 740151, 963059, 1133768, 1010624, 952025, 595390, 769840, 825097, 988401, 1216621, 999231, 861448, 720608, 660198, 788972, 997111, 978012, 870022, 923324, 740410, 756747, 808556, 701693, 451425, 502614, 422659, 531053, 529122, 400569, 730849, 527676, 387650, 342986, 290384, 181858, 85614, 171099, 406168, 442705, 307430, 34794, 397028, 420890, 381845, 100317, 32829, 266349, 202346, 259411]
7131B59411j0252m23504J72784Q744m3680K70195o1672n7022K2061j76943k6961
7120f6839n9690J44693L1343K84758j73855p6947j06071r2325K60794K01698O972
7109C54531K60356j88430l7099J3227j37074J36915K8276J19910j0006K80841
7099H21447r5614Q2855j38479K08401k58591k6835J12142K13587N3726m62929
7089E09710O4133K43650l9299k8870j08386K95144R1430L9065K6934j9096j72705
7078I01710K16710J84642l26263k5280m7374k44543k7152r7762j31758K22448
7068F25378L8627j25871k07488L77056L26343p8937o6332m07299J47372o6977
7058E61872j62069j87553j5244J77351l2125n170J14689R9526k87807j24394K31755
$$ y = [259411, 249159, -174345, -1561, 7183, -36497, 233698, 172026, 115004, 137065, -39878, -66839, -126529, 18164, 49507, 334265, 160410, 83463, -22608, -114933, 145861, 347559, 354531, 614887, 426457, 389358, 402585, 265511, 402426, 430702, 550612, 540606, 821447, 725833, 808688, 670209, 878610, 620019, 593184, 705326, 918913, 972639, 509710, 573843, 817493, 778194, 749324, 640938, 936082, 1027512, 1066577, 1093511, 1074415, 901710, 1118420, 1303062, 976799, 951519, 904145, 659602, 632450, 534688, 402930, 625378, 664005, 538134, 330646, 707702, 1034045, 955108, 888776, 481477, 628849, 561872, 399803, 212250, 197006, 374357, 342232, 337062, 451751, 551277, 263470, 139076, 370831]
7047C70831k27977J01234p2723J33031J83783P4472n6799l10012J91497q2110
7037C05227j13219K10211k61911K28508o80j92841N3392j88852K70360K4524O5834
7026D00553K93402l37909L00269K77984k3038k37737k47346K4966J55252k6037
7016E80359j13053K01453k30622L83123k90608k30782J45199L2035k93326K27423
7006D11201K80914Q10k04251m9759k66174j81757J91879R0704o5912M1594j51993
6995I7256J83402J69246k7768k47762j35003L8530K41606Q5709k27506o6017P2831
6984A84524l8687P7668K60211j28788J15287k19937q9993J27696j5031j52982
6974A19968J04707n4234k8225o0163J28117l3845J13237l6053l75273K15733K36542
$$ y = [370831, 142854, 244088, 171365, 304396, 488179, 562651, 505852, 195840, 387337, 305227, 192008, 402219, 140308, 368816, 368136, 175295, 228687, 39835, 310195, 334719, 400553, 693955, 356046, 656315, 934299, 911261, 673524, 426178, 451144, 606396, 580359, 467306, 668759, 438137, 821260, 530652, 299870, 445069, 477104, 183778, 411201, 692115, 692925, 488674, 438915, 172741, -9016, 182863, 273567, 207655, 249249, 97256, 280658, 449904, 422136, 174374, 39371, 77901, 319507, 405216, 177710, 111693, 184524, 145837, 223505, 483716, 354928, 470215, 250278, 160285, 287981, 272950, 119968, 224675, 170441, 142216, 82053, 210170, 176325, 289562, 253509, -121764, 93969, 330511]
6963C30511L7359J28876L5736k76607M7938R3720k98927j28394L9282K4488L61037
6952C95019J14264j63874p0745j24782o8349q710J49312m0289J6159J09466j74422
6941A33049J95804j52352J13963J56209L3227k60308M91258j38497n22483O9548
6931A19418Q900K8518N1200L3413j52507J93228J64203l348j89620Q2336j42323
6920A93418n2536k9294J57654K11991J07470l57467J5222K65067m11936j28478
6910b8889M12400j89963p668K15331n948q0876j70152P243K6897N4329j15892
6899A16812J47654j45008k78833K97211P17j08384K1096Q9444J80834k20662n2758
6888D8123R7934K37377J31863m54643n5033N9128j62522j49801J22158J15075
$$ y = [330511, 367870, 496746, 532482, 255875, 303813, 397533, 98606, -29788, 9494, 33982, 395019, 509283, 345409, 274664, 149882, 81533, 72823, 222135, 181846, 198005, 307471, 133049, 328853, 176501, 290464, 446673, 479900, 219592, 710850, 572353, 49870, 119418, 128318, 156836, 208036, 241449, 88942, 282170, 446373, 443025, 253405, 335741, 193418, 140882, 111588, 269242, 481233, 588703, 231236, 246458, 511525, 99589, -28889, 383511, 193548, 185880, 401211, 395263, 314387, 144235, 151478, 178375, 232704, 116812, 264466, 119458, -159375, 137836, 138553, 30169, 51265, 140709, 321543, 100881, 48123, 146057, 383434, 515297, 60654, 5621, 64749, -97773, -247574, -125416, -10341]
6878a0341K9114l3773Q7819K32560J82469j45670j36832k28357j49429K24816
6868E2376J65260l59189J50492L3151k87636J2368k1191J74669N5554l32396L88463
6857C1921J30011k21111K17377j8558q5640j74170n8393J5295K54659l16076o4873
6846b89558J58900J00839K8033q5869J58005J05443j34021Q7954J28916k81103
6836b2461J43023M3430j91073j42705M9008J21347k6642L5377m6968l3330m6072
6825a17066J52440L51948L4681j77735n0499J01600J23966j58470j48927j06702
6815E236l4992J34893J06627K29039l68703r2667K37980j08876J46552P2448q2875
6804B44662j1499k5165j77740o4056n0972P4387l6908J74742J40205j61211Q6515
$$ y = [-10341, 18773, -15000, 72819, 305379, 487848, 342178, 205346, -23011, -172440, 52376, 217636, -141553, 8939, 42090, -245546, -233178, -254369, -79700, -24146, -356542, 31921, 161932, -59179, 158198, 139640, 54000, -120170, -178563, -163268, 91391, -224685, -289558, -130658, -29819, -1786, -87655, 70350, 175793, 41772, 129726, 258642, -22461, 120562, 163992, -27081, -169786, -120778, 569, -26073, 9304, -37664, -70994, -117066, 35374, 387322, 422003, 244268, 193769, 295369, 419335, 260865, 111938, 5236, -29756, 105137, 211764, 440803, 72100, -20567, 217413, 108537, 255089, 327537, 244662, 233163, 207998, 30258, -33798, -84770, -10383, -47291, 127451, 267656, 106445, 192960]
6793A92960J26699j18356j22181R7985j69938k6000O7948m0265J50974r8397R3579
6782A55008J75412O8907k39434N6074l1798K4972j84111j1808k66856K62432J1807
6771B0605r4566K03636j36641k53058M2978K55289j21492J25314j25779M7660
6761c6054J91684j41979n8683J42362P0154k61367k8955K72737K41132j24166
6751B66865m6026j78533k6133r2254n6606P7420k4246K5250K38436K533k58968
6740g2262L13101j09026j20003j7015M1433N9774k22158l7595K47894j49669j0449
6729g5975J5397m6108k61766J9528K07513N8664K4556j37944J4922n8780n1278
6718b91271K57078l88756J41015J75425J74865j56353r6150p4875j53779j1855
$$ y = [192960, 319659, 201303, 79122, 177107, 7169, -18831, 49117, 8852, 159826, 61429, 155008, 330420, 399327, 159893, 215967, 184169, 209141, 25030, 13222, -253634, 8798, 20605, -73961, 129675, -6966, -260024, -217046, 38243, -83249, 42065, -83714, -36054, 155630, 13651, -45032, 97330, 167484, -93883, -122838, 149899, 391031, 266865, 220839, 42306, 16173, -76081, -132687, -55267, -79513, -54263, 184173, 186706, -72262, 240839, 131813, 11810, -5205, 36228, 96002, -126156, -163751, 84143, -65526, -75975, -60578, -106686, -368452, -348924, -141411, -82747, -58191, -196135, -181213, -239993, -291271, -34193, -422949, -281934, -106509, 68356, -87997, -184147, -259022, -412801, -424656]
6708d24656L79513J07866j55594j29136J43149Q1137j68764k13608j43582L25305
6698a98370K91493j58678J41681M6011o0776L0333j39350O4121J4529l89656K89074
6687f9588N904K17493K14573k13957j78933n2194q6773j24166o0068J21868J57071
6676f8770L35497k22682k51134Q5411k4014K44602j92998K08571k90876J36220
6666d0173j21228J75374J63400j88970j29899n6000J97829K39814j60141P0576
6656A50582J32697K35594m78433j14056j5771k16801m2050Q2145P7715l9298r9692
6645c27368L03725J75277j04168o9355j81698r1239K57402p8503j07431J13917
6635a09441J65049k08743j80627J92350K3175K23461j38057J02303L72459m4944
$$ y = [-424656, -45143, 62723, -92871, -222007, -78858, 2279, -166485, -380093, -523675, -198370, 93123, -65555, 76126, 122137, 61361, 91694, -47656, 16465, 30994, -358662, -69588, -63684, 153809, 368382, 154425, -24508, -76702, -163475, -287641, -347709, -225841, -68770, 266727, 44045, -207089, -121678, -145692, 98910, -94088, 114483, -176393, -40173, -161401, 13973, 177373, -11597, -141496, -197496, 333, 240147, 80006, 150582, 283279, 518873, 40440, -73616, -89387, -306188, -348238, -266093, -188378, -227676, -327368, -23643, 151634, 47466, -21889, -203587, -294826, -37424, -115927, -223358, -109441, 55608, -153135, -333762, -141412, -118237, 105224, -32833, 69470, 441929, 396985]
6625C96985j14568j23211N2085J71834P9234q1415O0974J19479k88386N5874r8926
6614B29959j23540K8591j93453M2438K58925K64477j89410M0857J31318n498P191
6603D91855K54579L47892j49466P1784K05931K28170K74159j60569j75302O8065
6593A457098k35533k34510j13262L24197l08797l72464K02613J33841M55705L13806
6583A622694L34672L0863l6847l62849n74789j49546O9363j71130k44587L06027
6573H23871J65841J0852j82923N1388j74892k9116k6067O1253J36263J28478n1387
6562I13561m15475p1219L56546r0868k88530k3125M3386K50537K86154r3065k64279
6551F03623L05377J92093J9519K83229J27137j34700l50587j24168j4746R1856
$$ y = [396985, 282417, 159206, 211291, 383125, 462359, 380944, 441918, 561397, 273011, 328885, 229959, 106419, 135010, -58443, -16005, 242920, 507397, 317987, 358844, 490162, 484664, 491855, 746434, 1094326, 944860, 1016644, 1222575, 1450745, 1724904, 1564335, 1389033, 1457098, 1221565, 987055, 873793, 1197990, 889193, 516729, 719342, 853183, 1308888, 1622694, 1957366, 1988229, 1951382, 1588533, 1013744, 864198, 933561, 762431, 517844, 823871, 989712, 1000564, 817641, 869029, 694137, 665021, 638954, 700207, 836470, 964948, 913561, 498086, 426867, 783413, 692545, 404015, 380890, 424276, 674813, 960967, 867902, 603623, 909000, 1101093, 1120612, 1403841, 1530978, 1396278, 1045691, 921523, 906777, 998633]
6541I98633k30656l7294R9234K54710R411o0536K97276J84438n0958j6833j0006
6530A437419J30445n5432K49242M49115M24597K41512j46110P4906J17106m12510
6520B510290n42859o64719J45439K85440n33496O5327M25826O11160O6454J65016
6510B533878J36866n1709k26193o41910k32502P3347k09601j22641p2883j13666
6500A072986L8282j44578p4634r2508p0852q8041J9380K32344J07672j62559l21695
6489E15797N1215K15900j29495l31435M30721o1291k04210j87072J59128J85150
6479F44408j7136k51153j94079O4551J12344o203k19661M32160Q2978n19804j84108
6468e5703K47166K58258l6220j22602n0314J77369q8024k00590m0765L80729R3472
$$ y = [998633, 767977, 730683, 829917, 1084627, 1094038, 1033502, 1330778, 1515216, 1464258, 1447425, 1437419, 1567864, 1512432, 1761674, 2210789, 2635386, 2876898, 2730788, 2805694, 2922800, 2510290, 1967431, 1302712, 1448151, 1733591, 1200095, 1265422, 1691248, 2302408, 2368862, 2533878, 2670744, 2619035, 2392842, 1750932, 1518430, 1591777, 1382176, 1259535, 1186652, 1072986, 1111268, 966690, 892056, 799548, 728696, 640655, 660035, 892379, 1000051, 837492, 515797, 567012, 782912, 653417, 321982, 752703, 691412, 487202, 300130, 459258, 644408, 627272, 376119, 182040, 246591, 358935, 352732, 133071, 565231, 648209, 128405, -55703, 191463, 449721, 413501, 290899, 240585, 417954, 329930, 129340, 88575, 469304, 562776]
6457E62776m0584k21906N6679L43884j56975l08612k03968K35884P5298j00407
6447B42069M2741J1258J88303j86679l49759M8436J67274K87035j65454L7334
6437C22558N9960k03530J00862J10290K37968k56514k50397O0744J42527J12097
6427D36565j06976j92790J73823J83110l40725J30370k3343K16679j85663J79763
6417D70813o2124k99887J82412M7599o0013M06507j02700k80486J41785J24210
6407E68116M4550k39532J08752K91557J79627j99346j77576K46191L43396J05258
6397A270993J07651K60505J79041r7453m33267J05650J78774k56851j30677p678
6387A176688M41824k33899k36423R3923R2942P874k1340L34784J57674J09668
$$ y = [562776, 522192, 300286, 356965, 700849, 543874, 235262, 31294, 267178, 342476, 242069, 284810, 296068, 484371, 297692, -52067, -3631, 163643, 450678, 285224, 322558, 382518, 178988, 279850, 390140, 628108, 371594, 121197, 181941, 324468, 436565, 329589, 136799, 310622, 493732, 153007, 283377, 260034, 476713, 291050, 470813, 408689, 108802, 291214, 338813, 278800, 685307, 582607, 302121, 443906, 568116, 612666, 373134, 481886, 773443, 953070, 753724, 576148, 822339, 1165735, 1270993, 1378644, 1639149, 1818190, 1720737, 1287470, 1393120, 1571894, 1315043, 1184366, 1176688, 1618512, 1384613, 1148190, 1242113, 1335055, 1342929, 1321589, 1656373, 1814047, 1923715]
6377A923715K90003K99359k6628K53515J94088l25781n9639l49175k22135k0059
6367A957263j91102J76467j28214l96831J09330L11923J35144J73029Q0132P6239
6357B303380k839j7720J20956O4846J57418j11835O1299L37678M0766Q7738j44062
6346B897625j43074L16692P5962o7925L19449M50186J27162k718K59464K65130
6336D497953K53327J91075K83911L62208L76435K37113K27976P50373O39138P85313
6326H604822P89444R13039J189752R94187J325109J437138J754622K235102K890718
6317B2133933M163304O918875J1847587J7643659K1721229K1527166J3241834
6310A19197587M02386j0051559j5260085j4866040j2249057q576585n401176k947671
$$ y = [1923715, 2213718, 2513077, 2486449, 2739964, 2934052, 2608271, 2548632, 2199457, 1977322, 1957263, 1766161, 1942628, 1814414, 1417583, 1526913, 1838836, 1973980, 2147009, 2227141, 2303380, 2300541, 2282821, 2403777, 2468623, 2626041, 2514206, 2575505, 2913183, 2953949, 3041687, 2897625, 2754551, 3071243, 3147205, 3079280, 3398729, 3848915, 3976077, 3973359, 4232823, 4497953, 4751280, 4942355, 5226266, 5588474, 5964909, 6202022, 6429998, 7180371, 7819509, 8604822, 9394266, 10307305, 11497057, 12491244, 13816353, 15253491, 17008113, 19243215, 22133933, 26297237, 33216112, 45063699, 62707358, 84428587, 105955753, 119197587, 119599973, 109548414, 94288329, 79422289, 67173232, 58596647, 53195471, 50247800]
6302E0247800j66345M725772J1336249J8155235K1232887J6802165N499682p587878
6294A20245567j6968338j8945690j6177335j2121122r251543p057023n317165
6287C4407351m011399l123700l104592k738084k052334j442589j449528q98397
6279A5586728p63073q24445p04067m85162k34080L7779l06429l21431N0534K11831
6269A2248185J01945j16051L4741M01228L20749K71968K85678N53280O5850O60887
6259A4828460J020004O39631P40693J024651J270604J415698J556813K050490
6251B4547044K203630K543170L411842L788768M507243O485728J1245896J9159408
6243G7892729L0055061L9984047M2140586L0224488P826725j4500804k7191964
$$ y = [50247800, 50081455, 54807227, 66143476, 84298711, 105531598, 122333763, 127833445, 120245567, 103277229, 84331539, 68154204, 56033082, 46781539, 39724516, 34407351, 30395952, 27272252, 24167660, 21429576, 19377242, 17934653, 16485125, 15586728, 14823655, 13999210, 13295143, 12809981, 12575901, 12613680, 12307251, 11985820, 12036354, 12248185, 12350130, 12234079, 12268820, 12670048, 12990797, 13262765, 13548443, 14101723, 14167573, 14828460, 15848464, 16488095, 17228788, 18253439, 19524043, 20939741, 22496554, 24547044, 26750674, 29293844, 32705686, 36494454, 41001697, 47487425, 58733321, 77892729, 107947790, 147931837, 190072423, 220296911, 228123636, 213622832, 186430868]
6236A86430868k8986276k4855333j8415326j2293631p246918j990340N615500
6229I8258544J6547020K9520418L7320596L3133924J6439646o639232k5698580
6222A98882336l3180335l1126671k5160540j9418448j4935635j1549012r148620
6215E4363075p285431o271928n283619m092479l185043k840424k275696j976628
6207B1151827j366439j141036j043388r37593p15093p15493r56764p20281m01851
6198A3153889j39887l29450o07049n26605l1794k04110j42559l57206l71751k78223
6188A0165255m28672l06093k69463j59811o4550m73285l99350j19157n84380j68586
6178G191908k42431J97284j18769k90064m446r2792Q5339n0470J8856j23113J66228
$$ y = [186430868, 157444592, 132589259, 114173933, 101880302, 94633384, 92643044, 98258544, 114805564, 144325982, 181646578, 214780502, 231220148, 224580916, 198882336, 165702001, 134575330, 109414790, 89996342, 75060707, 63511695, 54363075, 47077644, 40805716, 35522097, 31429618, 28244575, 25404151, 23128455, 21151827, 19785388, 18644352, 17600964, 16663371, 15948278, 15232785, 14276021, 13555740, 13153889, 13014002, 12684552, 12077503, 11550898, 11519104, 11314994, 11172435, 10815229, 10443478, 10165255, 9736583, 9430490, 9161027, 9001216, 8936666, 8463381, 8064031, 7944874, 7360494, 7191908, 6949477, 7146761, 7027992, 6737928, 6733482, 6640690, 6726029, 6675559, 6694415, 6571302, 6737530]
6167F737530l92444m73639n9149J08570j02070J6224m2674j43019L5180R5533
6157E780042j07152l00939J52260Q4844K2111o6392J04892J8383n6986L6185P1715
6146E738963J23128l47813Q7333L11149o0503j03196l23789J01706K06139k78316
6136E454801J53536K30837p8174K74547k46832J22088L18952n287o2161L22063
6126F484370N03179l7612O984J57384j37368J6574J70251K0831k43982J15558
6116G056169M5673P20440P48059J41841K59155N55730P11154N15741L44626O63960
6106A1762548R40867P95957R76028Q70621J415078J399742J427260J992217K438841
6097B4019159K593817L236496L690319N129735P881673J2443907K0064901L1777075
$$ y = [6737530, 6345086, 5871447, 5812298, 5920868, 5818798, 5835022, 5792348, 5649329, 5684509, 5780042, 5672890, 5371951, 5524211, 5609055, 5631166, 5564774, 5669666, 5688049, 5631063, 5667248, 5738963, 5862091, 5514278, 5601611, 5912760, 5852257, 5749061, 5425272, 5526978, 5733117, 5454801, 5608337, 5839174, 5761000, 6035547, 5788715, 5910803, 6229755, 6224468, 6162307, 6484370, 6987549, 6949937, 6956921, 7114305, 6976937, 6993511, 7163762, 7184593, 6940611, 7056169, 7101842, 7822282, 8570341, 8712182, 8971337, 9527067, 10238221, 10753962, 11098588, 11762548, 12703415, 13499372, 14475400, 15346021, 16761099, 18160841, 19588101, 21580318, 24019159, 26612976, 29849472, 33539791, 38669526, 46551199, 58995106, 79060007, 110837082]
6089A10837082M1630283M0724033K4471362m06615k2002697l1805277k9879204
6082A33568967k4197532j7667425j3165173j0227313p808697n741488l649549
6075E1111790k180800m88846Q87169K809928N237020J0335362J9269994L1279625
6067A18261242M2739040M2292324K6396371l88112k3806075l4565841l2974875
6060A37954074k6533621k0228033j5195401j2331797r763094q103568o636604
6053C9161956n219729l927223l031752k193685k195704j590466j107540m99285
6045A9396572o21694q92811l96702n34720o02859k13161q7649k18955l95869j46587
6035A5285565K64433K20724R9689L00230K77690N86025O54589Q15530P73985J165749
$$ y = [110837082, 152467365, 193191398, 217662760, 217256145, 195253448, 163448171, 133568967, 109371435, 91704010, 78538837, 68311524, 60502827, 54761339, 51111790, 48930990, 48442144, 49329313, 52139241, 57376261, 67711623, 86981617, 118261242, 161000282, 203292606, 229688977, 229300865, 205494790, 170928949, 137954074, 111420453, 91192420, 75997019, 63665222, 53902128, 45798560, 39161956, 33942227, 30015004, 26983252, 24789567, 22593863, 21003397, 19895857, 19396572, 18774878, 17882067, 17485365, 16950645, 16347786, 16134625, 16046976, 15828021, 15432152, 15285565, 15549998, 15770722, 15870411, 16170641, 16448331, 17034356, 17688945, 18504475, 19278460, 20444209]
6025B0444209J533475J590965K050205K629414N155382Q535754J4617487K1053048
6017G7609939K3183301J7315440M068257r356131j6944298j7130624j3870589
6010F4875295j0416449p530627n647933m759401l411510k288711j657007p50683
6002B8412974M12226J205552K362192M601963Q716539J5187445K2170737K4682499
5994A07752127J8208590M374801r616675j7983268j8689217j5680331j2295817
5987E6070210r151710o965750n854214n016680m132237l413656k761128j777675
5979A6997160j221837j057213j139266q41718m56238o28837n65632L7539l2133
5970A1091825o02347k37005j66423j68247l71935o18595m56738j91905m02683
$$ y = [20444209, 21977684, 23568649, 25618854, 28248268, 33403650, 41939404, 56556891, 77609939, 100793240, 118108680, 122176937, 112820806, 95876508, 78745884, 64875295, 54458846, 46928219, 41280286, 36520885, 33109375, 30820664, 29163657, 28412974, 28825200, 30030752, 32392944, 36994907, 45711446, 60898891, 83069628, 107752127, 125960717, 130335518, 120718843, 102735575, 84046358, 68366027, 56070210, 46918500, 39952750, 34098536, 29081856, 24949619, 21535963, 18774835, 16997160, 15775323, 14718110, 13578844, 12737126, 12280888, 11652051, 11086419, 11123958, 11091825, 10489478, 10252473, 10086050, 9917803, 9545868, 8927273, 8470535, 8278630, 7875947]
5961G875947m99161k84394j15140k65321k83174m57491J48528l02627k58474Q9676
5951E648369K3687k09999j19279j84683j82860r758k21249l94241N4010m1007
5941D362990N1317k16551M495J21212j02544k41312k0474p0242j56806J00605
5931C832690L02278L22769K20935J77351j32032j51972k96317j78478J59772l03120
5921C953876o2211k90382m88761Q0103K65658L07977K76907M3497j16544q985
5911C961135k09189k05341j55114o6472l35465o7445k08043J46709Q5301l50279
5901B595797k93855L23659j90368k67479k8662o5632j00331p9183o7301M8213
5891A874858K51142q1757p81k745k84666j91372L34626k24509j62000J59035q5805
$$ y = [7875947, 7376786, 7092392, 6977252, 6711931, 6428757, 5971266, 6119794, 5817167, 5558693, 5648369, 5672056, 5462057, 5342778, 5158095, 4975235, 4965477, 4744228, 4349987, 4403997, 4362990, 4414307, 4197756, 4202251, 4323463, 4220919, 3979607, 3959133, 3888891, 3732085, 3832690, 4134968, 4457737, 4678672, 4856023, 4723991, 4572019, 4275702, 4097224, 4256996, 3953876, 3891665, 3601283, 3112522, 3192625, 3458283, 3766260, 4043167, 4086664, 3970120, 3961135, 3751946, 3546605, 3391491, 3325019, 2989554, 2922109, 2714066, 2860775, 2946076, 2595797, 2301942, 2625601, 2435233, 2167754, 2139092, 2073460, 1973129, 1893946, 1826645, 1874858, 2126000, 2044243, 2043462, 2040717, 1756051, 1564679, 1899305, 1674796, 1512796, 1671831, 1586026]
5880A586026k5023m19939j1472N8060O7072N5713O0788k00977J6383M7838j05293
5869A129176J13490J65150j14386K6889j45668J12529r5924P4673J11021q0348
5859A296602J65834j74417j30762J53565J60041l09879K42846Q762j6656p4015
5849A321921j73098J27585k2926L23224r0775l21543P2985J18904m06789j14951
5839H34537q7623L0902L49279J4947J53971j76057m46333K94463M8617j12888
5829I03815j01755l0561P0951o5921j14225J63296P0816J8646j24782l75660j21537
5818B93083n6191K57245J73916J22226j89656K29020K59741l7642k05598P1718
5808I17862l7306r7796j4655j09413m0055l1068L95771K65026l1871K37115K0670
$$ y = [1586026, 1561003, 1141064, 1129592, 1187652, 1254724, 1310437, 1371225, 1170248, 1186631, 1234469, 1129176, 1242666, 1407816, 1293430, 1320319, 1174651, 1287180, 1191256, 1265929, 1376950, 1296602, 1462436, 1288019, 1157257, 1310822, 1470863, 1160984, 1403830, 1412592, 1395936, 1321921, 1148823, 1276408, 1253482, 1576706, 1485931, 1164388, 1237373, 1356277, 949488, 834537, 746914, 777816, 1127095, 1142042, 1296013, 1119956, 673623, 968086, 1016703, 903815, 802060, 771499, 842450, 776529, 662304, 825600, 896416, 915062, 790280, 414620, 293083, 236892, 494137, 668053, 790279, 600623, 829643, 1089384, 1051742, 846144, 917862, 880556, 782760, 768105, 658692, 618637, 587569, 983340, 1248366, 1216495, 1453610, 1474280]
5797A474280R5440J19705J46316R706l17756l41006p4716p9140q8789j65545L08093
5786A086588N4733j79413l99828K47059L79486r2451L19186J37932J41255M71810
5776B166357L69174J41446p895j19119l66372n42952j14357k7794k28607l7046
5766A232835m2959R1880K1058K5971J35849n4385M2418k20819K4493l2327N0905
5755A274919K17716M2550J20403J82907k1404k12467m10399j92749l40803J85066
5745H45739K33562k20509j91524l24487J23446J76452M5954J90358o0718k38619
5735E79654q18O3133J24520r8197j81950k05007L14986q4064j47904J77980q0737
5724D61596P0156Q8901j66581l5402k20749l7515M57464J59258j69612J12773
$$ y = [1474280, 1569720, 1689425, 1835741, 1845447, 1527691, 1186685, 1111969, 1032829, 944040, 778495, 1086588, 1141321, 961908, 562080, 809139, 1188625, 1096174, 1415360, 1553292, 1694547, 2166357, 2535531, 2676977, 2669082, 2549963, 2183591, 1640639, 1526282, 1498488, 1269881, 1232835, 1189876, 1281756, 1302814, 1328785, 1464634, 1410249, 1452667, 1231848, 1256341, 1224014, 1274919, 1492635, 1535185, 1655588, 1838495, 1817091, 1604624, 1194225, 1001476, 660673, 845739, 1079301, 858792, 667268, 342781, 466227, 642679, 688633, 878991, 818273, 579654, 578836, 641969, 766489, 668292, 486342, 281335, 596321, 512257, 364353, 542333, 461596, 531752, 620653, 454072, 418670, 197921, 160406, 617870, 777128, 607516, 720289]
5714G20289O0811k09767K4019K12049j56406l16647K8850K0206m82J17913J48709
5703F49544l9367L63155K09241m47638k49108J61385r8736j42127j23475J18400
5693D01274M1783k13423N4637K31896l69138k390J29758J65123J24178L08335
5683H72033L87274j55534R0866L1604j29635J32851k05341n1254k43776o6414
5673F62674r7572j21562Q8908K2743k85696N7960L17320J20603K2803p8365J26338
5662H36154j39128j03775p1296K06904O8729n7122K83042J40308k87638K887j41395
5651G37670J15814j49067r2905J44277J24299J20145K54462j17379o0910J36001
5641A212407l57930J44236j61057j25631J29994r8647q0253K86418k34426k31078
$$ y = [720289, 781100, 571333, 595352, 807401, 650995, 334348, 363198, 383404, 382922, 500835, 649544, 610177, 973332, 1182573, 734935, 485827, 647212, 548476, 406349, 282874, 401274, 443057, 229634, 284271, 516167, 147029, 144639, 274397, 439520, 563698, 872033, 1259307, 1103773, 1194639, 1226243, 1096608, 1229459, 1024118, 972864, 729088, 662674, 565102, 443540, 532448, 555191, 269495, 327455, 644775, 765378, 788181, 709816, 836154, 697026, 593251, 521955, 728859, 797588, 740466, 1023508, 1163816, 876178, 879065, 737670, 853484, 704417, 611512, 755789, 880088, 1000233, 1254695, 1137316, 1076406, 1212407, 854477, 998713, 837656, 712025, 842019, 743372, 663119, 949537, 715111, 484033]
5631D84033J92347m3620j08088K98984j39656r6870R3167k3168k65724N3087J42778
5620E87270k57626J91321k56208L8013N616J8662l051J70891q9217J23028n911
5609E22788R5286N3439K11424j36644n25591L7746J84527J39011k19501P6732
5599D39217m4008k00783k36772j2324J30572L55350j08730q4346j37812k23940
5589a23576K89481p711K31416l5784j23226o0890p0274J03790L87876p3711j32402
5578C84989N0143q4745K94865j85900j75211K7091k23262j27315q4923K46636
5568A22368O4786l33281L5094J58320L0859M9751J10634k9036k44011j20420J61266
5557F330O3252J59109j17299J51974L1258m6031m34728J53193J18694k41235J6567
$$ y = [484033, 676380, 632760, 524672, 823656, 684000, 587130, 680297, 657129, 391405, 444492, 587270, 329644, 520965, 264757, 302770, 308386, 327048, 323997, 494888, 405671, 528699, 522788, 618074, 671513, 882937, 746293, 220702, 258448, 442975, 581986, 362485, 439217, 395209, 194426, -42346, -54670, 75902, 431252, 322522, 238176, 100364, -123576, 165905, 158194, 389610, 353826, 230600, 169710, 99436, 203226, 591102, 517391, 384989, 435132, 350387, 645252, 459352, 284141, 311232, 87970, -39345, -124268, 122368, 187154, -146127, -111033, 47287, 78146, 127897, 238531, 209495, -34516, -154936, 6330, 69582, 228691, 111392, 263366, 294624, 248593, -186135, -32942, 85752, -155483, -138916]
5546a38916j88344J45299K49878k6208j50283J08602R8755M4743j15252j61006
5536a32732J41506O2216k90661L5870J8742J8984K33794j12435r3754R2612Q554
5525a7304L317K0020P7090k24634J28735K19609l59868j12120j00525K36810P2363
5514e6507l16742K58006p3961k56306R8388J28178J33174L20288j63458j61148
5504i0088j12898j12528K0898j12710O0140j4986m3995L10786p1697O9913K38626
5493A41461J26295K3407k0463j54883J26372k70862k0137J15182l7703j29398
5483a00729p4950l8047R9721L36399k16594n5465O2295l8786r3526K32152l5553
5472G6917j28342p9823j94048r690R4142O3626N2835l9637m3618j35249K2953
$$ y = [-138916, -327260, -181961, 67917, 41709, -108574, 28, 98783, 143526, 28274, -132732, 8774, 70990, -219671, -183801, -165059, -146075, 87719, -24716, -118470, -25858, -17304, -13987, 6033, 83123, -141511, -12776, 206833, -153035, -265155, -365680, -128870, -56507, -373249, -115243, -189204, -445510, -347122, -218944, -85770, 234518, 71060, -90088, -202986, -315514, -294616, -407326, -347186, -362172, -406167, -95381, -167078, -97165, 141461, 267756, 291163, 270700, 115817, 242189, -28673, -48810, 66372, 28669, -100729, -175679, -213726, -114005, 222394, 5800, -49665, 12630, -26156, -119682, 112470, 76917, -51425, -131248, -325296, -334986, -240844, -177218, -124383, -164020, -207638, -342887, -319934]
5461c19934r7497r529O2949L85604n2938L00816J5057j5958j32636J1547j05420
5450D2061k93971M9287m09749J67662J57622N3298K90604K0275k5468p9243j08225
5439a35847q7775k05326j831K24127J59449l4590l1613j90999M15310N2044j39966
5428B2983J17941k12467k2490O3990O0230k21578P4972k9877p6990L97720j60803
5417A3631j17642L024J40003L18278J48975p3638Q40m4434L4382J39062P1405
5406F33886O7053M9107K04550J91710J71345k6947o6150l19685j87934J57681
5396H74616r922k3950J21012J43262M22262J81517J44575J88460r6192L3106n5717
5385A923029K78322m7200n89160L5978M37573J4426N7259K16128O3157l41796
$$ y = [-319934, -417431, -426960, -364011, 21593, -31345, 269471, 284528, 268570, 135934, 147481, 42061, -251910, -202623, -612372, -444710, -287088, -233790, 56814, 77089, 51621, -27622, -135847, -223622, -428948, -430779, -206652, -47203, -81793, -113406, -304405, 110905, 162949, 22983, 140924, -71543, -94033, -30043, 30187, -191391, -116419, -146296, -223286, 174434, 13631, -104011, -100987, 39016, 357294, 506269, 432631, 433471, 389037, 423419, 562481, 633886, 700939, 750046, 954596, 1146306, 1317651, 1290704, 1224554, 904869, 716935, 874616, 864694, 840744, 961756, 1105018, 1527280, 1708797, 1853372, 2041832, 1945640, 1978746, 1923029, 2201351, 2154151, 1564991, 1600969, 2038542, 2052968, 2110227, 2326355, 2389512, 2047716]
5375B047716k20641K44138l4589K35259K9123P1437J13538M8605k34026m67793
5365A832767K39800J88953p6593K8538j0350j03430J44985k37807J9393k3003
5355B003253P0540J02338j57047R3967K17177L6160p6277n2038k16219k12885
5345A808969q9378J98099j7381m4980L1270j87181J45318J19017j76531R4726
5335A881948j06066O6671K4135l8601p2687L8211j0873p2494j2365L4185J88364
5324A920428L05606j5881J90125q4132N9933K58385p4250K85989n2748K56195
5314C049650L2898q3118N1666J05263L00498J92069J98067J61838n4488K06238
5304D160581J45143l9889K48855M24888J22685M00780K78470Q2778L93286N25199
$$ y = [2047716, 1827075, 2071213, 2036624, 2271883, 2301006, 2372443, 2485981, 2534586, 2300560, 1832767, 2072567, 2261520, 2184927, 2213465, 2203115, 2099685, 2244670, 2006863, 2026256, 2003253, 2073793, 2176131, 2019084, 2113051, 2330228, 2366388, 2290111, 2238073, 2021854, 1808969, 1719591, 1917690, 1900309, 1855329, 1886599, 1699418, 1844736, 1963753, 1787222, 1881948, 1775882, 1842553, 1866688, 1828087, 1755400, 1793611, 1782738, 1710244, 1697879, 1732064, 1920428, 2226034, 2210153, 2400278, 2316146, 2376079, 2634464, 2560214, 2846203, 2793455, 3049650, 3082548, 2999430, 3051096, 3156359, 3456857, 3648926, 3846993, 4008831, 3954343, 4160581, 4305724, 4265835, 4514690, 4939578, 5062263, 5463043, 5741513, 5824291, 6217577, 6742776]
5294F742776L28018O17670L63835N67191M69883L07204N91306J200695Q08480
5285A1997058J349871K096234L140754N555005Q344083J0612212Q438288J162466
5277E2695971m461242n414291m299225k576176j299516M58749K897799O254201
5269D4256270J0767960J4739663J4411775J0332231O522542L776167J805856K231474
5261A08843938R72843k549233k915405R83010J579565j607762k185117L084950
5253A06206789O439202M885609L386310M907143O987710Q250599J0102605P778855
5245A58944822M8989p066690q737933p257963m613157j502071k167689n999308
5237A21649000o782817k056785N15558k133150m582779j817587J720957J734157
$$ y = [6742776, 7070794, 7688464, 8052299, 8619490, 9089373, 9396577, 9987883, 11188578, 11997058, 13346929, 15443163, 18583917, 24138922, 32483005, 43095217, 51533505, 52695971, 48234729, 42820438, 38521213, 35945037, 34645521, 35104270, 38002069, 44256270, 55024230, 69763893, 84175668, 94507899, 101030441, 104806608, 106612464, 108843938, 109816781, 107267548, 104352143, 105335153, 106914718, 105306956, 103121839, 106206789, 112645991, 117531600, 120917910, 125825053, 132812763, 141063362, 151165967, 158944822, 158993811, 151927121, 143189188, 135931225, 131318068, 129815997, 127648308, 121649000, 114866183, 112809398, 113324956, 111191806, 106609027, 104791440, 106512397, 108246554]
5229A08246554J391010L363058L109293r43451m864016q934151j3667607j4716429
5221G2984261j1891675q980421o429286m265334k124414J076509M563601P101250
5213E2034491O569436N16847o550481q545614p372234n777707m210909l393648
5205B3270181k819800k179629k115007j652294j212244r15670n25263n70315m33581
5196A0846378k81414n17142k21558m64256n23875j90865m50404l93051j57524
5187G646289k9936m053o02866l12906Q172k88545p1410l93476k32878j62780J30405
5176E686016O159l03783R8099N1393m83291l45803n2485K51414l47273n7755j58299
5165D344392Q1699k54436j11996l4421J2892j33896j08883j93028k86101j36211
$$ y = [108246554, 109637564, 113000622, 116109915, 115166464, 110302448, 101368297, 87700690, 72984261, 61092586, 52112165, 45682879, 41417545, 39293131, 40369640, 44933241, 52034491, 58603927, 59120774, 52570293, 44024679, 36652445, 30874738, 26663829, 23270181, 20450381, 18270752, 16155745, 14503451, 13291207, 12375537, 11850274, 11279959, 10846378, 10564964, 10047822, 9826264, 9362008, 8838133, 8647268, 8196864, 7803813, 7646289, 7616353, 7612300, 7009434, 6696528, 6704700, 6416155, 6344745, 5951269, 5718391, 5555611, 5686016, 5692175, 5388392, 5486491, 5537884, 5054593, 4708790, 4656305, 4907719, 4560446, 4502691, 4344392, 4426091, 4171655, 4059659, 4025238, 4038130, 3904234, 3795351, 3602323, 3316222, 3180011]
5155C180011Q4199p9842n1588j39564j75418K5885P25J56188k20561j58544K78684
5144B900175j11631j79671j230J90620J18104o5080k65983k0768J70894J95833
5134B931263k5438j47758n5114j8021L84115M8361k10188r2431k07374N1351N40606
5123C199372K97693k94467m03301j08713J53923r7358n0012o3463j94346J99222
5113B638550j39918j47667m0767K76433K43532L7790O232K53045l12274k521r7093
5102B715342J20939N1268r1013k1620O50206N8749l23673q8119K0747P230Q2734
5091C182790J17480k45639p444R9695k81076J0428J41447k64447Q418k8367J04266
5080B837551j62278P9663j1452J06029L50987L6555j79301P0748J75574j06693
$$ y = [3180011, 3264210, 3184368, 3132780, 2993216, 2817798, 2843683, 2844408, 3000596, 2780035, 2621491, 2900175, 2788544, 2608873, 2607643, 2798263, 2916367, 2851287, 2585304, 2564536, 2735430, 2931263, 2905825, 2758067, 2702953, 2684932, 3069047, 3117408, 2907220, 2814789, 2607415, 2658766, 3199372, 3497065, 3202598, 2799297, 2690584, 2844507, 2747149, 2697137, 2633674, 2439328, 2638550, 2498632, 2350965, 2310198, 2586631, 2830163, 2867953, 2874185, 3127230, 2814956, 2812435, 2715342, 2836281, 2887549, 2796536, 2774916, 3425122, 3483871, 3160198, 3072079, 3092826, 3100056, 3182790, 3300270, 3054631, 3047187, 3146882, 2865806, 2876234, 3017681, 2753234, 2761652, 2733285, 2837551, 2675273, 2754936, 2743484, 2849513, 3200500, 3237055, 3057754, 3128502, 3304076, 3197383]
5070C197383O437o2303N1545K25570m01323q0487K18950J49509n33483l57564
5060B414234L35827L68680L79383J61176K52700j69852j0742j70173o1971K05546
5050C704808k50968k01257K08580l5297l96430k69233j61810m6973l1418j43537
5040B376465j65484r9448K60206J09546k180j3624J74372q0256p4584l5710J33308
5029B582611j59087j94721n3657R2692j48927N3602Q1408k6831J95373j0674k48912
5018B162877j22572K80538k04351q1589j42023K95543K63239j41809M8963j4864
5008B343952J9869j00220K6920M0871k9935j84056k39599M7052K41718K09113
4998B375685l01212q4994L49714M03530j8771p0130k21347K66708J80492j2212
$$ y = [3197383, 3203820, 3141517, 3193062, 3418632, 3017309, 2936822, 3155772, 3305281, 2771798, 2414234, 2750061, 3118741, 3498124, 3659300, 3912000, 3742148, 3731406, 3561233, 3499262, 3704808, 3453840, 3252583, 3461163, 3425866, 3029436, 2760203, 2598393, 2551420, 2520002, 2376465, 2210981, 2111533, 2371739, 2481285, 2479105, 2465481, 2639853, 2559597, 2485013, 2449303, 2582611, 2423524, 2228803, 2175146, 2267838, 2118911, 2172513, 2253921, 2227090, 2422463, 2411789, 2162877, 2040305, 2320843, 2116492, 2034903, 1892880, 2188423, 2451662, 2309853, 2358816, 2343952, 2363821, 2263601, 2290521, 2331392, 2301457, 2117401, 1877802, 1924854, 2166572, 2375685, 2074473, 1989479, 2339193, 2742723, 2723952, 2653822, 2432475, 2699183, 2879675, 2867463]
4988B867463J20770j60571j85663K52677R8832M34450K89221k02769n3390M58020
4978C919040q5964r7601P8458M67869L68038j33171l1738M66014L16353j71892
4968E095406j49897K25588j09754l82277K5850K00704K56873K09397J4014J6059
4958E401963N14045R0182j7548K93415L84421L90310o0956j29985K151j68630
4948F699368l05124o14702j05012L15709M27261J78120N16456J71050K69637L93466
4938G946229M37940K47375L9870j59050j580L17174K53778J87369J0872K70784
4928I550761N54680M72992J57714J79275N26259L87554L41589K11102M96538N90692
4918A3469156L70558L72731P55202R59115K15775l3980J17884j58100j43188q4174
$$ y = [2867463, 2988233, 2827662, 2641999, 2894676, 2993508, 3427958, 3717179, 3514410, 3461020, 3919040, 3833076, 3735475, 3813933, 4281802, 4649840, 4516669, 4484931, 4950945, 5267298, 5095406, 4945509, 5171097, 5061343, 4679066, 4704916, 4905620, 5162493, 5371890, 5385904, 5401963, 5916008, 6006190, 5988642, 6282057, 6666478, 7056788, 6995832, 6865847, 6867998, 6699368, 6394244, 5779542, 5674530, 5990239, 6417500, 6595620, 7112076, 7283126, 7552763, 7946229, 8384169, 8631544, 8671414, 8512364, 8510784, 8827958, 9081736, 9269105, 9279977, 9550761, 10105441, 10578433, 10736147, 10915422, 11441681, 11829235, 12170824, 12381926, 12878464, 13469156, 13839714, 14212445, 14967647, 15926762, 16142537, 16108557, 16226441, 16068341, 15925153, 15840979]
4908A5840979Q8367L98109L69826L30607Q14388R27462Q51104J189652J288509
4899B2099003J183380J190737J027613R72448J307002J101938J139814Q73772
4891C0895707L63435L10724M37654P20341J366157J904079K628618L322197N105962
4882D7054874Q423817J4489641K5832494L9503520M5090460L0054455k5661k3966776
4874A86456824l0176779k5204824j8474225j3082994r652190o696085m531922
4867G8637805k246462K51334L666310Q086277J5332417K7922191M2500365M8727667
4859B22877904M1369977K8034391K2622325J9605565J182577k6903609m3205790
4852B65583340m2075315l2832984k3166896j4813648q852661m448845n14809K832340
$$ y = [15840979, 15929346, 16327455, 16697281, 17027888, 17842276, 18769738, 19620842, 20810494, 22099003, 23282383, 24473120, 25500733, 26473181, 27780183, 28882121, 30021935, 30895707, 31259142, 31569866, 32007520, 32727861, 34094018, 35998097, 38626715, 41948912, 47054874, 55478691, 69968332, 95800826, 135304346, 180394806, 210449261, 210423600, 186456824, 156280045, 131075221, 112600996, 99518002, 89865812, 83169727, 78637805, 76391343, 76642677, 80308987, 88395264, 103727681, 131649872, 174150237, 222877904, 264247881, 292282272, 314904597, 334510162, 335692739, 308789130, 265583340, 223508025, 190675041, 167508145, 152694497, 143841836, 139392991, 138878182, 141710522]
4844A41710522O699888J1252507J8344120L0053870M5545135N7678297N2292708
4837C63577047K4165788j1378383l0872664l1394172k4738133j7997716j4565630
4830B56796137j2740509j1890629j1155206r673494p275890m842879k114529R3254
4822A97196255K906437O088976R524206J3551391J5970374J6676898J7666561
4815B79581098J8944395K1926266K4636837K5952726K4573996J8650685J0281762
4808D24547765M258275J017656M11304K33536j410095m350420q394552j2600840
4800D03712629j5627147j6233781j3427378p688765j740978J906791K449343J940725
4792C55291439J958559M034825O563527P030211M873058J596346o95320j786284
$$ y = [141710522, 148410410, 159662917, 178007037, 208060907, 253606042, 311284339, 363577047, 387742835, 376364452, 345491788, 314097616, 289359483, 271361767, 256796137, 244055628, 232164999, 221009793, 211336299, 204060409, 199217530, 197103001, 197196255, 200102692, 206191668, 215715874, 229267265, 245237639, 261914537, 279581098, 298525493, 320451759, 345088596, 371041322, 395615318, 414266003, 424547765, 428806040, 429823696, 430235000, 430468536, 429058441, 424708021, 416313469, 403712629, 388085482, 371851701, 358424323, 350735558, 348994580, 350901371, 353350714, 355291439, 357249998, 361284823, 367848350, 374878561, 379751619, 381347965, 380652645, 378866361]
4784C78866361k221188l281063m174642l429029j10200N856140J1803966J5448592
4776C98758937J5923477J3484784R829847N267023K184033K264999M405758P054832
4768D59173690N738513p59460j0243743j8255837k2594635k2819240k1525444
4761C68713844k0712724j9799674j8791440j7133212j4097239j1495799j0704674
4754B55979082r796035p858803m064670l09259K784214N113370M945406L126050
4746B49919355L85117m29289J002320L208088L228251K31355m984656j0675322
4738B41885219j5389199j7001311j5886912j4640131j3555784j2602658j2053168
4731A40756056j1614959j0858601j0066716r282321q208221p270544o808138n695556
$$ y = [378866361, 376645173, 373364110, 369189468, 365760439, 365650239, 371506379, 383310345, 398758937, 414682414, 428167198, 437997045, 443264068, 445448101, 447713100, 452118858, 459173690, 464912203, 464152743, 453909000, 435653163, 413058528, 390239288, 368713844, 348001120, 328201446, 309410006, 292276794, 278179555, 266683756, 255979082, 246183047, 238324244, 234259574, 233950315, 236734529, 241847899, 246793305, 249919355, 250304472, 249875183, 250877503, 254085591, 257313842, 257545197, 252560541, 241885219, 226496020, 209494709, 193607797, 178967666, 165411882, 152809224, 140756056, 129141097, 118282496, 108215780, 98933459, 90725238, 83454694, 76646556, 70951000]
4723G0951000m246717l570481l349621k790671k856111k720262k303460k087488
4715D7026189j542567j530106j545892j115677j116848j002390j001890j102786
4707C7068033p40189j137803o96290o13274o27694l00563o2060k87964q07859
4698C1794337n72386Q2847m14948m42702n15561n49721p11083n69093o20473p01078
4688B6780139J5193o16117p49450l73001k11644k53491n36239l86075k11800k57307
4678B3200208k18991l47156k66534n9653m49789m61042l72967P941k31743k6629
4668B0773645L75345L84660l4588m83015m14303q41351p06052n18731l20561j81065
4658A8033984l0819j46001N71322M43584O5973m54855m49738m65572n01584l39336
$$ y = [70951000, 66704283, 63133802, 59784181, 56993510, 54137399, 51417137, 49113677, 47026189, 45483622, 43953516, 42407624, 41291947, 40175099, 39172709, 38170819, 37068033, 36327844, 35190041, 34493751, 33880477, 33252783, 32952220, 32890160, 32602196, 31794337, 31221951, 31304798, 30889850, 30447148, 29931587, 29381866, 28670783, 28101690, 27481217, 26780139, 26795332, 26179215, 25429765, 25056764, 24845120, 24591629, 24055390, 23669315, 23457515, 23200208, 22981217, 22634061, 22367527, 22307874, 21858085, 21397043, 21024076, 21032017, 20800274, 20773645, 21148990, 21533650, 21499062, 21016047, 20601744, 19760393, 19054341, 18535610, 18215049, 18033984, 18003165, 17857164, 18428486, 18872070, 18938043, 18483188, 18033450, 17567878, 17066294, 16726958]
4648A6726958k29953L5101Q0930K86572P3693p01559o42813m00807J7632k05840
4638A5039914q986J1681j87312J70506L83912K93354k02593l06955j20795n52666
4628A4520060l61252j60307j91038J64259Q2342k19311j11010L1636J94397j10672
4618A3839104L6453J50060l3036k6070K13942O70952K5051l52530m2299M3912
4608A4525539J18757J96774J55451j84869L84694K02043L66514N61439P22550
4599A7048892N93838K23087Q9203P91746L64352J87108Q54895J103407J051731
4590B2308259P37694J119706J425734J654777J642198J899471K818581L963358
4582C7569778M830219P580676J1811497K0780810L3958277M4590052M0844244
$$ y = [16726958, 16497005, 16532106, 16613036, 16899608, 16973301, 16271742, 15628929, 15228122, 15245754, 15039914, 15030928, 15042609, 14855297, 15025803, 15409715, 15703069, 15500476, 15193521, 15072726, 14520060, 14158808, 13998501, 13807463, 13971722, 14054064, 13834753, 13723743, 13755379, 13949776, 13839104, 13875557, 14025617, 13992581, 13966511, 14180453, 14851405, 14876456, 14523926, 14481627, 14525539, 14644296, 14841070, 14996521, 14811652, 15196346, 15398389, 15764903, 16326342, 17048892, 17642730, 17865817, 17955020, 18746766, 19111118, 19298226, 20153121, 21256528, 22308259, 23045953, 24165659, 25591393, 27246170, 28888368, 30787839, 33606420, 37569778, 42399997, 49980673, 61792170, 82572980, 116531257, 161121309, 201965553]
4575B01965553J8800779j0370931k8210931l0121669k2936414j4850030p016198
4568A07260159J060644J3698582K8169400L7768179L2780177J0510140j6229793
4561B15017488l0333662k8876558j9804817p642571O213100K1822224L0616991
4554A87012195K4358288L166347j9624012k9807851k7552158k0431349j3312665
4547A03808795o691030J808886J2856500K5287292L1212537K2775543p562k1713638
4539A69337323l0043041k7221620k1050225j5675451j2086575r487727p452707
4532D6319977o377501m778787l481125k524224j934157j475670j555199j093036
4524B3100278r71276o09603p69287l64363m01549p02966p78485o73565m53572
$$ y = [201965553, 220766332, 210395401, 182184470, 152062801, 129126387, 114276357, 107260159, 108320803, 122019385, 150188785, 187956964, 220737141, 231247281, 215017488, 184683826, 155807268, 136002451, 128359880, 134572980, 156395204, 187012195, 211370483, 214536830, 194912818, 165104967, 137552809, 117121460, 103808795, 97117765, 98926651, 111783151, 137070443, 168282980, 191058523, 191050961, 169337323, 139294282, 112072662, 91022437, 75346986, 63260411, 53772684, 46319977, 39942476, 35163689, 31682564, 29158340, 27224183, 25748513, 24193314, 23100278, 22129002, 21519399, 20750112, 20385749, 19984200, 19281234, 18502749, 17829184, 17375612]
4515A7375612n22209j81295l68482k74451n32202o04262m07503j67661k22355
4506A4095192l43024l62142j75768l12566j48318j37042J81890k17760l13385
4497A2267077l80978k74441j65130l03089k65643K37262J65462o9234j94620M3915
4487A1060581k28459Q029K59615q0507j57550j91215k5191j5751j25564K19118
4477A0723106M82978k22675j83207L9835l59620n21478l33494k26285k30296n70255
4467H598609J7074L7031j35987k85611j51516k7494L61110K4144J08598J76859
4457H722817K65691r6687m4067P8473m5510N1462m75875l44606j04936j7382n19120
4446G470260m51113O3719j72958l6652j65144Q2163O363M3182M5322K11477K68252
$$ y = [17375612, 16853403, 16672108, 16303626, 16029175, 15496973, 14892711, 14485208, 14317547, 14095192, 13752168, 13390026, 13214258, 12901692, 12753374, 12616332, 12798222, 12580462, 12267077, 11886099, 11611658, 11446528, 11143439, 10877796, 11115058, 11280520, 11211286, 11016666, 11060581, 10832122, 10840151, 11099766, 11019259, 10861709, 10670494, 10645303, 10629552, 10503988, 10723106, 11206084, 10983409, 10800202, 10840037, 10480417, 9958939, 9625445, 9399160, 9168864, 8598609, 8615683, 8652714, 8516727, 8231116, 8079600, 8052106, 8413216, 8437360, 8545958, 8722817, 8988508, 8891821, 8847754, 8926227, 8880717, 8932179, 8456304, 8111698, 8006762, 7989380, 7470260, 7019147, 7082866, 6909908, 6873256, 6708112, 6790275, 6796638, 6839820, 6885142, 7096619, 7364871]
4435G364871k22058k10168r0693J06829j09627l45547J61708K62708K04763l693
4425G119093k04858R1712k08603l9140j35564K87354k51357K50219M48797P53699
4415H111352J508152K452631L791513M572856K650442j041913l534429l264509
4407A5246095k434457j273720j088862r38629k46791o09427n35351p42638j7492
4398G358728k35908k63007r4997K39743k53215j29047k46792j94406J41345q3787
4388F238657l16090j65797N81983l9512l95786k23556L92127j0307J8900L51431
4378F432050K20292J64526m2279j86767p963M24515J74022j84213k17954Q9716
4368F865945l90147n46451m4764K07242M2756Q8409N8533K0758n9702n27578m899
$$ y = [7364871, 7142813, 6932645, 6841952, 6948781, 6839154, 6493607, 6655315, 6918023, 7122786, 7119093, 6914235, 7005947, 6797344, 6758204, 6622640, 6909994, 6658637, 6908856, 7357653, 8111352, 9619504, 12072135, 15863648, 20436504, 23086946, 22045033, 18510604, 15246095, 12811638, 11537918, 10449056, 9510427, 9263636, 8654209, 8118858, 7376220, 7358728, 7122820, 6859813, 6764816, 7004559, 6751344, 6622297, 6375505, 6181099, 6322444, 6238657, 5922567, 5756770, 6338753, 6299241, 5903455, 5679899, 6072026, 6061719, 6080619, 6432050, 6652342, 6816868, 6774589, 6587822, 6579859, 7004374, 7178396, 6994183, 6776229, 6865945, 6475798, 5929347, 5884583, 6091825, 6134581, 6222990, 6281523, 6302281, 6242579, 5715001, 5710102]
4357E710102K30470j56591k9761l2506J4236L21308K43464k42522j86817J35574
4347F006957L03120j46165k73378M87958L1534j99866k85215K44874O3405k90544
4337E942680r6728M9145J20200q5922p5569p3812P2001J20954j77143O1128R5832
4326E952766L4431j70067n9603J19830K16723J21141J36107K01907J22855J20125
4316F796215l05813k87268L6440N8574o07804k21955J16667O0562o7443P6342
4306E654517K54847K78051n5902j45573j79976r0944P091J14613R4477j5824j99071
4295E716306p1027J75049k0657m0827n3683l34696J52773p8140o13263k08773
4285D623062J84634P1625j41148p6330K11697P7007j28889k82831j6918l0997
$$ y = [5710102, 5940572, 5783981, 5754220, 5721714, 5735950, 6057258, 6300722, 6058200, 5871383, 6006957, 6310077, 6163912, 5890534, 6378492, 6410026, 6210160, 5924945, 6169819, 6233224, 5942680, 5845952, 5895097, 6015297, 5929375, 5853806, 5779994, 5851995, 5972949, 5795806, 5856934, 5952766, 5987197, 5817130, 5757527, 5877357, 6094080, 6215221, 6351328, 6553235, 6676090, 6796215, 6490402, 6203134, 6239574, 6298148, 5690344, 5468389, 5585056, 5645618, 5578175, 5654517, 5909364, 6187415, 6131513, 5985940, 5805964, 5715020, 5722111, 5836724, 5931201, 5915377, 5716306, 5645279, 5820328, 5799671, 5758844, 5705161, 5370465, 5523238, 5445098, 4831835, 4623062, 4807696, 4879321, 4738173, 4661843, 4873540, 4950547, 4821658, 4538827, 4521909, 4490912]
4275D490912l5523k14100R844K43076J02313j40189J46201j53311J15660q8772
4265D476111l23611J76652L23217j23154q4323l8980R1961J2886k16241M19928
4255D714446M5773L1396j39131J27292r1919k22792P2463M690N184L05148k43762
4244D608788p9210M00072M18904k29784J94369N2340P2874m9382j1611J41995
4234E519355k9425K00577j54177p8044J62350N056N1676K92609n819j01311o9698
4223E793149J69714J80863N5458J9508l8502K49297m4733K8723K3699K29455L79318
4212G045949m39j36779M3260N72834Q9765j0816J25504M54831L14600k19306J52833
4201H432236K61229L11729j74951K68486K48516O5975L73125K835M00964K06442
$$ y = [4490912, 4455389, 4241289, 4251133, 4494209, 4596522, 4456333, 4602534, 4449223, 4564883, 4476111, 4152500, 4329152, 4652369, 4529215, 4444892, 4405912, 4497873, 4510759, 4294518, 4714446, 4760219, 4791615, 4652484, 4779776, 4687857, 4465065, 4537528, 4542218, 4547402, 4852550, 4608788, 4529578, 4929650, 5348554, 5118770, 5313139, 5365479, 5438353, 5388971, 5377360, 5519355, 5489930, 5690507, 5536330, 5458286, 5620636, 5625692, 5677368, 5969977, 5964158, 5862847, 5793149, 5962863, 6143726, 6199184, 6218692, 6180190, 6429487, 6384754, 6413477, 6437176, 6666631, 7045949, 7045510, 6908731, 6951991, 7524825, 7614590, 7603774, 7729278, 8184109, 8498709, 8279403, 8432236, 8693465, 9005194, 8830243, 9098729, 9347245, 9413220, 9786345, 9789180, 10190144, 10396586]
4191A0396586L69253K67566Q8359N51427O71612L72446N15273O73363Q64847O88112
4181A5458844N16999Q12652J382809J435619J343725J235821J739347K148777
4173B6074593K121354L090281M147367M257553L762872K852827J911999J347230
4165D9566076J008627N15636n67711j263515j267282j040125n62276P42159J854817
4156D8986406L514027N339658O560656P395794O752600M067885K429586J722078
4148H6768690J392972J976125L074038L398927K897110J957368J602636J040122
4140A04107988Q39546J803054K389406L752535L779513K270604p3726k284308
4132A16584612k859770k010473J036193N566583J0222819J5383704J8259157J5807347
$$ y = [10396586, 10765839, 11033405, 11121764, 11673191, 12344803, 12717249, 13232522, 13905885, 14770732, 15458844, 15975843, 16788495, 18171304, 19606923, 20950648, 22186469, 23925816, 26074593, 28195947, 31286228, 35433595, 39691148, 43454020, 46306847, 48218846, 49566076, 50574703, 51090339, 50522628, 49259113, 47991831, 46951706, 46389430, 47131589, 48986406, 52500433, 57840091, 64400747, 71796541, 78549141, 82617026, 85046612, 86768690, 88161662, 90137787, 93211825, 96610752, 99507862, 101465230, 103067866, 104107988, 104947534, 106750588, 109139994, 112892529, 116672042, 118942646, 118868920, 116584612, 113724842, 111714369, 112750562, 118317145, 128539964, 143923668, 162182825, 177990172]
4124A77990172Q588158m7202m057763l687384j021365J531611K704810K470128
4116A84471165J683449M10197j74804R98660K495261K907850J990252J41024j762082
4107A93160972l946808m951854m772291m452572k663601J081183N202597R980314
4099A88637940J4771342J7167682J6259776J2483545P567557M312915M055601
4092B65256358O561328R027835Q259301M011133L16352R48286M929587P223536
4084C06533716M242471j969994p119606q712976p632873n101413l239374K92187
4076B77292138M197512R667646J3824576J5832401J4888789J2257486P073276
4069C55033824l38939p319691j0707141j0385298q290449n211544j623508K028638
$$ y = [177990172, 186578330, 186531128, 182473365, 178785981, 177764616, 179296227, 182001037, 184471165, 186154614, 186564811, 186390007, 187388667, 189883928, 192791778, 194782030, 194923054, 193160972, 189214164, 184262310, 179490019, 175037447, 172373846, 173455029, 178657626, 188637940, 203409282, 220576964, 236836740, 249320285, 256887842, 261200757, 265256358, 271817686, 280845521, 289104822, 293115955, 293432307, 294380593, 299310180, 306533716, 310776187, 308806193, 301686587, 292973611, 285340738, 280239325, 276999951, 277292138, 281489650, 291157296, 304981872, 320814273, 335703062, 347960548, 355033824, 354694885, 347375194, 336668053, 326282755, 317992306, 312780762, 311157254, 313185892]
4061C13185892M345787M756307N074786N862948N171182J729130l517438n623837
4053C30984757l572820l15500K027167j96942n242076p512368m878975J151056
4045C12444299M756918J301382q105510j6477263k0376704k0232678j7911140
4038B35399304j4457199r872937m694239k13032L110651M167386L489716K429158
4030B19358808J992214J530428K29849j195025k312198l655954m550767n384288
4022B06013067o018529n091512l067714P59197M611851O262538L697617l273552
4014B03892963j0573265j4733476j4921513j2659966r507796o499078l865004
4007A31132865j164153N19490k36089k236757l656624m283571l734376k452544
$$ y = [313185892, 317531679, 322287986, 327362772, 333225720, 338396902, 340126032, 336608594, 330984757, 327411937, 327096437, 329123604, 328926662, 323684586, 316172218, 311293243, 312444299, 317201217, 318502599, 310397089, 293919826, 273543122, 253310444, 235399304, 220942105, 211069168, 206374929, 206161897, 209272548, 213439934, 216929650, 219358808, 221351022, 222881450, 223111299, 221916274, 219604076, 215948122, 211397355, 206013067, 199994538, 194903026, 191835312, 192594509, 197206360, 203468898, 207166515, 203892963, 193319698, 178586222, 163664709, 151004743, 141496947, 134997869, 131132865, 129968712, 130488202, 130252113, 128015356, 124358732, 120075161, 116340785, 113888241]
3999A13888241k000410j567597j420578j698424j706299j574657j542905j125251
3991A01252120j092311j013319j444531l439546n730950o899373o650802o192691
3983F8788597m898278l367820k261787j082495n12563n74898o59648q13181r29336
3974E3688591m57203j94800m66615j073398j947041k883744l137582l293611k955080
3965C7279517k490485k121829j853527j343148j285235j338648q55879o85925
3957B5304841r99107r74487o50517p16262q97961n41925l67306m37957k86596
3948A9432723n16441o62457k37789l67766l73908l25446m74998k59248j38975
3939A6075695k07682m5373k61560m04971m77895j14996j51259k21917m62011j82479
$$ y = [113888241, 111887831, 110320234, 108899656, 107201232, 105494933, 103920276, 102377371, 101252120, 100159809, 99146490, 97701959, 94262413, 88531463, 81632090, 74981288, 68788597, 63890319, 60522499, 58260712, 57178217, 56665654, 56090756, 55431108, 54617927, 53688591, 53231388, 53036588, 52569973, 51496575, 49549534, 46665790, 43528208, 40234597, 37279517, 34789032, 32667203, 30813676, 29470528, 28185293, 26846645, 25990766, 25304841, 24305734, 23331247, 22680730, 21964468, 21066507, 20524582, 20157276, 19719319, 19432723, 18916282, 18253825, 18016036, 17648270, 17274362, 16948916, 16473918, 16214670, 16075695, 15868013, 15822640, 15561080, 15156109, 14678214, 14563218, 14411959, 14190042, 13728031, 13545552]
3929A3545552M0811R020l17470k55355j51574j95099J08441J20470k82279k90898
3919A2331619P4392k29523L4101j16435j57497k91349J40810n4936k57499k7453
3909A1446230J96643j32124j01071k8469k33253r3411M098J01734o9113K95990
3899A1387254Q7918j64397m5905K1851n3561j1859Q7743k0387j64219k38334M7056
3888A0933160q18j02302J593K50087N6200j7417j94542n8480M0984Q4293J07830
3877A1100588p6443l8625o4806Q6659j00373Q1082Q0760K13927j00896j90890
3867A0990983J95754M0346J12228l71065m4729J45400j1862j68214J1576o7028
3857A0833389K43045P620p8787r2008j16890k35996m8799J63567M70713O393j32092
$$ y = [13545552, 13586363, 13595383, 13277913, 13022558, 12870984, 12675885, 12784326, 12904796, 12622517, 12331619, 12406011, 12176488, 12210589, 12094154, 11936657, 11645308, 11786118, 11731182, 11473683, 11446230, 11642873, 11510749, 11409678, 11381209, 11147956, 11054545, 11058643, 11160377, 11091264, 11387254, 11475172, 11310775, 11264870, 11286721, 11233160, 11221301, 11309044, 11288657, 11124438, 10886104, 10933160, 10932342, 10830040, 10831633, 11081720, 11137920, 11120503, 10925961, 10867481, 10908465, 10992758, 11100588, 11024145, 10985520, 10920714, 11007373, 10907000, 10988082, 11068842, 11282769, 11181873, 10990983, 11186737, 11227083, 11339311, 10968246, 10923517, 11068917, 11057055, 10888841, 10900417, 10833389, 11076434, 11084054, 11005267, 10913259, 10796369, 10560373, 10511574, 10675141, 11145854, 11152247, 11020155]
3846A1020155j51149M26130J32959J0417L74854K72626n5397M95413L89326K2074
3836A2937408N32691M91082N24363M98542N09779O38376J127212J459719K079222
3827B0798394K905330L991789N921561R797428J3011882J2989160N046653n127412
3819F9334785j0093807j0102983q124287o227426m748898l786207l112250k599945
3811B0538982k152112j795895j103372o95248r35655l71793o93737m12324m6932
3802A2331914m95806j14175n46206m0073j00795m69111j46851k32786n6304N7910
3792A0187717j24744m71319J23521j94565j49917j7299k21367k97924Q8944k04180
3782H718867k70093q2208N3141l76866k47745L37627M7395m9740j30106l4807
$$ y = [11020155, 10869006, 11295136, 11428095, 11438512, 11813366, 12085992, 12030595, 12526008, 12915334, 12937408, 13470099, 13961181, 14485544, 14984086, 15493865, 16132241, 17259453, 18719172, 20798394, 23703724, 27695513, 33617074, 43414502, 56426384, 69415544, 74462197, 69334785, 59240978, 49137995, 41013708, 34786282, 30037384, 26251177, 23138927, 20538982, 18386870, 16590975, 15487603, 14792355, 13856700, 13484907, 12791170, 12378846, 12331914, 11836108, 11721933, 11175727, 11135654, 11034859, 10565748, 10418897, 10186111, 10129807, 10187717, 10062973, 9591654, 9715175, 9520610, 9370693, 9353394, 9132027, 8834103, 8923047, 8718867, 8448774, 8366566, 8419707, 8042841, 7795096, 8132723, 8180118, 8130378, 8000272, 7965465]
3772G965465J99943j98764L7461L49085J29322p3683J00722k2638l69862m51132
3762G665919l68296R28r5471k48905J78308J25003N3564J28668j9646n9163j88131
3751G172778l0922J65316L02345k9313m2234p4512j46152O0223o0116K040K75251
3740G594704K06396j66429k12272j51789n9586j98358r5548k60606R4049L7575
3730F788136j69083K14667K92941J88149j82301n5807l4384l48864j04690K09555
3720F798319k61391K22474j3875j1449q6746K79166J98462q615K60250J42325
3710G518920j16530J20169l8231l38150l08003j55878K69253l37050n4376k4629
3700F535495l78034M1257K05695j25965m3182L41296K03964L44167J05544K72841
$$ y = [7965465, 8165408, 7966644, 8004105, 8353190, 8482512, 8408829, 8509551, 8486913, 8117051, 7665919, 7297623, 7298551, 7203080, 6954175, 7132483, 7257486, 7311050, 7439718, 7420072, 7360909, 7172778, 7141856, 7307172, 7609517, 7580204, 7537970, 7463458, 7317306, 7377529, 7317413, 7319453, 7594704, 7801100, 7634671, 7422399, 7270610, 7211024, 7012666, 6917118, 6656512, 6750561, 6788136, 6619053, 6833720, 7126661, 7314810, 7132509, 7076702, 7042318, 6693454, 6588764, 6798319, 6536928, 6759402, 6745527, 6734078, 6647332, 6926498, 7124960, 7116345, 7376595, 7518920, 7402390, 7522559, 7484328, 7146178, 6838175, 6682297, 6951550, 6614500, 6560124, 6535495, 6157461, 6198718, 6404413, 6278448, 6235266, 6576562, 6780526, 7124693, 7230237, 7503078]
3690G503078N8579J6051J9049l0861j66419J76115j09829l73917J8452L2471k48224
3679F894545n38098P0988R3237j36933Q9555j6708j85384j16183K83183P18j8379
3668F420541J1419m5144R7247J7994n082j50283j52974n2961j96095L6677J65256
3657F146595J69810J69248K3457J1966J68176M4252O0661J2425k08219m2976M23826
3646F979221O1059k01979k2937M1323K2925l62164q4262J23094K93514q3867M8761
3635F814688j10852N94328M03361J5508O7697K05431j15941k92481j01083M987
3625G485643R3484J59912p7519N20817J07077L63687L70423j92164M9373j04895
3615H775838k44991J26056j06583l35901k23821q622K14905j51361r839L04803
$$ y = [7503078, 7561657, 7577708, 7596757, 7565896, 7399477, 7575592, 7465763, 7091846, 7110298, 7142769, 6894545, 6356447, 6427435, 6520672, 6383739, 6473294, 6456586, 6271202, 6155019, 6438202, 6438920, 6420541, 6431960, 6386816, 6484063, 6502057, 6496975, 6346692, 6193718, 6140757, 5944662, 5981339, 6146595, 6316405, 6485653, 6509110, 6521076, 6689252, 6733504, 6794165, 6806590, 6598371, 6555395, 6979221, 7040280, 6838301, 6815364, 6856687, 6879612, 6517448, 6433186, 6556280, 6849794, 6765927, 6814688, 6703836, 7298164, 7701525, 7717033, 7784730, 7990161, 7874220, 7581739, 7480656, 7485643, 7579127, 7739039, 7661520, 8182337, 8289414, 8653101, 9023524, 8831360, 8880733, 8775838, 8530847, 8656903, 8550320, 8214419, 7990598, 7981976, 8196881, 8045520, 8035681, 8340484]
3605H340484J92129k69494K58726K61237M30016M92669Q7367P3999J19182j40277
3595I846038j55854J0064j62497j81734K8466j29764J67043R1812R4530J33297
3585I741401K63517r0484L01843M4039l45106J86185J84788j096J65550M03289
3575A0853926J00621k02953o8666J28214R3952L19346J74283J85697J95220P2319
3565A1851959L04477K97867M32397L37742M20238M99997N87243P40103O53297
3556A6125320M32301M73128J98293L46750O81006m5226l78385k01010J04873j8413
3546A7718637m40991L98049O73532K26377J86994M46941P17335O97232Q34062
3537B1458168P37162J003190O64301L85284M02182M92972M59111L06416K08299
$$ y = [8340484, 8532613, 8263119, 8521845, 8783082, 9213098, 9705767, 9793134, 9867133, 9986315, 9846038, 9690184, 9700248, 9537751, 9356017, 9384483, 9254719, 9421762, 9513574, 9608104, 9741401, 10004918, 9914434, 10216277, 10260316, 9915210, 10101395, 10286183, 10285087, 10450637, 10853926, 10954547, 10751594, 10682928, 10811142, 10905094, 11224440, 11398723, 11584420, 11779640, 11851959, 12156436, 12454303, 12886700, 13224442, 13644680, 14144677, 14731920, 15472023, 16125320, 16557621, 17030749, 17229042, 17575792, 18256798, 18211572, 17833187, 17632177, 17737050, 17718637, 17277646, 17675695, 18349227, 18575604, 18762598, 19209539, 19926874, 20624106, 21458168, 22195330, 23198520, 23862821, 24248105, 24650287, 25143259, 25602370, 25908786, 26117085]
3528B6117085L14483K55814O05690J028332J121996J529024J805991J890500K360473
3519C7029388K968238K926277K768152L086662L192297K817921K306153J865096
3511E8960184J585692R10538K68023k6075k95871q14669r54261j261705k045348
3502E6326508k310289k498640k833675k753091k852946k835021k164578j977854
3494C6100414j840707j504222j316843j044692j415444j211058j374905j218115
3486B5174428j165696j037354q65789q64707q24863o73839l64634o16374j23095
3477A8638077m22739l46335m6542k01227l11884j31459k56627k49575l23976n40946
3467A5806767n17092n51201l04525l13471l94854l28237l65875l69954r4890j09219
$$ y = [26117085, 26431568, 26687382, 27293072, 28321404, 29443400, 30972424, 32778415, 34668915, 37029388, 39997626, 42923903, 45692055, 48778717, 51971014, 54788935, 57095088, 58960184, 60545876, 61456414, 61724437, 61698362, 61402491, 60587822, 59633561, 58371856, 56326508, 54016219, 51517579, 48683904, 45930813, 43077867, 40242846, 38078268, 36100414, 34259707, 32755485, 31438642, 30393950, 28978506, 27767448, 26392543, 25174428, 24008732, 22971378, 22105589, 21240882, 20416019, 19742180, 19377546, 18761172, 18638077, 18215338, 17869003, 17822461, 17621234, 17309350, 17177891, 16921264, 16671689, 16347713, 15806767, 15289675, 14738474, 14433949, 14120478, 13725624, 13397387, 13031512, 12661558, 12566668, 12457449]
3457A2457449j67747n9372m8059k11130l38608j99781l30821j68063j36886J1523
3447A0808505k67647l39247j67125j95747j33963l23208j24853q2247O6947k48824
3437H992591j81788l34931j53915Q1571n4394J03211m9746K10391l05646l14477
3427G992867l5155l04052K42766O96k86712J5292j32083J75102q3449r2399N4573
3416G547446r1595j04165J03645K32287m6071l49598p0430J39959k76575p8144
3406G006759r498Q6643j59203l90432P7724o7268L5116j16293J076o7999P2374
3395F468999n1878k54061Q8013K9971L19067l11061k42285J39804k42905k01834
3385E741830j44787M2231p8686k19296R4284J6545L5642J32466m58637K48473
$$ y = [12457449, 12289702, 12230330, 12182271, 11971141, 11632533, 11432752, 11101931, 10933868, 10796982, 10808505, 10540858, 10201611, 10034486, 9838739, 9704776, 9381568, 9256715, 9174468, 9241415, 8992591, 8810803, 8475872, 8321957, 8403528, 8349134, 8452345, 8402599, 8612990, 8307344, 7992867, 7957712, 7653660, 7896426, 7897122, 7610410, 7625702, 7493619, 7668721, 7585272, 7492873, 7547446, 7455851, 7351686, 7455331, 7687618, 7641547, 7291949, 7221519, 7361478, 7084903, 7006759, 6997261, 7083904, 6924701, 6534269, 6611993, 6544725, 6579841, 6463548, 6464624, 6396625, 6468999, 6417121, 6163060, 6251073, 6281044, 6600111, 6289050, 6046765, 6186569, 5943664, 5741830, 5597043, 5639274, 5560588, 5341292, 5435576, 5452121, 5487763, 5620229, 5161592, 5410065]
3375E410065j02358j2115M2687q2588K00672j53389j30026J7180K46740R1544
3365E528412m33162k13373P5411r9901L9943K5800P9742l960O3072k30971j21278
3354D709735K8220k07629M3085J71029K05972o4847k29065j87491p456j5524m6388
3343D399641J47352j4817L85980m46143m3206R4510J23642l08406N5606J60625
3333D554784K6164l34843k44736j4758P5484N4534O071j03978K45390j85281j60064
3322C918767j5080Q6127k5884L5944J68898J5941l0432j80577K5293J25599J41738
3311D266334k09979k62098O4476J89542j5622p5163l60424L48453L79464j83514
3301D141469m30688J62236K00981k49858l26099J29717K38247l7824l18299j65155
$$ y = [5410065, 5307707, 5295592, 5338279, 5255691, 5456363, 5302974, 5172948, 5190128, 5436868, 5528412, 5095250, 4881877, 4957288, 4857387, 4897330, 4923130, 5002872, 4998912, 5061984, 4831013, 4709735, 4737955, 4530326, 4573411, 4744440, 4950412, 4885565, 4656500, 4469009, 4461553, 4446029, 4399641, 4546993, 4532176, 4918156, 4472013, 4428807, 4523317, 4646959, 4338553, 4394159, 4554784, 4580948, 4246105, 4001369, 3986611, 4062095, 4116629, 4122700, 4018722, 4264112, 4078831, 3918767, 3903687, 3989814, 3963930, 3999874, 4168772, 4184713, 4154281, 3973704, 3998997, 4124596, 4266334, 4056355, 3794257, 3858733, 4048275, 4032653, 3957490, 3597066, 3945519, 4324983, 4141469, 3710781, 3873017, 4073998, 3824140, 3498041, 3627758, 3866005, 3828181, 3509882, 3344727]
3291C344727n8863J17419J48266j05555R9396J74257K200n3853j49609P2328J10022
3280C700735j82301k40614L23239R5716L6737J89694m6072j68911J2353J50378
3270C870954J72766q8831K38628k67002J65670l4088o1573Q293R8434L01385l32831
3259D071805j0814M71349m5941L1400j47862l5015L10491l4745R987R9047N7951
3248D777653J04385q5591o2395K16188j47691K83028J28360l1101J38994O930
3238E328760K99954j30085p3522L15632J09505j7975j14324Q0365J18005J61632
3228F077947L07936k5749l58313Q4700K11346J83142J10437j66733M7967K24220
3218F696900K11169K04932J48787L64700K09536M9160L6621J14134M85697M13933
$$ y = [3344727, 3285864, 3403283, 3551549, 3445994, 3545390, 3719647, 3721847, 3667994, 3518385, 3590713, 3700735, 3518434, 3277820, 3601059, 3696775, 3733512, 3923206, 3877134, 3708223, 3720576, 3870954, 4043720, 3954889, 4193517, 3926515, 4092185, 4058097, 3996524, 4004817, 4103251, 4404636, 4071805, 4060991, 4532340, 4486399, 4517799, 4369937, 4334922, 4645413, 4610668, 4620655, 4719702, 4777653, 4882038, 4796447, 4734052, 4950240, 4802549, 5085577, 5213937, 5182836, 5321830, 5328760, 5628714, 5498629, 5425107, 5740739, 5850244, 5832269, 5717945, 5798310, 5916315, 6077947, 6385883, 6360134, 6001821, 6086521, 6297867, 6481009, 6591446, 6424713, 6472680, 6696900, 6908069, 7113001, 7261788, 7626488, 7836024, 7885184, 7921805, 8035939, 8521636, 8935569]
3208H935569M50300N54991j8924M20537P69373L34440N82557O62471O83144Q47433
3198A4221891J078256J237486J052484Q08552N28681L41892P1640j74021L14697
3189A9481558j45897j23435L1953m181K66184j73043k92392K53975n9848j44925
3179A9089949J55255M81333L33763L54334O91946O65139O04984J047687J374996
3170B4799386K315819L395689M632435N994271M864981J722402k230054l545497
3162D1949432l814864l247760l397020k771539k041083j596743j375485r75961
3154B2728977n50770o84755n48555l51859j83319M889J15438O25022J31586N10855
3144B1797509L00094Q1481N98595Q54085O86399Q30163R46984J041936M33804
$$ y = [8935569, 9385869, 9940860, 9921936, 10342473, 11111846, 11446286, 12028843, 12691314, 13374458, 14221891, 15300147, 16537633, 17590117, 18398669, 18927350, 19269242, 19340882, 19166861, 19481558, 19335661, 19212226, 19244179, 19239998, 19506182, 19333139, 19040747, 19294722, 19234874, 19089949, 19245204, 19726537, 20060300, 20414634, 21106580, 21771719, 22376703, 23424390, 24799386, 27115205, 30510894, 35143329, 41137600, 46002581, 47724983, 45494929, 41949432, 38134568, 34886808, 31489788, 28718249, 26677166, 25080423, 23704938, 22728977, 22178207, 21493452, 20944897, 20593038, 20409719, 20414608, 20530046, 21155068, 21286654, 21797509, 22097603, 22179084, 22777679, 23631764, 24318163, 25148326, 26095310, 27137246, 27571050]
3135B7571050J46878n96967j003792j213724j538419j559356j658291j100436
3127A9046943q81058r62327r81579m41490m15615m65726l09964j51954J70232
3118A4607462l15262m34759j95797k6403l75229p61908l87880q5800k34065m11087
3108A1379272n26950m88942k81059o88892n88486k08756O9792k70640k87143m16567
3098G691629O5956k13032k28562k68799l10382n19607j57496J72947M8992J65077
3088F446723j77455k05283j645j8821l77766j95330J92033m47595M0400j21271
3078E133990j27259K34l3118k66170k49551J26204K9687l39655k49961R5002J2930
3067D132333k10571k55097j00606J19003j41405j48028J0385J5170K2726j58557
$$ y = [27571050, 27717928, 27120961, 26117169, 24903445, 23365026, 21805670, 20147379, 19046943, 18165885, 17203558, 16221979, 15780489, 15364874, 14899148, 14589184, 14437230, 14607462, 14292200, 13857441, 13661644, 13635241, 13260012, 12498104, 12110224, 12024424, 11790359, 11379272, 10852322, 10363380, 10082321, 9393429, 8804943, 8596187, 8665979, 8395339, 8108196, 7691629, 7757585, 7544553, 7315991, 7047192, 6736810, 6217203, 6059707, 6232654, 6281646, 6446723, 6269268, 6063985, 6062340, 6043519, 5665753, 5470423, 5662456, 5214861, 5255261, 5133990, 5006731, 5006965, 4973847, 4707677, 4458126, 4584330, 4614017, 4274362, 4024401, 4119403, 4132333, 3921762, 3666665, 3566059, 3685062, 3543657, 3395629, 3406014, 3421184, 3443910, 3285353]
3057C285353J22350K13277k73793k02434p1893J07042K40128j65247k16617j61683
3047B876483k55876J19749l9935L7904M0335k43167j98191M8053R6569K65779
3037B747703j68638j53238N4265n324j13711l73912J42213M745m85799J15753
3027A764057J84493R5630K02810m70489o4762J40685q3353k63131j31708P225
3017A381457o0600j01136j0018J51700J00785l6355p8862j8247J74016n245j83021
3006A314474j75131M3975j02699P348n8616j34018j35443J47661k58703Q5631
2996G34479J83395j24778j2706L38208J64658j41576o6067j55436J43930J6429
2986A080536k3238J48553m6609j53416j05513j2088N7245k7679k48368k8425O7529
$$ y = [3285353, 3407703, 3620980, 3347187, 3144753, 3072860, 3179902, 3420030, 3254783, 3038166, 2876483, 2620607, 2740356, 2700421, 2738325, 2778660, 2535493, 2337302, 2385355, 2481924, 2747703, 2579065, 2425827, 2480092, 2474768, 2361057, 1987145, 2129358, 2134103, 1648304, 1764057, 1948550, 2044180, 2246990, 1776501, 1711739, 1852424, 1769071, 1505940, 1374232, 1381457, 1320857, 1219721, 1209703, 1361403, 1462188, 1425833, 1346971, 1328724, 1502740, 1497495, 1314474, 1139343, 1183318, 1080619, 1087967, 1029351, 895333, 759890, 907551, 648848, 734479, 917874, 793096, 780390, 1118598, 1283256, 1141680, 1075613, 920177, 1064107, 1080536, 1057298, 1205851, 1159242, 1005826, 900313, 888225, 945470, 917791, 669423, 640998, 708527]
2975G08527k66999l8012K01553m8194o0561L3596j02882k5325j43595K55030o8151
2964D44987Q6923O3773l32562m0442L0960K92350P1050n4022k07828j33803L1138
2953B52524p9744r5660k8881L82051j3550j15511o017k6844m6119k13735O7710
2942G6224K58774j6232L3768L4666j74863K2803k08589L15574j17296j50946L3726
2931A07609J8850K01198r2684j80461P8196L89820N8327k87555k16415K65221
2921C42106K08815j80774l71161p2107Q3284J22592K37812m4307P0671k63905
2911A33026l31700K64581m7113j1939N4272j56252p1316L28895P6719l05821p7521
2900a44169J1927k91361J37188N24752j8924j90021j67207N6289n8795o2910L6253
$$ y = [708527, 441528, 403516, 605069, 556875, 496314, 529910, 427028, 401703, 258108, 513138, 444987, 531910, 595683, 263121, 222679, 253639, 545989, 617039, 563017, 355189, 221386, 252524, 172780, 77120, 48239, 430290, 416740, 301229, 295212, 268368, 222249, 8514, 76224, 334998, 318766, 352534, 387200, 212337, 235140, 26551, 342125, 224829, 73883, 107609, 126459, 327657, 234973, 54512, 132708, 522528, 580855, 293300, 76885, 342106, 550921, 370147, -1014, -73121, 10163, 132755, 370567, 326260, 396931, 133026, -198674, 65907, 18794, 6855, 61127, -95125, -166441, 162454, 239173, -66648, -144169, -132242, -423603, -286415, 238337, 219413, 29392, -137815, -81526, -140321, -203231, -166978]
2889a66978J06386l18658k3469q9839J42044J52647K96572O7783l07344J31278
2879i578q8893l22878M0213J55844q2487J25329k8979o4570j65571q5810J06980
2868d20400J81042L1928J24941j67844p2568J84211j17150m4910J3409O7641k36329
2857d56029J70921n5536R4723J87140R3877n8753J73977r7338m18380J23225J15959
2846a26214J10207m9131j16748M4910o4620K2282r7910k85851K41507j27357N5184
2835c93741q0718K99403J37592O455o5950j79152R2288l52766k89134L37379J52593
2824c35751J45759j98004J31946p9951N2711o0680J17519k4196l2774j07450R553
2813c81318L7541l5771l6845r1123k76431j15795L50909J52830M4054q4593J42867
$$ y = [-166978, -60592, -379250, -402719, -492558, -350514, -197867, 98705, 166488, -140856, -9578, -98471, -421349, -381136, -225292, -307779, -182450, -211429, -275999, -441570, -527380, -420400, -239358, -207430, -82489, -250333, -322901, -138690, -255840, -300750, -287341, -219700, -456029, -285108, -340644, -245921, -58781, 35096, -23657, 150320, 52982, -365398, -242173, -126214, -16007, -65138, -181886, -136976, -201596, -179314, -277224, -563075, -321568, -448925, -393741, -474459, -175056, -37464, -31009, -96959, -276111, -183823, -536589, -825723, -488344, -335751, -189992, -387996, -256050, -336001, -283290, -343970, -226451, -250647, -283421, -390871, -381318, -343777, -379548, -416393, -507516, -783947, -899742, -548833, -396003, -351949, -436542, -293675]
2802b93675k35734j79462L5876J90056J05191j270L8076J4184k7762k0886k9302
2791d04708j62837r9055J24238K444L82529j17860l99781J69021J36534m3519
2781d12994k12592q0726K07850K20795L2932j69390N1722O9902k22091j22552
2771f37144J77047m4896N7819j82679K02516N8169l74100K44911P823j51137k7512
2760f69183J54558J44557O7527m0109k43500j52719M32498J564O0949K2968m9419
2749b70309l2233j97803K9941Q970k04028m4669J83511K1224M05057J57304m90219
2738d33254J19663K1919r1144J92510r4146k71899q2993J76128P7421M8070j07409
2727d45134l64862q2062L53603k18969l1044O499R2384K73468O5010j48387k35494
$$ y = [-293675, -529409, -708871, -672995, -482939, -377748, -379018, -340942, -326758, -354520, -375406, -404708, -567545, -666600, -542362, -539918, -157389, -275249, -675030, -506009, -369475, -412994, -625586, -706312, -498462, -277667, -244735, -414125, -362403, -292501, -514592, -637144, -460097, -504993, -447174, -629853, -427337, -369168, -743268, -498357, -490534, -641671, -669183, -514625, -370068, -302541, -342650, -586150, -738869, -306371, -304807, -243858, -220890, -270309, -302542, -500345, -470404, -461434, -665462, -710131, -526620, -505396, -100339, 56965, -433254, -313591, -291672, -382816, -190306, -284452, -556351, -639344, -463216, -385795, -337725, -445134, -809996, -892058, -538455, -757424, -788468, -781969, -689585, -416117, -351107, -499494, -734988]
2716g34988j9565O4493J41945j21721j9888J68386m7494q1825J4815j49116K4698
2705g60260J65988k79465O5853J26955k6651j39341j252q0206J25794l6421K39422
2694e99584K93562r2508m38343K56337J64662k02472k39573L13679K03082m3384
2684c84542j23288L0644m5509J71068j27751j09177Q181Q843j49777j33709K61872
2673e93145J8206k08763K33790k2126j20193o7354j68258J06579O4932K25236
2663e31096k09764N9257O8631Q6887O1150j334M09054Q9895k32134j27460L2013
2652b94901j42653j99040J38815L3535M416r1643O0230L2722j77189K92125j02468
2641d46051k31688L29837N3360K48190j55693J71202N07373M36311j5375L12877
$$ y = [-734988, -754553, -690060, -548115, -669836, -689724, -521338, -568832, -650657, -635842, -784958, -760260, -594272, -873737, -807884, -680929, -707580, -846921, -848173, -928379, -802585, -839006, -599584, -306022, -398530, -836873, -580536, -415874, -618346, -857919, -544240, -341158, -384542, -507830, -477186, -522695, -351627, -479378, -588555, -580374, -571531, -721308, -855017, -593145, -574939, -783702, -549912, -572038, -692231, -759585, -927843, -821264, -756332, -531096, -740860, -681603, -612972, -526085, -464935, -466269, -57215, 32680, -199454, -326914, -294901, -437554, -636594, -497779, -464244, -459828, -551471, -491241, -458519, -635708, -343583, -446051, -677739, -347902, -294542, -46352, -202045, -30843, 476530, 912841, 897466, 1210343]
2631A210343J33632m60827m32851k14657l43161l44427J54037J11087m9033j0863
2621b46720k16142j38797J214J16457r5770j15296L6388J28580k15660J47180
2611e98566L03547O6553j19956p3973j63065o6588m3356j31507J21460N09570
2601a95881j42167n40j73279J6261j17911r404L08678l53503R3112J75362j86867
2590e86139J10548j23576M8646j64724j87997K47782K56055L45o9491j87937j86934
2579h43422N4577K34192O0550L9923k87178j22024Q2240K51209J07503M7566J40008
2568b34856L6436k09571j22380j81625P9093M02329j31944l35747M8328R4470
2558e55467j3685J17673K30556r533k84320l4426K211J36339r6467p567O4995
$$ y = [1210343, 1343975, 883148, 450297, 235640, -107521, -451948, -297911, -186824, -235857, -246720, -462862, -601659, -600445, -483988, -579758, -695054, -658666, -530086, -745746, -598566, -295019, -228466, -348422, -422395, -585460, -652048, -695404, -826911, -705451, -195881, -338048, -338588, -511867, -495606, -613517, -622921, -314243, -667746, -574634, -399272, -586139, -475591, -599167, -550521, -715245, -903242, -655460, -399405, -399060, -468551, -656488, -843422, -788845, -554653, -494103, -454180, -741358, -863382, -781142, -529933, -422430, -374864, -234856, -198420, -407991, -530371, -711996, -632903, -230574, -362518, -698265, -649937, -555467, -569152, -451479, -220923, -230456, -514776, -549202, -546991, -410652, -507119, -514686, -449691]
2547d49691O7722j21212N7952j99553J1297j92113j85417o4474N3090L05285J363
2536g15751j73753K27362N9803j7942Q3025K61542p597L705m23739p6070M6911
2525g32504J54490J00143o1772j37900J48769l5725j26780J77411J23141l6561
2515d27288K30800J76669o145k73286O2272J04615j16601O7637o0782p3558m1266
2504c56933m5327k12702M3277K75777r3149m2316J19129j38529O6725L80006J25241
2493A21199p3960k64554k5985k20906k54177O2830L5011K4317Q5383K6182N5897
2482d28763j69940N3252L41382J46193j64264k71412L37653J29890k25249q2429
2472c33687m8680N09331J92082j9341j36743q4818n1550J5394K1181m2009J09299
$$ y = [-449691, -381969, -503181, -445229, -644782, -633485, -825598, -1011015, -1075489, -1022399, -717114, -715751, -889504, -662142, -602339, -620281, -537256, -275714, -283311, -279606, -703345, -779415, -732504, -578014, -477871, -539643, -677543, -528774, -564499, -691279, -513868, -390727, -427288, -196488, -19819, -25964, -299250, -236978, -132363, -248964, -181327, -242109, -315667, -356933, -402260, -614962, -571685, -295908, -389057, -431373, -312244, -450773, -384048, -4042, 121199, 47239, -217315, -243300, -464206, -718383, -655553, -620542, -596225, -510842, -484660, -428763, -598703, -545451, -204069, -57876, -222140, -493552, -155899, -26009, -251258, -333687, -382367, 126964, 319046, 299705, 162962, 78144, 26594, 41988, 63169, 21160, 130459]
2461A30459q910k10417o3608j07803q299P6644K14812K966Q4127J16131J50282
2450C76384J93417j06223j04228J56481J4235k7935K97736K56322j79173J33461
2440A010477P9698q5493J92601j6430j65713N3066j27756K12019n5671k4646K93483
2429A365635o0759K7389j05527J70753R8035K72779N7954k01562n3239L6843n1511
2418A556790j43813Q295J49840L95287L45516J75514L6423k35200K93678K24653
2408B806983M25887K44702J52167J25089J01954j20796K96224K37245K76784K15746
2398D761985L86843K93811J64268r1550M34658N47739O83061P37550O16489P0099
2388H604953Q73344P87273J340702J484967K552789L483084M819139L292661J180764
$$ y = [130459, 121549, -88868, -152476, -260279, -268578, -191934, 22878, 25844, 109971, 226102, 376384, 569801, 463578, 359350, 515831, 530066, 502131, 799867, 1056189, 877016, 1010477, 1090175, 1004682, 1197283, 1180853, 1015140, 1068206, 940450, 1152469, 1096798, 1072152, 1365635, 1304876, 1332265, 1226738, 1397491, 1495526, 1768305, 1826259, 1624697, 1571458, 1608301, 1556790, 1412977, 1421272, 1571112, 1966399, 2311915, 2487429, 2523852, 2288652, 2582330, 2806983, 3232870, 3477572, 3629739, 3754828, 3856782, 3735986, 4032210, 4269455, 4546239, 4761985, 5148828, 5442639, 5606907, 5515357, 5950015, 6497754, 7180815, 7918365, 8534854, 8604953, 9478297, 10265570, 11606272, 13091239, 15644028, 19127112, 23946251, 27238912, 28419676]
2379B8419676r77981m1637J30771J812567K493253M451825N870210R276722J2163570
2370F3598976K4497854N2076348J02279844J23757874P0383454l8365544r7220209
2363C01008597p7091622n4407361l6291642k7931556k0928466j7834896j3648672
2356E2874382j0450589o093634m829929j589750k19100n40955k695318l352273
2348B3102834l129601j968455j944192j334197j248717j142373r14054n36915
2340A0884330o46380l72384o34760n51018n18581j60427l52968J48330l41948
2331G454194l48370k06529m91442n80760j46775n5991N4873l04410k21217J22403
2321E275976l38201l76617l8343l93099j32759J32666k20013J46888r407k52854
$$ y = [28419676, 27441695, 27400058, 27530829, 29343396, 31836649, 36288474, 42158684, 51435406, 63598976, 88096830, 140173178, 242453022, 366210896, 436594350, 398228806, 301008597, 223916975, 169509614, 133217972, 105286416, 84357950, 66523054, 52874382, 42423793, 36330159, 31500230, 29910480, 29691380, 29150425, 26455107, 23102834, 19973233, 18004778, 16060586, 14726389, 13477672, 12335299, 11421245, 10884330, 10237950, 9865566, 9230806, 8679788, 8161207, 8000780, 7647812, 7796142, 7454194, 7105824, 6899295, 6407853, 5827093, 5680318, 5624327, 5679200, 5374790, 5153573, 5275976, 4937775, 4561158, 4522815, 4129716, 3996957, 4129623, 3909610, 4056498, 4047091, 3794237]
2311C794237k35815k88210L1493Q3185j91392l30459j39818r9644l77878k73096
2301A972603J29553L80356L796n5230m65904k23069J12623j13607l35539K1842
2291A427424J60323N2734m1471K1936M3320k25437J4708K45956k0049k75064l43319
2280A061061j37802j48348J13225O1054N14335j09735J19862k12589J26489j92543
2270A195009k00365j41966J22398J57635o3522r5084l40166n4838P9374j85134
2260D73341J9622p0192o1194J28198K23163k20574K59979j51933j45366J50912
2250F05956J84181m16732p4466K4190J73805k10731q0372k11764M6529Q8127n8043
2239G0680J65841l43857k2536K86259q8716L9164Q7566k68325J71403r2560p2274
$$ y = [3794237, 3558422, 3270212, 3301705, 3384890, 3193498, 2863039, 2723221, 2623577, 2245699, 1972603, 2102156, 2482512, 2486308, 2431078, 1965174, 1742105, 1854728, 1741121, 1405582, 1427424, 1587747, 1640481, 1599010, 1620946, 1664266, 1438829, 1453537, 1699493, 1679444, 1404380, 1061061, 923259, 774911, 888136, 949190, 1463525, 1353790, 1473652, 1261063, 1387552, 1195009, 994644, 852678, 975076, 1132711, 1069189, 974105, 633939, 579101, 658475, 473341, 492963, 422771, 361577, 489775, 712938, 492364, 752343, 600410, 455044, 605956, 790137, 373405, 298939, 323129, 496934, 286203, 205831, -5933, 40596, 128723, 70680, 236521, -107336, -129872, 156387, 67671, 106835, 194401, -73924, 97479, 4919, -67355]
2228f7355O7269J11068J02038k0217j6735k40567m5720R3244k11565M0188L2269
2217a56083R8013J62405n7356P1252k81725j67540R9325m8761K2678K42072L4351
2206A8631k48144m128j95197j75010O8793j7284R7117J21566m4453K37445Q1676
2195e8988j253N6511j10646o490j61840J20444J71276J3489k19292k38119j44029
2184e78937j1405L23114K66166j99182m5021k15008k8781k12147k2870J73299
2174e50772k04645K18181N7135o6203l10701K50515r757M7035n1286J48734j97480
2163f69244j902L47707j62762k05160O9420k78898j66045P741j33377L40526K30535
2152f21459k23730J9788J83665j5618K9158m7026n6614Q1811j12456P990m0941
$$ y = [-67355, -86, 110982, 213020, 192803, 176068, -64499, -110219, -16975, -228540, -188352, -156083, -58070, 104335, 46979, 118231, -163494, -331034, -231709, -280470, -257792, -15720, 18631, -229513, -233641, -428838, -603848, -535055, -552339, -455222, -333656, -378109, -140664, -58988, -60241, -3730, -114376, -120866, -282706, -162262, 9014, 22503, -196789, -434908, -578937, -590342, -267228, -1062, -200244, -245265, -460273, -489054, -701201, -724071, -550772, -755417, -537236, -480101, -546304, -857005, -606490, -616247, -569212, -620498, -471764, -669244, -671146, -323439, -486201, -691361, -621941, -900839, -1066884, -1059143, -1192520, -851994, -621459, -845189, -825401, -641736, -657354, -628196, -675222, -731836, -650025, -762481, -754491, -795432]
2141g95432L49491j84073k32518R8327K1774j42149O6551p8649q5935o2534Q8309
2130i56838j37435J8863J24430K71910K38447k69192J13782J6891q9562j4453
2120f83157j27276j14996j84371K05967K77236N0926j70034m5894J96885Q0259
2110e14455K8449L2902j59194q2033J06973J84406j0108J98840P0604j82810K18807
2099a07619K25915N86121L98450K77286m58334l75945m86354k64158j40061k7554
2089c72253O683j55869k4297q4013L0336j73995o4724J83147k48433M2678Q9514
2078g71226K75836K3784k11291O5468n6238j44690N8043J12235K6304r4187j38848
2067h54810L33586m4617l14803J8992J47360m0890o2458J09950N4115J31759l9976
$$ y = [-795432, -445941, -630014, -862532, -764205, -742431, -884580, -818029, -896678, -982613, -1045147, -956838, -1094273, -1075410, -950980, -679070, -440623, -709815, -596033, -579142, -668704, -683157, -810433, -925429, -1109800, -903833, -626597, -575671, -745705, -791599, -594714, -514455, -486006, -453104, -612298, -694331, -587358, -402952, -413060, -214220, -143616, -326426, -107619, 118296, 704417, 1102867, 1380153, 921819, 545874, 59520, -204638, -344699, -372253, -365570, -521439, -545736, -629749, -599413, -773408, -838132, -654985, -903418, -860740, -771226, -495390, -471606, -682897, -617429, -673667, -818357, -760314, -648079, -621775, -715962, -854810, -521224, -565841, -880644, -861652, -714292, -755182, -817640, -707690, -653575, -521816, -561792]
2056e61792j18031K50534l46927J05841j50589P0248J18572J42134K7710m10836
2046h73136j42759R0044j28527l1301L46092Q2664J03140k67933k39487K02722
2036h58481j98709L0620J16718J00553J68723q5820p9499j60069J5757k87820
2026a238027P0568R2151L43231l8282r4944j77592K64716M076j46145L8141j12656
2015i94763j42502Q8642j33323J44783L64415N1870k17851j13648L22104r4454
2005g24727R309r2828J09461k9650L4434P5728q7732J82501j87896l3419J34757
1994f10062j80842j24423k853J055l3244l49065J61061K16686J54784O7285Q824
1983f90794j72121J48747q5228N3220M7685j23081k1601l1446j0382q3528N18114
$$ y = [-561792, -679823, -429289, -776216, -670375, -820964, -750716, -632144, -490010, -462300, -873136, -1015895, -925851, -1054378, -1085679, -739587, -656923, -553783, -821716, -1061203, -858481, -1057190, -1026570, -909852, -809299, -640576, -726396, -805895, -965964, -950207, -1238027, -1167459, -1075308, -732077, -770359, -865303, -1042895, -778179, -774103, -920248, -882107, -994763, -1137265, -1048623, -1181946, -1037163, -672748, -620878, -838729, -952377, -630273, -724727, -715418, -808246, -698785, -728435, -694001, -618273, -706005, -523504, -711400, -744819, -610062, -790904, -915327, -918180, -917125, -950369, -1299434, -1138373, -921687, -766903, -699618, -690794, -862915, -714168, -799396, -746176, -698491, -821572, -843173, -874619, -885001, -968529, -450415]
1972d50415l54530n1016m6810J16972J01542M9316j19389j43952K51229l97123
1962a044176K28333j34042J5760R2094o0016R5416l3814j15567R1060K19703q1001
1951g26250j52677L2831J00154J05707R9859j47447j16354l8330N915J19462J49849
1940e67281q6043J83955k32314k97693p7465L61186j36749k49860K34973K78719
1930e88572j29226m09416N598K16421k0158r4859j1080K0257K14810j324l28308
1919a125857K37792K05655m3092j49033J34916n9539j48712j1108P9195r8817
$$ y = [-450415, -804945, -855961, -902771, -785799, -684257, -634941, -754330, -898282, -647053, -1044176, -815843, -949885, -934125, -842031, -902047, -806631, -840445, -956012, -864952, -645249, -726250, -878927, -846096, -745942, -640235, -540376, -687823, -804177, -842507, -836592, -717130, -567281, -653324, -469369, -701683, -999376, -1076841, -715655, -852404, -1102264, -867291, -588572, -717798, -1127214, -1121616, -905195, -925353, -1020212, -1031292, -1011035, -796225, -797549, -1125857, -888065, -682410, -725502, -874535, -739619, -799158, -947870, -958978, -879783, -978600]
$$ [...]
##END NTUPLES=NMR SPECTRUM
##END=
