##TITLE=1H_DE-80H_X3
 200.13MHz, d2o
 8 sc
 
 19ns.26.2.2025
##JCAMPDX= 6.0         $$ Bruker NMR JCAMP-DX V2.0
##DATA TYPE= NMR SPECTRUM
##DATA CLASS= NTUPLES
##ORIGIN= UXNMR, Bruker Analytische Messtechnik GmbH
##OWNER= pz
$$ XWIN-NMR		Version 3.5
$$ Thu Apr  2 10:40:34 2026 Russian Standard Time (UT+4h)  Yarkov@DPX200
##.OBSERVE FREQUENCY= 200.1313
##.OBSERVE NUCLEUS= ^1H
##.ACQUISITION MODE= SIMULTANEOUS
##.ACQUISITION SCHEME= undefined
##.AVERAGES= 8
##.DIGITISER RES= 18
##SPECTROMETER/DATA SYSTEM= spect
##.PULSE SEQUENCE= zg30
##.SOLVENT NAME= CDCl3
##.SHIFT REFERENCE= (INTERNAL, CDCl3, 0, 15.4472)
##AUDIT TRAIL= $$ (NUMBER, WHEN, WHO, WHERE, WHAT)
$$ ##TITLE= Audit trail, XWIN-NMR		Version 3.5
$$ ##JCAMPDX= 5.01
$$ ##ORIGIN= Bruker BioSpin GmbH
$$ ##OWNER= Yarkov
$$ C:/Bruker/XWIN-NMR/data/yarkov2/nmr/H-C/1/pdata/1/auditp.txt
$$ ##AUDIT TRAIL=  $$ (NUMBER, WHEN, WHO, WHERE, WHAT)
(   1,<2026-04-02 10:39:47.12 +0400>,<Yarkov>,<DPX200>,
      <created by zg, POWCHK disabled, PULCHK disabled
       configuration hash MD5:
       00 E9 B6 7A A2 85 ED C7 34 08 36 98 17 FE 4E 26
       data hash MD5: 16K
       22 67 FB CD FD 1A 00 B6 15 1F 1B 0F 19 E3 70 1D>)
(   2,<2026-04-02 10:39:50.87 +0400>,<Yarkov>,<DPX200>,
      <Start of raw data processing
       efp BC_mod = 2 LB = 0.25 FT_mod = 6 PKNL = 1 PHC0 = -5301.748 PHC1 = 6.821927 SI = 16K 
       data hash MD5: 16K
       6F 60 AE 0A F7 14 36 B6 BC A3 60 AA FB AA C0 E9>)
$$ ##END=
$$ 
$$ hash MD5
$$ DA 1C 29 41 FD 2E 9E A1 0D F5 93 92 0B A5 5F 65
##$RELAX= 
##$RELAX= 
##$RELAX= 
##$RELAX= 
##$RELAX= 
##$RELAX= 
$$ Bruker specific parameters
$$ --------------------------
##$DU= <C:/Bruker/XWIN-NMR>
##$EXPNO= 1
##$NAME= <H-C>
##$PROCNO= 1
##$TYPE= <nmr>
##$USER= <yarkov2>
##$AMP= (0..31)
100 100 100 100 100 100 100 100 100 100 100 100 100 100 100 100 100 100 
100 100 100 100 100 100 100 100 100 100 100 100 100 100 
##$AQSEQ= 0
##$AQ_mod= 1
##$AUNM= <au_zg>
##$AUTOPOS= <>
##$BF1= 200.13
##$BF2= 200.13
##$BF3= 200.13
##$BF4= 200.13
##$BF5= 200.13
##$BF6= 200.13
##$BF7= 200.13
##$BF8= 200.13
##$BYTORDA= 1
##$CFDGTYP= 0
##$CFRGTYP= 5
##$CHEMSTR= <none>
##$CNST= (0..31)
1 1 145 1 1 1 1 1 1 1 1 1 1 1 1 1 1 1 1 1 1 1 1 1 1 1 1 1 1 1 1 1 
##$CPDPRG= <>
##$CPDPRG1= <>
##$CPDPRG2= <>
##$CPDPRG3= <>
##$CPDPRG4= <mlev>
##$CPDPRG5= <mlev>
##$CPDPRG6= <mlev>
##$CPDPRG7= <mlev>
##$CPDPRG8= <mlev>
##$CPDPRGB= <>
##$CPDPRGT= <>
##$D= (0..31)
0 0.7 0 0 0 0 0 0 0 0 0 0.03 0 0 0 0 0 0 0 0 0 0 0 0 0 0 0 0 0 0 0 0 
##$DATE= 1775111986
##$DBL= (0..7)
120 120 120 120 120 120 120 120 
##$DBP= (0..7)
150 150 150 150 150 150 150 150 
##$DBP07= 0
##$DBPNAM0= <>
##$DBPNAM1= <>
##$DBPNAM2= <>
##$DBPNAM3= <>
##$DBPNAM4= <>
##$DBPNAM5= <>
##$DBPNAM6= <>
##$DBPNAM7= <>
##$DBPOAL= (0..7)
0.5 0.5 0.5 0.5 0.5 0.5 0.5 0.5 
##$DBPOFFS= (0..7)
0 0 0 0 0 0 0 0 
##$DE= 6
##$DECBNUC= <off>
##$DECIM= 32
##$DECNUC= <off>
##$DECSTAT= 4
##$DIGMOD= 1
##$DIGTYP= 9
##$DL= (0..7)
0 120 120 120 120 120 120 120 
##$DP= (0..7)
$$ [...]
##$SUBNAM2= <"">
##$SUBNAM3= <"">
##$SUBNAM4= <"">
##$SUBNAM5= <"">
##$SUBNAM6= <"">
##$SUBNAM7= <"">
##$SUBNAM8= <"">
##$SUBNAM9= <"">
##$SW= 18.0517328524113
##$SWIBOX= (0..15)
0 0 2 0 0 0 0 0 0 0 0 0 0 0 0 0 
##$SW_h= 3612.71676300578
##$TD= 16384
##$TD0= 1
##$TE= 0
##$TE2= 300
##$TE3= 300
##$TEG= 300
##$TL= (0..7)
0 120 120 120 120 120 120 120 
##$TP= (0..7)
150 150 150 150 150 150 150 150 
##$TP07= 0
##$TPNAME0= <>
##$TPNAME1= <>
##$TPNAME2= <>
##$TPNAME3= <>
##$TPNAME4= <>
##$TPNAME5= <>
##$TPNAME6= <>
##$TPNAME7= <>
##$TPOAL= (0..7)
0.5 0.5 0.5 0.5 0.5 0.5 0.5 0.5 
##$TPOFFS= (0..7)
0 0 0 0 0 0 0 0 
##$TUNHIN= 0
##$TUNHOUT= 0
##$TUNXOUT= 0
##$USERA1= <user>
##$USERA2= <user>
##$USERA3= <user>
##$USERA4= <user>
##$USERA5= <user>
##$V9= 5
##$VALIST= <valist>
##$VCLIST= <CCCCCCCCCCCCCCC>
##$VD= 0
##$VDLIST= <DDDDDDDDDDDDDDD>
##$VPLIST= <PPPPPPPPPPPPPPP>
##$VTLIST= <TTTTTTTTTTTTTTT>
##$WBST= 1024
##$WBSW= 4
##$XGAIN= (0..3)
0 0 0 0 
##$XL= 0
##$YL= 0
##$YMAX_a= 168352
##$YMIN_a= -151302
##$ZGOPTNS= <>
##$ZL1= 120
##$ZL2= 120
##$ZL3= 120
##$ZL4= 120
##$ABSF1= 0
##$ABSF2= 0
##$ABSG= 0
##$ABSL= 0
##$ALPHA= 0
##$AQORDER= 0
##$ASSFAC= 0
##$ASSFACI= 0
##$ASSFACX= 0
##$ASSWID= 0
##$AUNMP= <proc_1d>
##$AZFE= 0.1
##$AZFW= 0.1
##$BCFW= 0
##$BC_mod= 2
##$BYTORDP= 0
##$COROFFS= 0
##$CY= -3
##$DATMOD= 1
##$DC= 0
##$DFILT= <>
##$DTYPP= 0
##$F1P= 0
##$F2P= 0
##$FCOR= 1
##$FTSIZE= 16384
##$FT_mod= 6
##$GAMMA= 0
##$GB= 0
##$INTBC= 1
##$INTSCL= 3.241238e-09
##$ISEN= 128
##$LB= 0.25
##$LEV0= 0
##$LPBIN= 0
##$MAXI= 10000
##$MC2= 0
##$MEAN= 0
##$ME_mod= 0
##$MI= 1.114404
##$NCOEF= 0
##$NC_proc= -8
##$NLEV= 6
##$NOISF1= 3.799351
##$NOISF2= 2.8
##$NSP= 0
##$NTH_PI= 0
##$NZP= 0
##$OFFSET= 15.4472
##$PC= 1
##$PHC0= -5301.748
##$PHC1= 6.821927
##$PH_mod= 1
##$PKNL= yes
##$PPARMOD= 0
##$PSCAL= 0
##$PSIGN= 0
##$REVERSE= no
##$SF= 200.130014909176
##$SI= 16384
##$SIGF1= 3
##$SIGF2= 2
##$SINO= 0.751879
##$SIOLD= 32768
##$SREGLST= <19F.Aceton>
##$SSB= 0
##$STSI= 16384
##$STSR= 0
##$SW_p= 3612.71676300578
##$SYMM= 0
##$S_DEV= 0
##$TDeff= 16384
##$TDoff= 0
##$TI= <>
##$TILT= no
##$TM1= 0
##$TM2= 0
##$TOPLEV= 0
##$USERP1= <user>
##$USERP2= <user>
##$USERP3= <user>
##$USERP4= <user>
##$USERP5= <user>
##$WDW= 1
##$XDIM= 16384
##$YMAX_p= 426746382
##$YMIN_p= -1524293
$$ End of Bruker specific parameters
$$ ---------------------------------
##NTUPLES= NMR SPECTRUM
##VAR_NAME=  FREQUENCY,     SPECTRUM/REAL,   SPECTRUM/IMAG
##SYMBOL=    X,             R,               I
##VAR_TYPE=  INDEPENDENT,   DEPENDENT,       DEPENDENT
##VAR_FORM=  AFFN,          ASDF,            ASDF
##VAR_DIM=   16384,         16384,           16384
##UNITS=     HZ,            ARBITRARY UNITS, ARBITRARY UNITS
##FACTOR=    0.220516191357247, 1,           1
##FIRST=     3091.44833057625, 0,            0
##LAST=      -521.268432429534, 0,           0
##MIN=       -521.268432429534, -1524293,    0
##MAX=       3091.44833057625, 426746382,    0
$$ Real data points
##PAGE= N=1
##DATA TABLE= (X++(R..R)), XYDATA
$$ [...]
7649b41453o7615P9145J80288k87392r4822k18242J24108L35841J82493k24263
$$ -241453 -309068 -229923 -49635 -337027 -431849 -650091 -525983 -190142 -7649 -231912
7639b31912k29013N6917K09090Q1034P8374K9319p5730k27690J01463j54528l13934
$$ -231912 -460925 -404008 -194918 -113884 -35510 -6191 -81921 -309611 -208148 -362676 -676610
7628f76610K84099J15336l57851l9383J46890K17684p366k7823k09637j04794
$$ -676610 -392511 -277175 -635026 -674409 -527519 -309835 -317201 -345024 -554661 -659455
7618f59455P0031j07301J3169J03975J51619K02782r1163O243m5190l63141J88576
$$ -659455 -589424 -696725 -683556 -579581 -427962 -225180 -316343 -310100 -355290 -718431 -529855
7607e29855K22688M0000p9189j19536J6428K18776M2607J6753J901m9370P6228
$$ -529855 -307167 -267167 -346356 -465892 -449464 -230688 -188081 -171328 -169427 -218797 -142569
7596a42569j81956m84083J90394K53270K23847J42013q1102M1122M3809k30673
$$ -142569 -324525 -808608 -618214 -364944 -141097 916 -80186 -39064 4745 -225928
7586b25928n1941J9017j83396l3703J71246j48507k00595J89620J71692l5599
$$ -225928 -277869 -258852 -442248 -475951 -304705 -453212 -653807 -464187 -292495 -328094
7576c28094K89071J9509k7509j61221m04804L56037k3312Q8517J37677j59336
$$ -328094 -39023 -19514 -47023 -208244 -613048 -257011 -280323 -191806 -54129 -213465
7566b13465J16879M9314k28256M5761o3259R3340o6682j73890j77908J0906J91969
$$ -213465 -96586 -47272 -275528 -229767 -293026 -199686 -266368 -440258 -618166 -607260 -415291
7555d15291K17637J6042j13358o0679j38654P8900K02503l27558j3376J17529
$$ -415291 -197654 -181612 -294970 -355649 -494303 -415403 -212900 -540458 -553834 -436305
7545d36305k03465q7246J22028J18789J77048j48062l28463K75557J95728j18282
$$ -436305 -639770 -727016 -604988 -486199 -309151 -457213 -785676 -510119 -314391 -432673
7535d32673J8605N4169j51012k13150K24731J27120J82108J7799k3500j9262r1155
$$ -432673 -414068 -359899 -510911 -724061 -499330 -372210 -190102 -172303 -195803 -215065 -306220
7524c06220k1367k67567Q0516j94345Q4667K53735K8116j44972K7231k2993k13146
$$ -306220 -327587 -595154 -514638 -708983 -624316 -370581 -342465 -487437 -460206 -483199 -696345
7513f96345K44019l48810r2320J44193k8235J01465K31549J3226m0755L83719
$$ -696345 -452326 -801136 -893456 -749263 -777498 -676033 -444484 -431258 -472013 -88294
7503h8294K6662j47124k65926M2392M0381k86366j0754J69655j70558K37121k07285
$$ -88294 -61632 -208756 -474682 -432290 -391909 -678275 -689029 -519374 -689932 -452811 -660096
7492f60096J77208j21433K8475j77895K0280L3931J14268J09744j56538k51196
$$ -660096 -482888 -604321 -575846 -753741 -733461 -699530 -585262 -475518 -632056 -883252
7482h83252J99826K53410j99944j62586J65741K57235N1388j0504j60493J26450
$$ -883252 -683426 -430016 -629960 -792546 -626805 -369570 -318182 -328686 -489179 -362729
7472c62729j46769j65143L8108L12754P6312Q190q6614O40j33440J80400k0129
$$ -362729 -509498 -674641 -636533 -323779 -247467 -239277 -325891 -325251 -458691 -278291 -298420
7461b98420l1724K07329k73753K8401J60878o8077j65034q7009J91019j34867
$$ -298420 -330144 -122815 -396568 -368167 -207289 -275366 -440400 -527409 -336390 -471257
7451d71257j3650L18013j91092k07545K2784m7393J75716l3431k12968j37237
$$ -471257 -484907 -166894 -357986 -565531 -542747 -590140 -414424 -447855 -660823 -798060
7441g98060J74559J46489R2304J46386k14484j79601L521J58954L01087n6317
$$ -798060 -623501 -477012 -384708 -238322 -452806 -632407 -628886 -469932 -168845 -225162
7431b25162J22394K86664m02120j20267j05745J9709R1167j59034l5369j88678
$$ -225162 -102768 183896 -218224 -338491 -444236 -424527 -333360 -492394 -527763 -716441
7421g16441K15423L3141r5307N1145k11428J37985J79778k23053j16054m1517
$$ -716441 -501018 -467877 -563184 -512039 -723467 -585482 -405704 -628757 -744811 -786328
7411g86328L86196J04298j17442K00065k99376j73828r392K99518l1351n3124
$$ -786328 -400132 -295834 -413276 -213211 -512587 -686415 -695807 -396289 -427640 -480764
7401d80764p051k56765K10232l9229J00809k37582l22166K61802K21958K3074
$$ -480764 -487815 -744580 -534348 -573577 -472768 -710350 -1032516 -770714 -548756 -525682
7391e25682R4760N692J6749J79747r3903j23451J01505N8664M9809k45591R4776
$$ -525682 -430922 -425230 -408481 -228734 -322637 -446088 -344583 -285919 -236110 -481701 -386925
7380c86925K52919L3246k21525k63688r5863L40515j23321k4201N9736J10209
$$ -386925 -134006 -100760 -322285 -585973 -681836 -341321 -464642 -488843 -429107 -318898
7370c18898k76555K5659P0721q1673k41k05817J69776K02199P3821j7396j25807
$$ -318898 -595453 -569794 -499073 -580746 -580987 -786804 -617028 -414829 -341008 -358404 -484211
7359d84211L6461l0305n0726L4842m3945L7233q0282O1668R3990J58727k28937
$$ -484211 -447750 -478055 -528781 -493939 -537884 -500651 -580933 -519265 -425275 -266548 -495485
7348d95485J11812N1002k02758j95096Q5633p515J5814l4626n7816K52712j73011
$$ -495485 -383673 -332671 -535429 -730525 -644892 -652407 -636593 -671219 -729035 -476323 -649334
7337f49334l2445J79033q7524n7965O478p793J75158M078r4008J91929J16352
$$ -649334 -681779 -502746 -590270 -648235 -641757 -649550 -474392 -470314 -564322 -372393 -256041
7326b56041J36545j83547k14822j63598m3706K18735k41146M21963J18571n75746
$$ -256041 -119496 -303043 -517865 -681463 -725169 -506434 -747580 -325617 -207046 -782792
7316g82792Q4843L39928j45192n6340p4979k2537J80044j51228J41702j94633
$$ -782792 -697949 -358021 -503213 -559553 -634532 -657069 -477025 -628253 -486551 -681184
7306f81184Q9824j48968O4644J26703j34411k79244L84523J28179j05729k3700
$$ -681184 -591360 -740328 -675684 -548981 -683392 -962636 -578113 -449934 -555663 -579363
7296e79363o2044K08611J3908l9575j86667Q9583J81079K6298k33676J26854k40232
$$ -579363 -641407 -432796 -418888 -458463 -645130 -555547 -374468 -348170 -581846 -454992 -695224
7285f95224O5740K55236J61827k3167j8243Q5128j74336P7384O2449j6644j74299
$$ -695224 -629484 -374248 -212421 -235588 -253831 -168703 -343039 -265655 -203206 -219850 -394149
7274c94149r5871K9042J51031J81389k78498l06912K92516p4704K9577J62402
$$ -394149 -490020 -460978 -309947 -128558 -407056 -713968 -421452 -496156 -466579 -304177
7264c04177m09934R7744J73258k9124J26861k59586j12934K2990J4945r668K74948
$$ -304177 -714111 -616367 -443109 -472233 -345372 -604958 -717892 -694902 -679957 -689625 -414677
7253d14677L403J31013j13223k53156l23564O5916M23253J33085J32531k69857
$$ -414677 -411274 -280261 -393484 -646640 -970204 -904288 -481035 -347950 -215419 -485276
7243d85276J24783j74246J07175J00557K406m21783j09498K36659j414J30412
$$ -485276 -360493 -534739 -427564 -327007 -324601 -746384 -855882 -619223 -620637 -490225
7233d90225k2692j59760K3241j03576J14200J6580j00229K18796k14613J36117
$$ -490225 -512917 -672677 -649436 -753012 -638812 -622232 -722461 -503665 -718278 -582161
7223e82161K4456r2680J59745Q9820k69944K85590P1540j45066l3344m2932k98
$$ -582161 -557705 -650385 -490640 -400820 -670764 -385174 -313634 -458700 -492044 -534976 -535274
7212e35274n382p7204L456N4960j24084r7805K54657M15635P3920n5125k42853
$$ -535274 -540656 -617860 -614404 -559444 -683528 -781333 -526676 -111041 -37121 -92246 -335099
7201c35099k65653j15108J33626K4106j11768n3173K78907J06454n8969j5270
$$ -335099 -600752 -715860 -582234 -558128 -669896 -723069 -444162 -337708 -396677 -411947
7191d11947j7218o7711M33153J44375l75073k19272K67548K08405k76104j10933
$$ -411947 -429165 -496876 -63723 80652 -294421 -513693 -246145 -37740 -313844 -424777
7181d24777l9831N2916N1997l2775j32130K64598k14242J35447K47981l88281
$$ -424777 -464608 -411692 -359695 -392470 -524600 -260002 -474244 -338797 -90816 -479097
7171d79097j2039J15512P8573P4271J2624j06452L6679k44032M5673J93018j2252
$$ -479097 -491136 -375624 -297051 -222780 -210156 -316608 -279929 -523961 -478288 -285270 -297522
7160b97522j07427r9121k40273R2546l248K58917J89347k05013M2137J18751N1922
$$ -297522 -404949 -504070 -744343 -651797 -655045 -396128 -206781 -411794 -369657 -250906 -198984
7149a98984j34557j97831K55863j86152j79973k16166K41473R1339J38770L1383
$$ -198984 -333541 -531372 -275509 -461661 -641634 -857800 -616327 -524988 -386218 -354835
7139c54835j07562j28490k0209J82705j93325j45536J46854L68300j34002j41171
$$ -354835 -462397 -590887 -611096 -428391 -621716 -767252 -620398 -252098 -386100 -527271
7129e27271j03341N07315m8134J4440O500r8130l94077j64894J12662J2788k6208
$$ -527271 -630612 -123297 -171431 -156991 -150491 -248621 -642698 -807592 -694930 -682142 -708350
7118g08350n7089J76741l0525K02793J3032K9890r0735r2579k16978j28023K03658
$$ -708350 -765439 -588698 -619223 -416430 -403398 -373508 -464243 -556822 -773800 -901823 -698165
7107f98165K8150J4843J9963J86855N7167J90350J9380J34587l6381l3654j3722
$$ -698165 -670015 -655172 -635209 -448354 -391187 -200837 -181457 -46870 -83251 -116905 -130627
7096a30627j7695m6500o3019k5395M8993P82Q9736M9071j40882n6821J1969K30679
$$ -130627 -148322 -194822 -257841 -283236 -234243 -233461 -143725 -94654 -235536 -292357 -280388 -49709
7084d9709J39087k18016K10113r322j6258J65070l69928Q3273J95156k40292j82046
$$ -49709 89378 -128638 81475 72153 55895 220965 -148963 -65690 129466 -110826 -292872
7073b92872P8737J38920k09465p0197L69259J51069k19990J49736j84150j64214
$$ -292872 -214135 -75215 -284680 -354877 14382 165451 -54539 95197 -88953 -253167
7063b53167J05534q8147L8554r1612K3290P597j65269j32929M01397j69790q1445
$$ -253167 -147633 -235780 -197226 -288838 -265548 -257951 -423220 -556149 -154752 -324542 -405987
7052d05987q1764n4668k94552Q002M93734L44906k77172n62462K32323L82776
$$ -405987 -487751 -542419 -836971 -828969 -335235 9671 -267501 -829963 -597640 -214864
7042b14864j76270j34275J02045k38500m0791J3799L47641o8784J6265k7363k52834
$$ -214864 -391134 -525409 -423364 -661864 -702655 -688856 -341215 -409999 -393734 -421097 -673931
7031f73931O726q742K34661o7944K39725n4004k57969J63526j36111P9575k96804
$$ -673931 -667205 -675947 -441286 -509230 -269505 -323509 -581478 -417952 -554063 -474488 -771292
7020g71292j00026P3626O0962J62100J53865k08612n9801K45919l5230j05792
$$ -771292 -871318 -797692 -736730 -574630 -420765 -629377 -689178 -443259 -478489 -584281
7010e84281n4372J49953n3036j56925j15316K87081L17513k35433j59527L28992
$$ -584281 -638653 -488700 -541736 -698661 -813977 -526896 -209383 -444816 -604343 -275351
7000b75351q8516j17475k14766K2666J39016M0626n0624m1079K1993J45024R3111
$$ -275351 -363867 -481342 -696108 -673442 -534426 -493800 -544424 -585503 -563510 -418486 -325375
6989c25375m2417J17364j94689j0052J60420p7724j35022j99438j39863M24753
$$ -325375 -367792 -250428 -445117 -455169 -294749 -372473 -507495 -706933 -846796 -422043
6979d22043K15155k62657k2519P7480m46626k2615Q2754L77229k1144j80875R9490
$$ -422043 -206888 -469545 -492064 -414584 -861210 -883825 -801071 -423842 -444986 -625861 -526371
6968e26371j3284Q4869k19931J22893k0326k26777L62348J53586l11291p7075
$$ -526371 -539655 -454786 -674717 -551824 -572150 -798927 -436579 -282993 -594284 -671359
6958f71359j42099k1512J54880J99100j40489p9810J49386R7349j56105j69938
$$ -671359 -813458 -834970 -680090 -480990 -621479 -701289 -551903 -454554 -610659 -780597
6948g80597J87761O7447j13001n3544O3889Q8596L7191q0464k03426j69047K50093
$$ -780597 -592836 -525389 -638390 -691934 -628045 -539449 -502258 -582722 -786148 -955195 -705102
6937g05102K05134j51022K39592j15000m6486j03900j17518K29866l5503N0079
$$ -705102 -499968 -650990 -411398 -526398 -572884 -676784 -794302 -564436 -599939 -549860
6927e49860j66555n8690L12810K12514m90159Q5839K63416j85320k02569k67183
$$ -549860 -716415 -775105 -462295 -249781 -739940 -654101 -390685 -576005 -778574 -1045757
6917a045757L03608j33678Q4449M02279q8708k74308n4184J28849j69844q2891
$$ -1045757 -742149 -875827 -791378 -389099 -477807 -752115 -806299 -677450 -847294 -930185
6907i30185M8086M9496K9581k26804j18011N36454P6190j39002K98192p2539r3221
$$ -930185 -882099 -832603 -803022 -1029826 -1147837 -611383 -535193 -674195 -376003 -448542 -541763
6896e41763j23783J2585j5396r4926J00934K41269p1642n9015m46165k23801R103
$$ -541763 -665546 -652961 -668357 -763283 -662349 -421080 -492722 -551737 -997902 -1221703 -1212600
6885a212600Q2897M22524j94592k19908L22441K34848K33144k24175j74942j91113
$$ -1212600 -1129703 -707179 -901771 -1121679 -799238 -564390 -331246 -555421 -730363 -921476
6875i21476j81043L26008J66658J20077j07951j80468j13843k3087J43743l2424
$$ -921476 -1102519 -776511 -609853 -489776 -597727 -778195 -892038 -915125 -771382 -803806
6865h03806l7247M5991J23711L4180p0229j87009j19823J06967J5081q5686J04892
$$ -803806 -841053 -795062 -671351 -637171 -707400 -894409 -1014232 -907265 -892184 -977870 -872978
6854h72978J13254j8960P093O0528J64476k1969k95625R309q657K80687K36646
$$ -872978 -759724 -778684 -771591 -711063 -546587 -568556 -864181 -854872 -863529 -582842 -346196
6843c46196m60430L1771l28942L18959P5593N3254J52894j62452O1009j70348
$$ -346196 -806626 -774855 -1103797 -784838 -709245 -655991 -503097 -665549 -604540 -774888
6833g74888j60978k702J29397k9815O776J15885K5081j49158J21815R6110P9240
$$ -774888 -935866 -938568 -809171 -838986 -832210 -716325 -691244 -840402 -718587 -622477 -543237
6822e43237l677j12462k9370j3682K9451j03436k23751J35068K34927K6763R5585
$$ -543237 -546914 -659376 -688746 -702428 -672977 -776413 -1000164 -865096 -630169 -603406 -507821
6811e07821j71514J02871R4546L0493Q6108N9917n78310r7894J67226L588K82279
$$ -507821 -679335 -576464 -481918 -451425 -365317 -305400 -883710 -981604 -814378 -810790 -528511
6800e28511j24743j3371K30581k24619K49891O9803m31956l7288O2145J46560
$$ -528511 -653254 -666625 -436044 -660663 -410772 -340969 -772925 -810213 -748068 -601508
6790f01508R6163o8521l80417j7956k9815K806L6612J71108J83204j51288J31288
$$ -601508 -505345 -573866 -954283 -972239 -1002054 -999248 -962636 -791528 -608324 -759612 -628324
6779f28324J2763p0993p036j54923j37446R3924o0794J61729K00071L4641j92394
$$ -628324 -615561 -686554 -693590 -848513 -985959 -892035 -952829 -791100 -591029 -556388 -748782
6768g48782J95879J07849j54175j30946k03118P4675J03562K4144K34728L02539
$$ -748782 -552903 -445054 -599229 -730175 -933293 -858618 -755056 -730912 -496184 -193645
6758a93645j33955k21287j6177Q9559j95621K67288N2314j44548K01145p5362
$$ -193645 -327600 -548887 -565064 -475505 -671126 -403838 -351524 -496072 -294927 -370289
6748c70289k16620j84253j17847j86250J45486J96528j45638m1995j4919J64883
$$ -370289 -586909 -771162 -889009 -1075259 -929773 -733245 -878883 -920878 -935797 -770914
6738g70914q0404J84188K8614o5409k81046k6723L66909j44347K0046J76997k14219
$$ -770914 -851318 -667130 -638516 -703925 -984971 -1011694 -644785 -789132 -769086 -592089 -806308
6727h06308L5035n6316j81020P6042J56982J63578r2377j22731j7970K51549k88
$$ -806308 -771273 -827589 -1008609 -932567 -775585 -612007 -704384 -827115 -845085 -593536 -593824
6716e93824o403K1530l111J8576j48980j27632k26459R2521K37942m451O498J80610
$$ -593824 -600227 -578697 -581808 -563232 -712212 -839844 -1066303 -973782 -735840 -740291 -733793 -553183
6704e53183R2007q1624k05353p1023k28629K30753j49430N6961J12500k3507K8101
$$ -553183 -461176 -542800 -748153 -819176 -1047805 -817052 -966482 -909521 -797021 -820528 -792427
6693g92427N8547J33464p3885o9915Q1731k09699p0187o8890j11292K39935Q9101
$$ -792427 -733880 -600416 -674301 -744216 -662485 -872184 -942371 -1011261 -1122553 -882618 -793517
6682g93517q3168j27049m2591j14960q8097o164J87185J99832j2391K6095J05400
$$ -793517 -876685 -1003734 -1046325 -1161285 -1249382 -1255546 -1068361 -868529 -880920 -854825 -749425
6671g49425j61671o7028n6904j40409J25377Q0803n5465J90695L26487k78337
$$ -749425 -911096 -978124 -1035028 -1175437 -1050060 -969257 -1024722 -834027 -507540 -785877
6661g85877J13026L7660l57562r5776K58139J35677o9459k10354m6102J80560
$$ -785877 -672851 -635191 -992753 -1088529 -830390 -694713 -764172 -974526 -1020628 -840068
6651h40068o1580p0956k14906L34964j96047k1345J35810Q7008n9968N7732j8751
$$ -840068 -901648 -972604 -1187510 -852546 -1048593 -1069938 -934128 -847120 -907088 -849356 -868107
6640h68107q5074J62014L1266k97928J53687K469n1553L36184K11391k13705J01347
$$ -868107 -953181 -791167 -759901 -1057829 -904142 -901673 -953226 -617042 -405651 -619356 -518009
6629e18009l50983J817p0855nJ42001n3208K19235R0506K1210J05460J62691q0176
$$ -518009 -868992 -867175 -938030 -938035 -796034 -849242 -630007 -539501 -518291 -412831 -250140 -330316
6617c30316k55939k5361k37687j72858K28657j46014J97550J77553p9040k4334
$$ -330316 -586255 -611616 -849303 -1022161 -793504 -939518 -741968 -564415 -643455 -667789
6607f67789J30518J75909J21673k40527m845K04794J11340k10010j9434j00376
$$ -667789 -537271 -361362 -239689 -480216 -485061 -280267 -168927 -378937 -398371 -498747
6597d98747K6894n8290j50960J37901o7632j12868j94343J28262k26819K76961
$$ -498747 -471853 -530143 -681103 -543202 -610834 -723702 -918045 -789783 -1016602 -739641
6587g39641M90806j52646q6745O212K06306l41689J27572N8187K9742j21416o6060
$$ -739641 -248835 -401481 -488226 -482014 -275708 -617397 -489825 -431638 -401896 -523312 -589372
6576e89372K14014n2414J54r1063j02264K336j45224J63091J77310j03619M77083
$$ -589372 -375358 -427772 -427618 -518681 -620945 -618609 -763833 -600742 -423432 -527051 -49968
6565d9968p1489j20785K45738k95433p6738p8050J32152r3150p6821K60135k68356
$$ -49968 -121457 -242242 3496 -291937 -368675 -446725 -314573 -407723 -484544 -224409 -492765
6554d92765L90041l8530j78454L31321j32855j46240R8052L04982Q9801l72740
$$ -492765 -102724 -141254 -319708 11613 -121242 -267482 -169430 135552 225353 -147387
6544a47387m2545q8798j34501O900J80089J19005Q5035J60643k02803J44917K8364
$$ -147387 -189932 -278730 -413231 -406331 -226242 -107237 -22202 138441 -64362 80555 108919
6533A08919j43584J58332K562j73690m3038O3949J92260J62132j72378j88310
$$ 108919 -34665 123667 126229 -47461 -90499 -26550 165710 327842 155464 -32846
6523c2846l86228k57838L3894K6867M3846k06757J02929K21122J811J8428j2714
$$ -32846 -419074 -676912 -643018 -616151 -572305 -779062 -676133 -455011 -453200 -434772 -447486
6512d47486K10767O1454p759j38811J96384J31572m85238J57085N9865k41186
$$ -447486 -236719 -175265 -183024 -321835 -125451 6121 -479117 -322032 -262167 -503353
6502e03353L9147o8331J09534M1317k96155J30391K51058L54361M0770k52477
$$ -503353 -464206 -532537 -423003 -381686 -677841 -547450 -296392 57969 98739 -153738
6492a53738j60890P7037q1885J12826N7321j73466L2676l7544J64584P5585l4073
$$ -153738 -314628 -237591 -319476 -206650 -149329 -322795 -290119 -327663 -163079 -87494 -121567
6481a21567P3672k7110j07269j60544j59436k42783K21645j9556Q9517K30273
$$ -121567 -47895 -75005 -182274 -342818 -502254 -745037 -523392 -542948 -453431 -223158
6471b23158l26921l5113P4964K5445j0000O2057n5385m7797l4064P1664p7601
$$ -223158 -550079 -585192 -510228 -484783 -494783 -432726 -488111 -535908 -569972 -498308 -575909
6460e75909k22052j31707J29675L22687j88301k84703K7333K63796k51468j87459
$$ -575909 -797961 -929668 -799993 -477306 -665607 -950310 -922977 -659181 -910649 -1098108
6450a098108o240K43261M00411K68377j08319j12379j28684k03111J15006l54079
$$ -1098108 -1104348 -861087 -460676 -192299 -300618 -412997 -541681 -744792 -629786 -983865
6440i83865j58976j3721L01628J16417M1945l5440m169j21478J14616k11023j40004
$$ -983865 -1142841 -1156562 -854934 -738517 -696572 -732012 -736181 -857659 -743043 -954066 -1094070
6429a094070K40178j544N4852k51580J28076K23208J06083J82403j90071K00027
$$ -1094070 -853892 -855436 -800584 -1052164 -924088 -700880 -594797 -412394 -602465 -402438
6419d02438J32722q5133L2948m5856j46251n5791K92838k45604j43100L7543J72639
$$ -402438 -269716 -354849 -321901 -367757 -514008 -569799 -276961 -522565 -665665 -628122 -455483
6408d55483j66197j50690M7457K18112J33792j10733k9610K82878K15040J08642
$$ -455483 -621680 -772370 -724913 -506801 -373009 -483742 -513352 -230474 -15434 93208
6398I3208K2403k62515j11180K0597P6646k2758r1756J0846J19089J04631J35375
$$ 93208 115611 -146904 -258084 -237487 -160841 -183599 -275355 -264509 -145420 -40789 94586
6387I4586N7732l16999q5072K07768J37937q590m0240Q2062J28501J2017J57666
$$ 94586 152318 -164681 -249753 -41985 95952 87362 47122 129184 257685 269702 427368
6376D27368K30293l14704J19329j69791Q5736m770j84727J63545l677l4279P3774
$$ 427368 657661 342957 462286 292495 378231 373461 188734 352279 348602 314323 388097
6365C88097L8442J48749J2133l9878j35645m2240P5366J92971K25928k06992P6456
$$ 388097 426539 575288 587421 547543 411898 369658 445024 637995 863923 656931 733387
6354G33387R3308J24512K66236K62517j8861n369K5808K5361o5345J00795J48001
$$ 733387 826695 951207 1217443 1479960 1461099 1455730 1481538 1506899 1441554 1542349 1690350
6343A690350O6002J29125K9822J37915L29424J11152r3549J45440K35898K93329
$$ 1690350 1756352 1885477 1915299 2053214 2382638 2493790 2400241 2545681 2781579 3074908
6333C074908K87998O15278K89683M4979N77577M12551J77390N10194P66546P92986
$$ 3074908 3362906 3978184 4267867 4312846 4890423 5302974 5480364 5990558 6757104 7550090
6323G550090Q62388J167179J285703J521776K177961L147372M371517Q129708
$$ 7550090 8412478 9579657 10865360 12387136 14565097 17712469 22083986 30213694
6315C0213694J2522343J5539091J5594978R848579J628213o439641j0723084j1195722
$$ 30213694 42736037 58275128 73870106 83718685 85346898 78907257 68184173 56988451
6307E6988451q914742n916698m332439k459328k74102L274092P743740J2766674
$$ 56988451 48073709 42157011 37824572 35365244 35091142 38365234 46108974 58875648
6299E8875648J5011605J2729283N041411l969495j0540338j3236707j2408652
$$ 58875648 73887253 86616536 91657947 87688452 77148114 63911407 51502755
6292E1502755j0066363p188075n149857m437715l329963k723570k471965j896775
$$ 51502755 41436392 34248317 29098460 24660745 21330782 18607212 16135247 14238472
6284A4238472j247129j100097p10198m20342n87102o11810n27150j63264l95784
$$ 14238472 12991343 11891246 11181048 10760706 10173604 9561794 9034644 8871380 8475596
6275H475596j29594k93136k72657J8017L65140j10726J14599M80121j75546j33783
$$ 8475596 8346002 8052866 7780209 7798226 8163366 8052640 8167239 8647360 8471814 8338031
6265H338031K23293R3339L19493J89763N08798J39636O64870O21567O12983O39942
$$ 8338031 8561324 8654663 8974156 9163919 9672717 9812353 10477223 11098790 11711773 12351715
6255A2351715Q33307J054590J372202K085084J889659K330833K760157L175756
$$ 12351715 13185022 14239612 15611814 17696898 19586557 21917390 24677547 27853303
6247B7853303M694824P852645J3155306K0619532K8338090K9980507K2808583
$$ 27853303 32548127 40400772 53556078 74175610 102513700 132494207 155302790
6240A55302790Q243517p616203j8522382k1238149j8296471j4020053r776102
$$ 155302790 163546307 155930104 137407722 116169573 97873102 83853049 74076947
6233G4076947n687043j643201L335533J1515507K0652561K6353243K4768154J3958388
$$ 74076947 68389904 66746703 70082236 81597743 102250304 128603547 153371701 167330089
6225A67330089k127409j6248146k3392943k2985804j9444226j4811315j1478270
$$ 167330089 165202680 148954534 125561591 102575787 83131561 68320246 56841976
6218E6841976q888854o767741o006907n180165m335683k910629k365113j712123
$$ 56841976 47953122 41185381 35178474 29998309 25662626 22751997 20386884 18674761
6210A8674761j520344j342712j254078q32971m96606p03582k24484p51656o52115
$$ 18674761 17154417 15811705 14557627 13724656 13228050 12524468 12299984 11548328 10896213
6201A0896213o17688o03739m20565q5782j04418k02172l99654k95589j49114k20499
$$ 10896213 10278525 9674786 9254221 9168439 9064021 8861849 8462195 8166606 8017492 7796993
6191G796993m29048l02010k29227l06329j52671j35595k73061j38257j06370m52435
$$ 7796993 7367945 7065935 6836708 6530379 6377708 6242113 5969052 5830795 5724425 5271990
6181E271990j66776K45503P889l15854n2270o3048m4096l18824j28279m8429j25454
$$ 5271990 5105214 5350717 5358606 5042752 4990482 4927434 4883338 4564514 4436235 4387806 4262352
6170D262352n0839j03824J33890Q0282P1830j48892p1645l22202o3306j02176
$$ 4262352 4211513 4107689 4241579 4321861 4393691 4244799 4173154 3850952 3787646 3685470
6160C685470k3754j28904J23276j36442J17813J92023Q3035p5813j66663L2521
$$ 3685470 3661716 3532812 3656088 3519646 3637459 3829482 3912517 3836704 3670041 3702562
6150C702562k11284r9016K36573J98489k8450K28404p1904j95366N6140o5872
$$ 3702562 3491278 3392262 3628835 3827324 3798874 4027278 3955374 3760008 3816148 3750276
6140C750276k92411L22630R7117j87808P0263J820N0924j30522k14690M6402R8422
$$ 3750276 3457865 3780495 3877612 3689804 3760067 3761887 3812811 3682289 3467599 3514001 3612423
6129C612423K06598L65312M2140j82519L15515M32020j8053J51774M7701l4970
$$ 3612423 3819021 4184333 4226473 4043954 4359469 4791489 4773436 4925210 4972911 4937941
6119D937941k79j5224L33936K79102J95140J21024K91830L96155M6139M99599
$$ 4937941 4937662 4922438 5256374 5535476 5730616 5851640 6143470 6539625 6585764 7085363
6109G085363K70552K48818L95826O76189N94735P80592P94432J232336J574131
$$ 7085363 7355915 7604733 8000559 8676748 9271483 10052075 10846507 12078843 13652974
6100A3652974J238384J927463K236997K762680L135773M479814P237398J1865145
$$ 13652974 14891358 16818821 19055818 21818498 24954271 29434085 36671483 48536628
6092D8536628J9220632K7328450L0342194K4289691R360883q245293k0054297
$$ 48536628 67757260 95085710 125427904 149717595 159078478 150833185 130778888
6085A30778888k2754518j9966613j5506864j1763273q422808o185423m800430
$$ 130778888 108024370 88057757 72550893 60787620 52364812 46179389 41378959
6078D1378959l281196j946648n67298N85002R99419K831973N691674J0619366
$$ 41378959 38097763 36151115 35583817 36168819 37168238 40000211 45691885 56311251
6070E6311251J9012166K7392569L1259101K5855640R464054r228355k1732181
$$ 56311251 75323417 102715986 133975087 159830727 169294781 160066426 138334245
6063A38334245k5069077k2132284j7351510j3183049j0083568p831841o541802
$$ 138334245 113265168 91132884 73781374 60598325 50514757 42682916 36141114
6056C6141114n178141m210301l064760k495494j704878j565005j149130r24293
$$ 36141114 30962973 26752672 23687912 21192418 19487540 17922535 16773405 15849112
6048A5849112q39546p40636n87684l74934k07231p03717n60197l18157l46690
$$ 15849112 15009566 14268930 13681246 13306312 13099081 12395364 11835167 11517010 11170320
6039A1170320N14j94154k77297P9086l549m9443N00460J56047M95217L95280N82391
$$ 11170320 11170834 10976680 10699383 10778469 10774920 10725477 11225937 11381984 11877201 12272481 12854872
6028A2854872O00234J034905J055223J093245J772000K909063M594293Q437885
$$ 12854872 13455106 14490011 15545234 16638479 18410479 21319542 25913835 34351720
6020C4351720J3454440J6525446J5036131P711255j513772r549177j2580285j1358462
$$ 34351720 47806160 64331606 79367737 87078992 85565220 76016043 63435758 52077296
6012E2077296q915658o674542n100953l922528k520010k017400j349971q30946
$$ 52077296 43161638 36487096 31386143 27463615 24943605 22926205 21576234 20745288
6004B0745288N1485N92818J073767K126355M765553Q932329J3624965J7175380
$$ 20745288 20796773 21389591 22463358 24589713 29355266 38287595 51912560 69087940
5996F9087940J5814568Q416392k206042j0168640j3777774j2793587j0264044
$$ 69087940 84902508 93318900 91112858 80944218 67166444 54372857 44108813
5989D4108813p686315n712088m704632l650686l234894k573852j781428j568485
$$ 44108813 36422498 30710410 26005778 22355092 19120198 16546346 14764918 13196433
5981A3196433j303829r33098n69490o17106k92265p42591m44866J32803m67413
$$ 13196433 11892604 10959506 10390016 9772910 9480645 8738054 8293188 8425991 7958578
5972G958578k70474l63874m87466q4515Q1708k9322m55881q6614j81483l43764
$$ 7958578 7688104 7324230 6836764 6752249 6833957 6804635 6348754 6262140 6080657 5736893
5962E736893l27006k71565o7417k27569p5048k80016k64380k08173j5144o8962
$$ 5736893 5409887 5138322 5070905 4843336 4768288 4488272 4223892 4015719 4000575 3931613
5952C931613k06317r8371K34001K2880j40488j04465k10931Q9589j70157J74411
$$ 3931613 3725296 3626925 3860926 3883806 3743318 3638853 3427922 3517511 3347354 3521765
5942C521765k69634j1732J3311l91694j63051J87917r2932j28468K90565q245
$$ 3521765 3252131 3240399 3253710 2862016 2698965 2886882 2793950 2665482 2956047 2947802
5932B947802j3931K8354M05145J70627j02114p7678m2776l21384L0511K6372k76323
$$ 2947802 2933871 2962225 3367370 3537997 3435883 3358205 3315429 2994045 3024556 3050928 2774605
5921B774605J52578j09449o5032L9217m5065K32467j37123p8730q9887J4479r7694
$$ 2774605 2927183 2817734 2752702 2791919 2746854 2979321 2842198 2763468 2673581 2688060 2590366
5910B590366k14546l88279o1804p0477r8784r8570n307k28422J75735j09892K91661
$$ 2590366 2375820 1987541 1925737 1855260 1756476 1657906 1652599 1424177 1599912 1490020 1781681
5899A781681K1824k59897k27304j27533J09603j42489j60055j5357K62114l48333
$$ 1781681 1803505 1543608 1316304 1188771 1298374 1155885 995830 980473 1242587 894254
5889H94254J11516r4711r026j26425q0088J62928k92621J2522R8135j61033J24627
$$ 894254 1005770 911059 902033 775608 695520 858448 565827 578349 676484 515451 640078
5878F40078n3680j81287q2908P353J88782n7235j74929J7275M28083Q6807j51090
$$ 640078 586398 405111 322203 329556 518338 461103 286174 303449 731532 818339 667249
5867F67249j48001J51767j97736j47628M4543L47123J49327j10140j86556l83192
$$ 667249 519248 671015 473279 325651 370194 717317 866644 756504 569948 186756
5857A86756R300Q771L34521j02292l76J24275m4403j34935J05738J60046J93054
$$ 186756 196056 204827 539348 437056 436680 560955 516552 381617 487355 647401 840455
5846H40455j00172l12555k0778J43430l29446p6799J24743L37222N6414k37203
$$ 840455 740283 427728 406950 550380 220934 144135 268878 606100 662514 425311
5836D25311m1312j04333j12227J41477J01153N3296K5017l9743j64198K5170J6518
$$ 425311 383999 279666 167439 308916 410069 463365 488382 448639 284441 309611 326129
5825C26129J9188l43590j4318M5024k5536M49357k70832j78109R5626m1055K4997
$$ 326129 345317 1727 -12591 32433 6897 456254 185422 7313 102939 61884 86881
5814H6881j25921j76851K6272R8128K55390j3540O4417j03941j40855O6436p9661
$$ 86881 -39040 -215891 -189619 -91491 163899 150359 214776 110835 -30020 36416 -43245
5803d3245Q7970J18397Q4484J20776J97360K86832q4329M8666O4967j47890k41839
$$ -43245 44725 163122 247606 368382 565742 852574 768245 816911 881878 733988 492149
5792D92149J0184N5159j57168l67154K47032K25417j80965k7519J74707J53751
$$ 492149 502333 557492 400324 33170 280202 505619 324654 297135 471842 625593
5782F25593k61403m9192p9641L51064m7915L48511O25733l08652l9057O3991l00412
$$ 625593 364190 314998 235357 586421 538506 887017 1512750 1204098 1165041 1229032 928620
5771I28620k49990J5384j64461m5898k69978L5221P3934j3214l5388l36294Q276
$$ 928620 678630 694014 529553 483655 213677 248898 322832 309618 274230 -62064 -53788
5760e3788K10512K64771j97795j7999P9067J04071K79419n6753l80432Q1543j06272
$$ -53788 156724 421495 223700 205701 284768 388839 668258 611505 231073 312616 206344
5749B06344j86479N735J76918o4364K986j2942p7986J2408O9436l04065q9872
$$ 206344 19865 25600 202518 138154 141140 128198 50212 62620 132056 -172009 -261881
5738b61881k04308p5827O3952r4087J37606k8825k30264N2162K1898R3709N5595
$$ -261881 -466189 -542016 -478064 -572151 -434545 -463370 -693634 -641472 -619574 -525865 -470270
5727d70270j08720J68754j8364N6856j23558J35916k34950K31738K85287R1879
$$ -470270 -578990 -410236 -428600 -371744 -495302 -359386 -594336 -362598 -77311 14568
5717A4568m7927m1953J11303K6670k27349o5807j3581l89378j6020J73720M6456
$$ 14568 -33359 -75312 35991 62661 -164688 -230495 -244076 -633454 -649474 -475754 -429298
5706d29298j21795K41313K07585j60779n689K89798l10682j6032K59134j00209
$$ -429298 -551093 -309780 -102195 -262974 -268663 21135 -289547 -305579 -46445 -146654
5696a46654k29963K4682L84981j29129p963l6608j6375r9436m9436j33182N2094
$$ -146654 -376617 -351935 33046 -96083 -104046 -140654 -157029 -256465 -305901 -439083 -386989
5685c86989K42555K55665j28714o5421J29042j48867k1131m0219L4537J26519
$$ -386989 -144434 111231 -17483 -82904 46138 -102729 -123860 -164079 -129542 -3023
5675c023J61251j20640k75313J83178j04302j15716n4652r0729J8266K82619J63038
$$ -3023 158228 37588 -237725 -54547 -158849 -274565 -329217 -419946 -401680 -119061 43977
5664D3977L3512j75926P4374K3555n5139J0213K76653L2921n5374o4197J38452
$$ 43977 77489 -98437 -24063 -508 -55647 -45434 231219 264140 208766 144569 283021
5653B83021j86694J39442p2265N8711K63785k50066j94872L4467j3878k7586K8311
$$ 283021 96327 235769 163504 222215 486000 235934 41062 75529 61651 34065 62376
5642F2376J01027j91334j42591K10228J21691m8191m38397O2064K31876N8132
$$ 62376 163403 -27931 -170522 39706 161397 113206 -325191 -263127 -31251 26881
5632B6881q7139K0511J13071J88836j41954p653k4598q4194k72809N2306O7211
$$ 26881 -60258 -39747 73324 262160 120206 112553 87955 3761 -269048 -216742 -149531
5621a49531M6281J9001R5897k89149O9779J01984q795j14035r7778k1684J40206
$$ -149531 -103250 -84249 11648 -277501 -207722 -105738 -114533 -228568 -326346 -348030 -207824
5610b07824J5881K62753l9038o9749p1676l0095J99621o5063K4345l39315o3398
$$ -207824 -191943 70810 31772 -37977 -109653 -139748 59873 -5190 19155 -320160 -383558
5599c83558J50475q5565r9827r3090K02632K26459R4347m05824j02294K42550
$$ -383558 -233083 -318648 -418475 -511565 -308933 -82474 11873 -393951 -496245 -253695
5589b53695R786o2865j33963R8337k95548M3321K07715m8382j006J12262J07638
$$ -253695 -243909 -306774 -440737 -342400 -637948 -594627 -386912 -435294 -436300 -324038 -216400
5578b16400M1483j5066k73910J49723j42635k3628j28965p9018P7573J37206J15956
$$ -216400 -174917 -189983 -463893 -314170 -456805 -480433 -609398 -688416 -610843 -473637 -357681
5567c57681n0784M7240l29555K32295J52263k25033n0292n1931q2167j72353o767
$$ -357681 -408465 -361225 -690780 -458485 -306222 -531255 -581547 -633478 -715645 -887998 -894765
5556h94765K30688K2878J2327L13985r7597o5390N1326j91384k8977j46066K0680
$$ -894765 -664077 -641199 -628872 -314887 -412484 -477874 -426548 -617932 -646909 -792975 -772295
5545g72295J07850r7142k23543O3847n3388N5812J86673p3053k7291m2945l8074
$$ -772295 -664445 -761587 -985130 -921283 -974671 -918859 -732186 -805239 -832530 -875475 -913549
5534i13549N263N6689P7294J45032J36451M9720j72908J62821m3084j11165n2550
$$ -913549 -908286 -851597 -774303 -629271 -492820 -443100 -616008 -453187 -496271 -607436 -659986
5523f59986J86777J66546j85205l01964j06384p514L2979K24871k84530m7098
$$ -659986 -473209 -306663 -491868 -793832 -900216 -907730 -874751 -649880 -934410 -981508
5513i81508O0139J81512K84906k3578p1478k95258J39603k36917M1980J65084
$$ -981508 -921369 -739857 -454951 -478529 -550007 -845265 -705662 -942579 -900599 -735515
5503g35515Q3992j50848K36564O2532k36576J97983j44811J86282k45265J0834
$$ -735515 -651523 -802371 -565807 -503275 -739851 -541868 -686679 -500397 -745662 -734828
5493g34828R4417K7665l41902L30051K97279l81211l2056L89959k17337J06315
$$ -734828 -640411 -612746 -954648 -624597 -327318 -708529 -740585 -350626 -567963 -461648
5483d61648J24770j14935k7224K46855m1359r4501l97494k00349K19119l2958
$$ -461648 -336878 -451813 -479037 -232182 -273541 -368042 -765536 -965885 -746766 -779724
5473g79724k11998L05799K5369j96430O0733R5722L8822j44430J87609m344j29596
$$ -779724 -991722 -685923 -660554 -856984 -796251 -700529 -661707 -806137 -618528 -622872 -752468
5462g52468Q740P5747M9445k4225k49887M5589M3515j3938Q2308K80194M0313
$$ -752468 -743728 -667981 -618536 -642761 -892648 -847059 -803544 -817482 -735174 -454980 -414667
5451d14667J42792K68307L31839M7787j99969j47351j97068j31866Q5111k5634
$$ -414667 -271875 -3568 328271 376058 176089 28738 -168330 -300196 -215085 -240719
5441b40719l16479j15443l9295J84052j04593J5143J57684r1883k41332k067J32319
$$ -240719 -557198 -672641 -711936 -527884 -632477 -617334 -459650 -551533 -792865 -794932 -662613
5430f62613j84702j2040L49716Q5695j36976j35678K60240Q4720p2821m15951
$$ -662613 -847315 -859355 -509639 -423944 -560920 -696598 -436358 -351638 -424459 -840410
5420h40410L1950K73649l17151M52654J03975n3034j30504p9389N5660j9597k47628
$$ -840410 -808460 -534811 -851962 -399308 -295333 -348367 -478871 -558260 -502600 -522197 -769825
5409g69825K29399K16598m3517q3669j71198K66483L59699M6884P2276l13596
$$ -769825 -540426 -323828 -367345 -451014 -622212 -355729 3970 50854 123130 -190466
5399a90466m53588K15239K50916j56789q1737J17841j0517L50714J58146k43088
$$ -190466 -644054 -428815 -177899 -334688 -416425 -298584 -309101 41613 199759 -43329
5389d3329O4576M48169j97255m6858R9077J1418j30270J2188R1834j60536J54860
$$ -43329 21247 469416 272161 225303 324380 335798 205528 217716 309550 149014 303874
5378C03874K712q914L2936J36250L47070k45600j02298M0788j75776r7348L41304
$$ 303874 306586 297672 330608 466858 813928 568328 466030 506818 331042 233694 574998
5367E74998m0669l30778j45815J66298J24216r6708q2592Q609J78625j37353K54762
$$ 574998 534329 203551 57736 224034 348250 251542 168950 177559 356184 218831 473593
5356D73593K8740j11299r6645J81299q3004J10495m55783J03805K79710J69547
$$ 473593 502333 391034 294389 475688 392684 503179 47396 151201 430911 600458
5346F00458k00128k40341k0108Q8369M4354J50067K43540K99387j77850k57123
$$ 600458 400330 159989 139881 228250 272604 422671 666211 965598 787748 530625
5336E30625K31882j40809k74921Q58K2387k3964l00412o8347K60166J30722J54646
$$ 530625 762507 621698 346777 347635 370022 346058 45646 -22701 237465 368187 522833
5325E22833J94741P0194l9768q6763K79512J650Q4142P7227j4403L74646n4947
$$ 522833 717574 787768 748000 661237 940749 942399 1026541 1103768 1089365 1464011 1409064
5314A409064j38098P6327J99693N2503J73633r6705J24539L34404j4496M4959
$$ 1409064 1270966 1347293 1546986 1599489 1773122 1676417 1800956 2135360 2120864 2165823
5304B165823J12957K75871J40091J10648J8171N1070M06201N22896J86013K95782
$$ 2165823 2278780 2554651 2694742 2805390 2823561 2874631 3280832 3803728 3989741 4285523
5294D285523J50217K87706K64266L45955M83107O24702N42157N71780J083464
$$ 4285523 4435740 4723446 4987712 5333667 5816774 6441476 6983633 7555413 8638877
5285H638877J284598K293899M407425O099589P006906N698586Q00947k707621
$$ 8638877 9923475 12217374 16624799 22724388 29731294 35429880 36230827 33523206
5277C3523206l596021l059987k291399p32975K61104J951945M773852P706388
$$ 33523206 29927185 26867198 24575799 23842824 24103928 26055873 30829725 38536113
5269C8536113J0287431J0484081P318768N458106L024015J312374J160800Q57683
$$ 38536113 48823544 59307625 66626393 72084499 75108514 76420888 77581688 78439371
5261G8439371j384096j831911j7755J016331j008159r96053J859583M198113L742947
$$ 78439371 77055275 75223364 75205609 76221940 75213781 74217728 76077311 80275424 84018371
5252H4018371K840247M005327N084579O074473P295468N296099K31044m579111
$$ 84018371 86858618 90863945 95948524 102022997 109318465 114614564 114845608 110266497
5244A10266497n877379n141700l527525j351283j571089m580783m455171j388135
$$ 110266497 104389118 99247418 95719893 94368610 92797521 88216738 83761567 82373432
5236H2373432O5059j473710k828941j008243R56829J173159R23198K647658J906528
$$ 82373432 82438491 80964781 78135840 77127597 78084426 79257585 80180783 82828441 84734969
5227H4734969o77481l059627o680654r811508j0161648r175836o838476m603981
$$ 84734969 84057488 80997861 74317207 64505699 54344051 45168215 38329739 33725758
5219C3725758k817346j828248P60429L293566N015276M456849K28785m370318
$$ 33725758 30908412 29080164 29840593 33134159 38149435 42606284 42835069 38464751
5211C8464751n600852n382812m652322l155157k375921j987219j872376j402965
$$ 38464751 32863899 27481087 22828765 19673608 17297687 15310468 13438092 12035127
5203A2035127j042758o94887o28985p29625m70946l86090l25707m12635k92975
$$ 12035127 10992369 10297482 9668497 8938872 8467926 8081836 7756129 7343494 7050519
5194G050519l19223m08478k90301k04076l8587k588l68087j77635k22698k56070
$$ 7050519 6731296 6322818 6032517 5828441 5789854 5787266 5419179 5241544 5018846 4762776
5184D762776j38319j04116K766l80049l67445j27558j17578N1250j6151l17453
$$ 4762776 4624457 4520341 4523107 4143058 3775613 3648055 3530477 3581727 3565576 3248123
5174C248123k69336r4309k76056j27508J57086p506m4052J07903j65613k18213
$$ 3248123 2978787 2884478 2608422 2480914 2638000 2630494 2586442 2694345 2528732 2310519
5164B310519K74291K97687j35438j93796m72484J26959m54705M8895L0763l92277
$$ 2310519 2584810 2882497 2747059 2553263 2080779 2207738 1753033 1801928 1832691 1440414
5154A440414K18265k01044k67637J1296K21852k6344k91374P4096M6237j76256
$$ 1440414 1658679 1457635 1189998 1201294 1423146 1396802 1105428 1179524 1225761 1049505
5144A049505q6674J02458K0200J56148J43449p7578k57342M3840M4025j34513
$$ 1049505 962831 1065289 1085489 1241637 1385086 1307508 1050166 1094006 1138031 1003518
5134A003518k38912J5683P6878O1258P4968p8732l6902J78154J51298j6276N6685
$$ 1003518 764606 780289 857167 918425 993393 914661 877759 1055913 1207211 1190935 1247620
5123A247620K60876j48909j97392L7900K44941J24074k67974k14617J6483K85628
$$ 1247620 1508496 1359587 1162195 1200095 1445036 1569110 1301136 1086519 1103002 1388630
5113A388630M1743O970l98548J29576N0623o9602K73896L57437K2215k39551l119
$$ 1388630 1430373 1437343 1038795 1168371 1218994 1149392 1423288 1780725 1802940 1563389 1560270
5102A560270N0722P3978M3445r8948J5678J27360j9433K82263m2494J8389J04576
$$ 1560270 1610992 1684970 1728415 1629467 1645145 1772505 1753072 2035335 1992841 2011230 2115806
5091B115806j39355k5033l12412j28317K63821k9618l60001J64072P3306J87657
$$ 2115806 1976451 1951418 1639006 1510689 1774510 1744892 1384891 1548963 1622269 1809926
5081A809926K06368j39606j89185O8238J13903J22328M2189n3354K29207K29123
$$ 1809926 2016294 1876688 1687503 1755741 1869644 1991972 2034161 1980807 2210014 2439137
5071B439137K98221L38537l30041n5864j67008q7534j57079j71394J89941L0010
$$ 2439137 2737358 3075895 2745854 2689990 2522982 2435448 2278369 2106975 2296916 2326926
5061B326926k05478K42637Q7141J28675j45679j365L14022K26675K34320J29777
$$ 2326926 2121448 2364085 2451226 2579901 2434222 2432857 2746879 2973554 3207874 3337651
5051C337651j0817k02587j90338k00223k19704k27123m00010L9703j17280Q4857
$$ 3337651 3326834 3124247 2933909 2733686 2513982 2286859 1886849 1926552 1809272 1894129
5041A894129K04590l01284p6332J67366k23009L06273K39559j35603k28285q8683
$$ 1894129 2098719 1797435 1721103 1888469 1665460 1971733 2211292 2075689 1847404 1758721
5031A758721P3098O4589n7332k29132O2391M9612P4123k32462J54213N0241p9293
$$ 1758721 1831819 1896408 1839076 1609944 1672335 1721947 1796070 1563608 1717821 1768062 1688769
5020A688769j08871J20068j52064j674r6361l60513q0680O6986J08718q2649k38291
$$ 1688769 1579898 1699966 1547902 1546228 1449867 1089354 1008674 1075660 1184378 1101729 863438
5009H63438j70035L08787K35569j71796q1574k29062q3988J13952Q0108J00728
$$ 863438 693403 1002190 1237759 1065963 984389 755327 671339 785291 865399 966127
4999I66127K13189J89521j07267j21867L31796j84810L3743L13798j41915R470
$$ 966127 1179316 1368837 1261570 1139703 1471499 1286689 1320432 1634230 1492315 1501785
4989A501785o5802l1169J96923l7161L25152K39623j21758J75336K91021R2786
$$ 1501785 1435983 1404814 1601737 1564576 1889728 2129351 2007593 2182929 2473950 2566736
4979B566736o8333m6205J09046J44020o0566L62380J26369J13590J278m6093Q0038
$$ 2566736 2498403 2452198 2561244 2705264 2644698 3007078 3133447 3247037 3248315 3202222 3282260
4968C282260L21379J28682l35303k7641p1333L04688N732M3636J52898j37764
$$ 3282260 3603639 3732321 3397018 3369377 3298044 3602732 3608464 3652100 3804998 3667234
4958C667234J07401L20289j69264K41639N49328R2862m5550J74139J0445q5971
$$ 3667234 3774635 4094924 3925660 4167299 4716627 4809489 4763939 4938078 4948523 4862552
4948D862552o5909o3803N063p3620K4647l9553K04298L34841M05611K43942r0285
$$ 4862552 4796643 4732840 4737903 4664283 4688930 4649377 4853675 5188516 5594127 5838069 5747784
4937E747784r1829n25r2124J22945k47137K45449O12997N7018M91913K55445N73883
$$ 5747784 5655955 5655430 5563306 5686251 5439114 5684563 6297560 6354578 6846491 7101936 7675819
4926G675819M55447L03547K20445N44414K19214O9489K69782L54250L24210R2532
$$ 7675819 8131266 8434813 8655258 9199672 9418886 9488375 9758157 10112407 10436617 10529149
4916A0529149M0600L51307K91514p3548J13902j917J64894M90961K03238K07120
$$ 10529149 10569749 10921056 11212570 11139022 11252924 11251007 11415901 11906862 12110100 12317220
4906A2317220N62758P44968O07174O46463R66149Q91973Q82000N13889O46179
$$ 12317220 12879978 13624946 14232120 14878583 15844732 16736705 17618705 18132594 18778773
4897A8778773N86110L57097R3727N33729L25750M25998Q90777Q96434R10948R71347
$$ 18778773 19364883 19721980 19815707 20349436 20675186 21101184 21991961 22888395 23799343 24770690
4887B4770690J530959J807108K438405L396777N604821J0422062J7657528K7018768
$$ 24770690 26301649 28108757 30547162 33943939 39548760 49970822 67628350 94647118
4879I4647118L1711279K3458121L685506j4600571k1081688j9409242j4624099
$$ 94647118 126358397 149816518 153502024 138901453 117819765 98410523 83786424
4872H3786424j0337468p469919m943311l338371j591331N84965K455855N351844
$$ 83786424 73448956 65979037 61035726 57697355 56106024 56690989 59146844 64498688
4864F4498688J0609157J8676340K8491398L4067857L1443067K3141151J8141073
$$ 64498688 75107845 93784185 122275583 156343440 187786507 210927658 229068731
4857B29068731J4811996K847840j5935627k9291272l0765955k5455593j8469960
$$ 229068731 243880727 246728567 230792940 201501668 170735713 145280120 126810160
4850A26810160j2514198p638440l830672q62994J410691L296548O691027J1241099
$$ 126810160 114295962 106657522 102826850 101963856 103374547 106671095 113362122 124603221
4842A24603221J9578705L0409368M0416355M0735200K4534586N17804j5446787
$$ 124603221 144181926 174591294 215007649 255742849 280277435 280795239 265348452
4835B65348452k0041155j7620424j2994588r676634o767548n670544m820043m156526
$$ 265348452 245307297 227686873 214692285 205015651 198248103 192577559 187757516 183600990
4827A83600990l345918j847077j170576m44686J267020L028357N837003R244638
$$ 183600990 180255072 178407995 177237419 176792733 178059753 181088110 186925113 196169751
4819A96169751J1917173J3537038J3417688J2371836J1419943J2148588J3891847
$$ 196169751 208086924 221623962 235041650 247413486 258833429 270982017 284873864
4812B84873864J6818775J7878469J6310424J2704024Q242377N787684M460055
$$ 284873864 301692639 319571108 335881532 348585556 356827933 362615617 367075672
4805C67075672L732037K364468J09885k441990m768017o319122o219328n243296
$$ 367075672 370807709 373172177 373282062 370840072 366072055 359752933 353533605 348290309
4797C48290309l559500j617018l4365J562458K508766L832458M817503M826692
$$ 348290309 344730809 343113791 343079426 344641884 347150650 350983108 355800611 360627303
4789C60627303L424099Q45642k687284m939705n638581n191877m417965l702083
$$ 360627303 364051402 364897044 362209760 357270055 351631474 346439597 342021632 338319549
4781C38319549l309026j089864K579489O865842J0418362J1612650J1634535R377414
$$ 338319549 335010523 333920659 336500148 343365990 353784352 365397002 377031537 386408951
4773C86408951O623104L719430L325785N308945P838963Q230709N290495o64608
$$ 386408951 393032055 396751485 400077270 405386215 413225178 421455887 426746382 426081774
4765D26081774p574778j2873482j6073248j7955130j8058673j6962252j5015020
$$ 426081774 418506996 405633514 389560266 371605136 353546463 336584211 321569191
4758C21569191j2598780j0605686j0724565j1615304j1318387j0287733p667117
$$ 321569191 308970411 298364725 287640160 276024856 264706469 254418736 246751619
4751B46751619m326951j683543M19562R22311k17911k074605k465562j361713
$$ 246751619 242424668 240741125 241160687 242082998 241865087 239790482 237324920 235963207
4743B35963207N14394K571869K199850m43650m164456r079405j1433992j2347167
$$ 235963207 236477601 239049470 241249320 240805670 236641214 227561809 216127817 203780650
4735B03780650j2368953j1799048j1222733j1071202j0779518j0185155j0118170
$$ 203780650 191411697 179612649 168389916 157318714 146539196 136354041 126235871
4728A26235871r917314r959395r197516p992353p176280n904586m691549l915707
$$ 126235871 116318557 106359162 97161646 89169293 81993013 76088427 71396878 67481171
4720F7481171l789237l353196l323304k860063k476894k334911j846097j148370
$$ 67481171 63691934 60338738 57015434 54155371 51678477 49343566 47497469 46349099
4712D6349099j257137j633361j340975j392370j094369j437611j101017o20804
$$ 46349099 45091962 43458601 42117626 40725256 39630887 38193276 37092259 36471455
4704C6471455p44800j037999p56924m89410l6742o62045p30468o36309n41073
$$ 36471455 35726655 34688656 33931732 33442322 33405580 32743535 32013067 31376758 30835685
4695C0835685m02752o09019l72748p04822q55933l21344j020140m41030m79071
$$ 30835685 30432933 29823914 29451166 28746344 27890411 27569067 26548927 26107897 25628826
4686B5628826k83778j94107m82179j83141m03730p3181m84956m66057m14624n42723
$$ 25628826 25345048 25150941 24668762 24485621 24081891 24008710 23523754 23057697 22643073 22100350
4676B2100350k34027l19281k76242o02019k57268k14771r2304k9537L6724k33922
$$ 22100350 21866323 21547042 21270800 20668781 20411513 20196742 20104438 20074901 20111625 19877703
4666A9877703m58538m63163m03523m39110k16904m62752n67511l63552j32736
$$ 19877703 19419165 18956002 18552479 18113369 17896465 17433713 16866202 16502650 16369914
4657A6369914K94981l29398j02610R8684k26602l46161r6048L0964l07831l81454
$$ 16369914 16664895 16335497 16232887 16331571 16104969 15758808 15662760 15693724 15385893 15004439
4647A5004439k4670j49354n9753j57928j0886m33622l55243k09184l643p1602
$$ 15004439 14979769 14830415 14770662 14612734 14601848 14168226 13812983 13603799 13600156 13528554
4637A3528554K43175m3797J67999J15733m9889j61478j29158k02297m07145j11670
$$ 13528554 13771729 13727932 13895931 14011664 13961775 13800297 13671139 13468842 13061697 12950027
4627A2950027m63583k42269K19424j5896N8659O1158M5867j24479l4730K79152
$$ 12950027 12486444 12244175 12463599 12447703 12506362 12567520 12613387 12488908 12454178 12733330
4617A2733330m7429J21397p8438p0628J45773K88518M98026K49167l05368j16969
$$ 12733330 12685901 12807298 12728860 12658232 12804005 13092523 13590549 13839716 13534348 13417379
4607A3417379O5545N9851J83010M37351K08961L17675K33015K60211k7751l8495
$$ 13417379 13482924 13542775 13725785 14163136 14372097 14689772 14922787 15182998 15155247 15116752
4597A5116752L12555J46703K09794M59939N27495N83116O82605P43273J159985
$$ 15116752 15429307 15576010 15785804 16245743 16773238 17356354 18038959 18782232 19942217
4588A9942217J317431J514168J311650K074142K898775L235019M938847Q656492
$$ 19942217 21259648 22773816 24085466 26159608 29058383 32293402 37232249 45888741
4580D5888741J5418136K4047541L1074753K8907841J3902874n527824j8324513
$$ 45888741 61306877 85354418 116429171 145337012 159239886 153712062 135387549
4573A35387549k1167685j7341610j1516986n859405Q14076R612261K0112588K6673535
$$ 135387549 114219864 96878254 85361268 79501863 80315939 89928200 110040788 136714323
4565A36714323K3358970Q925024r610150k0461152k1191676j5069414o082731
$$ 136714323 160073293 168998317 159388167 138927015 117735339 102665925 96583194
4558I6583194M419426J5231972K0906020J6582853K936201j2295379k0451389
$$ 96583194 101002620 116234592 137140612 153723465 156659666 144364287 123912898
4551A23912898k0122688j5487828j0337244m788540J462912R435927J7918541
$$ 123912898 103790210 88302382 77965138 73176598 74639510 84075437 101993978
4544A01993978K1932379J6009391J120198j4160024k0794196j9695308j6139561
$$ 101993978 123926357 139935748 141055946 126895922 106101726 86406418 70266857
4537G0266857j2032395q795999o865947n429659m410032l185150k506179j836694
$$ 70266857 58234462 49438463 42572516 37142857 32732825 29547675 27041496 25204802
4529B5204802j178304j078222o89427n62715l07006n60961l83180k87241m01929
$$ 25204802 24026498 22948276 22258849 21696134 21389128 20828167 20444987 20157746 19755817
4520A9755817l82996n46573p23304m02111n31727n17938n31253l57955n32722
$$ 19755817 19372821 18826248 18102944 17700833 17169106 16651168 16119915 15761960 15229238
4511A5229238o92192l52302l77541o22020n80318l65104l23733k35235m6301l00103
$$ 15229238 14537046 14184744 13807203 13185183 12604865 12239761 11916028 11680793 11634492 11334389
4501A1334389m34562j82351k36009k69233k91369m19152k77720O1230o8046j52075
$$ 11334389 10899827 10717476 10481467 10212234 9920865 9501713 9223993 9285223 9217177 9065102
4491I065102J01663j50862L6531j26378l32262K01327j76319K75942l3204k28684
$$ 9065102 9166765 9015903 9052434 8926056 8593794 8795121 8618802 8894744 8861540 8632856
4481H632856l02414J75356J42093j43412O6406O2122j76781l09105O0506j34148
$$ 8632856 8330442 8505798 8647891 8504479 8570885 8633007 8456226 8147121 8207627 8073479
4471H073479o1133l98718j68821j92332j31093R6445O9061r1798m02561j55825
$$ 8073479 8012346 7613628 7444807 7252475 7121382 7217827 7286888 7195090 6792529 6636704
4461F636704K35454p4343M4996J26198J27977J93350m1291j08401j60839k00093
$$ 6636704 6872158 6797815 6842811 6969009 7096986 7290336 7249045 7140644 6979805 6779712
4451F779712k62667J31032l53443j64900N5274k30710k40504j67442p3281n8103
$$ 6779712 6517045 6648077 6294634 6129734 6185008 5954298 5713794 5546352 5473071 5414968
4441E414968R6730j2698p5508O1953L6638q8345j66983j83377q9602k9759k05766
$$ 5414968 5511698 5499000 5423492 5485445 5522083 5433738 5266755 5083378 4993776 4964017 4758251
4430D758251k2311J89562l5640k1605m8654J13778J04775k17538j15159J94657
$$ 4758251 4735940 4925502 4889862 4868257 4819603 4933381 5038156 4820618 4705459 4900116
4420D900116L3188J21144k21014k80527P0392L19611K13767P44328O45472O15661
$$ 4900116 4933304 5054448 4833434 4552907 4623299 4942910 5156677 5901005 6546477 7162138
4410G162138M02800m90519n74445m21579o82850O2543N4542o5045l16011j9960
$$ 7162138 7564938 7074419 6499974 6078395 5395545 5458088 5512630 5447585 5131574 5111614
4400E111614L31042o5721M53356k5752k45341o2439k68418m2537J96237o0377
$$ 5111614 5442656 5376935 5830291 5804539 5559198 5496759 5228341 5185804 5382041 5321664
4390E321664P525l08695N7124j9667K01817N2485j9834j29015n1133L35400M27749
$$ 5321664 5329189 5020494 5077618 5057951 5259768 5312253 5292419 5163404 5112271 5447671 5875420
4379E875420J38689j96812M78999j08888p5818M4149J7822K27578j70732k18296
$$ 5875420 6014109 5817297 6296296 6187408 6111590 6155739 6173561 6401139 6230407 6012111
4369F012111J69871k09742J9465P9121K8664o4031l47018J30909R5858N8060k19662
$$ 6012111 6181982 5972240 5991705 6070826 6099490 6035459 5688441 5819350 5915208 5973268 5753606
4358E753606J7293P6016j23502N9574L25309j04840O4991j8910q8206N0727K09929
$$ 5753606 5770899 5846915 5723413 5782987 6108296 6003456 6068447 6049537 5961331 6012058 6221987
4347F221987O029p0590m2204k0803J42268L12905l0153k09839j35049j00014j57523
$$ 6221987 6228016 6157426 6115222 6094419 6236687 6549592 6519439 6309600 6174551 6074537 5917014
4336E917014J15026J59385n0276Q1906J96661P5199l14158J18669L05694k21904
$$ 5917014 6032040 6191425 6141149 6223055 6419716 6494915 6180757 6299426 6605120 6383216
4326F383216k19469J14414J7683N2495K41143J12984k2044J61987K08939K32879
$$ 6383216 6163747 6278161 6295844 6348339 6589482 6702466 6680422 6842409 7051348 7284227
4316G284227l5110k40079j76885l26288j44756J6141j36752J5518J16431N6406
$$ 7284227 7249117 7009038 6832153 6505865 6361109 6377250 6240498 6256016 6372447 6428853
4306F428853L96202N08037r3650k38414J85291k41244j52985k17442j04784K81976
$$ 6428853 6825055 7333092 7239442 7001028 7186319 6945075 6792090 6574648 6469864 6751840
4296F751840n0255k5124J3054p7840M1931j71186l38109j29718k86574L01658
$$ 6751840 6701585 6676461 6689515 6611675 6653606 6482420 6144311 6014593 5728019 6029677
4286F029677l23714j95301J61345j62795j12804L6825p222P1189j83979j70259
$$ 6029677 5705963 5510662 5672007 5509212 5396408 5433233 5426011 5497200 5313221 5142962
4276E142962j4641l92918m73841R3043N8173Q0732n1547l7213l5481n8694p2202
$$ 5142962 5128321 4735403 4261562 4354605 4412778 4493510 4441963 4404750 4369269 4310575 4238373
4265D238373N3942O7556L515P2304j25353r4220j67002K10222M9416j93257o920
$$ 4238373 4292315 4359871 4363386 4435690 4310337 4216117 4049115 4259337 4308753 4115496 4108576
4254D108576K89715p870l47862R996p6969l8702J20102M56729Q7875k68739K51493
$$ 4108576 4398291 4390421 4042559 4052555 3975586 3936884 4056986 4513715 4601590 4332851 4584344
4243D584344L7539L3511k9546J97904K6826J57650p6218j05760J83059P8837j06831
$$ 4584344 4621883 4655394 4625848 4823752 4850578 5008228 4932010 4826250 5009309 5088146 4981315
4232D981315k8846J2888p0989K3232K92826L27249M6376P7980Q4830k73484K4235
$$ 4981315 4952469 4965357 4894368 4917600 5210426 5537675 5584051 5662031 5746861 5473377 5497612
4221E497612L17468o4493k42299M36669J43716j37688K18151K14967j2778k89260
$$ 5497612 5815080 5750587 5508288 5944957 6088673 5950985 6169136 6384103 6371325 6082065
4211F082065k00103J7591L35284L21336J72955K34272K23564k2391O5144o5635
$$ 6082065 5881962 5899553 6234837 6556173 6729128 6963400 7186964 7164573 7229717 7164082
4201G164082k2556K32109K06180J44912J58227j9352R5318J52480M50220L58151
$$ 7164082 7141526 7373635 7579815 7724727 7882954 7863602 7958920 8111400 8561620 8919771
4191H919771L49724m5727K72921K11329K03030K32620M85701O69257M91815O81918
$$ 8919771 9269495 9223768 9496689 9708018 9911048 10143668 10629369 11298626 11790441 12472359
4181A2472359N42966P53393P14352O83458P88022R33775O98898J343056J596097
$$ 12472359 13015325 13768718 14483070 15166528 15954550 16888325 17587223 18930279 20526376
4172B0526376J857225K222175K937608L200022L251443K322926J646676J269602
$$ 20526376 22383601 24605776 27543384 30743406 33994849 36317775 37964451 39234053
4164C9234053L94493K36913p24534r74010j295311p37581O9815N05611J271563
$$ 39234053 39628546 39865459 39140925 38166915 36871604 36134023 36203838 36709449 37981012
4155C7981012K829179M121305N061649N699181N053457K947829J539785J693729
$$ 37981012 40810191 44931496 49993145 55692326 60745783 63693612 65233397 66927126
4147F6927126J721476K013577K182371K481985K725715K414073J602057J041408
$$ 66927126 68648602 70662179 72844550 75326535 78052250 80466323 82068380 83109788
4139H3109788J116226J564629J991744K548491K968185J888344k849j694630k321174
$$ 83109788 84226014 85790643 87782387 90330878 93299063 95187407 95184558 93489928 91168754
4130I1168754j336054J013008M408375Q542309J2568924J4830751J2701779O774963
$$ 91168754 89832700 90845708 95254083 103796392 116365316 131196067 143897846 150672809
4122A50672809R18063k003461k392381q67642Q75762J344999J397066P35417N97299
$$ 150672809 151590872 149587411 147195030 146327388 147203150 148548149 149945215 150680632 151277931
4113A51277931O71295J093905K111940K365546K599686J529991M56026q07438
$$ 151277931 151949226 153043131 155155071 157520617 160120303 161650294 162106320 161298882
4105A61298882k015950k851982l385590k223879N07459M594756R386967J3833769
$$ 161298882 159282932 156430950 153045360 150821481 151328940 155923696 165310663 179144432
4097A79144432J6169758J5846975J1866109O874177L483811L387682N881297P937873
$$ 179144432 195314190 211161165 223027274 229901451 233385262 236772944 242654241 250592114
4089B50592114O241033K153655J10852K060829N399876P752419N244287p08403
$$ 250592114 256833147 258986802 259097654 261158483 266558359 274310778 279555065 278846662
4081B78846662m505155m612921l507208j297740K153434O911025J3067136J7523195
$$ 278846662 274341507 269728586 266221378 264923638 267077072 273988097 287055233 304578428
4073C04578428J8258832J5544154J1011439P177366L316177j680051o297021q485550
$$ 304578428 322837260 338381414 349392853 356570219 359886396 358206345 351909324 343423774
4065C43423774p469320m372247n7683L175008K830219L24923L37184L616490P713034
$$ 343423774 335954454 331582207 331524524 334699532 337529751 337854674 338191858 341808348 349521382
4056C49521382Q168237K591550m931728p840161n398388j919632o76965j707421
$$ 349521382 357689619 360281169 355349441 347509280 342110892 340191260 339514295 337806874
4048C37806874l891442l414786J046003N274275N039134l462771j3413008j9960820
$$ 337806874 333915432 330500646 331546649 336820924 341860058 338397287 324984279 305023459
4040C05023459k2035972k1512849j9042443j4568101r795651m804439j054833
$$ 305023459 282987487 261474638 242432195 227864094 218068443 213264004 212209171
4033B12209171R36513J107323j54029r75837j63399N44612o59607j874604k007055
$$ 212209171 213145684 214253007 214098978 213123141 212959742 213504354 212844747 210970143 208963088
4024B08963088k761389l365101m757759n926382o041046n451977l416245K73118
$$ 208963088 206201699 202836598 198078839 192152457 186111411 180659434 177243189 177516307
4016A77516307J958237J175193k473840p216043j0436012j1023560j0581130q893850
$$ 177516307 179474544 180649737 178175897 170959854 160523842 149500282 138919152 130025302
4008A30025302o816097m063404j657794r52105r72325k217005l105915l427839
$$ 130025302 123209205 119145801 117488007 116535902 115563577 113346572 110240657 106812818
4000A06812818k789637j868116j114769q66386o28073j52235j449859k144736
$$ 106812818 104023181 102155065 101040296 100173910 99545837 99393602 97943743 95799007
3992I5799007k164017k296465k038670j737811j978037k738730m401612n353092
$$ 95799007 93634990 91338525 89299855 87562044 85584007 82845277 78443665 73090573
3984G3090573n141746m779719l624266k477301j627220j194315q33354n10403
$$ 73090573 67948827 63169108 59544842 57067541 55440321 54246006 53412652 52902249
3976E2902249j257210j082131j126865r10001p47778r07089j006401j975904k404893
$$ 52902249 51645039 50562908 49436043 48526042 47778264 46871175 45864774 43888870 41483977
3967D1483977k790169k417429k283851j909631j949470j342490r99288j379312
$$ 41483977 38693808 36276379 33992528 32082897 30133427 28790937 27791649 26412337
3959B6412337j213764m94540p20569j326738q40755p44590o36443o89329l28674
$$ 26412337 25198573 24704033 23983464 22656726 21815971 21071381 20434938 19745609 19416935
3950A9416935k96608l97321o14237k42835j19953o65717j33166j52252o02365
$$ 19416935 19120327 18723006 18108769 17865934 17745981 17080264 16947098 16794846 16192481
3941A6192481m16590k10919o2498j78443n77590J7134j86422n35199l06823l8180
$$ 16192481 15775891 15564972 15502474 15324031 14746441 14763575 14577153 14041954 13735131 13696951
3931A3696951L0411o2722j3710k17060l85981j18383j28129m06933j59328N6881
$$ 13696951 13727362 13664640 13650930 13433870 13047889 12929506 12801377 12394444 12235116 12291997
3921A2291997M5951N9845k02966k31385J2926P949m838k2537j13854o6576l12343
$$ 12291997 12337948 12397793 12194827 11963442 11976368 11984317 11979479 11956942 11843088 11776512 11464169
3910A1464169j41665j32343Q1987J24070k00064J64287n7373Q0271R7251k97676
$$ 11464169 11322504 11190161 11272148 11396218 11196154 11360441 11303068 11383339 11480590 11182914
3900A1182914J21707L25589O3591k61991k15543J93112l8129Q8551N36731k05915
$$ 11182914 11304621 11630210 11693801 11431810 11216267 11409379 11371250 11459801 11996532 11790617
3890A1790617n85929l38528J75208K22835K18711j32871m3738k43214K9529M0488
$$ 11790617 11204688 10866160 11041368 11264203 11482914 11350043 11306305 11063091 11092620 11133108
3880A1133108j4235K934n4021J9652j03852K12133M6407k21378j11864K27998
$$ 11133108 11118873 11121807 11067786 11087438 10983586 11195719 11242126 11020748 10908884 11136882
3870A1136882J19213O7255j66620L573R2400P939j90757l4323K98119j61907k05818
$$ 11136882 11256095 11323350 11156730 11160303 11252703 11260642 11069885 11035562 11333681 11171774 10965956
3859A0965956K76103j33938J21537J96996Q1989l1515l65144J70082L69433L79723
$$ 10965956 11242059 11108121 11229658 11426654 11508643 11477128 11111984 11282066 11651499 12031222
3849A2031222J19369K42915L29382N1125J78093M97273O11207M95966Q43094R56904
$$ 12031222 12150591 12393506 12722888 12774013 12952106 13449379 14060586 14556552 15399646 16356550
3839A6356550J575453J347050J466538J563248K154933K971390M026302N368404
$$ 16356550 17932003 19279053 20745591 22308839 24463772 27435162 31461464 36829868
3831C6829868N930320N634452M723519K484547m51871k650753m086913m819022
$$ 36829868 42760188 48394640 53118159 55602706 55150835 52500082 48413169 43594147
3823D3594147m828020m249498l872898l123494k730771k068388k113591j469799
$$ 43594147 38766127 34516629 30643731 27520237 24789466 22721078 20607487 19137688
3815A9137688j081630j177055p41424n83626n08469p04964n56821n28048o44078
$$ 19137688 18056058 16879003 16137579 15553953 15045484 14340520 13783699 13255651 12611573
3806A2611573k43485n45522n34543k87502j97527m30378o5061K1666l73165l35579
$$ 12611573 12368088 11822566 11288023 11000521 10802994 10372616 10307555 10329221 9956056 9620477
3796I620477k87070r1710K6775j14244j53066j28318m23757P6505L07311m0080
$$ 9620477 9333407 9241697 9268472 9154228 9001162 8872844 8449087 8525592 8832903 8792823
3786H792823k78380J0691q0482k96067j90515J02038j74618k73701j61859j14623
$$ 8792823 8514443 8525134 8444652 8148585 7958070 8060108 7885490 7611789 7449930 7335307
3776G335307j09179j45215j48445P4340K48114m18464k75883L12977M37356r0006
$$ 7335307 7226128 7080913 6932468 7006808 7254922 6836458 6560575 6873552 7310908 7220902
3766G220902K06939J91857l21281k30815k14976O0993q4002j96215j76344K63754
$$ 7220902 7427841 7619698 7298417 7067602 6852626 6913619 6829617 6633402 6457058 6720812
3756F720812o652l1703j55675m18768M8264K43956o2688j2652K04889J52617J23036
$$ 6720812 6714160 6682457 6526782 6108014 6156278 6400234 6337546 6324894 6529783 6682400 6805436
3745F805436P0162l9654p9931J00825l06062o1492Q6098j3914q7698J47165l82858
$$ 6805436 6875598 6835944 6756013 6856838 6550776 6489284 6575382 6561468 6473770 6620935 6238077
3734F238077j65188k09333L9440M44880n5947n52085J1954N3390j19281L9617
$$ 6238077 6072889 5863556 5902996 6347876 6291929 5739844 5751798 5805188 5685907 5725524
3724E725524K2437R1437k34094p7745J7027P8785j49342k4525l32118J80662K13349
$$ 5725524 5747961 5839398 5605304 5527559 5544586 5623371 5474029 5449504 5117386 5298048 5511397
3713E511397K5471J8868n9756N4945L99403J89776K49055K81310j2359l77733
$$ 5511397 5536868 5555736 5495980 5550925 5950328 6140104 6389159 6670469 6658110 6280377
3703F280377n30298k08331k92729j30202J535l59534J59669L16381k5846j61597
$$ 6280377 5750079 5541748 5249019 5118817 5120352 4760818 4920487 5236868 5211022 5049425
3693E049425L56160N12817K790n6056L33636K23174K49290J22622k22244k8204
$$ 5049425 5405585 5918402 5921192 5865136 6198772 6421946 6671236 6793858 6571614 6543410
3683F543410j9042m23937n4685k10059l69937J02374j29361j07172k21929j1000
$$ 6543410 6524368 6100431 6045746 5835687 5465750 5568124 5438763 5331591 5109662 5098662
3673E098662J89546q0637M1508n8492l02191l2812K31358J24078J89553L18329
$$ 5098662 5288208 5207571 5249079 5190587 4888396 4855584 5086942 5211020 5400573 5718902
3663E718902n46779j85875j27655j31835N0707J73298P8901j82219j90408j91201
$$ 5718902 5172123 4986248 4858593 4726758 4777465 4950763 5029664 4847445 4657037 4465836
3653D465836J19150L11601K55272K20727q65m9508M9092P8262P9426Q6830k64850
$$ 4465836 4584986 4896587 5151859 5372586 5371721 5322213 5371305 5449567 5528993 5615823 5350973
3642E350973l34821J94752J09891p6219m12220r93K45689M74773n6121J62052
$$ 5350973 5016152 5210904 5320795 5244576 4832356 4831363 5077052 5551825 5495704 5657756
3632E657756J78154K50634J9297m0055K48016j56586M31980J43164j63116k67093
$$ 5657756 5835910 6086544 6105841 6065786 6313802 6157216 6589196 6732360 6569244 6302151
3622F302151K22269M34091M65205K94982m6748l90249n14411j84251l3499m98711
$$ 6302151 6524420 6958511 7423716 7718698 7671950 7281701 6767290 6583039 6549540 6050829
3612F050829k5779n4778p8914m9865J2883O2142K44766J40571q6213M64136M28324
$$ 6050829 6025050 5970272 5891358 5841493 5854376 5916518 6161284 6301855 6215642 6679778 7108102
3601G108102M57426M39796k69065l65374n83005p1352o8878J6534o7140L17117
$$ 7108102 7565528 8005324 7736259 7370885 6787880 6716528 6647650 6664184 6597044 6914161
3591F914161k9963j73323J35842K0233j93269j80010R4445J31068K3978k20216
$$ 6914161 6884198 6710875 6846717 6866950 6673681 6493671 6588116 6719184 6743162 6522946
3581F522946K32103L35732L6470k5405K00210j33757p0616k0470j84513j1132
$$ 6522946 6755049 7090781 7127251 7101846 7302056 7168299 7097683 7077213 6892700 6881568
3571F881568M27696K63148R8576l2526J57714O4639R0197J63095M38011P30482
$$ 6881568 7309264 7572412 7670988 7638462 7796176 7860815 7951012 8114107 8552118 9282600
3561I282600M66244O64232P23955M30935K91963M25739L39844L93128N21967l40898
$$ 9282600 9748844 10413076 11137031 11567966 11859929 12285668 12625512 13018640 13540607 13199709
3551A3199709l00472N3232l55527k51800J06643J49545P9767k40805N66852L65864
$$ 13199709 12899237 12952469 12596942 12345142 12451785 12601330 12681097 12440292 13007144 13373008
3541A3373008M24068P52232L85958O67773O04174P11333O91902Q18389N72383
$$ 13373008 13797076 14549308 14935266 15603039 16207213 16918546 17610448 18428837 19001220
3532A9001220J78063p8204m64559K78064N08530K67771J84583O28194O19978J030691
$$ 19001220 19179283 19101079 18636520 18914584 19423114 19690885 19875468 20503662 21123640 22154331
3522B2154331J121327J562256J939115K231119K709852K581954K807196K924802
$$ 22154331 23275658 24837914 26777029 29008148 31718000 34299954 37107150 40031952
3514D0031952K986073K729605J692438J102818L2484p81615j276685j570511k278558
$$ 40031952 43018025 45747630 47440068 48542886 48575370 47793755 46517070 44946559 42668001
3505D2668001k584382k408016j714876j491447j489995j375535j329056j262072
$$ 42668001 40083619 37675603 35960727 34469280 32979285 31603750 30274694 29012622
3497B9012622j523415j672468j318699p63488o90875q32829j146423j065903r66759
$$ 29012622 27489207 25816739 24498040 23734552 23043677 22210848 21064425 19998522 19031763
3488A9031763j202041j567500j162121o74874m27522r47442o09818l11610l88072
$$ 19031763 17829722 16262222 15100101 14425227 13997705 13050263 12440445 12128835 11740763
3479A1740763k57889j61385J9338k70308m76879K64753p812k13464n3970m48544
$$ 11740763 11482874 11321489 11340827 11070519 10593640 10858393 10850581 10637117 10583147 10134603
3469A0134603o32224l16661n23775m83764l27285l01913k26377j36343q4037k03602
$$ 10134603 9502379 9185718 8661943 8178179 7850894 7548981 7322604 7186261 7102224 6898622
3459F898622l1159R8540R7373k32463j50121r5848l01944l5751k44487n34327
$$ 6898622 6867463 6966003 7063376 6830913 6680792 6584944 6283000 6247249 6002762 5468435
3449E468435q1427l50242l43222R0711o0381j09602l2518l05738l16905j09463
$$ 5468435 5387008 5036766 4693544 4784255 4723874 4614272 4581754 4276016 3959111 3849648
3439C849648J06229k70602K22575J6182l57353O2351K97929j33261k74620j04456
$$ 3849648 3955877 3685275 3907850 3924032 3566679 3629030 3926959 3793698 3519078 3414622
3429C414622J2031J381j61646j13949n7775J76109j50896K05541P6209k5583j44125
$$ 3414622 3426653 3428034 3266388 3152439 3094664 3270773 3119877 3325418 3401627 3376044 3231919
3418C231919J44023K15046r139m49167K56092l449n4724K2477O8945P8666P015
$$ 3231919 3375942 3590988 3581849 3132682 3388774 3385325 3330601 3353078 3422023 3500689 3507704
3407C507704j17217l60486l84815K37779P6919j34785m9097p7510K04055J35224
$$ 3507704 3390487 3030001 2645186 2882965 2959884 2825099 2776002 2698492 2902547 3037771
3397C037771j72297J3451N8860J79605k62743j62328M82987k35615l77476L7989
$$ 3037771 2865474 2878925 2937785 3117390 2854647 2692319 3175306 2939691 2562215 2600204
3387B600204J14125L7931o531P2057k47853k91206o7456Q7210K09876P2750J36520
$$ 2600204 2714329 2752260 2745729 2817786 2569933 2278727 2211271 2298481 2508357 2581107 2717627
3376B717627k9533m00739j1280N1749k39829J25129L0195J45901j44567j18894
$$ 2717627 2688094 2287355 2276075 2327824 2087995 2213124 2243319 2389220 2244653 2125759
3366B125759k205R081l816M8528L96990j82176k57832J09122j73562J868N8644
$$ 2125759 2123554 2132635 2128819 2177347 2574337 2392161 2134329 2243451 2069889 2071757 2130401
3355B130401n7735m0417K95999j5227j42637q5283l33658J88285J99842j93467
$$ 2130401 2072666 2032249 2328248 2313021 2170384 2085101 1751443 1939728 2139570 1946103
3345A946103J68596p533j17181k37872j04771K46047J62151p5393k17356m1545
$$ 1946103 2114699 2107166 1989985 1752113 1647342 1893389 2055540 1980147 1762791 1721246
3335A721246Q4661j51524K62727P7896l10542r0977L16943J97339j31535j58792
$$ 1721246 1805907 1654383 1917110 1995006 1684464 1593487 1910430 2107769 1976234 1817442
3325A817442j84043k8688j03491R8629k2072p1312J77684J89632O9494n2410J37424
$$ 1817442 1633399 1604711 1501220 1599849 1577777 1506465 1684149 1873781 1943275 1890865 2028289
3314B028289k09078l11916r0685L48720P8058O0835k23610J40738j28336N4878
$$ 2028289 1819211 1507295 1416610 1765330 1843388 1904223 1680613 1821351 1693015 1747893
3304A747893l15318j0017J82037j27555J09976J92204Q0473P2122Q7078P6099
$$ 1747893 1432575 1422558 1604595 1477040 1587016 1779220 1859693 1931815 2018893 2094992
3294B094992P9860j59834k21270N6004k12244K3663J93762J62023L1127k81843
$$ 2094992 2174852 2015018 1793748 1849752 1637508 1661171 1854933 2016956 2048083 1766240
3284A766240L22450l43455j83315K02486J61051l11464N6471K23288M2196k70065
$$ 1766240 2088690 1745235 1561920 1764406 1925457 1613993 1670464 1893752 1935948 1665883
3274A665883k12111K39477P7310k06982L01192J866j83435N9223K5952J28084
$$ 1665883 1453772 1693249 1770559 1563577 1864769 1866635 1683200 1742423 1768375 1896459
3264A896459N6305J07728L8185j19866j41336J73535r3489n38621J05888M40556
$$ 1896459 1952764 2060492 2098677 1978811 1837475 2011010 1917521 1378900 1484788 1925344
3254A925344J80178j62175J05116O9786q9524k0858J21352l3863N5804J150m8949
$$ 1925344 2105522 1943347 2048463 2118249 2028725 2007867 2129219 2095356 2151160 2152310 2103361
3243B103361l360j84119J33146J95676J53805N2192K91557k07601n7329J24447
$$ 2103361 2100001 1915882 2049028 2244704 2398509 2450701 2742258 2534657 2477328 2601775
3233B601775j9459j240l01751j6248k8610K42120K71559p4209N60487L0885l10756
$$ 2601775 2582316 2581076 2279325 2263077 2234467 2476587 2748146 2673937 3234424 3265309 2954553
3222B954553N0564K70198L799j82739J33798K53308r2407J14391J93463L68018
$$ 2954553 3005117 3275315 3279114 3096375 3230173 3483481 3391074 3505465 3698928 4066946
3212D066946p2131j96274M27062J77732M79807M75368L55850O3774o2141L01996
$$ 4066946 3994815 3798541 4225603 4403335 4883142 5358510 5714360 5778134 5715993 6017989
3202F017989O77694N72401Q05133O40881Q80089J012723J407718J340513J007589
$$ 6017989 6695683 7268084 8073217 8714098 9594187 10606910 12014628 13355141 14362730
3193A4362730M21273O44479O6049m19312j61440n169k83812k79007J94734J68744
$$ 14362730 14784003 15428482 15494531 15075219 14913779 14908610 14624798 14345791 14540525 14709269
3183A4709269P1664p135O5914l07988k17401j15341J61513L36127J54572L5918
$$ 14709269 14780933 14773798 14839712 14531724 14314323 14198982 14360495 14696622 14851194 14887112
3173A4887112L81476M22243N49879P67082R81718K520713L983758N901465O189029
$$ 14887112 15268588 15690831 16240710 17007792 17989510 20510223 24493981 30395446 36584475
3164C6584475L650035l41548l208866m179454m317969l793221k742601k766554
$$ 36584475 40234510 39892962 36684096 32504642 28186673 24393452 21650851 18884297
3156A8884297j815840j157562r55466j096123p09792l23515o79830o13698m46772
$$ 18884297 17068457 15910895 14955429 13859306 13149514 12825999 12146169 11532471 11085699
3147A1085699k07574j82114j68821K70422J29135j70117j06230L72629O18447
$$ 11085699 10878125 10696011 10527190 10797612 10926747 10756630 10650400 11023029 11641476
3138A1641476N56535Q69413J002666P92380O20697M96553o99944r86988j125600
$$ 11641476 12198011 13067424 14070090 14862470 15483167 15979720 15279776 14292788 13167188
3129A3167188r45716j010989q74697q36218p79196r15735p32095r2947m36872
$$ 13167188 12221472 11210483 10335786 9499568 8720372 7804637 7072542 6979595 6542723
3120F542723n03397k49832k22323q964k43350l80045j82421k64456m50860n3885
$$ 6542723 6039326 5789494 5567171 5558207 5314857 4934812 4752391 4487935 4037075 3983190
3110C983190m8924K45395n25810m2853q3321k11053l79923K22184j34990m53300
$$ 3983190 3934266 4179661 3653851 3610998 3527677 3316624 2936701 3158885 3023895 2570595
3100B570595N6483O3350k78185j68112P6664n5407q7421J47965J66290k54165
$$ 2570595 2627078 2690428 2412243 2244131 2320795 2265388 2177967 2325932 2492222 2238057
3090B238057k52433L30575R7677k26814p1609j50464j00166k206j26707n791J19780
$$ 2238057 1985624 2316199 2413876 2187062 2115453 1964989 1864823 1862617 1735910 1730119 1849899
3079A849899r6147l693J04426Q8093j64523p3847K0318J68480P57k27652q9842
$$ 1849899 1753752 1750059 1854485 1942578 1778055 1704208 1724526 1893006 1893763 1666111 1576269
3068A576269k7367K8451l7959J5690K03433J21681j46838k57473K40246L2694
$$ 1576269 1548902 1577353 1539394 1555084 1758517 1880198 1733360 1475887 1716133 1748827
3058A748827j82050k42049J95943K61214j88768k76412m2014J73280k8112j23112
$$ 1748827 1566777 1324728 1520671 1781885 1593117 1316705 1274691 1447971 1419859 1296747
3048A296747J6570J74302m7783k4932J0419L8718j87156n0811l8891O9245p2703
$$ 1296747 1313317 1487619 1439836 1414904 1425323 1464041 1276885 1226074 1187183 1256428 1183725
3037A183725k21479j15243N3041Q271J15088L161j0238J69009K934l0910j07065
$$ 1183725 962246 847003 900044 908315 1023403 1026564 1016326 1185335 1188269 1157359 1050294
3026A050294M3837J1566K14091j11775j25555K56527J84718j97139k98571p0237
$$ 1050294 1094131 1105697 1319788 1208013 1082458 1338985 1523703 1326564 1027993 957756
3016I57756Q7464j46202M6725j23747J05158O6537K88077q7426k12477r8130M3656
$$ 957756 1045220 899018 945743 821996 927154 993691 1281768 1194342 981865 883735 927391
3005I27391n7512J19164J60469l1554m8329P1200j60755j86430Q5844L15364k02329
$$ 927391 869879 989043 1149512 1117958 1069629 1140829 980074 793644 879488 1194852 992523
2994I92523m5360n9982l8396J63661L0421k44148P2610p8695j64631L09514k21287
$$ 992523 947163 887181 848785 1012446 1042867 798719 871329 792634 628003 937517 716230
2983G16230j41635j8899K00520J79048K8402L5104j88286J61688n3652l38721
$$ 716230 574595 555696 756216 935264 963666 998770 810484 972172 918520 579799
2973E79799J89640K4427L8048J02206o1013L6684j98673Q0419Q5514q3561L6704
$$ 579799 769439 793866 831914 934120 873107 909791 711118 791537 877051 793490 830194
2962H30194k32453M5155J89560j43963L70929q1642k18579K58019l7263q5262
$$ 830194 597741 642896 832456 688493 1059422 977780 759201 1017220 979957 894695
2952H94695j14924K43868k07490j51395r626J35482N0715j51553j13465j07981
$$ 894695 779771 1023639 816149 664754 655128 790610 841325 689772 576307 468326
2942D68326J69079j71152R8476M73591j69042j86788K74606J31015j60621k49245
$$ 468326 637405 466253 564729 1038320 869278 682490 957096 1088111 927490 678245
2932F78245O0964J01184k57040m6050j17637k33903K08010L07858M368j58825
$$ 678245 739209 840393 583353 537303 419666 185763 393773 701631 705999 547174
2922E47174J35103Q441j92399j62980J38868K97055j64984j43300J08536J12111
$$ 547174 682277 690718 498319 335339 474207 771262 606278 462978 571514 683625
2912F83625R1551O6378N1187K3474j97471q7721q3339O1880L0203K76185j94490
$$ 683625 775176 841554 892741 916215 718744 631023 547684 609564 639767 915952 721462
2901G21462M9715L35703J0067l95132k16139J98885L20115J14842n12256K34262
$$ 721462 771177 1106880 1116947 721815 505676 704561 1024676 1139518 627262 861524
2891H61524J14435j65879O7379j04666P0036j59595J3771j32704j58891L90106
$$ 861524 975959 810080 877459 772793 842829 683234 697005 564301 405410 795516
2881G95516K96159k13467m00169j22041K25599J83808K3191l33061K92869j55703
$$ 795516 1091675 878208 478039 355998 581597 765405 788596 455535 748404 592701
2871E92701l04399L7997J56077J13556K32373n0408q7847K9118J60545J05715
$$ 592701 288302 326299 482376 595932 828305 777897 690050 719168 879713 985428
2861I85428r9327k46739J5180Q3148L4273R5726N2703r7109n8616J40136k00744
$$ 985428 886101 639362 654542 737690 771963 867689 920392 823283 764667 904803 704059
2850G04059J34465J0788r4911k8932j65920J09225K52976j28134j39865J0842
$$ 704059 838524 849312 754401 725469 559549 668774 921750 793616 653751 664593
2840F64593P0164j90641P2675r9506J5191k81722j06791K01115L22873k99611
$$ 664593 734757 544116 616791 517285 532476 250754 143963 345078 667951 368340
2830C68340j61523J92583j09531J40471J61645J73604j27695Q7388K34526N708
$$ 368340 206817 399400 289869 430340 591985 765589 637894 725282 959808 965516
2820I65516M0861k68272j98259J39963m3585j4921L86693k83484m95257Q1888
$$ 965516 1006377 738105 539846 679809 636224 621303 1007996 724512 229255 311143
2810C11143K61681M3971m272L00693J09856o7187l46842L4591p7058k12312J1324
$$ 311143 572824 616795 612523 913216 1023072 955885 609043 643634 566576 354264 365588
2799C65588L00616N617k4523J31940J50119k64041k63602K31716O1853J15569
$$ 365588 666204 671821 647298 779238 929357 665316 401714 633430 695283 810852
2789H10852J3933K74096j85582l19160j32877j15245P7055k9248J44619j01755
$$ 810852 824785 1098881 913299 594139 461262 346017 423072 393824 538443 436688
2779D36688j75632J67299o8388J54552K35026r1008J5887K1617j64423K82238
$$ 436688 261056 428355 359967 514519 749545 658537 674424 696041 531618 813856
2769H13856j18741j00829o0857j80524q4206Q2634K47742l1404k00490J1819L54761
$$ 813856 695115 594286 533429 352905 268699 351333 599075 567671 367181 379000 733761
2758G33761Q1866N1720Q6132o0796m7356l54085K3444J08905r8336l1253k05843
$$ 733761 815627 867347 953479 892683 845327 491242 514686 623591 525255 494002 288159
2747B88159P6316J30458j15301J55196j00741j26266N3407J28715j21397k0040
$$ 288159 364475 494933 379632 534828 434087 307821 361228 489943 368546 348506
2737C48506L2095J67626p4557r4768l9433j39030K18343m4307J52243N6524j99727
$$ 348506 380601 548227 473670 378902 339469 200439 418782 374475 526718 583242 383515
2726C83515k00016J76824K09287K7865k39980J38383J76207O0698j67080L0989
$$ 383515 183499 360323 569610 597475 357495 495878 672085 732783 565703 596692
2716E96692q6631o439J52117j66709j89416j53159J63127j5245K15340N1796k9038
$$ 596692 510061 503622 655739 489030 299614 146455 309582 294337 509677 561473 532435
2705E32435l8999j29627J20590K6346k51610N5485n6694M7606J0167J50549O9436
$$ 532435 493436 363809 484399 510745 259135 314620 257926 305532 315699 466248 535684
2694E35684j16665n6258q6735l5947P1873P9949R0376j30271q1380J04241j28112
$$ 535684 419019 362761 276026 240079 311952 391901 482277 352006 270626 374867 246755
2683B46755j37882n7558q9278K58214M09032j66669M2075J12055j01057j11448
$$ 246755 108873 51315 -37963 220251 629283 462614 504689 616744 515687 404239
2673D04239j8074j49229K26271J99927j06532j70845K34213L04300j88246j02339
$$ 404239 386165 236936 463207 663134 556602 385757 619970 924270 736024 633685
2663F33685o8304K35974l03782m4101q0043j63105K27424l2842N5828j96579q4403
$$ 633685 565381 801355 497573 453472 373429 210324 437748 404906 460734 264155 179752
2652A79752m8983K48262J18057J1323r4297j0185L30741L178j59454K982J57374
$$ 179752 130769 379031 497088 508411 414114 403929 734670 737848 578394 581376 738750
2641G38750o3823j09794J84602R540J04845J31504J85935K08985K69457N25827
$$ 738750 674927 565133 749735 759275 864120 995624 1181559 1390544 1660001 2185828
2631B185828M37661K12387k46356m64626l05738l37692j92162M6410k47813j96909
$$ 2185828 2623489 2835876 2589520 2124894 1819156 1481464 1289302 1335712 1087899 890990
2621H90990j5029k60587Q2186J10354K53091k70248p8448Q1544j6981j02816o0665
$$ 890990 875961 615374 697560 807914 1061005 790757 712309 793853 776872 674056 613391
2610F13391K508J03900q9180J56564j52064Q340J71746Q7800j08171l03411j20497
$$ 613391 615899 719799 630619 787183 635119 643459 815205 903005 794834 491423 370926
2599C70926J37596N1854J24010M2940j43535J17718L7274o4718l5867j38520K12096
$$ 370926 508522 560376 684386 727326 583791 701509 738783 674065 638198 499678 711774
2588G11774J99231m8476l88986J02759K34535m3975j37704k19695J93231J08197
$$ 711774 911005 862529 473543 576302 810837 766862 629158 409463 602694 710891
2578G10891j86884N5580K3916m8354J34684L16178o2125n03869j40202K29208
$$ 710891 524007 579587 603503 555149 689833 1006011 943886 440017 299815 529023
2568E29023J14736l88625L48981K87248o4107k71635j91632J68043J30185j06808
$$ 529023 643759 255134 604115 891363 827256 555621 363989 532032 662217 555409
2558E55409k81756K53349J78358j87296L6870j67205J55902M3715J2890P0461
$$ 555409 273653 527002 705360 518064 554934 387729 543631 587346 600236 670697
2548F70697K00930n3704q9644j70023j52914J38498K16260k38252J16412j4237
$$ 670697 871627 817923 728279 558256 405342 543840 760100 521848 638260 624023
2538F24023l09766k23749J83382J68083J60343o3897K62865L1224j74730o8710
$$ 624023 314257 90508 273890 441973 602316 538419 801284 832508 657778 589068
2528E89068L0367j18748J9915j2812L05072j31199k94046K05048J78529J84895
$$ 589068 619435 500687 520602 507790 812862 681663 387617 592665 771194 956089
2518I56089k36620m608J01785k3091k9355j55539M308j37643L4916R2918j17531
$$ 956089 719469 714861 816646 793555 764200 608661 612969 475326 510242 603160 485629
2507D85629p7918P6761J28273n674J94858M2430J38873j86267n1234N68641l1574
$$ 485629 407711 484472 612745 607071 801929 844359 983232 796965 745731 1314372 1282798
2496A282798o7262m85307o1710N9815J86057j8863j63234P1457p470J36868j8443
$$ 1282798 1215536 730229 668519 728334 914391 895528 732294 803751 796281 933149 914706
2485I14706j36326J68802j39190J48132J14110K72461L6520m91606Q5886K86324
$$ 914706 778380 947182 807992 956124 1070234 1342695 1379215 887609 973495 1259819
2475A259819o8102l61978L8722J53487r9069K18883R3757R9068r4657l07914n9156
$$ 1259819 1191717 829739 868461 1021948 922879 1141762 1235519 1334587 1239930 932016 872860
2464H72860j39762K49469M3780p1107L93900P4651P006l9699r2258k58615L6587
$$ 872860 733098 982567 1026347 955240 1349140 1423791 1430797 1391098 1298840 1040225 1076812
2453A076812J98626K11666o7948j1279r306P9194J72746J90410J50378k66648
$$ 1076812 1275438 1487104 1419156 1407877 1398571 1477765 1650511 1840921 1991299 1724651
2443A724651J02648J59585l8548p2082j7594k0854L52361l8793m22292p8326M34210
$$ 1724651 1827299 1986884 1948336 1876254 1858660 1837806 2190167 2151374 1729082 1650756 2084966
2432B084966O7750L72386k93925j53883j94502K82407J31614J90833p1991J31787
$$ 2084966 2152716 2525102 2231177 2077294 1882792 2165199 2296813 2487646 2415655 2547442
2422B547442J68815K16793o4210k6588K4417M3464k20741K41561j07062J93782
$$ 2547442 2716257 2933050 2868840 2842252 2866669 2910133 2689392 2930953 2823891 3017673
2412C017673K27085M01320k56826K00928K7975N46690L66040o7032j76425L80924
$$ 3017673 3244758 3646078 3389252 3590180 3618155 4164845 4530885 4463853 4287428 4668352
2402D668352K27063l5452j11043N48638K15956K24438n406M00402K86002N70360
$$ 4668352 4895415 4859963 4748920 5297558 5513514 5737952 5732546 6132948 6418950 6989310
2392F989310N36917R25599J92370L67308J11979L67888J42086Q04774J153433
$$ 6989310 7526227 8451826 8644196 9011504 9123483 9491371 9633457 10438231 11591664
2383A1591664J933930K576095L807760L989534K619516k74951j28779L65007J951661
$$ 11591664 13525594 16101689 19909449 23898983 26518499 26243548 26114769 26479776 28431437
2374B8431437K299685L145350L763160O334550Q788329J5359663L4278193O8560956
$$ 28431437 30731122 33876472 37639632 43974182 52762511 68122174 102400367 170961323
2366A70961323J06553772J08875624L3603615n9228004q0056130p2094970m7999548
$$ 170961323 277515095 386390719 419994334 360766330 280710200 208615230 160615682
2359A60615682l4789247k5324781k0686797j5691386j2728910r254357n542993
$$ 160615682 125826435 100501654 79814857 64123471 51394561 42140204 36597211
2352C6597211k618755n53387l01012j312570l012456l041542k885441k524516
$$ 36597211 33978456 33425069 33124057 31811487 28799031 25757489 22872048 20347532
2344B0347532j802605j475540j260064j278919j225074j236340p19614l49433
$$ 20347532 18544927 17069387 15809323 14530404 13305330 12068990 11349376 10999943
2336A0999943n52736j12468m47524m32881j54115j90753j72571m66252l59647
$$ 10999943 10447207 10334739 9887215 9454334 9300219 9109466 8936895 8470643 8110996
2327H110996k12409j47169q2977m01752l529m05828j06267k1291k83955j93067
$$ 8110996 7898587 7751418 7668441 7266689 7263160 6857332 6751065 6729774 6445819 6252752
2317F252752r0002k48240J83462l55504p1499k23042k62618k42840J85840m53576
$$ 6252752 6162750 5914510 6097972 5742468 5670969 5447927 5185309 4942469 5128309 4674733
2307D674733r7298j27731P810j44194J10768r7112l35272p5693R775k59020l25214
$$ 4674733 4577435 4449704 4457514 4313320 4424088 4326976 3991704 3916011 3925786 3666766 3341552
2296C341552k02238K92215k12347K23542J16955k28265k16171K2465J79125R8092
$$ 3341552 3139314 3431529 3219182 3442724 3559679 3331414 3115243 3137708 3316833 3414925
2286C414925o00226J48056n9084O9296j66561n5053r5829k48280k16581L56534
$$ 3414925 2814699 2962755 2903671 2972967 2806406 2751353 2655524 2407244 2190663 2547197
2276B547197k42246p1255k38943K65864l2032j29890K24527J11380j02249J13080
$$ 2547197 2304951 2233696 1994753 2260617 2228585 2098695 2323222 2434602 2332353 2445433
2266B445433l2383J57742k89830k25578j73119j60866r7170R0948M219J65807
$$ 2445433 2413050 2570792 2280962 2055384 1882265 1721399 1624229 1715177 1719396 1885203
2256A885203k34285J83211r0537k03904j5526K31015J96904k85331k05630J5824
$$ 1885203 1650918 1834129 1743592 1539688 1524162 1755177 1952081 1666750 1461120 1476944
2246A476944J83101p0226j96613N3792K27048j05183j63196p616k51931q8662
$$ 1476944 1660045 1589819 1393206 1446998 1674046 1568863 1405667 1398051 1146120 1057458
2236A057458M16425m3579P855L8059n8421o6858K1706m8714J73140j2522Q6043
$$ 1057458 1473883 1430304 1438159 1476218 1417797 1350939 1372645 1323931 1497071 1484549 1570592
2225A570592J42723j17391m40667k46765K77834K1927k7121j14805j7905j0071
$$ 1570592 1713315 1595924 1155257 908492 1186326 1208253 1181132 1066327 1048422 1038351
2215A038351j9908K49943k39561J59118l4413J57042j87445j97987r2746K8049
$$ 1038351 1018443 1268386 1028825 1187943 1153530 1310572 1123127 925140 832394 860443
2205H60443m4723P3217K4603N2060j28062J89292j07609L3130J71343J40445k51959
$$ 860443 815720 888937 913540 965600 837538 1026830 919221 952351 1123694 1264139 1012180
2194A012180N1735J85833k29598K4433K31837l40507k45508K63554p9450O438
$$ 1012180 1063915 1249748 1020150 1044583 1276420 935913 690405 953959 874509 880947
2184H80947J05854l21861k62562K47801Q0540l00732L361P1107J8391L0576M13356
$$ 880947 986801 664940 402378 650179 730719 429987 433348 504455 522846 553422 966778
2173I66778j19322j75487K54716q3230p1095J74310o9883l37525K36009J71395
$$ 966778 847456 671969 926685 843455 772360 946670 876787 539262 775271 946666
2163I46666n14150n8741Q7378L83473r3489N7709J62774J32342k74169K37348
$$ 946666 432516 373775 461153 844626 751137 808846 971620 1103962 829793 1067141
2153A067141k25094j73758J38893J54062k55722q1325J40773j95072J06853k0963
$$ 1067141 842047 668289 807182 961244 705522 624197 764970 569898 676751 655788
2143F55788N3918P220k30866j55802K43035n9556L04415m0635j83837j16073O0150
$$ 655788 709706 716926 486060 330258 573293 513737 818152 777517 593680 477607 537757
2132E37757R1223l840k3351l8822J93740N6752k39527J98406m169P1205q868j66043
$$ 537757 628980 625140 601789 562967 756707 813459 573932 772338 768169 839374 830506 664463
2120F64463K9158P2110r3237r0011q0703K32J28954J21155J72464j65620j95110
$$ 664463 693621 765731 672494 582483 501780 502012 630966 752121 924585 758965 563855
2109E63855Q0942o6114K6459K20967q4699n6154K43781j99929N0518j14326K57442
$$ 563855 644797 578683 605142 826109 741410 685256 929037 729108 779626 665300 922742
2098I22742K36228L37711O06732L07806j29239r6989O1227o91692r9445j48905
$$ 922742 1158970 1496681 2103413 2411219 2281980 2184991 2246218 1554526 1455081 1306176
2088A306176l27052Q8737j24232j79566m9145N3475l60112j04242K77634K15058
$$ 1306176 979124 1067861 943629 764063 714918 768393 408281 304039 581673 796731
2078G96731j40605J14057l72615l61618K81465L10577K74363l23529l4606L1389
$$ 796731 656126 770183 397568 35950 317415 627992 902355 578826 544220 575609
2068E75609m2843P4419l0906L7924m9558p1032J43287L01443k25103l97341l4008
$$ 575609 532766 607185 576279 614203 564645 493613 636900 938343 713240 315899 281891
2057B81891N00850j8061p2588q5090l32904J41080m0645q6707q795K50558P3541
$$ 281891 782741 764680 692092 607002 274098 415178 374533 287826 279031 529589 603130
2046F03130k04598K21993o1034O721P0977Q8961j04466j68911j05464J14440J7537
$$ 603130 398532 620525 559491 566212 637189 726150 621684 452773 347309 461749 479286
2035D79286O3731J98669o0226q4583J16820k02962j48648N6759j33429J01847
$$ 479286 543017 741686 681460 596877 713697 510735 362087 418846 285417 387264
2025C87264O4671q1593k17020j90830K33213R9956J55877N7873k05331J0802J53208
$$ 387264 451935 370342 153322 -37508 195705 295661 451538 509411 304080 314882 468090
2014D68090K43116j20202o4367J74854O4490j15800l63730j7514j47980j58813
$$ 468090 711206 591004 526637 701491 765981 650181 286451 268937 120957 -37856
2004c7856J06468K57289K08833j47769m4936j71455K11622K12251M7252k94473
$$ -37856 68612 325901 534734 386965 342029 170574 382196 594447 641699 347226
1994C47226n8699J13821K91449j78594j6607k5254k37170P1046o4464j31180M6469
$$ 347226 288527 402348 693797 515203 498596 473342 236172 307218 242754 111574 158043
1983A58043J41283K3151M1832K36332j3774J02984j51043l6747K67374q5271P732
$$ 158043 299326 322477 364309 600641 586867 689851 538808 502061 769435 684164 691896
1972F91896k07605J68239J31876P5382k17198l42383l02049j34782M58883p3079
$$ 691896 484291 652530 784406 859788 642590 300207 -1842 -136624 322259 249180
1962B49180k640l1427J33436J18237M2541P1037l5659M8919j77175j64269j44705
$$ 249180 246540 215113 348549 466786 509327 580364 544705 593624 416449 252180 107475
1951A07475O2691J18688P1743j55397P7032j7499p2596J19200k23696K78251J8607
$$ 107475 170166 288854 360597 205200 282232 264733 192137 311337 87641 365892 384499
1940C84499K11170M0281n83478M401J07455L6521K34402O5810p0873j04302N5424
$$ 384499 595669 635950 52472 56873 164328 200849 435251 501061 430188 325886 381310
1929C81310n3171k1244N6280p3296J95038J9406n3340J66791r813j14648k7155
$$ 381310 328139 306895 363175 289879 484917 504323 450983 617774 607961 493313 466158
$$ [...]
##END NTUPLES=NMR SPECTRUM
##END=
