##TITLE=1H_DE-80H_X3
 200.13MHz, d2o
 8 sc
 
 19ns.26.2.2025
##JCAMPDX= 6.0         $$ Bruker NMR JCAMP-DX V2.0
##DATA TYPE= NMR SPECTRUM
##DATA CLASS= NTUPLES
##ORIGIN= UXNMR, Bruker Analytische Messtechnik GmbH
##OWNER= pz
$$ XWIN-NMR		Version 3.5
$$ Wed Apr  1 09:42:20 2026 Russian Standard Time (UT+4h)  Yarkov@DPX200
##.OBSERVE FREQUENCY= 200.1313
##.OBSERVE NUCLEUS= ^1H
##.ACQUISITION MODE= SIMULTANEOUS
##.ACQUISITION SCHEME= undefined
##.AVERAGES= 8
##.DIGITISER RES= 18
##SPECTROMETER/DATA SYSTEM= spect
##.PULSE SEQUENCE= zg30
##.SOLVENT NAME= CDCl3
##.SHIFT REFERENCE= (INTERNAL, CDCl3, 0, 15.4329)
##AUDIT TRAIL= $$ (NUMBER, WHEN, WHO, WHERE, WHAT)
$$ ##TITLE= Audit trail, XWIN-NMR		Version 3.5
$$ ##JCAMPDX= 5.01
$$ ##ORIGIN= Bruker BioSpin GmbH
$$ ##OWNER= Yarkov
$$ C:/Bruker/XWIN-NMR/data/yarkov2/nmr/H-C/1/pdata/1/auditp.txt
$$ ##AUDIT TRAIL=  $$ (NUMBER, WHEN, WHO, WHERE, WHAT)
(   1,<2026-04-01 09:41:28.60 +0400>,<Yarkov>,<DPX200>,
      <created by zg, POWCHK disabled, PULCHK disabled
       configuration hash MD5:
       00 E9 B6 7A A2 85 ED C7 34 08 36 98 17 FE 4E 26
       data hash MD5: 16K
       D4 91 40 3F 40 26 E8 88 0F FD 34 94 DC E9 48 DF>)
(   2,<2026-04-01 09:41:34.14 +0400>,<Yarkov>,<DPX200>,
      <Start of raw data processing
       efp BC_mod = 2 LB = 0.25 FT_mod = 6 PKNL = 1 PHC0 = -5299.148 PHC1 = 6.821927 SI = 16K 
       data hash MD5: 16K
       C9 B3 F6 1D ED 10 0F B6 36 00 55 5D EA 6A E4 D1>)
(   3,<2026-04-01 09:41:41.34 +0400>,<Yarkov>,<DPX200>,
      <abs ABSG = 5 
       data hash MD5: 16K
       C1 29 DF B2 C6 BE 1F 08 DC C7 9B D6 28 FB 33 39>)
$$ ##END=
$$ 
$$ hash MD5
$$ 0A FD FF 42 27 3A 5D CA CC 3E D0 E1 13 B0 76 A7
##$RELAX= 
##$RELAX= 
##$RELAX= 
##$RELAX= 
##$RELAX= 
##$RELAX= 
$$ Bruker specific parameters
$$ --------------------------
##$DU= <C:/Bruker/XWIN-NMR>
##$EXPNO= 1
##$NAME= <H-C>
##$PROCNO= 1
##$TYPE= <nmr>
##$USER= <yarkov2>
##$AMP= (0..31)
100 100 100 100 100 100 100 100 100 100 100 100 100 100 100 100 100 100 
100 100 100 100 100 100 100 100 100 100 100 100 100 100 
##$AQSEQ= 0
##$AQ_mod= 1
##$AUNM= <au_zg>
##$AUTOPOS= <>
##$BF1= 200.13
##$BF2= 200.13
##$BF3= 200.13
##$BF4= 200.13
##$BF5= 200.13
##$BF6= 200.13
##$BF7= 200.13
##$BF8= 200.13
##$BYTORDA= 1
##$CFDGTYP= 0
##$CFRGTYP= 5
##$CHEMSTR= <none>
##$CNST= (0..31)
1 1 145 1 1 1 1 1 1 1 1 1 1 1 1 1 1 1 1 1 1 1 1 1 1 1 1 1 1 1 1 1 
##$CPDPRG= <>
##$CPDPRG1= <>
##$CPDPRG2= <>
##$CPDPRG3= <>
##$CPDPRG4= <mlev>
##$CPDPRG5= <mlev>
##$CPDPRG6= <mlev>
##$CPDPRG7= <mlev>
##$CPDPRG8= <mlev>
##$CPDPRGB= <>
##$CPDPRGT= <>
##$D= (0..31)
0 0.7 0 0 0 0 0 0 0 0 0 0.03 0 0 0 0 0 0 0 0 0 0 0 0 0 0 0 0 0 0 0 0 
##$DATE= 1775022088
##$DBL= (0..7)
120 120 120 120 120 120 120 120 
##$DBP= (0..7)
150 150 150 150 150 150 150 150 
##$DBP07= 0
##$DBPNAM0= <>
##$DBPNAM1= <>
##$DBPNAM2= <>
##$DBPNAM3= <>
##$DBPNAM4= <>
##$DBPNAM5= <>
##$DBPNAM6= <>
##$DBPNAM7= <>
##$DBPOAL= (0..7)
0.5 0.5 0.5 0.5 0.5 0.5 0.5 0.5 
##$DBPOFFS= (0..7)
0 0 0 0 0 0 0 0 
##$DE= 6
$$ [...]
##$SUBNAM3= <"">
##$SUBNAM4= <"">
##$SUBNAM5= <"">
##$SUBNAM6= <"">
##$SUBNAM7= <"">
##$SUBNAM8= <"">
##$SUBNAM9= <"">
##$SW= 18.0517328524113
##$SWIBOX= (0..15)
0 0 2 0 0 0 0 0 0 0 0 0 0 0 0 0 
##$SW_h= 3612.71676300578
##$TD= 16384
##$TD0= 1
##$TE= 0
##$TE2= 300
##$TE3= 300
##$TEG= 300
##$TL= (0..7)
0 120 120 120 120 120 120 120 
##$TP= (0..7)
150 150 150 150 150 150 150 150 
##$TP07= 0
##$TPNAME0= <>
##$TPNAME1= <>
##$TPNAME2= <>
##$TPNAME3= <>
##$TPNAME4= <>
##$TPNAME5= <>
##$TPNAME6= <>
##$TPNAME7= <>
##$TPOAL= (0..7)
0.5 0.5 0.5 0.5 0.5 0.5 0.5 0.5 
##$TPOFFS= (0..7)
0 0 0 0 0 0 0 0 
##$TUNHIN= 0
##$TUNHOUT= 0
##$TUNXOUT= 0
##$USERA1= <user>
##$USERA2= <user>
##$USERA3= <user>
##$USERA4= <user>
##$USERA5= <user>
##$V9= 5
##$VALIST= <valist>
##$VCLIST= <CCCCCCCCCCCCCCC>
##$VD= 0
##$VDLIST= <DDDDDDDDDDDDDDD>
##$VPLIST= <PPPPPPPPPPPPPPP>
##$VTLIST= <TTTTTTTTTTTTTTT>
##$WBST= 1024
##$WBSW= 4
##$XGAIN= (0..3)
0 0 0 0 
##$XL= 0
##$YL= 0
##$YMAX_a= 261577
##$YMIN_a= -219261
##$ZGOPTNS= <>
##$ZL1= 120
##$ZL2= 120
##$ZL3= 120
##$ZL4= 120
##$ABSF1= 15.47584
##$ABSF2= -2.57601
##$ABSG= 5
##$ABSL= 3
##$ALPHA= 0
##$AQORDER= 0
##$ASSFAC= 0
##$ASSFACI= 0
##$ASSFACX= 0
##$ASSWID= 0
##$AUNMP= <proc_1d>
##$AZFE= 0.1
##$AZFW= 0.1
##$BCFW= 0
##$BC_mod= 2
##$BYTORDP= 0
##$COROFFS= 0
##$CY= -3
##$DATMOD= 1
##$DC= 0
##$DFILT= <>
##$DTYPP= 0
##$F1P= 0
##$F2P= 0
##$FCOR= 1
##$FTSIZE= 16384
##$FT_mod= 6
##$GAMMA= 0
##$GB= 0
##$INTBC= 1
##$INTSCL= 3.241238e-09
##$ISEN= 128
##$LB= 0.25
##$LEV0= 0
##$LPBIN= 0
##$MAXI= 10000
##$MC2= 0
##$MEAN= 0
##$ME_mod= 0
##$MI= 1.114404
##$NCOEF= 0
##$NC_proc= -7
##$NLEV= 6
##$NOISF1= 3.799351
##$NOISF2= 2.8
##$NSP= 0
##$NTH_PI= 0
##$NZP= 0
##$OFFSET= 15.43288
##$PC= 1
##$PHC0= -5299.148
##$PHC1= 6.821927
##$PH_mod= 1
##$PKNL= yes
##$PPARMOD= 0
##$PSCAL= 0
##$PSIGN= 0
##$REVERSE= no
##$SF= 200.130017775774
##$SI= 16384
##$SIGF1= 3
##$SIGF2= 2
##$SINO= 0.751879
##$SIOLD= 32768
##$SREGLST= <19F.Aceton>
##$SSB= 0
##$STSI= 16384
##$STSR= 0
##$SW_p= 3612.71676300578
##$SYMM= 0
##$S_DEV= 0
##$TDeff= 16384
##$TDoff= 0
##$TI= <>
##$TILT= no
##$TM1= 0
##$TM2= 0
##$TOPLEV= 0
##$USERP1= <user>
##$USERP2= <user>
##$USERP3= <user>
##$USERP4= <user>
##$USERP5= <user>
##$WDW= 1
##$XDIM= 16384
##$YMAX_p= 315906155
##$YMIN_p= -605416
$$ End of Bruker specific parameters
$$ ---------------------------------
##NTUPLES= NMR SPECTRUM
##VAR_NAME=  FREQUENCY,     SPECTRUM/REAL,   SPECTRUM/IMAG
##SYMBOL=    X,             R,               I
##VAR_TYPE=  INDEPENDENT,   DEPENDENT,       DEPENDENT
##VAR_FORM=  AFFN,          ASDF,            ASDF
##VAR_DIM=   16384,         16384,           16384
##UNITS=     HZ,            ARBITRARY UNITS, ARBITRARY UNITS
##FACTOR=    0.220516191357247, 1,           1
##FIRST=     3088.58262910587, 0,            0
##LAST=      -524.134133899911, 0,           0
##MIN=       -524.134133899911, -605416,     0
##MAX=       3088.58262910587, 315906155,    0
$$ Real data points
##PAGE= N=1
##DATA TABLE= (X++(R..R)), XYDATA
$$ [...]
7827B26033j0849P4406j01740l4355M945j6062J10257K8124r733Q53k9509k0569
7815B21801o2148n5526J71793M9497n7870k8675j29851j31224k4870K65896o3169
7804A55654K0918P8751M5025M5533m1969r3501J12653k2460j37816j02232O3296
7793A23852k6512R0368J4026L6773l384k3266J5357j69550J57570m5211P9633
7782B49656Q3658M5755j09261J02368j43884M145p2369l7872q3822Q9737J0683
7771A38794L3615j592n6651N3125l6421L9547M9147n5175p4111M1755J56654j0462
7759B78225N7625q6310j11493P701J2802N5194j0717K7714l3695O5493o5196J00502
7747B97845l8432j30216J4165m7869K9117p42L237K8216J5004M5222n5112n5909
$$ plain form
7827 226033 215184 289590 187850 153495 158440 142378 252635 280759 271026 271879 242370 221801
7815 221801 159653 104127 275920 325417 267547 238872 109021 -22203 -47073 218823 155654
7804 155654 176572 255323 300348 345881 303912 210411 323064 300604 162788 60556 123852
7793 123852 97340 187708 201734 238507 235123 211857 227214 57664 215234 170023 249656
7782 249656 333314 379069 269808 372176 228292 232437 160068 122196 38374 128111 138794
7771 138794 172409 170817 114166 167291 130870 170417 219564 164389 90278 132033 288687 278225
7759 278225 335850 249540 138047 145748 158550 213744 203027 230741 197046 262539 197343 297845
7747 297845 259413 129197 143362 95493 124610 123868 127105 155321 170325 215547 160435 104526
7735A04526N3567K4329K2274O8709J08100p8157j45198K1023m7314n574r1993
7724C4292l4534R3305k6609O2192K6298o5239r082Q7622l4191n028O8946k100
7712A95872R7663J6215q6827j25886N2933k5605j36161J22039J78966l199m6872
7701B39138q4808M2682q007N6023j364K560M5054m7446j20878j31597N0982p5286
7689c2947J31993J18564l9184K7374l246j82391P2688n7349L8417J31925R501
7678B15345j05967q1200J27374k1920k14n9994M7095K1871N8699l1335j84151
7667a4397P0382J18345M945q0388l542R3333K9203q1001m867Q9015j01112m6721
7655G3195J8409j449P5662O1766M204m9103j19538j08461O1975J18390R3201j03316
$$ plain form
7735 104526 158093 182422 204696 273405 381505 303348 158150 179173 131859 126285 34292
7724 34292 -242 93063 66454 128646 154944 89705 80623 168245 134054 129026 197972 195872
7712 195872 293535 309750 222923 97037 149970 124365 -11796 110243 289209 286010 239138
7701 239138 154330 197012 189005 245028 243664 246224 291278 243832 122954 -8643 42339 -32947
7689 -32947 99046 217610 178426 205800 202554 20163 92851 35502 73919 205844 215345
7678 215345 109378 28178 155552 133632 133418 73424 120519 142390 201089 169754 -14397
7667 -14397 55985 174330 179275 98887 95345 188678 217881 136880 132013 221028 119916 73195
7655 73195 91604 90155 165817 227583 231787 182684 63146 -45315 16660 135050 228251 124935
7643A24935n4101O1278J2158j0325p7249j8961m8061k6086J07074O2075m4164
7632H8573J3316j1579o6332J22828P8157p1103j08030N528J41952P8595L7146
7621C09051j37736j13763J7936j7557J0885M1081M9138N738m3043L9757n1693
7610A09794m4307L0028J10637j46341j5452N277l2391J17368k8529k12371P1603
7599c4684J85858L8874m0334k00509m600R6253p6823N702M5297J6896M7901p7363
7587B468K4001q4934k3276L6683Q3628J14224n8858R3589j66708j59894m5910
7576a84987O5214L94N1962J16481O0920J8282M6245M512n7304Q4253q8864j74387
7564e7279Q765J7453k7249M5525Q2944R2942j1530K2829Q6444q1015j56568l2309
$$ plain form
7643 124935 70834 132112 144270 133945 56696 37735 -10326 -36412 70662 132737 88573
7632 88573 101889 90310 23978 146806 224963 153860 45830 51358 193310 271905 309051
7621 309051 171315 57552 75488 57931 68816 109897 159035 164773 121730 161487 109794
7610 109794 65487 95515 206152 59811 44359 49636 17245 134613 106084 -106287 -34684
7599 -34684 151174 190048 149714 -50795 -55395 40858 -35965 -30263 15034 31930 79831 2468
7587 2468 26469 -58465 -81741 -45058 38570 152794 93936 187525 20817 -139077 -184987
7576 -184987 -119773 -119379 -67417 49064 109984 128266 174511 179023 121719 205972 117108 -57279
7564 -57279 -48514 -31061 -58310 -12785 70159 163101 151571 174400 260844 179829 23261 -9048
7552i048P6928q4987P5808k6821J9043n2502p5105J75631j2753q8613r7528N0766
7540d9181J32628k2261l2061k7713j09969J29831p8456K2556R1617J2893p7955
7529h071J38319K6403n7639l3473r4929M3191K6909k6622r1800j5849J44572L6794
7517H7805o3594n3455K9858r4279L0041K2929Q5737J51914j56447Ln231n8460
7505b3179M5562l3066P3950M0701j0465n3256O1654n2561j9898n1361N8349J05185
7493A41615r6235m4046J471m5956J10590K3229r7515J7920Q943M6517N1604L7862
7481A55999J5050K364n9621l80L0352m7240m6394O2415p3135p65N4151q3808J9285
7468B8273k3305k0001J26266j0240J03165q4792n389L5946m4530k6741j0722J5273
$$ plain form
7552 -9048 67880 -17107 58701 31880 50923 -1579 -76684 98947 86194 -2419 -99947 -49181
7540 -49181 83447 61186 29125 1412 -108557 21274 -57182 -34626 56991 69884 -8071
7529 -8071 130248 156651 99012 65539 -29390 13801 40710 14088 -77712 -93561 51011 87805
7517 87805 24211 -29244 614 -93665 -63624 -40695 45042 196956 40509 40512 35281 -23179
7505 -23179 22383 -10683 63267 103968 93503 40247 101901 49340 29442 -21919 36430 141615
7493 141615 45380 1334 2805 -43151 67439 90668 -6847 11073 20016 66533 118137 155999
7481 155999 171049 173413 113792 113412 143764 96524 50130 112545 39410 38645 92796 8988 28273
7468 28273 4968 -15033 111233 100993 204158 119366 113977 149923 105393 78652 67930 83203
7456H3203k357l6230N9549N4896l6739l9588J36299j16604m3060j6877M0856P7188
7444A60536n6467N9927K3350P6869k7044q9844k1652L5061p3154P7234q4995n3059
7432B6762l6715O2845J393o1014J1509L3585N3095N6092L5169n4770J21391p473
7420B41869k22765Q152N75M494m7720J9740K7603K796Q8039q5068j3144N7858
7408H2429j17255Q5483J65949m8095j50789l1755N8719J3353N5897l4137o4145
7397A5654P9139p8371J13006J2115k33960J6782l684p4341M4762J39357J7465
7386D7924J3252r6844j0460Q001P5390m6804l6254p6120O2870J44444m7624p8420
7374d0645J33590k19127L0584Q0022l5745l7532J15180j9773r8880J03881R7225
$$ plain form
7456 83203 80846 44616 104165 159061 122322 82734 219033 102429 59369 42492 83348 160536
7444 160536 104069 163996 187346 264215 237171 147327 125675 160736 87582 164816 79821 26762
7432 26762 -9953 52892 54285 -6729 4780 38365 91460 147552 182721 127951 249342 241869
7420 241869 19104 27256 27831 32325 -15395 4345 31948 34744 122783 37715 24571 82429
7408 82429 -34826 50657 216606 168511 17722 -14033 44686 58039 113936 79799 15654
7397 15654 94793 16422 129428 141543 -92417 -75635 -79319 -153660 -108898 30459 47924
7386 47924 61176 -35668 -46128 -38127 37263 -9541 -45795 -121915 -59045 85399 37775 -40645
7374 -40645 92945 -126182 -95598 -15576 -51321 -88853 26327 6554 -92326 11555 108780
7363A08780L4810l7847j91959M102K0532L4799k8851p919J99596j17584q983L8005
7351D7481o9582N3568j29977k5340K437k6363R7753l7767P5639r3924Q8092Q1122
7339F3139o9502l7533O1607p5340J4863J20802j11557k8488q1943L6934o32l8559
7327a46209L9424K2344M0296n0816p1308L0765O9166N1819J29450j46615r0889
7316a22573P6400J54460n3133n9249j33063k4917P1325N7122o2970J0377l3698
7305a19919J7603l5382N4436N9060M5146m5369m8397O7790J6680j09989l6627
7294a34968L8460M6344L8187k2058j8031J58151R6307j2436j42580j57057k622
7283a12303M0916j010O4670k6061r7820q9417J09507K4570l5332J54057L4258
$$ plain form
7363 108780 143590 105743 -86216 -82114 -61582 -26783 -55634 -63553 136043 18459 9476 47481
7351 47481 -22101 31467 -98510 -123850 -121413 -147776 -50023 -87790 -12151 -106075 -17983 63139
7339 63139 -6363 -43896 17711 -57629 -42766 78036 -33521 -62009 -143952 -107018 -107650 -146209
7327 -146209 -106785 -84441 -44145 -94961 -166269 -135504 -66338 -14519 114931 -31684 -122573
7316 -122573 -46173 108287 55154 -4095 -137158 -162075 -90750 -33628 -96598 -86221 -119919
7305 -119919 -102316 -137698 -83262 -24202 20944 -24425 -72822 -5032 11648 -98341 -134968
7294 -134968 -96508 -50164 -11977 -34035 -52066 106085 202392 189956 47376 -109681 -112303
7283 -112303 -71387 -72397 -7727 -33788 -131608 -221025 -111518 -86948 -122280 31777 66035
7272F6035l517l4485R534j10964N0577j10302k2768m3347J10495K042L343J24272
7260D0915j45047p3033k8019M5378J05788n5141m3465J23208M4433k5337j37168
7249a47488Q1468p3993p7062J62385m7408J4818J10953o1031j24805P3850K84182
7238A95869j33892j35210j0385j05251L4171J9015l8502J0799k6098R2855Q0169
7227a6460k36245P7411P0817J07553K7322k3941p7152K3915j28448M0313n4322
7216a89237l8122o7216k6214J21991J27017N7913m9623j31678M0727P6725j45320
7205b23037r879Q0673N846K548L9015p9986K7399J72525n9j7866l9558N0225P0483
7192G8329m0754l0385l3629J5883o4364J69317j08878k6075k8136l3245J98127
$$ plain form
7272 66035 62518 28033 37567 -73397 -22820 -133122 -155890 -199237 -88742 -86700 -83357 40915
7260 40915 -104132 -177165 -205184 -159806 -54018 -109159 -152624 -29416 15017 -10320 -147488
7249 -147488 -66020 -140013 -217075 -54690 -102098 -87280 23673 -37358 -162163 -88313 195869
7238 195869 61977 -73233 -83618 -188869 -154698 -135683 -174185 -163386 -189484 -96629 -16460
7227 -16460 -252705 -175294 -104477 3076 30398 6457 -70695 -46780 -175228 -134915 -189237
7216 -189237 -227359 -294575 -320789 -198798 -71781 -13868 -63491 -195169 -154442 -77717 -223037
7205 -223037 -232916 -152243 -146397 -143849 -104834 -184820 -157421 15104 15045 -2821 -42379 7846 78329
7192 78329 37575 7190 -26439 -10556 -74920 94397 -14481 -40556 -68692 -101937 96190
7181I6190N5425p3052j48957J9967K060o3786l848J49039l0778n6794K4324O6940
7169C6730j3353o7382k4971N3425m0618l268J59697o8597j97713L4374N5588o45
7157g6733J82822k4770j11496l4051L8177j80195o8774J69972p7749q5355Q1553
7146a86599P7198j07137j28905Q1844M5817J3839p3407J15926J5566P1001Q4493
7135I636q9974j26984K9995J2267K85L1876J11822r9989m8781J7724J8307o0424
7123a94240Q4950J18457j01382O3548q5511K4012O8230n3392k2397n2882j31128
7112b81735O7104N3624M6526p4259M8266R4246k1933p2048K7391J52606L2577
7101G2365k02174l5051J42345Q0879L4727O8476j79532J4242l4612j16755J04539
$$ plain form
7181 96190 151615 78563 -70394 -50427 -48367 -112153 -116001 33038 2260 -54534 -30210 36730
7169 36730 23377 -44005 -68976 -15551 -56169 -59437 100260 31663 -166050 -131676 -76088 -76733
7157 -76733 106089 81319 -30177 -64228 -26051 -206246 -275020 -105048 -182797 -268152 -186599
7146 -186599 -109401 -216538 -345443 -263599 -217782 -203943 -277350 -161424 -145858 -74857 9636
7135 9636 -80338 -207322 -177327 -165060 -164775 -132899 -21077 -121066 -169847 -152123 -133816 -194240
7123 -194240 -109290 9167 -92215 -28667 -114178 -90166 -21936 -75328 -97725 -150607 -281735
7112 -281735 -214631 -161007 -114481 -188740 -140474 -46228 -68161 -140209 -112818 39788 72365
7101 72365 -129809 -164860 -22515 58364 93091 161567 -17965 -3723 -38335 -155090 -50551
7090e0551R2475J65265n3758l0513m4136R2685K6332O497J9321J23793j53931
7079A93479j26245J13489J02516L2712j03858j4887O9287k30496j45447J20713
7069A1263L4776n9065k4147Q4605m9391K5963j6327j0420k0360R241J1219j34175
7057a36818j31115J11688Q1832o495j17471N235J18160m6340R5429M9617k26751
7046b03029M7473K0948r9531L0116Q8477Q4706l2987j33672o8529J61408m3385
7035a48005L9494O6799J0850p5574M8884P3310j03561l7211o7890J29645J71011
7024A07752j40974l9822O8194j1029q7481J2598q345j34474n4040J10441O9473
7013a07707m5929K9301n0773p9647O1336P3667m2885K798M8767O0283n3750P0298
$$ plain form
7090 -50551 41924 207189 153431 122918 78782 171467 197799 204296 223617 347410 193479
7079 193479 67234 180723 283239 315951 212093 197206 266493 35997 -109450 11263
7069 11263 46039 -13026 -37173 47432 -1959 24004 7677 -2743 -23103 -13862 -2643 -136818
7057 -136818 -267933 -156245 -74413 -80908 -198379 -193144 -74984 -121324 -25895 23722 -203029
7046 -203029 -155556 -134608 -234139 -204023 -115546 -30840 -63827 -197499 -266028 -104620 -148005
7035 -148005 -108511 -41712 -30862 -106436 -57552 15758 -87803 -125014 -192904 -63259 107752
7024 107752 -33222 -73044 -4850 -15879 -103360 -90762 -99107 -233581 -287621 -177180 -107707
7013 -107707 -153636 -124335 -175108 -254755 -193419 -119752 -162637 -159839 -111072 -50789 -104539 -34241
7001c4241R5176k28940n863P3132j01094R7026Q1055n5653j15206P7815Q3969
6990c2824p3115o9755k4778O931N3854k7693M970j6875K1738k2643k9330K7166
6978a82354l8813k7624P3473j6810J18977o9911N5279o7000j43195J8761J17707
6967a61510K3259j64771J19836J52378O3766j20140J3289j10327R3267N5681j20880
6956a56152n624m6471k2141P9582N47L218J1761m3973J1493P5965q7684l5095
6944b14574R7358K3670J54945j32479N9384Q7819j39008j41076l9825Q7593p7824
6933b34017N1265o55P4740M9671j4619m7548m0539R2096K2920k477n6448m6881
6921a52492o297k1817M0101n3563L9092o7795m7316p561J9171p6358q8356K8934
$$ plain form
7001 -34241 60935 -168005 -173868 -100736 -201830 -104804 -23749 -79402 -194608 -116793 -32824
6990 -32824 -105939 -175694 -200472 -193541 -139687 -167380 -162410 -179285 -157547 -180190 -209520 -182354
6978 -182354 -221167 -248791 -175318 -192128 -73151 -143062 -87783 -154783 -297978 -279217 -161510
6967 -161510 -138251 -303022 -183186 -30808 32958 -87182 -73893 -184220 -90953 -35272 -156152
6956 -156152 -161776 -208247 -230388 -150806 -150259 -147041 -135280 -179253 -167760 -91795 -179479 -214574
6944 -214574 -117216 -93546 61399 -71080 -11696 76123 -62885 -203961 -243786 -156193 -234017
6933 -234017 -182752 -183407 -108667 -58996 -73615 -121163 -161702 -69606 -46686 -49163 -105611 -152492
6921 -152492 -158789 -180606 -140505 -194068 -154976 -222771 -270087 -277648 -258477 -334835 -423191 -394257
6909c94257K17834j4913L3271j6193m4287m3856M8461l7688k16595L1282J6923
6898d20018N4910L5607K7620q3853Q0427Q358J8015J3562J39p7299M2249L9817
6886b60466R9992r1467k3398J91323j08043q4207O5154k738J0272l1785M5504
6875a89859r5896K6300J17483m4004l0360j21003J41549J04520l1174j13511j1685
6864b47640K7065L096J6501k9052o0043j295j3032M143J9808j06876J1965N54
6852c74806N2765j02442J23774j9924R6864L6635j4575p2139k35484M9056J51771
6841c08505P0417M5560k2065j49286o7726J11608J03291K0863q3090j17926J47069
6830b49790L1937n5383j34383N4773R1839L613j8589K9911k9147o0111j3927J62893
$$ plain form
6909 -394257 -176423 -191336 -158065 -174258 -218545 -262401 -213940 -251628 -468223 -436941 -420018
6898 -420018 -365108 -329501 -301881 -385734 -305307 -296949 -278934 -265372 -265233 -342532 -300283 -260466
6886 -260466 -160474 -251941 -275339 -84016 -192059 -276266 -211112 -213850 -203578 -235363 -189859
6875 -189859 -285755 -259455 -141972 -185976 -216336 -337339 -195790 -91270 -122444 -235955 -247640
6864 -247640 -220575 -217479 -200978 -230030 -290073 -291368 -304400 -300257 -280449 -387325 -375360 -374806
6852 -374806 -322041 -424483 -300709 -320633 -223769 -187134 -201709 -273848 -509332 -460276 -308505
6841 -308505 -238088 -192528 -214593 -363879 -431605 -319997 -216706 -195843 -278933 -396859 -249790
6830 -249790 -217853 -273236 -407619 -352846 -261007 -257394 -275983 -246072 -275219 -335330 -349257 -186364
6818a86364L4729K8579j21486L1786r1176M7240j08952N6419R3620j37003K3782
6807c28826k4190J98349j18915j45497J35779n764k0538j08006N7921l995J3794
6796c49888M185J696M8243p2929J12087n1355l5735J35949P2368o8763o3458J3225
6784b54375N1414O2284N6464K7443o4268j95293k2867J28776K1177j0234J8598
6773a80881j9180K4349J0956P0086m918k3399n8271M9074L1446K4377P605j25884
6761a94640j05347M4833l9986J61755R3506j7951j99890L1073p5848p7958J45763
6750b34690p0418P5289J66093l214p5404n8258J103j39208J11422P0570j01838
6739b58553J42280J8844o8763p5977j9712K6037j09154Q0415l9746l4799N6713
$$ plain form
6818 -186364 -151635 -123056 -244542 -212756 -303932 -256692 -365644 -309225 -215605 -352608 -328826
6807 -328826 -353016 -154667 -273582 -419079 -283300 -289064 -309602 -417608 -359687 -363682 -349888
6796 -349888 -345703 -344007 -295764 -368693 -256606 -307961 -343696 -207747 -135379 -204142 -267600 -254375
6784 -254375 -202961 -140677 -84213 -56770 -121038 -316331 -339198 -210422 -189245 -199479 -180881
6773 -180881 -200061 -175712 -164756 -94670 -99588 -122987 -181258 -132184 -100738 -76361 -68756 -194640
6761 -194640 -299987 -255154 -295140 -133385 -39879 -57830 -257720 -226647 -302495 -380453 -234690
6750 -234690 -305108 -229819 -63726 -66940 -142344 -200602 -199499 -338707 -227285 -156715 -258553
6739 -258553 -116273 -97429 -166192 -242169 -261881 -235844 -344998 -264583 -304329 -339128 -282415
6728b82415l7488J10748j5814L1622l7189l9388k934n0370L0921Q2411j05759
6717c15655m980o0057k0054P034k4193P5411J9314j47199q3335J94924N8136l7735
6705c38389m3612m7247Q6263q3588p6472L5787M5274k880j10460J10419R5395
6694c29510m1762n0780k3154P0048L5728l4893J88921q0244k17206q7850Q243
6683e62459Q8490Q3950K5746m9782L0133j0036P5546l7452M2481M9798m7046p3177
6671c83808P804j54418P9397o1433M1139L6496p702Q147L2095P0630l8989j11251
6659d81893o6034N8014j026K83P8134M4645p141Q722n2814n4696m5579j1888J84625
6646c46648j04639l3521J09814L7765j60144j7316J00959m3706P5306k3551M1423
$$ plain form
6728 -282415 -319903 -209155 -224969 -193347 -230536 -269924 -272858 -323228 -292307 -209896 -315655
6717 -315655 -320635 -380692 -400746 -393712 -417905 -342494 -323180 -470379 -553714 -358790 -300654 -338389
6705 -338389 -382001 -429248 -342985 -426573 -503045 -467258 -421984 -424864 -535324 -424905 -329510
6694 -329510 -371272 -422052 -445206 -375158 -339430 -374323 -185402 -265646 -482852 -570702 -562459
6683 -562459 -473969 -390019 -364273 -414055 -383922 -393958 -318412 -355864 -313383 -263585 -310631 -383808
6671 -383808 -376004 -530422 -451025 -512458 -471319 -434823 -442525 -434378 -402283 -331653 -370642 -481893
6659 -481893 -547927 -489913 -490939 -490656 -412522 -367877 -375018 -366296 -419110 -473806 -519385 -531273 -346648
6646 -346648 -451287 -484808 -374994 -337229 -497373 -514689 -413730 -457436 -382130 -405681 -364258
6635c64258L5819K6235j12209l1638O2482M4269l5312q0771N0632J67687r2247
6624c29311J078O5557o4897J8018J91218o3811j51226N9867R7518r138o66o6752
6612b52545l2517J5403N1958K1490l996K9936J02270J80j29177P3399J24395q7482
6600h6686r6568o0801P1485J19817n078n9578j47150R5909J99069J21614p7158
6589G4875k13540o7875n0647K8109j24880P0648J72852k6450l8559N7814J27794
6578A0141R9238j13531r0236m4219J03861l0672k3043P6201m2603j45112p5188
6567b75163k1785K7209j44130N367P524L8878J81756j6593p8034J14327L1259
6556a29385K6891N1582M280R4961K0564L5477l0124J21761J8609J47731p1120
$$ plain form
6635 -364258 -328439 -302204 -414413 -446051 -383569 -339300 -374612 -455383 -404751 -237064 -329311
6624 -329311 -328233 -262676 -327573 -309555 -118337 -182148 -333374 -273507 -175989 -185127 -185793 -252545
6612 -252545 -285062 -269659 -217701 -196211 -200207 -170271 -68001 -67821 -196998 -123599 796 -86686
6600 -86686 -183254 -244055 -172570 -52753 -57831 -117409 -264559 -168650 30419 152033 74875
6589 74875 -138665 -206540 -257187 -229078 -353958 -283310 -110458 -136908 -175467 -117653 10141
6578 10141 109379 -4152 -94388 -138607 -34746 -65418 -88461 -12260 -54863 -199975 -275163
6567 -275163 -296948 -269739 -413869 -408502 -400978 -362100 -180344 -196937 -274971 -160644 -129385
6556 -129385 -102494 -50912 -46632 48329 68893 104370 74246 196007 214616 362347 291227
6545B91227N9632P5437n0201j54283k7877k6751m5526N385O2010M573R7784O8638
6533C60048P0537r959K2105j47999j31428J09935r0489L157Q4656j08848p2546
6522H9169J17464N9949J29078J19266j38357q5657j60942p7162o8560j72185L5768
6511a52169O6247Q7240j57392L5110J68470J02013j4648K1200K9708j72955m4047
6500c1223o9421j12395n1736N8322k5054L194q3135J717N2410N5386J8730j5307
6488a98512j5333M5956L1321r0591K889p2928P8466M6413K9942n3544j1849J12092
6476i5678j6626Q6718l727R6807j04972j08098K2117J06749Q8772j48831m6558
6465a23327m3336J61952p9250N187q1396Q1406J00342j5250n906J5956L8291L407
$$ plain form
6545 291227 350859 426296 376095 221812 193935 167184 121658 127043 189053 193626 291410 360048
6533 360048 430585 420626 442731 294732 163304 273239 182750 185907 270563 161715 89169
6522 89169 206633 266582 395660 514926 376569 290912 129970 52808 -15752 -187937 -152169
6511 -152169 -85922 1318 -156074 -120964 47506 149519 134871 156071 185779 12824 -31223
6500 -31223 -100644 -213039 -264775 -206453 -231507 -228313 -311448 -309731 -257321 -201935 -183205 -198512
6488 -198512 -213845 -167889 -136568 -227159 -224270 -297198 -218732 -172319 -142377 -195921 -207770 -95678
6476 -95678 -112304 -25586 -29313 67494 -37478 -145576 -123459 -16710 72062 -76769 -123327
6465 -123327 -166663 -4711 -83961 -78774 -160170 -78764 21578 6328 422 16378 54669 58076
6453E8076r4072k7311n8075P812m2411m0089K2277n9730K1792J3166n4211j630
6441b54406O440O698J22102j62539J3010Q1906L3315p9838r6493J11022m719N2104
6429a71398m9231l2755k3691m999K55905j13493n7199k6134M7483N4049l524j3396
6417a38383m1680J4504J9771M3765j5483N7181K3428J06343M6067m9921l1238
6406C4354q3893K5973k9352L3387N8486l0936L8312j5763N8083J38297Q1656L4361
6394C42965J86979P5051O491M0413N5923J5632q6058p5031n3322R1025k0287K4261
6382F04042N9325r5642M0306l2451J23618J22076o4061r7665K9507J16765J38585
6371I44405N3169j5196o7052O5462k2632j29479J03733m6312q1152r4184n1678
$$ plain form
6453 58076 -35996 -63307 -121382 -113570 -155981 -196070 -173793 -233523 -211731 -198565 -252776 -254406
6441 -254406 -247966 -241268 -119166 -281705 -268695 -186789 -153474 -233312 -329805 -218783 -223502 -171398
6429 -171398 -220629 -253384 -277075 -282074 -26169 -139662 -196861 -222995 -175512 -121463 -124987 -138383
6417 -138383 -180063 -165559 -145788 -102023 -117506 -60325 -36897 69446 115513 65592 34354
6406 34354 -49539 -23566 -52918 -19531 38955 8019 46331 30568 88651 226948 308604 342965
6394 342965 529944 604995 611486 651899 707822 723454 637396 562365 509043 600068 579781 604042
6382 604042 663367 567725 608031 575580 699198 821274 757213 659548 689055 805820 944405
6371 944405 997574 982378 915326 980788 958156 828677 932410 886098 804946 710762 659084
6360F59084J02360k1803J9268k5831M2604J82503j2989m1477Q9195k3304J0286
6349I79896O0060Q7011J43315o4760J61789J72404j22280r695O7605J73701N6434
6338A705480J6361J49094K28111J55258q068K7895J72382J70328J61934K51075
6328C029850K95879K25258K28432M27181M53212P84293P59652Q79144R16156R73836
6318H972893J194695J672549K470335L955516O330005R286580J1209322J0578067
6310E5669962O133252q2976n435895p881329p828171o308868m373512k588092
6302B7304371r94533P41622L440094O815446J0007868J0874683P716882J693807
6294F7600240m612932q906327r932363q753997o896147n016102l705686k923549
$$ plain form
6360 659084 761444 739641 758909 733078 775682 958185 945196 903719 992914 969610 979896
6349 979896 1039956 1126967 1270282 1205522 1367311 1539715 1417435 1407740 1475345 1649046 1705480
6338 1705480 1721841 1870935 2099046 2254304 2246236 2274131 2446513 2616841 2778775 3029850
6328 3029850 3325729 3550987 3779419 4206600 4659812 5444105 6203757 7082901 7999057 8972893
6318 8972893 10167588 11840137 14310472 18265988 24595993 33882573 45091895 55669962
6310 55669962 61803214 61720238 56284343 48403014 40574843 34265975 29892463 27304371
6302 27304371 26309838 27051460 30491554 37307000 47314868 58189551 65906433 67600240
6294 67600240 62987308 54080981 44148618 35394621 28498474 23482372 19776686 16853137
6286A6853137k272646j773603j331880j047766p47404n28229m22059l86029k17882
6277H125639k44899p0815j9071p5847j95465j90108m9137l9034l63019k16362
6267F661882p853J55169r115R0455J55599N6811K46575M19142L25953K73244M15977
6256H783839N76723M57795M54804O24389Q99525J157388J430565J706602J823064
6247A7914694K165494K776909L941187O374634J0503940J6117728K0782232K0701557
6239A01278375J4487667L423431p431739j3994326j5177186j2842833r545469
6232F0197920o236161l231258k7549M302097J0340866J6049083J9050661J5740038
6224A16185697O621527m889300j3772855j7185012j6480539j3207031j0233432
$$ plain form
6286 16853137 14580491 12806888 11475008 10427242 9679838 9151609 8729550 8343521 8125639
6277 8125639 7880740 7809925 7790854 7715007 7519542 7329434 7280297 7241263 6878244 6661882
6267 6661882 6654029 6809198 6800083 6890538 7046137 7102948 7349523 7768665 8094618 8367862 8783839
6256 8783839 9360562 9818357 10273161 10897550 11797075 12954463 14385028 16091630 17914694
6247 17914694 20080188 22857097 26798284 33172918 43676858 59794586 80576818 101278375
6239 101278375 115766042 119189473 111757734 97763408 82586222 69743389 60197920
6232 60197920 53961759 50730501 50702952 55005049 65345915 81394998 100445659 116185697
6224 116185697 122807224 117917924 104145069 86960057 70479518 57272487 47039055
6217D7039055p878497n917310m685606l689700k968573k243657j837466j560030
6209A6258216j195976j079004p23910o09299n67991m11930m44313n51771m79873
6200A0194149m37502l12805l63904l03748l41620l67722m02649k12368j81522
6191G270309k66929m8561l0756j68751j81028m2243j71357l58000k15970j32577
6181E654137k58912k17612j95052r3694k31269J8712j02690j29172O1823o0826
6171D445445j2897q5048l2445k77872r2506r3846k05966k4675O7680J0597q0617
6160C617850q7441k07457j1181O2338j7004j37277j2191K02870o2329j94399j81980
6149B971799l1394j01309Q0414j38095j03801L075J73917J21294n5282j47095
$$ plain form
6217 47039055 39160558 33243248 28557642 24867942 21899369 19655712 17818246 16258216
6209 16258216 15062240 13983236 13259326 12650027 12082036 11670106 11225793 10674022 10194149
6200 10194149 9756647 9443842 9079938 8776190 8434570 8066848 7664199 7451831 7270309
6191 7270309 7003380 6954819 6924063 6755312 6574284 6532041 6360684 6002684 5786714 5654137
6181 5654137 5395225 5177613 4982561 4888867 4657598 4676310 4573620 4444448 4506271 4445445
6171 4445445 4432548 4347500 4315055 4037183 3944677 3850831 3644865 3620190 3687870 3698467 3617850
6160 3617850 3530409 3322952 3311771 3374109 3357105 3219828 3207637 3410507 3348178 3153779 2971799
6149 2971799 2940405 2839096 2919510 2781415 2677614 2680689 2854606 2975900 2920618 2773523
6139B773523q1089R6724K8451J16707J8548M8074N2035q5384o0283p3338R8672
6128B932640J35404j89599q2424J21351M0306r2996J51425J65535R5069M4673
6118C321384J61281J49797p2560L0496Q9386m7432Q3621K36486K08748L37295
6108D498502L08828J61222N2928L30353L35040L90901M81600M41632N66145N29416
6098H096567N97242N48020O74660R24802J254831J580562J867688K434005K605681
6089B0584058L386322N243490Q259758J2943042J8186212K1248081J7904848Q071569
6081A15827380m359423j3429755j6612723j5426069j2118053q898859o462328
6074C8520170m749328l367938k043501j315038l42301K60689R45813K049595L673366
$$ plain form
6139 2773523 2692434 2789158 2817609 2934316 2952864 3000938 3052973 2967589 2907306 2833968 2932640
6128 2932640 3068044 2878445 2796021 2917372 2957678 2864682 3016107 3181642 3276711 3321384
6118 3321384 3482665 3632462 3559902 3590398 3679784 3632352 3715973 3952459 4161207 4498502
6108 4498502 4807330 4968552 5021480 5351833 5686873 6077774 6559374 7001006 7567151 8096567
6098 8096567 8693809 9241829 9916489 10841291 12096122 13676684 15544372 17978377 20584058
6089 20584058 23970380 29213870 37473628 50416670 68602882 89850963 107755811 115827380
6081 115827380 111467957 98038202 81425479 65999410 53881357 44982498 38520170
6074 38520170 33770842 30402904 28359403 27044365 26702064 26962753 27908566 29958161 33631527
6065C3631527O764593J1961963J8221404K2140250J9541431R626880l582871j3951513
6057A04353664j7872317j6768653j3447168j0234837p636946n921062m624054
6050B7848627l763156l037598k281629j682795j399780j221976q41990p22019
6042A2897684n90949o18898l27833k05055k11028k11564k38988o5173k03120q0863
6032A0144213P2417R4537J72379J25035J68220M64249N23270O70884R20475J243685
6022A4599364J648887J927075J775617J334154J074795J167793K265154M673969
6014C0466808Q297769J1004553J0781115O442175o11496o476265r056260q962229
6006D1886170p211893n387369l906993k732259j905748j240900p68709j10050
$$ plain form
6065 33631527 40396120 52358083 70579487 92719737 112261168 121888048 118305177 104353664
6057 104353664 86481347 69712694 56265526 46030689 38393743 32472681 27848627
6050 27848627 24085471 21047873 18766244 17083449 15683669 14461693 13619703 12897684
6042 12897684 12306735 11687837 11360004 11154949 10943921 10732357 10493369 10428196 10225076 10144213
6032 10144213 10216630 10311167 10483546 10608581 10776801 11241050 11764320 12435204 13355679 14599364
6022 14599364 16248251 18175326 19950943 21285097 22359892 23527685 25792839 30466808
6014 30466808 38764577 49769130 60550245 66992420 66380924 59904659 50848399 41886170
6006 41886170 34674277 29286908 25379915 22647656 20741908 19501008 18732299 18622249
5998A8622249J88375O16579J131051J828100L500370O142301R915548J3129870
5990E5074443J3487180R298902J882655n149522r180918j0029738q935827p228929
5982C9218246n889667m838066m034344l162101k494288j883704j567472j177185
5974A4171419r57760n94146n24705k94792j5934O8771L25049L52701O0732J40784
5964A2732119k8564k15109n78150o45242p60501q55413p55924q16457n66740n06384
5954G003635l92501l93500m13792k95891m06501l49441j70320n4252K845p6270
5944D454012r1747j22106j23744j32993o8710j55197o1763O2686n5930j70248
5934C534260n6377j04507l7946k0128M520Q3423K35288K60014K8404p409K07942
$$ plain form
5998 18622249 18810624 19427203 20558254 22386354 25886724 32029025 41944573 55074443
5990 55074443 68561623 77860525 79743180 74593658 65412740 55383002 46447175 39218246
5982 39218246 33328579 28490513 24456169 21294068 18799780 16916076 15348604 14171419
5974 14171419 13213659 12619513 12094808 11800016 11784082 11852853 12177902 12530603 12591335 12732119
5964 12732119 12703555 12488446 11910296 11265054 10504553 9649140 8893216 8076759 7510019 7003635
5954 7003635 6611134 6217634 5803842 5507951 5101450 4752009 4581689 4527437 4530282 4454012
5944 4454012 4362265 4240159 4116415 3983422 3914712 3759515 3697752 3760438 3704508 3534260
5934 3534260 3477883 3373376 3335430 3315302 3319822 3403245 3638533 3898547 3926951 3919542 4127484
5923D127484J78787j1223R7428K0142k06475k29360j79158j01873j36169P437
5913C567020L4979k71972l16071j02732r1486j42420k53681j32854M6299K465
5903B339547k9521J21196N2191N7165J13329m8545j69493R378j26640j77750p0610
5892B070247j05427k46584n7185k07363j89826M4290p993O688j12923L7227j01131
5881A130020J11712j36684m1103m011q650J2963j07078N3004j65560L1190l2741
5870H43062J50274J89547O7401j15504j21471m9748j89405k2380P1787Q0313J0742
5859I14618l2928o1438p4610J7348J61339L8886N3582N3317n4426p5287m7316
5848H93085o8969j17202q3332O6866O0938M0351j72028j02154M2114M3328o6943
$$ plain form
5923 4127484 4306271 4295048 4392476 4412618 4206143 3976783 3797625 3695752 3559583 3567020
5913 3567020 3601999 3330027 3013956 2911224 2819738 2677318 2423637 2290783 2337082 2339547
5903 2339547 2310026 2431222 2483413 2540578 2653907 2605362 2435869 2445247 2318607 2140857 2070247
5892 2070247 1964820 1718236 1661051 1453688 1263862 1308152 1300159 1306847 1193924 1231151 1130020
5881 1130020 1241732 1105048 1063945 1059934 1051284 1064247 957169 1010173 844613 875803 843062
5870 843062 993336 1182883 1250284 1134780 1013309 963561 774156 751776 823563 903876 914618
5859 914618 881690 820252 745642 762990 924329 963215 1016797 1070114 1015688 940401 893085
5848 893085 824116 706914 623582 690448 751386 791737 619709 517555 559669 602997 536054
5837E36054n3388J45050j2794j12268m7368J65291L6067m4126r4856o043m8337
5826D63282M8813o5661M5914N9948O1929M8636O3894l469j22955r3372j18193
5815C88766J1447J31023O4385k8429O6461q2140J21224j3384q0188N5376O6838
5804G01379r9368K4757N5651M14o7379J49203J80582J92654K51264K57921K25191
5793A872269J22477k20303k30512r5244j00176j64082j00735n578k57505o3887
5783G56724O0427n0204P2888J69835j7664L2043J30686J17106L01484K93642M6572
5772A913539l785j58448j66724j3599r4041l34171k13278l0721O477J46351M0201
5761A091801r5295q420p9366m2017K17305Q1836O7010Q9405J1182j7846p0442
$$ plain form
5837 536054 482666 627716 614922 502654 455286 620577 656644 612518 517662 511619 463282
5826 463282 512095 446434 492348 552296 614225 662861 726755 723286 600331 506959 388766
5815 388766 400213 531236 595621 567192 633653 551513 672737 659353 579165 634541 701379
5804 701379 602011 626768 682419 682833 615454 764657 945239 1137893 1389157 1647078 1872269
5793 1872269 1994746 1774443 1543931 1448687 1348511 1184429 1083694 1078116 820611 756724
5783 756724 817151 766947 839835 1009670 992006 1024049 1154735 1271841 1573325 1866967 1913539
5772 1913539 1909754 1751306 1584582 1570983 1476942 1142771 929493 898772 905249 1051600 1091801
5761 1091801 996506 988086 908720 866703 1084008 1165844 1232854 1322259 1333441 1315595 1245153
5750A245153j44227L8716J37548j69810q9676j28951O4481r4178j47836j28071
5740E83149l4003O294p8747j48344R4145K56113j65262Q08j47151q2218J01837
5729C86621J41558Q3533j55569j60648K7484K8704R1238j5703p3650n8376N1624
5718C46816l0563j08309q6177M7950l593J34956m8788j34015n1869j84904Q99
5707a17597O5276J53578p2014j8184n4477j06412Q9003J91862M6240M9849r6511
5696A30613m3964L5381O9116q145j46632k5981N1010o4658L3147M2844K202j36429
5684f1496L949K4749O7788J6773L0830k5729K25943J70887q1258l0696q7701J00062
5672C54101k22460p1783P1530J51148l8987j97134N5096L6255J20279O0833p1807
$$ plain form
5750 1245153 1100926 1139642 1277190 1107380 1017704 888753 953234 859056 711220 583149
5740 583149 549146 555440 476693 328349 422494 678607 513345 514153 367002 284784 386621
5729 386621 528179 611712 456143 295495 322979 351683 442921 427218 353568 295192 346816
5718 346816 316253 207944 121767 169717 166124 301080 252292 118277 66408 -118496 -117597
5707 -117597 -52321 101257 29243 11059 -43418 -149830 -60827 131035 177275 227124 130613
5696 130613 86649 122030 191146 183001 36369 10388 61398 -3260 29887 72731 74933 -61496
5684 -61496 -57547 -32798 34990 51763 82593 56864 282807 453694 372436 341740 254039 354101
5672 354101 131641 59858 131388 282536 243549 46415 101511 137766 258045 318878 247071
5661B47071p774l269J06501M132j44077j3493M9669J9900N6897k8250j7417J10042
5649C79932k6049j51077J4164J22953M5345j40808r387J41782o0035M3503j2233
5638C48090j01308J3485P6523J5123q6047l4616k8772Q8237m1298k51678k472
5627d733J00183P1151N882p4548M9894O5628j85358K7602k7468j39480k4530K14710
5615G8933R5529j27659J38246N3154J14211J49009m4119n0517J2369l8980J07701
5604D87877n0766l3038M0837l0095M8256J4625k00811m5961j28165j24703O6234
5593D4290j6362l3417L3955Q456J96086Q5520Q4123L3425Q6714K9026m2082j1018
5581D98716j42332j04949n0288J34890O8860J09517m9120j37439j48632q0520
$$ plain form
5661 247071 239297 236028 342529 346661 202584 189091 238760 258660 315557 287307 269890 379932
5649 379932 353883 202806 216970 339923 385268 244460 235073 376855 316820 360323 348090
5638 348090 246782 260267 336790 351913 265866 231250 202478 290715 249417 -2261 -4733
5627 -4733 95450 166601 172483 97935 147829 213457 28099 55701 28233 -111247 -135777 78933
5615 78933 174462 46803 185049 238203 352414 501423 457304 406787 419156 380176 487877
5604 487877 437111 404073 444910 414815 463071 477696 276885 230924 102759 -21944 44290
5593 44290 27928 -5489 28466 36922 233008 318528 402651 436076 522790 551816 509734 498716
5581 498716 356384 251435 201147 336037 404897 514414 465294 327855 179223 98703
5571I8703N782j69413j49997J03251j33238M439J10962m9946Q4688J15818o6986
5560d5937n5957j0376m4162q7364j11229Q6434K5378J39252R2843j1691m8267
5549g1076P7890j05346j57448J65383l3183p4707J29875L9028k10481K2458N2761
5538a64846j56584K6633n0657M2220J13313l0650l1337l111p7542k9424N27l5287
5526c96745P1336O1458j09412R100L8181K6107K2747m1383j21n3331K2010N6825
5514b93228j26101J56700n7811P854J13697K0851m4701j17844O5864j8282N3756
5503b39245j23508j02778j25552J11227k4748J7952l224L9598J18367J06526m525
5492b29910l5002j41706m8091r812J3995m8593J17537R5738j62967r324L351Q747
$$ plain form
5571 98703 104485 -64928 -214925 -111674 -244912 -240473 -129511 -179457 -94769 21049 -45937
5560 -45937 -101894 -112270 -156432 -243796 -355025 -268591 -243213 -103961 -11118 -22809 -71076
5549 -71076 6814 -98532 -255980 -90597 -123780 -198487 -68612 -29584 -240065 -217607 -164846
5538 -164846 -321430 -294797 -345454 -303234 -189921 -220571 -251908 -255019 -332561 -361985 -361458 -396745
5526 -396745 -325409 -263951 -373363 -364263 -326082 -299975 -277228 -318611 -318732 -372063 -350053 -293228
5514 -293228 -419329 -262629 -320440 -312586 -198889 -178038 -222739 -340583 -274719 -293001 -239245
5503 -239245 -362753 -465531 -591083 -479856 -504604 -486652 -489876 -450278 -331911 -225385 -229910
5492 -229910 -264912 -406618 -454709 -464521 -450526 -499119 -381582 -285844 -448811 -458135 -454784 -446037
5480d46037L5474K3695O7532l5334k7814l6852P8292R9088M8393j41002j2151
5469c46716p574l9395P8385m3137p1320j12874m0097k2688J20543J94198J93251
5458i7424o5991k25561J3860m2539l2654J03556M8983M9562p0320l4177r0240
5447d42945J4314j5004J22111m5723p6701N9936l2274o5924j18224Q6709J75220
5436c38505j5250j06661K9949J6317J8337Q8842m3697P8077l1787n653m8549j1340
5424c69920P5876J9196m3325q0630j5427j2078l0902j226r3029P0159o3294k1048
5412e65648J10908Q2707N7970r5534N018J8628J0117J3399M8471k1432M8404K28083
5400e8909J3017j00589j8053k02717q9760J23642P3002O8234l5460K8772R2867
$$ plain form
5480 -446037 -410563 -386868 -319336 -354670 -382484 -419336 -341044 -241956 -193563 -334565 -346716
5469 -346716 -354290 -393685 -315300 -358437 -429757 -542631 -582728 -605416 -484873 -290675 -97424
5458 -97424 -163415 -388976 -375116 -417655 -450309 -346753 -297770 -248208 -318528 -352705 -442945
5447 -442945 -428631 -443635 -321524 -367247 -443948 -384012 -416286 -482210 -600434 -513725 -338505
5436 -338505 -353755 -460416 -430467 -414150 -395813 -306971 -350668 -272591 -304378 -310031 -358580 -369920
5424 -369920 -294044 -274848 -318173 -398803 -414230 -426308 -457210 -458436 -551465 -481306 -544600 -565648
5412 -565648 -454740 -372033 -314063 -409597 -404579 -385951 -375834 -362435 -313964 -335396 -286992 -58909
5400 -58909 -45892 -146481 -164534 -367251 -457011 -333369 -260367 -192133 -227593 -198821 -105954
5389a05954J13678O4114O6590Q7610J3117o248q2395m8605P8218L3522P0938P126
5377B91711j53189J42984K5250o9183J50051m8746J26192J21910Q9313j32275
5367E44018N7598K03309k48839J988N3153L4330L3953L405l8652P5419n2242J09576
5355G77016O5469l4643Q027o1206k311N973O5435K6342J09083M4072q4868P4794
5343I93183L8259O9953o8607O9063m26o0337m2540M015J7738r5066J42033R295
5331A076563q6704m6054M714R9808j1875q1355P8923j8270J9536K7222o6618P1995
5319A067885L4179J40958O860J48574O9533p0704J15462l6152N1116K04337J49750
5308A881798Q3456j2915m9079l5534l5976Q5654J00204Q3408J23350J41709J50255
$$ plain form
5389 -105954 7724 71838 138428 226038 239155 232907 150512 101907 180125 213647 284585 291711
5377 291711 138522 281506 306756 237573 387624 338878 465070 586980 676293 544018
5367 544018 601616 804925 556086 558074 611227 645557 679510 682915 644263 719682 667440 777016
5355 777016 842485 807842 815869 754663 752352 758325 823760 850102 959185 1003257 918389 993183
5343 993183 1031442 1101395 1032788 1101851 1101425 1041088 998548 1002563 1020301 925235 1067268 1076563
5331 1076563 989859 943805 948519 1048327 1036452 955097 1034020 1015750 1035286 1062508 995890 1067885
5319 1067885 1102064 1243022 1249882 1398456 1467989 1397285 1512747 1476595 1527711 1732048 1881798
5308 1881798 1965254 1952339 1903260 1867726 1831750 1917404 2017608 2101016 2224366 2366075 2516330
5297B516330K26186J74232O7115J34574K35607M40832K24644J81896L88653L72663
5287D962732M17782O44437P52860Q58757J588211K642131M025962N155875M470928
5278B5519675J542866j363169k729600k599680j688453p81233j35984J182054
5270A8946476K958353N340561P388956P605909O183666M209386K049800Q33039
5262E5516146J042786L75433r50800j149588j64914P60044J44319k38252Q83322
5253E6218496K503737K628354J883086K371973L619042M666154M998788L741043
5245H2630673J057887k330625m170200m260790l203691j406327r49649k057369
5237F5309909k591110j714529m15648r18356j983882j275564J25554O55984Q67672
$$ plain form
5297 2516330 2742516 2916748 2983863 3118437 3354044 3794876 4019520 4201416 4590069 4962732
5287 4962732 5380514 6024951 6777811 7636568 9224779 11866910 15892872 21048747 25519675
5278 25519675 27062541 25699372 22969772 20370092 18681639 17900406 17764422 18946476
5270 18946476 21904829 27245390 34634346 42240255 48423921 52633307 54683107 55516146
5262 55516146 56558932 56934365 55983565 54833977 54669063 55429107 55573426 55335174 56218496
5253 56218496 58722233 61350587 63233673 65605646 69224688 73890842 78889630 82630673
5245 82630673 83688560 81357935 77187735 72926945 69723254 68316927 67367278 65309909
5237 65309909 62718799 61004270 60588622 59670266 57686384 56410820 56536374 57192358 58060030
5228E8060030J610075J644158N65973j707673m409866o651033p648646o838910
5220C4624108n075784l712174k488246j280373K96655J803783L375802L414668
5212C0958439R44311k346985m100968m078801l276922k737943k161940j441819
5204A1757372j289080j051017p02876o97797n39358l76058l65011l90264j24912
5195F220999k64803l13275l54888j71387l77197j49726k0388j10050j53631j99309
5185D106345k47935j09028r9250k1362j84561k74505j42007j33212m800j3223
5175B876462J1451o2268k93592o4543J37942j89794j48053j14997n3832N5069
5165B153845J4337j21238n0431j27467l1566J26488k4652k28809j927j47818J81355
$$ plain form
5228 58060030 59670105 61314263 61880236 60172563 55762697 49111664 41463018 34624108
5220 34624108 29548324 25836150 23347904 22067531 22364186 24167969 27543771 30958439
5212 30958439 31902750 29555765 25454797 21375996 18099074 15361131 13199191 11757372
5204 11757372 10468292 9417275 8714399 8016602 7477244 7101186 6736175 6345911 6220999
5195 6220999 5956196 5642921 5288033 5116646 4739449 4589723 4569335 4459285 4305654 4106345
5185 4106345 3858410 3749382 3650132 3628770 3444209 3169704 3027697 2894485 2889685 2876462
5175 2876462 2887913 2825645 2532053 2467510 2605452 2415658 2267605 2152608 2098776 2153845
5165 2153845 2168182 2046944 1996513 1869046 1837480 1963968 1939316 1710507 1708580 1560762 1742117
5154A742117J65848j1519N7339m3261j21845L7859P2698p4552m3832N3955N5821
5143A890628J43631N3516p0538k91968J58774k79450k05039o8013k44228K35154
5133A322467m2897j24586k5339J5041J3504O886K9089K3731J02348N7759J34019
5122A512022j37055O3873q0053l6757N6917R423O1402n8246j15089O0477p7072
5111A259842J2618J15111P735O7972N3117L4714k5528L2142O8692Q714O0137J4757
5099A710023Q7585Q5609o5139K5517j08206p785J61635O3309k7096l1224O4075
5088A958303r1357k24940R031j5178q4048M5523L2122R9498R9115n48J00747J10493
5076B038761J77591m0335K5884J7459O3443n7612J33016L4336J0024m6933l7339
$$ plain form
5154 1742117 1907965 1896446 1953785 1910524 1788679 1826538 1899236 1824684 1780852 1834807 1890628
5143 1890628 2034259 2087775 2017237 1725269 1884043 1604593 1399554 1331541 1087313 1322467
5133 1322467 1279570 1154984 1129645 1144686 1158190 1165076 1194165 1217896 1320244 1378003 1512022
5122 1512022 1374967 1438840 1358787 1322030 1378947 1388370 1449772 1391526 1276437 1336914 1259842
5111 1259842 1272460 1387571 1395306 1463278 1516395 1551109 1525581 1557723 1626415 1635129 1695266 1710023
5099 1710023 1797608 1883217 1818078 1843595 1735389 1727604 1889239 1952548 1925452 1894228 1958303
5088 1958303 1866946 1642006 1651037 1635859 1551811 1597334 1629456 1728954 1828069 1827521 1928268 2038761
5076 2038761 2216352 2176017 2201901 2219360 2282803 2225191 2358207 2392543 2402567 2355634 2318295
5065B318295m1730K8616r7311o5595j02023O0452n6509K2318N6106J36436J32169
5054B391224l5452J4500J4568j28783L1485j47644l08161Q0508Q0696j37309n3554
5043A802078k8504O786O6019Q5347o0826l8988L3144j12049M4216K2222n5545
5032A763900k8048j25962o4068K8026j07547j6527M4957j01410R1295r684j74729
5021A300203m0409J2026L1811l2609L3792J7658J54306K7670K15581P7926O1113
5010A859068r6602j16459n4373j76812j43K7656q1048r541M534K5276J49626J95204
4998A726386K3154N8334j45878J2361J56814p7944p1648K4086m2849m4757P4950
4987A693009J31530Q1329k3738J04357J34006J50997P5698K34022P4979J33513
$$ plain form
5065 2318295 2276565 2305181 2207870 2142275 2040252 2100704 2044195 2066513 2122619 2259055 2391224
5054 2391224 2355772 2370272 2384840 2256057 2287542 2139898 1831737 1912245 1992941 1855632 1802078
5043 1802078 1773574 1780360 1846379 1931726 1870900 1831912 1865056 1753007 1797223 1819445 1763900
5032 1763900 1735852 1609890 1545822 1573848 1466301 1449774 1494731 1393321 1484616 1474932 1300203
5021 1300203 1259794 1271820 1303631 1271022 1304814 1322472 1476778 1504448 1720029 1797955 1859068
5010 1859068 1762466 1646007 1591634 1414822 1414679 1442335 1361287 1351746 1356280 1381556 1531182 1726386
4998 1726386 1749540 1807874 1661996 1674357 1831171 1753227 1681579 1705665 1662816 1618059 1693009
4987 1693009 1824539 1905868 1882130 1986487 2120493 2271490 2347188 2581210 2656189 2789702
4977B789702J25515K00525Q0545j78114K8471l1911j28362j22633o0109J68330
4967B871959R7254N6983M3075R5595n1987m2691K12555J27517N9706N0178J26383
4956C646527j56685K34378K61095J42141J02730k04566j73719K8p591K746k14608
4945C632476j749K17599N8740J94788J32296J56483J81220L2333M1403k0838L3574
4934D658325J1597J2523l7938K17361J28917K11042K07955J95714J08709M6176
4924E760381K4824O5344J62235l4900K9250J05806J59608J03536J53774M06659
4914F936517J57965J11228J53917K22250J23610K79270K23188J64183L26728M45061
4904I143917M69587M25416O52271N10847L74333M01870O09057L22499L62932N90579
$$ plain form
4977 2789702 2915217 3115742 3196287 3018173 3046644 3014733 2886371 2763738 2703629 2871959
4967 2871959 2969213 3026196 3069271 3164866 3112879 3070188 3282743 3410260 3469966 3520144 3646527
4956 3646527 3489842 3724220 3985315 4127456 4230186 4025620 3851901 3851929 3844338 3847084 3632476
4945 3632476 3630727 3848326 3907066 4101854 4234150 4390633 4571853 4604186 4645589 4624751 4658325
4934 4658325 4669922 4682445 4644507 4861868 4990785 5201827 5409782 5605496 5714205 5760381
4924 5760381 5785205 5850549 6012784 5977884 6007134 6112940 6272548 6376084 6529858 6936517
4914 6936517 7094482 7205710 7359627 7581877 7705487 7984757 8207945 8372128 8698856 9143917
4904 9143917 9613504 10038920 10691191 11202038 11576371 11978241 12587298 12909797 13272729 13863308
4894A3863308P99287O96420P63720Q60773R53495R90928J219973J365248J660390
4885B3173542J931503K294990L548337O418041J1229232J7907502K2511621J8773352
4877A07788120O182354p749974j5064209j5306310j1735087q236071n567545l697428
4869D6613850k217255p15600N74752K200188L974426P044368J2324436J9200468
4861H8999633K4132771K3437146J7926941J3784146J0874261M041851q525146
4854A74671603j9348964k2586003j9199527j3696133q866085n111098k307543
4847H3556250o7175K065953M550707O849928J0019057J4624745K0663054K6353067
4839A68615586K6284221J6124237j50154j2436830j6796651j4882819j1827471
$$ plain form
4894 13863308 14662595 15359015 16122735 16983508 17937003 18927931 20147904 21513152 23173542
4885 23173542 25105045 27400035 30948372 37366413 48595645 66503147 89014768 107788120
4877 107788120 113970474 106220500 91156291 75849981 64114894 55878823 50311278 46613850
4869 46613850 44396595 43680995 44255747 46455935 50430361 57474729 69799165 88999633
4861 88999633 113132404 136569550 154496491 168280637 179154898 183196749 174671603
4854 174671603 155322639 132736636 113537109 99840976 90974891 85863793 83556250
4847 83556250 83489075 85555028 90105735 96955663 106974720 121599465 142262519 168615586
4839 168615586 194899807 211024044 210873890 198437060 181640409 166757590 154930119
4832A54930119r688998q092521o948242n336707l998627k499617r24899J088647
4824A18529155K867902N204042O923164Q538122R247058R508089J0193372J1495299
4816A82506203J3855822J6494203J7604515J6506268J3805075R902145O164176
4809B76838407L461494J610821j35361k712194n870152q271966r237046q316853
4801B47367150o575688n180539m186653l665629k055261R75243M297961O561984
4793B37538568P102717N891046L999473K762999K431447L521133M722779N719342
4785B73689504O245755O031163O270832P062218P375496O020873L135220P5094
4777C15906155j729060j729197n74088j05569j309598m179429p920252j0367030
$$ plain form
4832 154930119 145241121 137148600 130200358 124863651 120865024 118365407 117440508 118529155
4824 118529155 121397057 126601099 133524263 142062385 151309443 160817532 171010904 182506203
4816 182506203 196362025 212856228 230460743 246967011 260772086 270674231 276838407
4809 276838407 280299901 281910722 281775361 279063167 273193015 264921049 255684003 247367150
4801 247367150 240791462 235610923 231424270 227758641 225703380 226678623 230976584 237538568
4793 237538568 244641285 250532331 254531804 257294803 259726250 263247383 267970162 273689504
4785 273689504 279935259 285966422 292237254 299299472 306674968 312695841 315831061 315906155
4777 315906155 314177095 312447898 311873810 311768241 310458643 306279214 298358962 287991932
4769B87991932j0452277q527145o294022m757172m955137n725276n811098n366996
4761B36102809n018398n631466o688591p048299o071516m235924k138153j115615
4753A98154847j421772k309985k946008k708546j889271r37746p64478k239266
4745A82937775m325909o334432p439971p724960p460985p257161p627629p944872
4737A26821856q202271q309793p822825p322382o609047n844626n648779n436372
4729G1625761n239594m321197l656182l125483k511524k310479k176530k179468
4721D6105304k051480j866025j556375j300945j252569j179375j155614j356386
4713C4386535j246517j202295j044858q55220p28756o80469o40862n19327l90717
$$ plain form
4769 287991932 277539655 269012510 262718488 257961316 253006179 247280903 241469805 236102809
4761 236102809 231084411 225452945 218764354 211716055 205644539 201408615 199270462 198154847
4753 198154847 196733075 194423090 191477082 188768536 186879265 185941519 185177041 182937775
4745 182937775 178611866 172277434 164837463 157112503 149651518 142394357 134766728 126821856
4737 126821856 118619585 110309792 102486967 95164585 88555538 82710912 77062133 71625761
4729 71625761 66386167 62064970 58408788 55283305 52771781 50461302 48284772 46105304
4721 46105304 44053824 42187799 40631424 39330479 38077910 36898535 35742921 34386535
4713 34386535 33140018 31937723 30892865 30037645 29308889 28628420 27987558 27468231 27077514
4704B7077514n49365n40286n19426m24543m68039n12768m03450m24400n29437
4695B2705800n50036n43661l55874l44787m57292m43371m34727k88045o36459
4686A8651548l33962m43456m47823l27205k29989j11234j94082k23774n0462k39382
4676A6050179l14897j93904l49552k55356k39295l40289j34633j00025k87485
4667A3834743k10760j78604o6805k52324k35070q1965q3098l20309k20511k26074
4657A1959223M4610j3301m911P6875j0097k1028k23881j11334j69030n0988j52416
4646A1323722k4134j12318j90893j23077k61133k70974k5991P3924j4788J52281
4636A0526619J86563J10200J81585P275k1336p4150j90263k03859k72694r3527
$$ plain form
4704 27077514 26528149 25987863 25468437 25043894 24575855 24063087 23659637 23235237 22705800
4695 22705800 22155764 21612103 21256229 20911442 20454150 20010779 19576052 19288007 18651548
4686 18651548 18317586 17874130 17426307 17099102 16869113 16757879 16563797 16340023 16289561 16050179
4676 16050179 15735282 15541378 15191826 14936470 14697175 14356886 14222253 14122228 13834743
4667 13834743 13623983 13445379 13378574 13126250 12891180 12809215 12726117 12405808 12185297 11959223
4657 11959223 12003833 11990532 11985621 12062496 12052399 12031371 11807490 11696156 11527126 11476138 11323722
4646 11323722 11299588 11187270 10996377 10873300 10612167 10341193 10315202 10389126 10374338 10526619
4636 10526619 10713182 10823382 11004967 11012242 10990906 10916756 10726493 10522634 10249940 10156413
4626A0156413l8828J15112K99976J54195J00424M2204o9229l01437q3032k21174
4616A0154624j37776j43178m9208K7410J41189J10840O6815K10454m3368j30534
4606A0207268j81582j31993j67974O5636J35746J20559J39655J82854J13463L28460
4596A0812092K40953K37638L25098L99552M41938N11180N47639Q91348J168657
4587A5576095J431436J788372K290207K722207L695108N982353J0336451J6908142
4579F0730371K2189780K1004630J1253214k527758j2675311j5454121j2829340
4572G1691465q509831m577196L10960O297947J3800187J9314752J7680043P436445
4564A23444772n582246j3947632j5363650j1485711n245022K292975J0176165
$$ plain form
4626 10156413 10117585 10232697 10532673 10686868 10787292 10829496 10760267 10458830 10375798 10154624
4616 10154624 10016848 9873670 9824462 9851872 9993061 10103901 10170716 10381170 10337802 10207268
4606 10207268 10025686 9893693 9725719 9791355 9927101 10047660 10187315 10370169 10483632 10812092
4596 10812092 11053045 11290683 11615781 12015333 12457271 12968451 13516090 14407438 15576095
4587 15576095 17007531 18795903 21086110 23808317 27503425 33485778 43822229 60730371
4579 60730371 82920151 103924781 115177995 112650237 99974926 84520805 71691465
4572 71691465 63181634 58604438 58915398 65213345 79013532 98328284 116008327 123444772
4564 123444772 117862526 103914894 88551244 77065533 71820511 74113486 84289651
4557H4289651J5085361J2757897L145019p753240j4446126j4880687j1585166
4550F6612709q016443m056305N23665O362773J2772888J5988402J1938732J354287
4542A03480708r249992j5105163j5122676j2108637r169840o739103n443779m186206
4534B6355312l093244k194671j834148j295428j014109q11592p34025o30124o31865
4525A4116106m89255m23121l73548l82534l74899l25516l87042l23016l57496
4516A0679679j29841k40024k28014l36240j90636j96672j89475k95354k50213
4507H623210j53259j18143k12842k00589j73359r2310J48735q0388k21427k59148
4497G260480o7725r7874j19531M2369j82072j75175P5232r7524r5756q1653k3554
$$ plain form
4557 84289651 99375012 112132909 115277928 107524688 93078562 78197875 66612709
4550 66612709 58596266 54539961 55063626 61426399 74199287 90187689 102126421 103480708
4542 103480708 94230716 79125553 64002877 51894240 42724400 35985297 30541518 26355312
4534 26355312 23262068 21067397 19233249 17937821 16923712 16112120 15378095 14747971 14116106
4525 14116106 13626851 13203730 12830182 12447648 12072749 11747233 11360191 11037175 10679679
4516 10679679 10549838 10309814 10081800 9745560 9554924 9358252 9168777 8873423 8623210
4507 8623210 8469951 8351808 8138966 7938377 7765018 7672708 7821443 7741055 7519628 7260480
4497 7260480 7192755 7094881 6975350 7017719 6835647 6660472 6735704 6638180 6542424 6460771 6437217
4486F437217R9228j8626j43749k65524r9761o9491l8375J67993J0578r9414l8319
4475E941757L8053j27546k38854r2683o7115j59981m6289J8364j71440j32570
4465D961696q902k5794J3836r1446K252J92835J10622J52902k7651J30345P1700
4454E482395j28404j90619k06334k04002q3865m3968k13528m6368j19267j47261
4444D098779j15374J72191M4022J4630J43709O723J61199o1135J8758O107k09459
4433D280150M3000n2660j12790p3207J84043M4950r0531j1464P9262J73015N9000
4422D522768M1064L62654M07008M74639L99433j22679l34024m07875m23163j86641
4412D733184j10871n8155P5526J16878r9351J31840J85803Q9075K74789N9936
$$ plain form
4486 6437217 6536445 6517819 6374070 6108546 6008785 5939294 5900919 6068912 6079490 5980076 5941757
4475 5941757 5979810 5852264 5613410 5520727 5453612 5293631 5247342 5265706 5094266 4961696
4465 4961696 4952794 4927000 4940836 4849390 4851642 5044477 5155099 5308001 5280350 5410695 5482395
4454 5482395 5353991 5163372 4957038 4753036 4669171 4625203 4411675 4365307 4246040 4098779
4444 4098779 3983405 4155596 4199618 4214248 4357957 4364680 4525879 4464744 4483502 4489609 4280150
4433 4280150 4323150 4270490 4157700 4084493 4268536 4313486 4222955 4211491 4290753 4463768 4522768
4422 4522768 4563832 4926486 5333494 5808133 6207566 6084887 5750863 5342988 4919825 4733184
4412 4733184 4622313 4564158 4639684 4756562 4657211 4789051 4974854 5063929 5338718 5398654
4402E398654K15089J99560J20087J69393K08729L05253K04817J91323J08463j63087
4392F958281L9319j41734k4114j5847r8486n0973jM3995O9778N5924J55941L05755
4380G297838K01421J49888P8199P8007N5717j49475l18455l20848j90793l51842
4370F529657j63980j03313p2157l4371j06006l16538p2376k4704q5022n419R6120
4359E641891j32620J58872K9354k91371K1132J5363J03973M0418j2028p910k1354
4348E545720j8421N6989O1282J94530L4949L7895m4048j07659j01491k9910k7652
4337E602184r8511J47610K9988r5137j00043J37707J36510j18082K1859P0503
4327E734588R7350j9692q4871j71704n7502j7559P3085K44643p974o0995M7135
$$ plain form
4402 5398654 5613743 5813303 5933390 6102783 6311512 6616765 6821582 7012905 7121368 6958281
4392 6958281 6997600 6855866 6831752 6815905 6717419 6666446 6666445 6710440 6780218 6836142 6992083 7297838
4380 7297838 7499259 7649147 7727346 7805353 7861070 7711595 7393140 7072292 6881499 6529657
4370 6529657 6365677 6262364 6190207 6155836 6049830 5733292 5660916 5636212 5551190 5545771 5641891
4359 5641891 5509271 5668143 5697497 5406126 5427258 5442621 5546594 5587012 5574984 5567074 5545720
4348 5545720 5527299 5584288 5645570 5840100 5875049 5912944 5868896 5761237 5659746 5629836 5602184
4337 5602184 5503673 5651283 5681271 5586134 5486091 5623798 5760308 5642226 5664085 5734588
4327 5734588 5831938 5812246 5727375 5555671 5498169 5480610 5553695 5798338 5790364 5729369 5776504
4316E776504j11384P2149M4280q6324q1839M8791l9510o9763M5597j1303Q7545
4305E674743j12250N8312R675q9010J98539O5657P4691m2849M9167J3586q5943
4294E814318j08658j62553k03097L6402J8047r940j52257n1818O2428J03479P8708
4283E425059p7418L0302n4344J02137r3090j99732Q8828j09662r0233m0095Q5468
4272E067220n3589j5659K2150k9218j28587j15332q1449k9320M894q9551j02430
4261D449129q0970k9782o0589j68174K31505J13050k1340r0447r3483J10945r1572
4250D268272j69440N9873J32005l0274k0621N6958m6471J02095Q67m1038J10572
4239D422798J21962J35719Q7187J79389r8775K1012K4813j1734j03474j2973j27719
$$ plain form
4316 5776504 5665120 5737269 5781549 5695225 5613386 5662177 5622667 5552904 5598501 5587198 5674743
4305 5674743 5562493 5620805 5630480 5541470 5740009 5805666 5880357 5837508 5886675 5900261 5814318
4294 5814318 5705660 5543107 5340010 5376412 5394459 5384519 5232262 5180444 5242872 5346351 5425059
4283 5425059 5347641 5377943 5323599 5425736 5332646 5132914 5221742 5112080 5021847 4981752 5067220
4272 5067220 5013631 4997972 5020122 4990904 4862317 4746985 4665536 4636216 4641110 4551559 4449129
4261 4449129 4368159 4338377 4277788 4109614 4341119 4454169 4432829 4342382 4248899 4359844 4268272
4250 4268272 4098832 4158705 4290710 4260436 4239815 4296773 4250302 4352397 4353264 4312226 4422798
4239 4422798 4544760 4680479 4767666 4947055 4848280 4869292 4894105 4882371 4778897 4765924 4638205
4228D638205P5727J14642k532o6391K03297J09585M1496J22429N4128J26649K9769
4217E447004J2998J9167J04971j5417j35415J34686J10548O8495J11178J40958
4207E999173L0025P6075k4325K69242N8782K1156P1129J06481J25624K33240K83681
4196G250283J23545R0470J54026K87669K03977K69917J74959K81345M52012K91884
4186I580087K81705N43845N59567N78074P64662R94420J184153J348774J590483
4177A7425770J814657J999493J970465J806190J281036Q02256P01405M86403K84024
4168B8571699j4805l53682n15165l55720N3127N69462J339031K117049K761227
4159C4172223L657775M105891L322023K355407J354381Q89262R54479J018516
$$ plain form
4228 4638205 4713932 4828574 4826042 4759651 4962948 5072533 5114029 5236458 5290586 5417235 5447004
4217 5447004 5460002 5479169 5584140 5568723 5433308 5567994 5678542 5747037 5858215 5999173
4207 5999173 6029198 6105273 6080948 6350190 6408972 6430128 6501257 6607738 6733362 6966602 7250283
4196 7250283 7373828 7464298 7618324 7905993 8109970 8379887 8554846 8836191 9288203 9580087
4186 9580087 9861792 10405637 10965204 11543278 12307940 13302360 14486513 15835287 17425770
4177 17425770 19240427 21239920 23210385 25016575 26297611 27099867 27801272 28287675 28571699
4168 28571699 28556894 28203212 27688047 27332327 27385454 27954916 29293947 31410996 34172223
4159 34172223 37829998 41935889 45257912 47613319 48967700 49856962 50811441 51829957
4151E1829957J185237J334314J427768J234082R41274P83310J217383J415975
4143F1369300J869895K369655K331891J417729K35143m78947r07114m63842J180417
4134F8924127L129632N516492P929689Q894060P305638L949660N57500q74771
4126A05332027r05432L7730J050898J472244J496872J061650P46961M70953O49260
4117A11413163J064590J318471R61041K58667n99722j359663j821523j720420
4109A09514604p66296L97063K003082L855702N916757P668690Q892731Q698961
4101A46181294P686876O295743N273908N342286N751092N418685M016963K340541
4093A88307388J357363J609769K394660K679923J434055m35863j753973k456538
$$ plain form
4151 51829957 53015194 54349508 55777276 57011358 57952632 58735942 59953325 61369300
4143 61369300 63239195 65608850 67940741 69358470 69593613 69114666 68207552 67743710 68924127
4134 68924127 72053759 77570251 85499940 94394000 101699638 105649298 106206798 105332027
4126 105332027 104426595 104464325 105515223 106987467 108484339 109545989 110292950 110763903 111413163
4117 111413163 112477753 113796224 114757265 115015932 114416210 113056547 111235024 109514604
4109 109514604 108748308 109145371 111148453 115004155 120920912 128589602 137482333 146181294
4101 146181294 153868170 160163913 165437821 170780107 176531199 181949884 185966847 188307388
4093 188307388 189664751 191274520 193669180 196349103 197783158 197347295 195593322 193136784
4085A93136784k405185j505129j3267K316613N201441Q120237J0802514J2384936
4077B28038944J1712032Q495336L090075j904256m797478n280309m330382k571335
4069B32452627m37161J749605M141064O015392N946535L337511N51158j456938
4061B52299793j591592o91503L37533N60294j88500j745298m333483n707308m781929
4052B34158007k211031M45460R50915j101223m891875r362142j1927430j2589609
4044A93471072j1045826q695763o230794l449771j191937N87997J228229J009310
4036A65682517o6318j196165j792023k266834k853846l352083l699864l932411
4028A46522973l795630l054842j884201o11779O45040J012010l25059k986999
$$ plain form
4085 193136784 190731599 189226470 189213203 191529816 196731257 204851494 215654008 228038944
4077 228038944 239750976 248246312 251336387 249432131 244634653 239354344 235023962 232452627
4069 232452627 232015466 233765071 237906135 243921527 249868062 253205573 253756731 252299793
4061 252299793 250708201 250016698 250354231 250914525 250726025 248980727 244647244 238939936 234158007
4052 234158007 231946976 232392436 233343351 232242128 227350253 217988111 206060681 193471072
4044 193471072 182425246 173729483 167498689 164048918 162856981 163444978 164673207 165682517
4036 165682517 165616199 164420034 162628011 160361177 157507331 154155248 150455384 146522973
4028 146522973 142727343 139672501 137788300 137176521 137821561 138833571 138508512 135521513
4020A35521513o181569p780985p770517o865455n486052m301004k864906j690338
4012I2580687j051055j143052j919348k505587k753378k590254k101793j601058
4004G6915162j269541j346691j015252q98357p87934o52401m68075o40145r47542
3995F8889224j809497k422944l411267l933462l917026l630084k888620k231225
3987D4645099j788901j177618o72291o64064p06617p43602o57238m62063k49610
3978C7523095o30235r65474j199746j612180j907242k000765j674946j595190
3970B5937317j657308j247929j036877q98615q05036n69576n66951o67296n29158
3961A7958571m12953o54264m50721m08364l62302l09457m79634l03814k90982
$$ plain form
4020 135521513 129339944 121558959 113788442 106922987 101436935 97135931 94271025 92580687
4012 92580687 91529632 90386580 88467232 85961645 83208267 80618013 78516220 76915162
4004 76915162 75645621 74298930 73283678 72385321 71597387 70944986 70476911 69836766 68889224
3995 68889224 67079727 64656783 61245516 57312054 53395028 49764944 46876324 44645099
3987 44645099 42856198 41678580 41006289 40342225 39635608 38892006 38234768 37772705 37523095
3978 37523095 36892860 35927386 34727640 33115460 31208218 29207453 27532507 25937317
3970 25937317 24280009 23032080 21995203 21096588 20291552 19721976 19155025 18487729 17958571
3961 17958571 17545618 16891354 16440633 16032269 15669967 15360510 14880876 14577062 14286080
3952A4286080l86111k98344k98258k33239k72535j89652j52549k23125j69872
3943A2062395k59135k42150j75354l21455k42222j54844O0988k26492k02216j48039
3933A0151476k06954k8609j27379j06117o7982p0290j90367j36419j25986j78672
3923H912701o9073j23205m1242m1092q1269K8763j09900P9306L2174N4927q6612
3912H555478j85668K9220J9549K4454N0808p1854k1266Q1700j14961N3934O0219
3901H481613J36676J24473J07791M8468r573J47450k0489n9762r5617M1273J49605
3890I051908N2359K46098M4654K06629K96876K16359J56981K29759Q2036m6411
3880A0537248J22692K67941K59141K13189L56865L71085N03047M42993O23369
$$ plain form
3952 14286080 13899969 13601625 13303367 13070128 12797593 12607941 12455392 12232267 12062395
3943 12062395 11803260 11561110 11385756 11064301 10822079 10667235 10728223 10501731 10299515 10151476
3933 10151476 9944522 9915913 9788534 9682417 9614435 9544145 9353778 9217359 9091373 8912701
3923 8912701 8843628 8720423 8679181 8638089 8556820 8585583 8475683 8554989 8587163 8642090 8555478
3912 8555478 8369810 8399030 8418579 8443033 8493841 8421987 8400721 8482421 8367460 8421394 8481613
3901 8481613 8618289 8742762 8850553 8899021 8889448 9036898 9016409 8956647 8861030 8902303 9051908
3890 9051908 9104267 9350365 9395019 9601648 9898524 10114883 10271864 10501623 10583659 10537248
3880 10537248 10659940 10927881 11187022 11400211 11757076 12128161 12631208 13074201 13697570
3871A3697570P78654R23064J089214J271411J350827J466820J679243J617933
3863B3874736J199069N80073Q9579l76041r43002j427855j546214j448922j432658
3854A8568765j264678j239394r85303q60927p28140p68622p09271l99745m39295
3845A1173390m97621k90082k92307k91080k06912k34704l20426k56041j12795
3836H671422j26100m7468n9426j89444j84813q6942j13035q3103j22702j82701
3826G475688j03346m9364k796K6289K32163j41687j6651J20872j51039n7102j51302
3815G181725p6617j37492j73536m8790M8q8695r5623K1493R5583J02381M9138
3804F829615p7256j77480j91294K3557p1321j59194l01848p4441n6727j02408
$$ plain form
3871 13697570 14476224 15399288 16488502 17759913 19110740 20577560 22256803 23874736
3863 23874736 25073805 25653878 25743457 25367416 24424414 22996559 21450345 20001423 18568765
3854 18568765 17304087 16064693 15079390 14218463 13490323 12721701 12012430 11612685 11173390
3845 11173390 10675769 10385687 10093380 9802300 9595388 9360684 9040258 8784217 8671422
3836 8671422 8545322 8497854 8438428 8248984 8064171 7977229 7864194 7781091 7658389 7475688
3826 7475688 7372342 7322978 7320182 7346471 7578634 7436947 7420296 7541168 7390129 7333027 7181725
3815 7181725 7105108 6967616 6794080 6745290 6745338 6656643 6561020 6582513 6678096 6780477 6829615
3804 6829615 6752359 6574879 6383585 6407142 6335821 6176627 5874779 5800338 5743611 5641203
3794E641203J95078j02780j13151M0956K6243m0276k00260q4171q842j03281k54104
3783D996615R7625j01869j51254j14629q5682M4896Q0587L0444l1681l1429j44717
3772D588906M7943o134n2089j62352J00269j17019r8694p1362l9496O7173l9957
3761D217188J20235l4452L0445j1736r1541o6756K6968J84434m0287N9164J45496
3750D539158n9426o6323N9122r9689n0200P9205j24134p3863K4223q5001p7852
3739D065220J77576m2525j20805J73668N6087j37835J05964J64476j24322j10830
3729D206674j47055K6361J9287n8700p763n8310o5615J66435K5463l5232L032
3718D074577p4540k0048K4127L2540o5280K69986J09509k70969q6830n4040p2089
$$ plain form
3794 5641203 5836281 5733501 5620350 5661306 5687549 5647273 5447013 5362842 5354000 5250719 4996615
3783 4996615 5094240 4992371 4841117 4726488 4640806 4685702 4766289 4796733 4765052 4733623 4588906
3772 4588906 4636849 4630715 4578626 4416274 4516543 4399524 4300830 4229468 4189972 4257145 4217188
3761 4217188 4337423 4302971 4333416 4321680 4230139 4163383 4190351 4374785 4334498 4393662 4539158
3750 4539158 4479732 4413409 4472531 4372842 4322642 4401847 4277713 4203850 4228073 4143072 4065220
3739 4065220 4242796 4200271 4079466 4253134 4309221 4171386 4277350 4441826 4317504 4206674
3729 4206674 4059619 4085980 4105267 4046567 4038804 3980494 3914879 4081314 4106777 4071545 4074577
3718 4074577 4000037 3979989 4004116 4036656 3971376 4241362 4350871 4079902 3993072 3939032 3866943
3707C866943J4716m9790m9635Q248O4468n542q5226L1921K09410Q3963Q2157M7916
3695D219549M792j3868O7094O5137n145o3237j47327l04977m3731M2448n5637
3684C765098q1115j4260O8775J13361J49355J07946J55997m3290P8070m2946R8117
3673D355108O7709j65783L7773L6283n6263o1002j95150j33198p1661p5789j32619
3662C605408j65143J53522M3309N3351J36417J56539J83810J92288J17727J1369
3652D488597j71868j80488m4518j53287j07162j05895J7996j36553j52673p0206
3642C383943P4831J14221O3756J71406R008O8479J34302K14309J20841o9818j27810
3631D157468j31176k09430j54279n6714j8327q0869O7257J74601J87451O5366
$$ plain form
3707 3866943 3881659 3831869 3782234 3790482 3854950 3849408 3764182 3796103 4005513 4089476 4171633 4219549
3695 4219549 4224341 4210473 4277567 4342704 4337559 4274322 4126995 3822018 3778287 3820735 3765098
3684 3765098 3683983 3669723 3738498 3851859 4001214 4109160 4265157 4221867 4299937 4256991 4355108
3673 4355108 4422817 4257034 4294807 4331090 4274827 4213825 4018675 3885477 3813816 3738027 3605408
3662 3605408 3440265 3593787 3637096 3690447 3826864 3983403 4167213 4359501 4477228 4488597
3652 4488597 4316729 4136241 4091723 3938436 3831274 3725379 3743375 3606822 3454149 3383943
3642 3383943 3458774 3572995 3636751 3808157 3817165 3885644 4019946 4234255 4355096 4285278 4157468
3631 4157468 4026292 3816862 3662583 3605869 3587542 3506673 3573930 3748531 3935982 4001348
3621D001348j1952J43099J16027K77573K19983J51480J25455J50102Q7299j146
3611E259268r8288P1896K09670J30112j15283j0763j59069j69107m8683P1437
3601E141190p988m8599K88207K8978K71745J13804J27616J38803R514j16219P466
3590E954517J00732l2227O1588p5739k05516k11366k07257n3407K9026j47694
3580E212657J84311J60516Q8116R246K25630J64377L26399J87732J15012R5923
3570F769919O4777J88723j61515J60520P8587K36845K01392J34644M3644J57583
3560G875119K62785J55335J89798J84041L87069K04415J2419M3718J69748K5649
3550I510096K10810L94193N19383N58030N08696M56756M89005L33152K29490K93678
$$ plain form
3621 4001348 3989396 4132495 4248522 4526095 4746078 4897558 5023013 5173115 5260414 5259268
3611 5259268 5160980 5232876 5442546 5572658 5457375 5446612 5287543 5118436 5069753 5141190
3601 5141190 5133202 5084603 5372810 5401788 5673533 5787337 5914953 6053756 6063270 5947051 5954517
3590 5954517 6055249 6023022 6084610 6008871 5803355 5591989 5384732 5331325 5360351 5212657
3580 5212657 5396968 5557484 5645600 5654846 5880476 6044853 6371252 6558984 6673996 6769919
3570 6769919 6834696 7023419 6861904 7022424 7101011 7337856 7539248 7673892 7717536 7875119
3560 7875119 8137904 8293239 8483037 8667078 9054147 9258562 9270981 9314699 9484447 9510096
3550 9510096 9720906 10115099 10634482 11192512 11701208 12157964 12646969 12980121 13209611 13503289
3540A3503289J94403R6649K41383K82643L35361L77449P32740J041612J019747
3531A7825276J498988J676378K021833K048029J949346K014976J986700J770088
3523C2791614J247010O74122K8702n48340j104851j392041j388653j348953j403697
3514B7554913j307742j010934j070836r72169j127104j076365j144387j073930
3506A8771446j062987q82388r00536q62896p96145p39651n15280m89256o10817
3497A1911490m36611k64958n19517m19028m86132o20808m15001k96085k26410
3488H226940m99291l53758l91483k13812L6409j75769j93402l1571P1154n9652
3478F415765j28046k32745j19523j84860k36794m07505k47355l9836p3287j95966
$$ plain form
3540 13503289 13697692 13794341 14035724 14318367 14653728 15031177 15763917 16805529 17825276
3531 17825276 19324264 21000642 23022475 25070504 27019850 29034826 31021526 32791614
3523 32791614 34038624 34712746 34741448 34193108 33088257 31696216 30307563 28958610 27554913
3514 27554913 26247171 25236237 24165401 23193232 22066128 20989763 19845376 18771446
3506 18771446 17708459 16826071 15925535 15062639 14266494 13526843 13011563 12522307 11911490
3497 11911490 11474879 11209921 10690404 10271376 9785244 9164436 8749435 8453350 8226940
3488 8226940 7727649 7373891 6982408 6768596 6805005 6629236 6435834 6404263 6475417 6415765
3478 6415765 6287719 6054974 5935451 5750591 5513797 5106292 4858937 4819101 4745814 4549848
3468D549848p2178Q2382r7898n9007N0923j60090J73602J53303K15126P393J32610
3457D976014N0311r3759J2343J27641N0490m752M0115q9664p3971p9515k09772
3446D705481k15781k00689q4484o2347k43179n5012l447l9629n8153K10109M7609
3435D000478p3677K92481J51712m6682j31066j10233j69334j90762k28373k37031
3425C257513k20243q5391j63454j85704r412j72040J05470m3747j24013m6054
3415B312925M4971k20193j3944m4155j47261Q1226k0828p2647q2625J16510O6439
3404B020418M1548p2308P2658n7079j5908k03M4649M7773k645J14558J18517j9917
3392B292061M5257J03075N8040j4975N859N5195j75225N7916j02051o9518j86946
$$ plain form
3468 4549848 4477670 4560052 4462154 4403147 4454070 4293980 4467582 4620885 4836011 4843404 4976014
3457 4976014 5026325 4932566 4944909 5072550 5123040 5118288 5158403 5068739 4994768 4915253 4705481
3446 4705481 4489700 4289011 4204527 4142180 3899001 3843989 3840542 3800913 3742760 3952869 4000478
3435 4000478 3926801 4219282 4370994 4324312 4193246 4083013 3913679 3722917 3494544 3257513
3425 3257513 3037270 2951879 2788425 2602721 2593309 2421269 2526739 2482992 2358979 2312925
3415 2312925 2357896 2137703 2123759 2079604 1932343 2013569 1992741 1920094 1837469 1953979 2020418
3404 2020418 2061966 1989658 2062316 2005237 1989329 1989126 2033775 2081548 2078903 2193461 2311978 2292061
3392 2292061 2337318 2440393 2498433 2483458 2489317 2544512 2369287 2427203 2325152 2255634 2068688
3381B068688r2605O9675j27801J11465J6833J1487P2853M2948k5813L1003O0127
3370B238860j0395M7574k8059M8932k468j67591j26574j38269p5101N6595n1566
3359A791938j64575n0836L0613n5066K0460j70093L065Q7882j04476o0907Q6205
3348A414210n1695k5948m9957j9589M7961j1103L2687m2433j0832m8848r1234
3337A143219m0639K5178J63437j0340n5272n3901r143l8766R8987Q9026l8003
3326A273783J3739k3725j7900p9571L0283J06436Q3657j71517o8870l571j13028
3315A029716P8217l8080o3432J12612J8456r1556M6380J9941j3432r6414l828
3304I98580K0940m8138K13973J9132m8063j12744Q0120K0705k7987O9477O2977
$$ plain form
3381 2068688 1976083 2045758 1917957 2029422 2046255 2057742 2130595 2173543 2147730 2178733 2238860
3370 2238860 2228465 2276039 2247980 2296912 2294444 2126853 2000279 1862010 1786909 1843504 1791938
3359 1791938 1627363 1576527 1607140 1552074 1572534 1402441 1405506 1493388 1388912 1328005 1414210
3348 1414210 1362515 1336567 1286610 1267021 1314982 1303879 1336566 1294133 1283301 1234453 1143219
3337 1143219 1102580 1127758 1291195 1280855 1225583 1171682 1162539 1123773 1222760 1311786 1273783
3326 1273783 1287522 1263797 1245897 1166326 1196609 1303045 1386702 1215185 1146315 1142744 1029716
3315 1029716 1107933 1069853 1006421 1119033 1137489 1045933 1092313 1112254 1098822 1002408 998580
3304 998580 1019520 971382 1185355 1204487 1156424 1043680 1123800 1144505 1116518 1185995 1248972
3293A248972r2293K65j07846J0726O5065q8962O6374k4878K4951m6879j39823
3282I15672J45037P3400j74218q0153J09727J08812J39548K5611l0067m9393P2856
3271A256832P8258j13722l7957P036J03738P9584R0059k631j5297j36429P0324
3260A379795O0732j7701m8794n9131q5736Q4528J57127n7453o6211m33R6933L0884
3248A474540J5360M7171m1571J68510J17678r6524j07001Q4973l3812L8327J13956
3237A781607k6153O1773m927L2283j33712J66018J69117J18117j06058k5360J21074
3226B153779m5603J16306K25513K55842J11927J22603J19702O2453K69729K78175
3216C670426K98093K73309J97480L56040M95290N46352N38607O02227Q13232P58577
$$ plain form
3293 1248972 1156679 1156944 1049098 1059824 1124889 1035927 1102301 1077423 1102374 1055495 915672
3282 915672 1060709 1134109 959891 879738 989465 1098277 1237825 1263436 1233369 1183976 1256832
3271 1256832 1335090 1221368 1183411 1190447 1294185 1373769 1463828 1461197 1445900 1309471 1379795
3260 1379795 1440527 1422826 1374032 1314901 1229165 1313693 1470820 1413367 1347156 1346723 1443656 1474540
3248 1474540 1489900 1537071 1495500 1664010 1781688 1685164 1578163 1663136 1629324 1667651 1781607
3237 1781607 1755454 1817227 1812300 1844583 1710871 1876889 2046006 2164123 2058065 2032705 2153779
3226 2153779 2108176 2224482 2449995 2705837 2817764 2940367 3060069 3122522 3392251 3670426
3216 3670426 3968519 4241828 4439308 4795348 5290638 5836990 6375597 6977824 7791056 8549633
3206H549633P48725N91251K05994k2571n1291j52214j95539K2647R3306p6585
3196I713356j39614P080P1942P3946j26818j09505J95189o6327J94073K00480
3186A0013802J81660L01464J59621L89161N30188J035027J608458K597350L815947
3177B0632678M016872K450875j11828k284492k930670k718845k415809k126067
3169A4512714j597190j473795q23846o18436n99913m15238l83441k66438l30081
3160H004336k18239k08558j09095n2904L9914J52784O6508P4851K49314L47533
3150H346444M62883M61183N31902M93715M93632J13794k73629n31334q80875o60700
3140H557015o96099p42300o19961o81041m02463l18274l13016l19503k05633j88299
$$ plain form
3206 8549633 9298358 9889609 10095603 10073032 10021741 9869527 9673988 9696635 9789941 9713356
3196 9713356 9573742 9580822 9652764 9726710 9599892 9490387 9685576 9619249 9813322 10013802
3186 10013802 10195462 10496926 10656547 11045708 11575896 12610923 14219381 16816731 20632678
3177 20632678 24649550 27100425 26988597 24704105 21773435 19054590 16638781 14512714
3169 14512714 12915524 11441729 10617883 9999447 9399534 8984296 8600855 8334417 8004336
3160 8004336 7786097 7577539 7468444 7415540 7455454 7608238 7674746 7749597 7998911 8346444
3150 8346444 8809327 9270510 9802412 10296127 10789759 10903553 10629924 10098590 9217715 8557015
3140 8557015 7860916 7118616 6498655 5817614 5415151 5096877 4783861 4464358 4258725 4070426
3130D070426j54682j24932j51660j26908k82226j73890k1771j74261o1557j11552
3120B686987q1696j59932o7151j36934k25897J43390n239j93850r0212q3064j78363
3109A608039R4213n1935n9744l207K1629Q160j56338j13482l3098N6371j11905
3098A258703J4617m4096K7639J61942j01283J33292q167j1213j64914j22192m491
3087A139837j26864o8186P8554o272L9808n9081j31442J5943L5237q286M1160
3076I50408K5955n2912p730j55754k8650L5485M844r993K5343j5212J09832j7712
3064H63904o4045P5044o5954j11401k5851l5741M6244Q3022r5639n541K3917k3701
3052F64258k5j3288J4158o7274k4813N0235J46924K7741j4465p8373j26773N0538
$$ plain form
3130 4070426 3915744 3790812 3639152 3512244 3230018 3056128 3034357 2860096 2798539 2686987
3120 2686987 2605291 2445359 2378208 2241274 2015377 2158767 2153528 1959678 1869466 1786402 1608039
3109 1608039 1702252 1650317 1590573 1587366 1608995 1617155 1460817 1347335 1314237 1370608 1258703
3098 1258703 1273320 1229224 1256863 1418805 1317522 1450814 1442647 1431434 1266520 1144328 1139837
3087 1139837 1012973 944787 1023341 1017069 1056877 997796 866354 882297 917534 909248 950408
3076 950408 976363 923451 915721 759967 731317 766802 771646 761653 786996 771784 881616 863904
3064 863904 799859 874903 808949 697548 671697 635956 682200 765222 669583 664042 687959 664258
3052 664258 664233 650945 665103 597829 573016 623251 770175 797916 783451 705078 578305 628843
3040F28843j8674j19747J04605J4774j12343P0020L0052j6176L1007q2168r1983
3029D38210R305J802N022m5365j3206L2685k2272M4118K8150J44686M0515k8941
3017F34709m7831j14127O194l3516j22031J7462l6986j6374o1085J2260j470o3418
3005A73787P5050M8064O9840r5905M7991m0919L5778N1431J7466O2421Q1246o8222
2993D58028j44655j6959J21662p5539m2950R6634L919K2336L5426k4598p4353
2982C58951o3072j475M9677j50760J46072r424j2630L5242R3216p2157o8030M6337
2970C51947k4715n8447m6130P5165k9123k0329L1409Q214o8395Q8621r7783n8070
2958A52364R1933M6027k3410r447r8583M0785P2502K7679J0916q9280Q0390j29630
$$ plain form
3040 628843 610169 490422 595027 609801 497458 567478 597530 581354 612361 530193 438210
3029 438210 447515 449317 454339 408974 395768 428453 406181 450299 478449 623135 663650 634709
3017 634709 586878 472751 478945 445429 323398 340860 303874 287500 226415 238675 237205 173787
3005 173787 248837 296901 366741 270836 318827 277908 313686 365117 382583 445004 526250 458028
2993 458028 313373 296414 418076 342537 299587 396221 400140 422476 457902 433304 358951
2982 358951 295879 294404 344081 193321 339393 329969 317339 352581 445797 373640 305610 351947
2970 351947 327232 268785 222655 297820 268697 248368 279777 287991 219596 308217 210434 152364
2958 152364 244297 290324 266914 257467 158884 199669 272171 299850 310766 221486 301876 172246
2946A72246P1780J26720j00258j29995O5144r9635J5194m7604M6126J04352n2040
2935A72030J04343K4407n6865Q0531r6811j40840J55749L9245k8870j07296n5529
2924I0094O6531P0920J3565j6589o9305k9835m871J39446o835j72875o8594K14679
2912B26331O3331K7726j88240J07471M2425k8069n0290l8551o6924n8872J23993
2901A60331J24723J05263J4409r4805j02157N5952R7603O4589p5616p7041L3032
2890C06283Q892j62643j81697J32709K48375j04387J3039m8848j25331L3917p2742
2879D7567k7269J12780j00290J69933J14655r4547L7595l8000l4502O5765o9888
2868A83799j01382k4612J65614O0938r0901Q0810N4115J3996r6205j17793J5718
$$ plain form
2946 172246 244026 370746 270488 140493 205637 106002 121196 73592 119718 224070 172030
2935 172030 276373 300780 243915 324446 227635 86795 242544 281789 252919 145623 90094
2924 90094 156625 227545 241110 224521 155216 125381 120510 259956 253121 80246 11652 226331
2912 226331 289662 317388 129148 236619 279044 250975 200685 162134 95210 36338 160331
2901 160331 285054 390317 404726 309921 207764 263716 361319 425908 350292 273251 306283
2890 306283 315175 152532 -29165 103544 351919 247532 260571 211723 86392 120309 47567
2879 47567 20298 133078 32788 202721 317376 222829 260424 222424 187922 253687 183799
2868 183799 82417 57805 223419 284357 193456 274266 328381 342377 246172 128379 144097
2857A44097O6640J26062l5789j5107p2942n8891J8998n0364R4813J678p4226L7953
2845A82922m0380J3630P3172p614n6488K1927m7063m4741Q2615J6872j77714Q166
2833B5304O6496q9992O9419o0121N7433R6788o4166J1076R9647M1853l0098m5917
2821A77722J7778j03580q8884l9279M3013p5647N4450k3410p6856j2723K08953
2810H1537j8823n047K8407M5882l0495m9895R3907m923n1608K5654L6078q4847
2798F5827P0948k1526k658q615m401m9717n171N9376l2240j7131J64713J1874
2786B31279j25422j89407K5546j01069Q1691J33891R9934p8356L9031K9362n8758
2775H7722K4638l2813n1859M0683J2445K4110n6046n0948R0442k791j13755J62350
$$ plain form
2857 144097 210737 336799 301010 285903 212961 154070 173068 122704 217517 219195 144969 182922
2845 182922 142542 156172 229344 221730 165242 187169 140106 95365 177980 194852 17138 25304
2833 25304 91800 1808 71227 11106 68539 165327 101161 112237 211884 253737 223639 177722
2821 177722 195500 91920 3036 -36243 6770 -68877 -14427 -37837 -114693 -127416 81537
2810 81537 62714 57667 86074 131956 101461 51566 145473 140550 88942 114596 150674 65827
2798 65827 136775 115249 112591 103976 99575 49858 44687 104063 71823 54692 219405 231279
2786 231279 105857 -83550 -58004 -159073 -77382 56509 156443 78087 117118 146480 87722
2775 87722 112360 79547 27688 68371 80816 104926 48880 -2068 88374 85583 -28172 134178
2763A34178n7447k27741J03260J17352K8440L8356n2461j52541l408J66967N6224
2752A51179k880J55981j41791m1493M5022q5246p1298L5406J20408J3023r1382
2741H6929n0307j01237O6854J28590p0504j71341J38501k5747L536K0005L3957
2730E9236m0303j96411J92299N6922L6148j6976k026j02688m7081j3612P9562
2719E070Q418j4788N2650j8766j1698n7336n5386J42659J22950N123J1607j4673
2707A75830m6399O9706J5933o9469m6828r5868J36051k7025L9379R4307p6050
2696A69567m5103m7751j0852l3946j09003O4377O7420J55926m0712j2878m2056
2685A14989p5122J50279P362o3239p0109q6740J07207J72861l0473j22569j32552
$$ plain form
2763 134178 76731 -151010 -47750 69602 98042 136398 83937 -68604 -72012 94955 151179
2752 151179 148299 304280 162489 120996 166018 80772 9474 44880 165288 178311 86929
2741 86929 36622 -64615 2239 130829 60325 -111016 27485 1738 5274 25279 59236
2730 59236 18933 -177478 14821 71743 107891 90915 88889 -13799 -60880 -74492 5070
2719 5070 13488 -1300 51350 32584 20886 -36450 -91836 50823 173773 178896 190503 175830
2707 175830 129431 199137 215070 145601 98773 2905 138956 111931 151310 245617 169567
2696 169567 124464 76713 65861 31915 -77088 -12711 54709 210635 169923 157045 114989
2685 114989 39867 190146 197508 134269 64160 -22580 84627 257488 227015 104446 -28106
2674b8106L8929N9160j36594R7282M7602j74191o4924J85981J07978J3609r6344
2663E0382K0960P7829R6306j23053j0172k5544P8592o4535P0037L2202K2606M3715
2651B69325J4066q9585j30934Q2319K39380L24961J55563K31739J18366j56701
2641A058499l06781j09325r4964j60529j49023J7884j43842p6972Q7300o3869
2631E8378N389L6660q0129J25756N932k2397l3541q7289l1273J44629N4338p0198
2619A06255j8134n4493J9363j00197M05J54066p1536K36L6050K13o576M5184q0467
2606C0369j66525J26771R6193j25419Q925J0196O6830N2220m9024k982P6350j7776
2594A06128p2163j1118M7531k1294J03172l8082M3509q0747q8698J0525q1707
$$ plain form
2674 -28106 10823 69983 -66611 30671 78273 -95918 -160842 25139 133117 146726 50382
2663 50382 71342 149171 245477 122424 112252 86708 165300 100765 170802 203004 225610 269325
2651 269325 283391 193806 62872 145191 384571 709532 865095 1096834 1215200 1058499
2641 1058499 751718 642393 547429 386900 237877 255761 111919 34947 122247 58378
2631 58378 63767 100427 20298 146054 151986 129589 96048 8759 -22514 122115 176453 106255
2619 106255 88121 33628 52991 -47206 -46801 107265 35729 35965 72015 72228 65652 110836 30369
2606 30369 -136156 -9385 86808 -38611 -29686 -19490 47340 99560 50536 47554 123904 106128
2594 106128 33965 22847 70378 49084 152256 114174 157683 76936 -11762 -1237 -82944
2583h2944j5262J16211R7618K0450q9283l0826O1580j3132M3016q892J06720j16959
2571H8297N073l6359j35581J82048l5268L0126m1957L7156R4910k6311k2782Q4559
2559B23911q6739m9053K2727p5167k6772n783K2249J28909p326J2655L6668j6125
2547A80154n1277n5174J26354m481n1481l9427l2908j55699J61554q0820P4412
2536G1207J44560p2722N8174j05797J9899m2276O4888o6680m4529j8150O1928
2525G0502l57n7722q857m0955R4461m028j3589M9321r093J08974R3456K4252o1729
2512B44636k26129R0849Q740j4284J09271M1342j62659q3947m3244J30796Q4679
2501A80050j1046k14824m8713J09546J68508K5921n5511j03719K13948n0759q0999
$$ plain form
2583 -82944 -98206 18005 115623 136073 46790 15964 77544 64412 107428 98536 205256 88297
2571 88297 93370 57011 -78570 103478 68210 98336 56379 93535 188445 162134 139352 223911
2559 223911 137172 88119 110846 35679 8907 3124 25373 154282 146956 159611 196279 180154
2547 180154 128877 73703 200057 195576 144095 104668 71760 -83939 77615 -3205 71207
2536 71207 215767 143045 201219 95422 115321 73045 137933 71253 26724 8574 70502
2525 70502 70145 12423 3566 -37389 57072 53044 39455 88776 79683 188657 282113 306365 244636
2512 244636 18507 109356 118096 103812 213083 254425 91766 7819 -35425 95371 180050
2501 180050 169004 -45820 -94533 15013 183521 209442 153931 50212 264160 213401 132402
2490A32402O7849J09220P5019o9527J94062N6908j38925j60426J27294R3256m3643
2479D43489J31400L7658j36405L7817P8511j7977r6235l8128M8895m3682R3412
2468E38755j2146q4637l7319K09043N1065o3108n956j06196P8834j46170m4083
2457C78082J5331J10599J83454o035J3539l8946P3353O826j9440j0431o994k93
2445F99045p9791O3064p595N9122O4489m2845J04976J30126m1170j4927k8321
2434I06173M4017P2834l4074j56673m27J86466Q8101J5928j2376P5610Q7266m0481
2422A232364L0088J11218K20746P8726P3292k2763J53934J82891j68028M0720
2412A933188o9237j9973J21108J94872J12881P3088J66883K60070L20599J68806
$$ plain form
2490 132402 200251 309471 384490 314963 509025 565933 427008 266582 393876 487132 443489
2479 443489 574889 612547 476142 513959 592470 574493 478258 440130 489025 445343 538755
2468 538755 526609 441972 404653 613696 664761 601653 595697 489501 568335 422165 378082
2457 378082 393413 504012 687466 681431 694970 656024 729377 736203 716763 706332 699338 699045
2445 699045 619254 682318 674723 733845 798334 755489 860465 990591 949421 934494 906173
2434 906173 950190 1023024 988950 832277 831850 1018316 1106417 1122345 1109969 1185579 1272845 1232364
2422 1232364 1262452 1373670 1594416 1673142 1746434 1723671 1877605 2060496 1892468 1933188
2412 1933188 1863951 1843978 1965086 2159958 2272839 2345927 2512810 2772880 3093479 3262285
2402C262285K64752L62858P7792J73395O27446M48446J032957J272113J706228
2393I228272J961118J350741K13372j13742J45176P94284J056382J842477K336862
2384A8814942L274140M307015O477362J3300625L0461195M9917375N4579874K4780976
2376B05913504j7815950m0089550l9501407k6368135j9032055j3826798j0710226
2369C8569383q015136n952732m293334k594550j414095m75851K1321m91234j226908
2360A4126864j773069j470466j123738p04521o49767p24193m19657n74509m34979
2351F251965k55846j76481j17087k05828k52700m06656j62132n6020j12446j92124
2341D314645k34780q256j00461k68960j84480j90894j57959j01046j19832q4353
$$ plain form
2402 3262285 3527037 3889895 3967687 4141082 4768528 5216974 6249931 7522044 9228272
2393 9228272 11189390 12540131 12753503 12639761 12784937 13579221 14635603 16478080 18814942
2384 18814942 22089082 26396097 32873459 46174084 76635279 126552654 181132528 205913504
2376 205913504 188097554 148008004 108506597 82138462 63106407 49279609 38569383
2369 38569383 30554247 24601515 20308181 17713631 16299536 15823685 15845006 15353772 14126864
2360 14126864 12353795 10883329 9759591 9055070 8405303 7681110 7261453 6686944 6251965
2351 6251965 5996119 5819638 5702551 5496723 5244023 4837367 4675235 4619215 4506769 4314645
2341 4314645 4079865 4071609 3971148 3702188 3517708 3326814 3168855 3067809 2947977 2863624
2331B863624j46360P272q4363R986j87155j62260R2211j16039j4812q1229o5116
2320B115759O5347r5967j26590p5709L5922q42p4582j97536m3855J53755L8143
2309A793845l53622J17Q4237p4615n4402J1902j0714j06010m9642N7518J82203
2298A480817j61837j42185M0402p1355j78221l3826K02267N8106j75288p2476
2288I46404n2328r0791J27749r1187m1646l4952j09957j1890j1946J3930N7420
2277G00806n8153L7097n4017k7131J04723N3108m3038n3608n8668j3592P0079
2266F57606j650j10783m7948p749J90417R767l721N7153j68190j07065J32531
2255F00368P7207j14853j11800o3055L4019Q1459l7444L1674M0428l8999m2302
$$ plain form
2331 2863624 2717264 2724536 2640173 2650159 2463004 2300744 2392955 2276916 2262104 2180875 2115759
2320 2115759 2181106 2085139 1958549 1882840 1918762 1917920 1843338 1645802 1601947 1755702 1793845
2309 1793845 1440223 1440340 1524577 1449962 1395560 1407462 1396748 1290738 1241096 1298614 1480817
2298 1480817 1318980 1176795 1217197 1145842 967621 933795 1136062 1194168 1018880 946404
2288 946404 894076 803285 931034 839847 798201 763249 653292 641402 629456 643386 700806
2277 700806 642653 679750 625733 598602 703325 756433 713395 659787 601119 587527 657606
2266 657606 655956 545173 497225 489476 679893 689660 685939 743092 574902 467837 600368
2255 600368 677575 562722 450922 387867 421886 503345 465901 497575 538003 499004 456702
2244D56702J7520l1348N0779P102l1069L1646o4382l77k1578Q2922R111R621o8270
2231D48379m557j26558j56796J09515J01059j0521o8120j6040L6875J50073j22504
2220C40805j37124J43491k6934O1200J7003R73j30307M3175M0190n5388N5548
2209C52632P419r8474k3131Q3294J9742p7354m1266J14729K2401l4552K0929j62114
2197A84255K5402M5140K37452q8513k21936j20845L6718j25968l2886J49418K3191
2186A11428j1833k1954M661k2214r6970O1581r11J7822J38361J54869n6034j44641
2174A34165L4691j62601m1608N2293p140K7091R4654j67811L0089P7485j2638
2163E8670M4564J3846j14952J2332J81661M9295j30315p0633K6755O3663j01624
$$ plain form
2244 456702 474222 442874 493653 500755 469686 501332 436950 436573 414995 497917 507028 516649 448379
2231 448379 443822 317264 160468 269983 371042 360521 292401 276361 313236 463309 340805
2220 340805 203681 347172 320238 381438 398441 399414 269107 312282 352472 297084 352632
2209 352632 360051 261577 238446 321740 341482 264128 222862 337591 359992 325440 346369 184255
2197 184255 209657 254797 492249 403736 181800 60955 97673 -28295 -61181 88237 111428
2186 111428 99595 77641 82302 60088 -36882 24699 23788 41610 179971 334840 278806 134165
2174 134165 168856 6255 -35353 16940 9800 36891 131545 -36266 -6177 71308 58670
2163 58670 103234 117080 2128 14460 196121 245416 115101 44468 71223 134886 33262
2152C3262J0033J5591L1689P5146p3131j10265O3276J4596J40284p7502j2957
2141A10022m9809r1424N0910M9780J79135J8679K8716r9011j8577k3083M0663
2130A96001k670j67616R0710M7187j92753k9992q3484J17306P7212J8191N6591
2119A26683l1562Q4486O1582N2095p6850Q4404P1692j7554J9088J71318K80400
2108H25782J15789j2047j6263l27457j5527l2395j51552k40882J7247j29403R9844
2097A33136p6556j03456O2062Q6825J30272j97460J1515K2776n4997l4293P8482
2086E8306Q8954J5532j13004l0621L6123q3557n8327R5390J41205O0404j18071
2075I2334q7145j53711R2555J02789n384N9590P1837n2211M6091o9420J33305
$$ plain form
2152 33262 43295 58886 90575 165721 92590 -17675 45601 60197 200481 122979 110022
2141 110022 60213 -31211 19699 69479 248614 267293 296009 196998 178421 155338 196001
2130 196001 193331 25715 116425 163612 -29141 -59133 -142617 -25311 51901 70092 126683
2119 126683 95121 179607 241189 293284 216434 300838 372530 354976 374064 545382 825782
2108 825782 941571 929524 913261 585804 570277 537882 386330 145448 162695 33292 133136
2097 133136 56580 -46876 15186 102011 232283 34823 46338 69114 14117 -20176 58306
2086 58306 147260 162792 49788 19167 55290 -28267 -86594 8796 150001 210405 92334
2075 92334 5189 -148522 -55967 46822 41438 101028 172865 120654 166745 97325 230630
2064B30630l4666j31171j04449M5519J6526j77571N7803J5402o0829p3466J61796
2053e4476P3765j9340n5955n9931M7582P9219R3522m9376R7047q8451J3528J08395
2041A85529K4180j44687k46715O8078M5585J04054k6806L2664O8916j05323O4976
2030G0451r6591n7043Q5462M9864J4128m3765K6833j6321j7265K904j24441j6714
2018a22498O5072R4768Q4650j27456j01661m8429r5135J62432J98039J0466j33413
2007a3165k8579J9730m8870M0051r9593j0175J76847j06254k4992o3722q2946
1996b41668O0234o50n6247J20483N8327L9431r714p9488l3175L9607n1456Q3233
1984g1083m3432L8500J48273j25727p6504J17279J2669j06154N7637k6600p8404
$$ plain form
2064 230630 195964 64793 -39656 5863 22389 -155182 -97379 -81977 -142806 -216272 -54476
2053 -54476 19289 -51 -56006 -115937 -68355 10864 104386 55010 152057 63606 77134 185529
2041 185529 209709 65022 -181693 -113615 -68030 36024 9218 41882 110798 5475 70451
2030 70451 -26140 -83183 2279 52143 66271 22506 49339 33018 15753 18657 -105784 -122498
2018 -122498 -57426 37342 121992 -5464 -107125 -155554 -250689 -88257 109782 120248 -13165
2007 -13165 -41744 -22014 -70884 -30833 -130426 -140601 36246 -70008 -95000 -158722 -241668
1996 -241668 -181434 -182084 -238331 -117848 -59521 -20090 -29804 -109292 -142467 -102860 -154316 -71083
1984 -71083 -114515 -76015 72258 -53469 -129973 -12694 -25 -106179 -48542 -75142 -153546
1973a53546R0068k9132l886J68120p1947l8439L0113O0221j10415k6173J06119
1962B1103l1371r8822O9311J30724n4661j17519J03740n2198M9997j2236j05140
1951i7072m9662Q2249J10618p8491n8852n2935K7126R0007j37959j6048M7978
1940a33041l7805N7855J39635p0132M3797o3112k1595Q5276o930n6143p8905n361
1928a46461O2844O8346m5429q6877J85464L7019k9331m9485j58052L6712J44659
1917A9409q5850n9973J04497J4700J951J29811R05j45383Q9404j10540j14823
1906a55892J11422J18239R2299k4239k14198q2768n0159K6964J29703R4295l9952
1895E714K403L768q0397m0036P6553N8267J45614p9799k00849N8455j9598m0827
$$ plain form
1973 -153546 -63478 -92610 -96496 71624 -323 -38762 -8649 51572 -58843 -85016 21103
1962 21103 -10268 -109090 -39779 90945 36284 -81235 22505 -29693 20304 8068 -97072
1951 -97072 -146734 -64485 46133 -32358 -91210 -144145 -117019 -27012 -164971 -181019 -133041
1940 -133041 -170846 -112991 26644 -43488 309 -62803 -84398 878 -6052 -62195 -141100 -146461
1928 -146461 -83617 -15271 -60700 -147577 37887 74906 45575 -3910 -161962 -125250 19409
1917 19409 -66441 -126414 -21917 -7217 -5266 124545 125450 -19933 69471 -41069 -155892
1906 -155892 -44470 73769 166068 141829 -72369 -155137 -205296 -178332 -48629 45666 5714
1895 5714 8117 11885 -68512 -108548 -31995 26272 171886 92087 -108762 -50307 -69905 -110732
1883a10732m7861Q3456L673M2521L0476k4982R748J1882J8393k28559k8180K68468
1871B8303K0665k37m9013j36948M9771k622k2019R052L6753Q0615n0224j14512
1859a50416J65128J4401j28439m6557p4242K03609K25207j95410k2675R565p147
1848f976j12821Q0983L7527j19079l0475P0685J17952n8680k6323m5955o7638
1837a60800N702R8363P8881L9946j19259j0577o3992j2524O2617o8983J14921
1826c5705m4402p6495Q8092R3391p5245p5936K9144o0026k3763N1581K9675j23325
1814b23014o8435J88129J05189n2782r3597N6401O7295n3770p5614J9356N3646
1803g7196o7658N3958K7701k8811P4046p8498J1890J27064j9423l8028j454k10
$$ plain form
1883 -110732 -158593 -75137 -71464 -28943 1533 -23449 -13701 -1819 16574 -211985 -240165 28303
1871 28303 48968 48731 -282 -137230 -87459 -90081 -112100 -103048 -66295 14320 -35904 -150416
1859 -150416 14712 29113 -99326 -145883 -220125 -16516 208691 13281 -9394 171 -6976
1848 -6976 -119797 -38814 -1287 -120366 -150841 -80156 37796 -20884 -47207 -93162 -160800
1837 -160800 -155098 -56735 22146 62092 -57167 -67744 -131736 -144260 -81643 -150626 -35705
1826 -35705 -80107 -156602 -68510 24881 -50364 -126300 -97156 -157182 -180945 -129364 -99689 -223014
1814 -223014 -291449 -103320 1869 -50913 -144510 -88109 -20814 -74584 -150198 -130842 -77196
1803 -77196 -144854 -90896 -63195 -92006 -17960 -96458 -84568 42496 23073 -14955 -16409 -16619
$$ [...]
##END NTUPLES=NMR SPECTRUM
##END=
