##TITLE=1H_DE-80H_X3
 200.13MHz, d2o
 8 sc
 
 19ns.26.2.2025
##JCAMPDX= 6.0         $$ Bruker NMR JCAMP-DX V2.0
##DATA TYPE= NMR SPECTRUM
##DATA CLASS= NTUPLES
##ORIGIN= UXNMR, Bruker Analytische Messtechnik GmbH
##OWNER= pz
$$ XWIN-NMR		Version 3.5
$$ Wed Apr  1 09:49:04 2026 Russian Standard Time (UT+4h)  Yarkov@DPX200
##.OBSERVE FREQUENCY= 200.1313
##.OBSERVE NUCLEUS= ^1H
##.ACQUISITION MODE= SIMULTANEOUS
##.ACQUISITION SCHEME= undefined
##.AVERAGES= 8
##.DIGITISER RES= 18
##SPECTROMETER/DATA SYSTEM= spect
##.PULSE SEQUENCE= zg30
##.SOLVENT NAME= CDCl3
##.SHIFT REFERENCE= (INTERNAL, CDCl3, 0, 15.4329)
##AUDIT TRAIL= $$ (NUMBER, WHEN, WHO, WHERE, WHAT)
$$ ##TITLE= Audit trail, XWIN-NMR		Version 3.5
$$ ##JCAMPDX= 5.01
$$ ##ORIGIN= Bruker BioSpin GmbH
$$ ##OWNER= Yarkov
$$ C:/Bruker/XWIN-NMR/data/yarkov2/nmr/H-C/1/pdata/1/auditp.txt
$$ ##AUDIT TRAIL=  $$ (NUMBER, WHEN, WHO, WHERE, WHAT)
(   1,<2026-04-01 09:48:08.79 +0400>,<Yarkov>,<DPX200>,
      <created by zg, POWCHK disabled, PULCHK disabled
       configuration hash MD5:
       00 E9 B6 7A A2 85 ED C7 34 08 36 98 17 FE 4E 26
       data hash MD5: 16K
       A6 5B C7 8D E2 98 B8 7E AA 2D B8 D6 46 10 5B B4>)
(   2,<2026-04-01 09:48:15.62 +0400>,<Yarkov>,<DPX200>,
      <Start of raw data processing
       efp BC_mod = 2 LB = 0.25 FT_mod = 6 PKNL = 1 PHC0 = -5299.148 PHC1 = 6.821927 SI = 16K 
       data hash MD5: 16K
       B9 75 A6 5F F1 3B 9F D1 2B 5D B5 38 75 A5 D2 AC>)
(   3,<2026-04-01 09:48:19.82 +0400>,<Yarkov>,<DPX200>,
      <abs ABSG = 5 
       data hash MD5: 16K
       EA E0 BC 2B 78 1F 8A 3C 0F C5 FB ED B9 A6 8D 78>)
$$ ##END=
$$ 
$$ hash MD5
$$ BB 5F 85 70 68 B9 C7 31 D6 7F 43 2D DE 1F 17 9E
##$RELAX= 
##$RELAX= 
##$RELAX= 
##$RELAX= 
##$RELAX= 
##$RELAX= 
$$ Bruker specific parameters
$$ --------------------------
##$DU= <C:/Bruker/XWIN-NMR>
##$EXPNO= 1
##$NAME= <H-C>
##$PROCNO= 1
##$TYPE= <nmr>
##$USER= <yarkov2>
##$AMP= (0..31)
100 100 100 100 100 100 100 100 100 100 100 100 100 100 100 100 100 100 
100 100 100 100 100 100 100 100 100 100 100 100 100 100 
##$AQSEQ= 0
##$AQ_mod= 1
##$AUNM= <au_zg>
##$AUTOPOS= <>
##$BF1= 200.13
##$BF2= 200.13
##$BF3= 200.13
##$BF4= 200.13
##$BF5= 200.13
##$BF6= 200.13
##$BF7= 200.13
##$BF8= 200.13
##$BYTORDA= 1
##$CFDGTYP= 0
##$CFRGTYP= 5
##$CHEMSTR= <none>
##$CNST= (0..31)
1 1 145 1 1 1 1 1 1 1 1 1 1 1 1 1 1 1 1 1 1 1 1 1 1 1 1 1 1 1 1 1 
##$CPDPRG= <>
##$CPDPRG1= <>
##$CPDPRG2= <>
##$CPDPRG3= <>
##$CPDPRG4= <mlev>
##$CPDPRG5= <mlev>
##$CPDPRG6= <mlev>
##$CPDPRG7= <mlev>
##$CPDPRG8= <mlev>
##$CPDPRGB= <>
##$CPDPRGT= <>
##$D= (0..31)
0 0.7 0 0 0 0 0 0 0 0 0 0.03 0 0 0 0 0 0 0 0 0 0 0 0 0 0 0 0 0 0 0 0 
##$DATE= 1775022488
##$DBL= (0..7)
120 120 120 120 120 120 120 120 
##$DBP= (0..7)
150 150 150 150 150 150 150 150 
##$DBP07= 0
##$DBPNAM0= <>
##$DBPNAM1= <>
##$DBPNAM2= <>
##$DBPNAM3= <>
##$DBPNAM4= <>
##$DBPNAM5= <>
##$DBPNAM6= <>
##$DBPNAM7= <>
##$DBPOAL= (0..7)
0.5 0.5 0.5 0.5 0.5 0.5 0.5 0.5 
##$DBPOFFS= (0..7)
0 0 0 0 0 0 0 0 
##$DE= 6
$$ [...]
##$SUBNAM3= <"">
##$SUBNAM4= <"">
##$SUBNAM5= <"">
##$SUBNAM6= <"">
##$SUBNAM7= <"">
##$SUBNAM8= <"">
##$SUBNAM9= <"">
##$SW= 18.0517328524113
##$SWIBOX= (0..15)
0 0 2 0 0 0 0 0 0 0 0 0 0 0 0 0 
##$SW_h= 3612.71676300578
##$TD= 16384
##$TD0= 1
##$TE= 0
##$TE2= 300
##$TE3= 300
##$TEG= 300
##$TL= (0..7)
0 120 120 120 120 120 120 120 
##$TP= (0..7)
150 150 150 150 150 150 150 150 
##$TP07= 0
##$TPNAME0= <>
##$TPNAME1= <>
##$TPNAME2= <>
##$TPNAME3= <>
##$TPNAME4= <>
##$TPNAME5= <>
##$TPNAME6= <>
##$TPNAME7= <>
##$TPOAL= (0..7)
0.5 0.5 0.5 0.5 0.5 0.5 0.5 0.5 
##$TPOFFS= (0..7)
0 0 0 0 0 0 0 0 
##$TUNHIN= 0
##$TUNHOUT= 0
##$TUNXOUT= 0
##$USERA1= <user>
##$USERA2= <user>
##$USERA3= <user>
##$USERA4= <user>
##$USERA5= <user>
##$V9= 5
##$VALIST= <valist>
##$VCLIST= <CCCCCCCCCCCCCCC>
##$VD= 0
##$VDLIST= <DDDDDDDDDDDDDDD>
##$VPLIST= <PPPPPPPPPPPPPPP>
##$VTLIST= <TTTTTTTTTTTTTTT>
##$WBST= 1024
##$WBSW= 4
##$XGAIN= (0..3)
0 0 0 0 
##$XL= 0
##$YL= 0
##$YMAX_a= 253645
##$YMIN_a= -222011
##$ZGOPTNS= <>
##$ZL1= 120
##$ZL2= 120
##$ZL3= 120
##$ZL4= 120
##$ABSF1= 15.43288
##$ABSF2= -2.618969
##$ABSG= 5
##$ABSL= 3
##$ALPHA= 0
##$AQORDER= 0
##$ASSFAC= 0
##$ASSFACI= 0
##$ASSFACX= 0
##$ASSWID= 0
##$AUNMP= <proc_1d>
##$AZFE= 0.1
##$AZFW= 0.1
##$BCFW= 0
##$BC_mod= 2
##$BYTORDP= 0
##$COROFFS= 0
##$CY= -3
##$DATMOD= 1
##$DC= 0
##$DFILT= <>
##$DTYPP= 0
##$F1P= 0
##$F2P= 0
##$FCOR= 1
##$FTSIZE= 16384
##$FT_mod= 6
##$GAMMA= 0
##$GB= 0
##$INTBC= 1
##$INTSCL= 3.241238e-09
##$ISEN= 128
##$LB= 0.25
##$LEV0= 0
##$LPBIN= 0
##$MAXI= 10000
##$MC2= 0
##$MEAN= 0
##$ME_mod= 0
##$MI= 1.114404
##$NCOEF= 0
##$NC_proc= -7
##$NLEV= 6
##$NOISF1= 3.799351
##$NOISF2= 2.8
##$NSP= 0
##$NTH_PI= 0
##$NZP= 0
##$OFFSET= 15.43288
##$PC= 1
##$PHC0= -5299.148
##$PHC1= 6.821927
##$PH_mod= 1
##$PKNL= yes
##$PPARMOD= 0
##$PSCAL= 0
##$PSIGN= 0
##$REVERSE= no
##$SF= 200.130017775712
##$SI= 16384
##$SIGF1= 3
##$SIGF2= 2
##$SINO= 0.751879
##$SIOLD= 32768
##$SREGLST= <19F.Aceton>
##$SSB= 0
##$STSI= 16384
##$STSR= 0
##$SW_p= 3612.71676300578
##$SYMM= 0
##$S_DEV= 0
##$TDeff= 16384
##$TDoff= 0
##$TI= <>
##$TILT= no
##$TM1= 0
##$TM2= 0
##$TOPLEV= 0
##$USERP1= <user>
##$USERP2= <user>
##$USERP3= <user>
##$USERP4= <user>
##$USERP5= <user>
##$WDW= 1
##$XDIM= 16384
##$YMAX_p= 316414623
##$YMIN_p= -737225
$$ End of Bruker specific parameters
$$ ---------------------------------
##NTUPLES= NMR SPECTRUM
##VAR_NAME=  FREQUENCY,     SPECTRUM/REAL,   SPECTRUM/IMAG
##SYMBOL=    X,             R,               I
##VAR_TYPE=  INDEPENDENT,   DEPENDENT,       DEPENDENT
##VAR_FORM=  AFFN,          ASDF,            ASDF
##VAR_DIM=   16384,         16384,           16384
##UNITS=     HZ,            ARBITRARY UNITS, ARBITRARY UNITS
##FACTOR=    0.220516191357247, 1,           1
##FIRST=     3088.58262910491, 0,            0
##LAST=      -524.134133900868, 0,           0
##MIN=       -524.134133900868, -737225,     0
##MAX=       3088.58262910491, 316414623,    0
$$ Real data points
##PAGE= N=1
##DATA TABLE= (X++(R..R)), XYDATA
$$ [...]
7834C47901r562J7131j903J48883r5633P1026j39786j31338M6772r2839O9365
7823B30017J26663J4687N8268K133j94433l2512M2653L7348j27625N7458J5567
7812B30224o7190k7488O3459K3342Q5478N4117L62403j1445l56892n1505K3353
7801C27856J07512r7647l985k8870p6424P0197L2198p3011m2305k5445R967m5662
7789A54381J22864m9606j4853P8246l83p9222j8773q367n5889n9818P0427m0992
7777I8015R5572j802J09421K5610j51798l3369J7619m113j14066N1183J66705
7766B58977P5554j19396l4363m688J07573j03346q2767J34754P862K2188L198
7755B65546l3534J5758k0825n522l3765j3189L1703k4483N2632P4576J6453J4804
$$ y = [347901, 338339, 355470, 353567, 502450, 406817, 477843, 338057, 206719, 253491, 160652, 230017, 356680, 371367, 429635, 431768, 237335, 204823, 247476, 284824, 157199, 214657, 230224, 163034, 135546, 199005, 222347, 307825, 361942, 724345, 712900, 356008, 304503, 327856, 435368, 337721, 333736, 304866, 228442, 298639, 330837, 257826, 215521, 190076, 200043, 154381, 277245, 227639, 212786, 291032, 290649, 211427, 192654, 184287, 128398, 68580, 139007, 98015, 193587, 191785, 301206, 326816, 175018, 141649, 159268, 155155, 41089, 92272, 258977, 334531, 215135, 180772, 176084, 283657, 180311, 97544, 232298, 240160, 262348, 265546, 232012, 247770, 226945, 221423, 187658, 174469, 206172, 181689, 234321, 308897, 325350, 340154]
7743C40154j3167j10648L0036o7594j94389J18162L0954j4069j4521O644o8574
7732D2988Q1627K5640j07373R8400M8272q9051O4705J30038K7572o2123p644J7993
7720B71044l6902J121m6716r9204M6959J7833O3325j08201o4575K10235L2762
7709B87681m1976k5039o9920k466k9360K2543J755n8768r0203r7369J30855J27630
7697A55363K8579L7853J12298j63015L2176J14628p8947j25082j6041p8271J9939
7686C9480M6758J04365R3853j8256n4052R2239K8951j33539j758o8935o4913K5082
7674H9275m548K3873J30468J2992O391k18868P0586J51610p3167J66754q0756
7663B74610P2553j52189j09184k8113k292J30998j22569J76962O2925J4637j02204
$$ y = [340154, 326987, 216339, 246375, 178781, -15608, 102554, 133508, 119439, 104918, 111562, 42988, 124615, 150255, 42882, 141282, 189554, 100503, 165208, 295246, 322818, 260695, 253051, 271044, 234142, 235263, 188547, 89343, 136302, 154135, 217460, 109259, 44684, 254919, 287681, 245705, 220666, 150746, 148280, 118920, 141463, 143218, 84450, -5753, -103122, 27733, 155363, 183942, 221795, 334093, 171078, 203254, 317882, 238935, 113853, 97812, 19541, 39480, 86238, 190603, 284456, 266200, 212148, 304387, 333338, 199799, 198041, 129106, 64193, 89275, 84727, 108600, 239068, 252060, 258451, 39583, 110169, 261779, 188612, 355366, 274610, 347163, 194974, 85790, 57677, 55385, 186383, 63814, 240776, 303701, 318338, 216134]
7652B16134q2772n707P9319l7567K653O026k8398M9096M6602p1312M2903j02321
7640A14656L812L771M8847J69055j39285J04680r2446q3650R484R1989J503r1578
7628A40838p0344m4313l7654J44017J11273l5511j21331o0600O6646j1678N5346
7617A36689J7681l0502r2061N0512j30941J41640j35290j1823m3786J24741J81178
7606B08038j35498N7550N4554L6101k0280j10256o9531Q2956j0372j44531M0777
7595a0492Q4049M5302L9258o8803k8665p075K3959M8546o0183J9231O8348l1133
7583A22342m2634O7185l3275j04202O9832J12383p9951r6191N2914l5958O0867
7572I3312k9475Q4113O244Q1494o4245m7523r1003p747N2919l7194l0699O0497
$$ y = [216134, 133362, 127655, 206974, 169407, 172060, 178086, 149688, 198784, 245386, 174074, 216977, 114656, 118468, 122239, 171086, 340141, 200856, 305536, 213090, 129440, 138924, 230913, 232416, 140838, 70494, 26181, -11473, 132544, 243817, 208306, 86975, 26375, 93021, 81343, 136689, 154370, 123868, 31807, 82319, -48622, 93018, -42272, -54095, -97881, 26860, 208038, 72540, 130090, 184644, 220745, 200465, 90209, 20678, 103634, 93262, -51269, -10492, 73557, 118859, 158117, 89314, 60649, 53574, 77533, 126079, 65896, 85127, 153475, 122342, 79708, 146893, 113618, 9416, 79248, 191631, 111680, 15489, 68403, 32445, 93312, 63837, 147950, 154194, 235688, 171443, 123920, 32917, 25170, 78089, 40895, 10196, 70693]
7560G0693l5833O5853J9004m1748P3802M4945r3355m9040l4283j0174L6250j14380
7548f8266j7104J97596K3511m5592Q0024k2635N4284o881n2280l4487j41174N3947
7536B0943R613J35079M4312j14869J6964k8312j06001N9160J7756J10123m9538
7525A15230j09115L7728o709K01049o9949P3312J2184o75j64805P507p292j15956
7513b7491j2584J38806L0324o2431j38295j2805N8079K9883M5417l5161m3245
7502b9503k2752L5329R6065M9029m6896N9763l4930M407k4668k1546o6204K2032
7490B0126n7754P299N3476M8731P979K5743m4621r1860Q065k6950M0411M8655
7478C9300N467J60068M3927j96436m5817O8436r6252M4777Q9951j10938J7709
$$ y = [70693, 34860, 100713, 119717, 77969, 151771, 196716, 103361, 54321, 20038, 9864, 46114, -68266, -85370, 112226, 135737, 90145, 170169, 147534, 201818, 194937, 142657, 108170, -33004, 20943, 30556, 165635, 209947, 95078, 112042, 83730, -22271, 36889, 54645, 164768, 115230, 6115, 43843, 37134, 238183, 168234, 241546, 253730, 253055, 88250, 95757, 88465, -27491, -40075, 98731, 129055, 66624, -71671, -84476, -26397, 3486, 48903, 13742, -29503, -52255, -16926, 79139, 128168, 81272, 141035, 106105, 110512, 85844, 64298, -1906, 20126, -37628, -30329, 23147, 71878, 79857, 105600, 60979, -30881, -22816, -49766, -9355, 39300, 44767, 204835, 248762, 52326, 6509, 74945, -21307, 23470, 113421, 2483, 20192]
7467B0192K5269O6402O5525n3507k3630p6728J8198k2819K6653K48175N1006j71924
7455A72812n9954l1090j19907L9100O0275J6169j3810M042k6158j03294l8915
7444a00730Q4449J25098k6626n6814j8147N9634l0008o0995M3654j51241m686
7433a36412J76586K5807J65266j2276j66432j7512K6697J4588k7998J9607k4176
7422D3745m0222Q4788J44168l5889q0428N358r7260l2644O8033P9661L2665J6981
7410A88956q711j04750L1713J25302m2872k2063m7655j22165J60567l64j0967
7399A46991L4229p763Q4891k5024j27376M6649q3114j7413o4666j3511N7587n5663
7387b4183K633J95950r3350l9286N1368O3332n6636J5437q9826r2673M0863n7052
$$ y = [20192, 45461, 111863, 177388, 123881, 100251, 23523, 41721, 18902, 45555, 293730, 344736, 172812, 112858, 81768, -38139, 961, 61236, 77405, 63595, 67637, 41479, -61815, -100730, -16281, 108817, 82191, 25377, 7230, 66864, 36856, -24139, 19515, -131726, -136412, 40174, 65981, 231247, 218971, 52539, 35027, 61724, 76312, 48314, 67921, 43745, 3523, 88311, 232479, 196590, 116162, 121520, 24260, -8384, 59649, 139310, 171975, 188956, 180245, 75495, 107208, 232510, 189638, 167575, 119920, -2245, 158322, 157958, 146991, 181220, 173457, 258348, 233324, 105948, 152597, 69483, 52070, -12596, -26107, 31480, -24183, -21550, 174400, 81050, 41764, 93132, 156464, 99828, 115265, 25439, -67234, -26371, -83423]
7375h3423l8047M9738K2059J20716R545N6967O1734j89441j88396j5027R2383
7364a01192J978Q8600P1681j8943N237m5265n1631K5159J04849L2661j66637o5240
7352a18743P6769K1381m5250J17576j32280J6664J8756J29786K2912n1018m3521
7341A3032N7418j8963l4548J05129o3057q1628N1768n4615J28707k8993m9104
7330B5146l4751M3329o2693k8657J18370k827l1378L1674k7245o7922j3657O2487
7318A1876J2433p2164N422o5039M2299O8960o3226J1702N6457n1213l6523J0480
7306f8536m4648j8456m7256O6600K8287J37966k479j44299k4409o378N736m7407
7294a65279j01910N50J94275J29056l6782j22764J16384L5387l6948m4426R7004
$$ y = [-83423, -121470, -71732, -49673, 71043, 80588, 137555, 199289, 9848, -178548, -193575, -101192, -99214, -10614, 61067, 42124, 47361, 2096, -49535, -24376, 80473, 113134, -53503, -118743, -41974, -20593, -65843, 51733, -80547, -63883, -45127, 84659, 107571, 56553, 13032, 70450, 51487, 16939, 122068, 59011, -22617, 29151, -25464, 103243, 74250, 25146, -9605, 33724, -28969, -57626, 60744, 57917, 26539, 58213, 30968, -36954, -50611, 11876, 24309, -47855, -42433, -107472, -65173, 3787, -59439, -47737, 8720, -42493, -79016, -68536, -113184, -131640, -178896, -112296, -84009, 53957, 51478, -92821, -117230, -123608, -117872, -165279, -267189, -266639, -72364, 56692, 19910, -102854, 13530, 48917, 11969, -32457, 64547]
7283F4547j83052o9417L8899K6081M0941M6957l9831q355k7762j47493J32622
7272a25863J42921M7342n6155q1992n19N7642q4925R4600l8977L492J1548L2986
7260B100Q5805r6809q5014q545n129J00502M0736j91008k756J12461M1697m7398
7248e3358N0108p5908o8553j4014L5503M0451m3191N6443n1515K6935O4673l4336
7236f6762R2126k8505j62892o1526m0000J25389J32345p6000m7116M7692J18319
7225C3070p2286j0562p948L3423L5897j1246n9802o9442K0371j0324J32234k0464
7213g079l08725J40314J76684j51598O419L7026k5066J73253r1831k52832J23441
7202a79994R5802j9707j21815R3894L380O5383K03634j72857P120r5708o6583
$$ y = [64547, -118505, -187922, -149023, -122942, -82001, -35044, -74875, -83230, -110992, -258485, -125863, 17058, 64400, 8245, -73747, -74266, -16624, -101549, -6949, -45926, -42434, -30886, 2100, 87905, -8904, -93918, -102463, -107592, -7090, 33646, -157362, -160118, -47657, -5960, -53358, -3250, -79158, -147711, -161725, -126222, -85771, -128962, -72519, -124034, -97099, -32426, -66762, 25364, -3141, -166033, -227559, -267559, -142170, -9825, -85825, -132941, -85249, 33070, -39216, -49778, -57726, -24303, 11594, 348, -59454, -128896, -108525, -118849, 13385, -7079, -315804, -175490, 1194, -150404, -143985, -106959, -132025, 41228, -50603, -303435, -179994, -84192, -103899, -225714, -131820, -128440, -63057, 140577, -32280, -25160, -120868, -187451]
7191a87451J41792k0343N8639J6560j0187O5196p3331K0919p3654P6766o9229
7180e4323N6434O2614j72615j45872R6987J36042m0441J11841n3695P3626j5617
7169E4981k52716l0430O4961Q4028k4243P7536j5141j01779j11360P9272O9814
7158a05077l8028Q1131o2896N1357q563O1620j3982L2923j99142l816J06692l7799
7146a35580M9917j31863j00341J28356L7561J3280M7851k5796r4161J27494K018
7135h1264q4530J7058j08597j29403J37599J33535p669n3825o8751j4409O752
7124b53504K16955O4251n8096j18850j28559L3105K8503L2459J09080r8323Q1101
7113i1878j9170k1316k3557M3095N88n9829M6764N3046k2540O5264J9292p1351
$$ y = [-187451, -45659, -66002, -7363, 9197, -990, 64206, -9125, 11794, -61860, 14906, -54323, 2111, 64725, -107890, -253762, -156775, -20733, -61174, 50667, -3028, 70598, 54981, -197735, -228165, -163204, -79176, -103419, -25883, -41024, -142803, -254163, -174891, -105077, -143105, -61974, -124870, -73513, -82076, -20456, -34438, -1515, -200657, -204473, -97781, -135580, -85663, -217526, -317867, -189511, -151950, -138670, -90819, -116615, -210776, -83282, -81264, -165794, -148736, -257333, -386736, -249137, -115602, -123271, -177096, -245847, -260256, -253504, -36549, 27702, -30394, -149244, -277803, -244698, -216195, -183736, -74656, -172979, -91878, -111048, -132364, -155921, -112826, -112238, -172067, -125303, -72257, -94797, -29533, -10241, -81592]
7101h1592J0570k4436N9940K5346l7573k00814J38860K44911j00052J16723N0344
7090B02227j8186O0782j24447N5255M8369L80j66740m5563o2289N5759Q10l6112
7078b9755l9672l6026K2115o1633K09306J40128m7533r3563o7230O8970j28051
7067f2944R071K08136Q5497j57572p8245r1454r179K4204K491j31898J9590J34728
7055d7575r2970j33411o6350J3591k0897P0154o8749J3833J59484q1749J16536
7044a38103o7017o0435O2865J8866r1486K13941m756q6948J30084k3984k0997
7033f7970p0369P3808L247P4360O8941P639j21393Q7232K7474j97114M5684k7766
7021i6227j11364M3332R4181l9044j33267J42706j1367N8567K204Q736j29106
$$ y = [-81592, -71022, -95458, -35518, -10172, -47745, -248559, -109699, 135212, 35160, 151883, 202227, 184041, 244823, 120376, 175631, 224000, 224380, 57640, 12077, -50212, 5547, 6357, -29755, -69427, -105453, -83338, -144971, 64335, 204463, 156930, 63367, -3863, 65107, -62944, -53873, 154263, 239760, 82188, 3943, -87511, -96690, -72486, -69995, -201893, -182303, -47575, -140545, -273956, -340306, -326715, -347612, -277458, -346207, -332374, -172890, -254639, -138103, -205120, -265555, -202690, -183824, -275310, -61369, -66125, -153073, -22989, -46973, -67970, -138339, -64531, -61284, 13076, 82017, 89656, -31737, 55495, 82969, -114145, -68461, -96227, -207591, -164259, -70078, -109122, -242389, -99683, -111050, -52483, -50279, -41543, -170649]
7010a70649k7658R5057l529j24417R1976J3740Q0438Q4741j05785r0541N8434
6999i8193k8351r5326K5916l7550M9032M6o6638O8149R9118l0215N1890L027K3183
6986c5912n6958j75402N3781r6321j8318K7143N7522K9161L9725m0910N9516j25650
6974b82623M20K26189l1453j77569R4124K1866J4155j33947M502P113r0240K26255
6962a21208K8039n8799N8608J32j07266J0777J35064J4812j04246p2928O632j4130
6950b24513m2518J83561k2974n7915j05484J7732P5170j3442K1160o7314L1527
6939b05010J4073R9801N3787j47780J22110j49161J2348n3077j08305J35267m8125
6928b74072j2122N8799p1882Q6360P7597M1347j32913j12899l0222P5852k4444
$$ y = [-170649, -198307, -103250, -106779, -231196, -139220, -125480, -45042, 39699, -66086, -156627, -98193, -126544, -221870, -195954, -233504, -184472, -184426, -251064, -182915, -83797, -114012, -62122, -59095, -35912, -92870, -268272, -214491, -310812, -329130, -301987, -244465, -215304, -175579, -216489, -156973, -282623, -282203, -56014, -87467, -265036, -170912, -149046, -134891, -268838, -264336, -257223, -347463, -121208, -93169, -151968, -93360, -93228, -200494, -189717, -54653, -39841, -144087, -217015, -210383, -224513, -267031, -83470, -106444, -164359, -269843, -252111, -176941, -190383, -169223, -236537, -205010, -190937, -91136, -37349, -185129, -63019, -212180, -199832, -252909, -361214, -225947, -274072, -286194, -227395, -299277, -212917, -135320, -93973, -226886, -339785, -370007, -294155, -318599]
6917c18599j5614l4981K0181r697J13746n0579j03761J72869o5867l1841R5959
6906b28184Q5717j16704k27307J00449L3630m6144R590J03804K9647J6036j20939
6895c60405p9857P4384J13754j01556M9263P7701m8400Q711k5734k1664J9650
6884b94153o5385j00265R0759j00035L2430P7709k3N5515J02566l6296r6292p2352
6872d05822L5966N9780J52008l3369p3112n3048O7556l9694m0179J9686j22771
6861d32999J47415J58130o7773p5567o3731n1591P9699k0965O5456L761j68612
6850d26777L4918K4927P237L2384M6886M0988O9852N114r8217r4256j9509l4257
6838d10710N5307M85P579n3518q9752J65460J00595m2598M9405j00040N3922L7034
$$ y = [-318599, -334213, -369194, -349013, -358710, -244964, -295543, -399304, -226435, -292302, -324143, -228184, -142467, -259171, -486478, -386029, -352399, -398543, -388953, -285149, -255502, -239466, -360405, -440262, -365878, -252124, -353680, -304417, -226716, -275116, -266405, -292139, -313803, -294153, -359538, -459803, -369044, -469079, -436649, -358940, -358963, -303448, -200882, -237178, -333470, -405822, -369856, -310076, -158068, -191437, -264549, -317597, -250041, -289735, -329914, -310228, -432999, -285584, -127454, -195227, -270794, -334525, -386116, -306417, -327382, -261926, -258165, -426777, -391859, -366932, -359695, -327311, -280425, -239437, -169585, -164471, -262688, -356944, -376453, -410710, -355403, -354918, -347339, -400857, -490609, -325149, -224554, -267152, -217747, -317787, -263865, -226831]
6826b26831O3733r6438j04115R967R355K7781m569n6694m2392M5369j6364J32644
6814b58554j6609p8184q3789M606L6395p477k5429r871n1298J13724r5651o4697
6802e36834k9384J04445J00960q983M7839o2699Q0052L8903K6716q807k8654k2734
6790b99180m3577l7110R6912l3648M8047j1214m444j33280J8868L2088l391J22995
6778b46934P0416M543r6376M809q9985M582O5073p1555n2428J58132l2923j71916
6766d54562J65751K2393j79455J5101j3970L3267O3229N992n1636p9670P2488
6755d01072L2562Q5995J09128j06307K8053k1548N8011J3362j50611m9094j67588
6744e69109J18109J1471j03212m684J09885O5864K9832R7820J4099q4281K2988
$$ y = [-226831, -163098, -259536, -363651, -353684, -344329, -316548, -321117, -377811, -420203, -374834, -391198, -258554, -275163, -353347, -437136, -432530, -396135, -403612, -429041, -438912, -490210, -376486, -472137, -536834, -566218, -461773, -360813, -369796, -321957, -384656, -304604, -265701, -238985, -247792, -276446, -299180, -342757, -379867, -282955, -316603, -268556, -279770, -284214, -417494, -398626, -366538, -369929, -246934, -176518, -171975, -268351, -263542, -353527, -348945, -283872, -355427, -407855, -249723, -282646, -454562, -288811, -266418, -445873, -430772, -444742, -411475, -348246, -342254, -393890, -473560, -401072, -368510, -282515, -173387, -279694, -251641, -273189, -215178, -201816, -352427, -401521, -569109, -451000, -439529, -542741, -547425, -437540, -371676, -341844, -244024, -229925, -314206, -291218]
6733b91218L4097j7826K3178j96345L7080R0181j1714p5191R7270k2269J6951
6722c15806M0740j30696j8933o7155J51644r7413q6905K16172j3435o3769n4481
6711d40037m2557M6772L8920l8972K7499k4594j4847k5757J22840K1700o714o3938
6699c99685O708K740m000q480n3469P1257n2k8368m6949J11286J8355j5028R534
6686c36151K1707k029K1650p675j05893p0109O7276M1012J11387p2292j15650
6675d46767k976j849O7430J31574l8721n4552r8855O1826k7401l8029J12360j12579
6663d48539o3582J03370J09160j04274N4837k28453k6044L9747O2528K4869q3020
6652e59401L0329N3281K048J35141m5023k3656J15672j350k2508M2308K4750l25
$$ y = [-291218, -257121, -274947, -251769, -448114, -411034, -320853, -332567, -407758, -310488, -332757, -315806, -275066, -405762, -424695, -491850, -340206, -437619, -524524, -308352, -321787, -385556, -440037, -482594, -435822, -396902, -435874, -408375, -432969, -447816, -473573, -350733, -329033, -335747, -399685, -392977, -390237, -394237, -402717, -456186, -384929, -384981, -413349, -460298, -349012, -330657, -345685, -336151, -314444, -316473, -294823, -302498, -408391, -478500, -411224, -370212, -258825, -331117, -446767, -449743, -451592, -384162, -252588, -291309, -345861, -444716, -382890, -410291, -448320, -335960, -448539, -512121, -408751, -299591, -403865, -349028, -577481, -603525, -563778, -501250, -476381, -559401, -529072, -475791, -473743, -338602, -383625, -407281, -291609, -292959, -315467, -273159, -248409, -248734]
6640b48734r4287l5125N8317m4603q5787J08077O7802o0355q2827k3158K8495
6629d12185O4421m502N8902P6069m8678J00548J495N2917O7282M6934l7625j13106
6617a47528p1703j45369j69800J77008l8894M7446J00121M339m5983J00464J14891
6606g5008l2053m7660q2975n7200r5453j4061J16699j8131N6812N2711R5848p8721
6594a79192j27423O3182p674j7120j35300m1859R0194O4871l3445j01836K246
6583d23356J61616O3323J11889J01581k33919m8501O6603L1847q1849j33456J6352
6572c67870P6738p3196m8843n1930M0700J81474j6229j6527N4355k3292L131L099
6560b38390O3302j7250J79340j21435j58904J86916L2395O4219k8479P9672M1819
$$ y = [-248734, -343021, -378146, -319829, -364432, -450219, -342142, -274340, -334695, -417522, -440680, -412185, -347764, -352266, -293364, -217295, -265973, -165425, -163930, -111013, -43731, 3203, -34422, -147528, -219231, -364600, -534400, -357392, -396286, -348840, -248719, -244380, -290363, -189899, -75008, -107061, -154721, -237696, -294896, -390349, -404410, -287711, -305842, -249030, -196319, -100471, -179192, -306615, -243433, -251107, -268227, -403527, -445386, -355192, -290321, -323766, -425602, -423356, -261740, -198417, -86528, 15053, -218866, -267367, -200764, -168917, -250766, -384222, -367870, -291132, -364328, -413171, -465101, -424401, -242927, -259156, -275683, -221328, -244620, -241489, -238390, -175088, -192338, -12998, -134433, -293337, -106421, -74026, -9807, -38286, 41386, 83205]
6549H3205R3885k8901j9593p8827k60769l8629J73012N3651j10076j5598J45680
6538b960J37188K8533k9419j9275o0846m8624r6676l5806J6446q723J9481M4304
6526e6377k509j38820N8704J49725p0204N7087l0347q4310J27370K9743j43452
6515a03390q6347J13563j9465J23100N3743j44201J01264j11626j25754k3025
6505b22138l5972p638n9205l623R9381j1175o1593j05861J144k9810P3412J63823
6493a99255L9018k6134J17338p1186p7727J34669l0688l1048m3668P8775J2358
6482i7548N043j35149j34197J52840J02124P0390p0844j85196O8242L3652R820
6471a80823K7925J8432L7144k0091j15379m2188k5624R9410Q1657N6097j00889
$$ y = [83205, 177090, 148189, 128596, 49769, -211000, -249629, -76617, -22966, -133042, -148640, -2960, 134228, 162761, 133342, 114067, 53221, 4597, -92079, -127885, -111439, -120162, -100681, -56377, -58886, -197706, -139002, 10723, -59481, -2394, -32741, -117051, 10319, 40062, -103390, -189737, -76174, -95639, 27461, 81204, -62997, 38267, -73359, -199113, -222138, -258110, -265748, -324953, -328576, -229195, -240370, -301963, -407824, -406680, -436490, -363078, -199255, -160237, -186371, -69033, -140219, -217946, -83277, -113965, -145013, -188681, -109906, -97548, -92505, -227654, -361851, -209011, -106887, -36497, -107341, -292537, -224295, -190643, -180823, -152898, -134466, -97322, -117413, -232792, -274980, -300604, -201194, -119537, -63440, -164329]
6460a64329j02546m358J22342J28208j32075m9273l9421J16906O515r4803p1664
6449b84498P413r6797J71470j0697j26188L8305p5713l476P1493Q6304J11459
6438a10925j6047o7850l0228k8890p449l3681l397J929Q7862j30424J5585O1484
6426b62031P7918n2270k2163J72234P31n6724j4988L7881j06621J09567O8360
6415d8106J28081o1067p7506m0253J43511M7639k02753p871P8636M1355l1563
6404b9897o859K4975P3213j4388K30965N7273r2152K43975M1159j36846L0985
6393D22403R2827L0511K3373J3566j20204J5097J475k03097j35343J29535M6821
6382C16964M8579l8206m4826K9187M6382J4274K06373J80283R3649k0856m6060
$$ y = [-164329, -266875, -271233, -148891, -20683, -152758, -202031, -241452, -124546, -118031, -212834, -284498, -277085, -373882, -202412, -213109, -339297, -300992, -376705, -380181, -308688, -222384, -110925, -126972, -194822, -225050, -253940, -261389, -295070, -298467, -296538, -208676, -339100, -323515, -262031, -184113, -236383, -258546, -86312, -85581, -142305, -157293, -119412, -226033, -116466, -48106, 79975, 18908, -58598, -98851, 44660, 92299, -110454, -118325, -39689, 1666, -29897, -36756, -11781, 61432, 47044, 278009, 335282, 243130, 487105, 528264, 391418, 422403, 515230, 545741, 569114, 582680, 462476, 477573, 479048, 275951, 140608, 270143, 316964, 365543, 327337, 282511, 311698, 358080, 372354, 578727, 759010, 852659, 831803, 785743]
6371G85743l0791J13164M0740j2427r5383j30431k7522J60056P6403q3297M0771
6360H37026O3098j8604l1400O3399r651n6242k5606N6910J06895O2093J50037
6349A197955J68085l479j09437o9731J24555J01276J49926J05155J7431j6620
6339A665116M4729P1077J38176J78137k6403J09706J89732K58721K44078K72789
6329C145858L42263L38972M73936M84673N95148P44918P36541P88298J165642
6320H816249J646215K240123L715527O071052Q623511J0083584Q610706M857590
6312E4664557j55547m572072o875131o794543n556706l992838k517985r91071
6304B3208664Q08436L359082O441425Q937303R241548O244166J378556l969885
$$ y = [785743, 754952, 868116, 908856, 896429, 801046, 670615, 643093, 803149, 879552, 796255, 837026, 900124, 881520, 850120, 913519, 903868, 847626, 822020, 878930, 985825, 1047918, 1197955, 1366040, 1362561, 1253124, 1183393, 1307948, 1409224, 1559150, 1664305, 1681736, 1665116, 1709845, 1780922, 1919098, 2097235, 2070832, 2180538, 2370270, 2628991, 2873069, 3145858, 3488121, 3827093, 4301029, 4785702, 5380850, 6125768, 6862309, 7650607, 8816249, 10462464, 12702587, 16418114, 22489166, 31112677, 41196261, 49806967, 54664557, 54509010, 49936938, 43061807, 36267264, 30710558, 26717720, 24199735, 23208664, 24017100, 27376182, 33817607, 42754910, 51996458, 58240624, 59619180, 55649295]
6296E5649295p599900q582987p580275o021271m607040l456510k525359k224573
6288A3051380j759074j313275j025047o75185m16057m22105m29153j86307j81561
6279F643616j30962q2072o6422j40984j35862j700K8879j74035N426N9415J5342
6268F020641J45272J2862Q065K05511J00999J22262L06391K39594K75831L52619
6258G790047M41307N76402O87245R21596J031698J175565J228740J455520J805579
6249A7113699K409207L510987O022455J0022061J4835386J8204062J7926481J2097185
6241A02141523K834728o076872j1618829j3066999j1482296q635863n821056k989238
6233D5285098P1720M261874R453048J4395645J6359774J2963717N128712m119352
$$ y = [55649295, 48049395, 39466408, 31886133, 25864862, 21257822, 17801312, 15275953, 13051380, 11292306, 9979031, 8953984, 8278799, 7862742, 7440637, 7011484, 6825177, 6643616, 6512654, 6430582, 6364160, 6223176, 6087314, 6085614, 6114493, 5940458, 5945884, 6005299, 6020641, 6165913, 6178775, 6186840, 6392351, 6493350, 6615612, 6922003, 7161597, 7437428, 7790047, 8231354, 8807756, 9495001, 10416597, 11448295, 12623860, 13852600, 15308120, 17113699, 19522906, 23033893, 29056348, 39078409, 53913795, 72117857, 90044338, 102141523, 104976251, 98899379, 87280550, 74213551, 62731255, 54095392, 48274336, 45285098, 45356818, 49618692, 59071740, 73467385, 89827159, 102790876, 107919588, 103800236]
6225A03800236j1432444j4604798j4074381j1875822r372091o973090n373311
6218C0094299m449564l549533k768603k273460j623680j415388j036750p39862
6210A2237459q33346n97309l79530m22464m45360l65762n05212k92011k69183
6201H127282k97613m12363m32635j32336j36922j87940k42692j42027n3383j31380
6191E957991q918j66138k07571l7251m4429k28258k39550j02483q5403J9752k39648
6180D618094r0910k16722k00332j45635K9735l0680j32793j35947j48566j09429
6170C436815q9100r6049M816n4680L7555J79669L443o923R1346j14898p7877q3313
6158C230804k8929r5976K7229K1423j57072k1865O352j62528n1296j28944j00031
$$ y = [103800236, 92367792, 77762994, 63688613, 51812791, 42440700, 35467610, 30094299, 25644735, 22095202, 19326599, 17053139, 15429459, 14014071, 12977321, 12237459, 11404113, 10806804, 10427274, 10004810, 9559450, 9193688, 8688476, 8396465, 8127282, 7829669, 7417306, 6984671, 6852335, 6715413, 6527473, 6284781, 6142754, 6089371, 5957991, 5949073, 5782935, 5575364, 5538113, 5493684, 5265426, 5025876, 4923393, 4837990, 4857742, 4618094, 4527184, 4310462, 4110130, 3964495, 3994230, 3963550, 3830757, 3694810, 3546244, 3436815, 3347715, 3251666, 3256482, 3201802, 3239357, 3419026, 3422469, 3415546, 3506892, 3391994, 3314117, 3230804, 3201875, 3105899, 3133128, 3154551, 2997479, 2975614, 2981966, 2819438, 2768142, 2639198, 2539167]
6147B539167J0715P2760M6193l318k2163K8583N5024m9579l5911O4331J12214
6136B818016P1818m8929q5620K858O0285k231j1161j52897Q2910J67722k5027
6125B877744M3602q798R9637L2550J59534J27495J6449N1629J52435r359j5177
6114C527741J59183K01584R5993J0417N7235J94028L14316K87968K17090K00652
6104E266207K84506M97620M04800L38859N42660P76729O27096P04197J092535
6095A0535209J420570J477991J815008K293065L525828N258118Q607225J3230612
6087D8163626J7521699J8517825J3626690M108848n732526j2027070j4308091
6080F9871001j3071280j0154520p576949n426569m102322k969288j898892j243234
$$ y = [2539167, 2549882, 2622642, 2668835, 2665517, 2643354, 2671937, 2726961, 2677382, 2641471, 2705802, 2818016, 2889834, 2840905, 2755285, 2758143, 2818428, 2816197, 2805036, 2652139, 2735049, 2902771, 2877744, 2921346, 2912548, 3012185, 3044735, 3204269, 3331764, 3348213, 3399842, 3552277, 3542918, 3527741, 3686924, 3888508, 3984501, 3994918, 4052153, 4246181, 4560497, 4848465, 5065555, 5266207, 5550713, 6048333, 6453133, 6791992, 7334652, 8111381, 8738477, 9442674, 10535209, 11955779, 13433770, 15248778, 17541843, 21067671, 26325789, 34933014, 48163626, 65685325, 84203150, 97829840, 101938688, 96206162, 84179092, 69871001, 56799721, 46645201, 39068252, 33641683, 29539361, 26570073, 24671181, 23427947]
6072B3427947n95706L64185J082576K195536M129288P348999J2283524J7478701
6064F7715050J9416792J5162094N528461n136097j2547699j5334268j4478740
6057F0325593j1673340q781216o584895n148912m048671l157462k529611k004316
6049A6397170j549404j214788q49206o48006p00534n61090m79668l61075l65224
6040I668175k43185l06831k17448k84895q7897j47212J63588n9439j4477J09749
6030H580128J52656L19008L60688M71475O17421Q66057J093402J433560J512340
6021A5406735J323059J525042J777705K993259N456049Q192510R886260Q478457
6013E5039076M027096j791726o134836p882021p483126o075585m497398l223541
$$ y = [23427947, 22832241, 23196426, 24279002, 26474538, 30603826, 37952825, 50236349, 67715050, 87131842, 102293936, 107822397, 102686300, 90138601, 74804333, 60325593, 48652253, 39871037, 33286142, 28137230, 24088559, 20931097, 18401486, 16397170, 14847766, 13632978, 12783772, 12135766, 11435232, 10874142, 10394474, 10033399, 9668175, 9424990, 9118159, 8900711, 8615816, 8527919, 8380707, 8544295, 8484856, 8470379, 8580128, 8732784, 9051792, 9412480, 9883955, 10501376, 11367433, 12460835, 13894395, 15406735, 16729794, 18254836, 20032541, 23025800, 28481849, 36674359, 46560619, 55039076, 59066172, 57274446, 51139610, 43257589, 35774463, 29698878, 25201480, 21977939]
6005B1977939k386085j677215j160230o95979j45746R655L98369J103401J950106
5996A9374215L454505O087220R411408J1466421J0533705O163266j20932m911544
5988F1458264p822341q248142p247688n904074m691263l981542l313632k791034
5980A7458548k152207j707495j411921r45246q17098m81312k58964m29437j94967
5971I059901N2116M8595J48651N4672K0392k4788k27745l69129m48086n11080
5961G803499n03893n10578n92687l41725l13604l28786m11462k07726k17009k20280
5951D155749j75247j16213r6288q0084k04740k06508k5898J1521m263m5880j14444
5940C097705l7233m5539k4450O92P862l9625L769K8532q3222Q4785J33603O5311
$$ y = [21977939, 19591854, 17914639, 16754409, 16058430, 15912684, 15922339, 16320708, 17424109, 19374215, 22828720, 28915940, 38327348, 49793769, 60327474, 66490740, 66369808, 61458264, 53635923, 45387781, 38140093, 32236019, 27544756, 23563214, 20249582, 17458548, 15306341, 13598846, 12186925, 11241679, 10424581, 9943269, 9684305, 9254868, 9059901, 9112017, 9160612, 9309263, 9363935, 9384327, 9359539, 9131794, 8762665, 8314579, 7803499, 7299606, 6789028, 6196341, 5854616, 5541012, 5212226, 4800764, 4593038, 4376029, 4155749, 3980502, 3864289, 3768001, 3687917, 3483177, 3276669, 3250771, 3262292, 3258029, 3212149, 3097705, 3060472, 3014933, 2990483, 2991175, 2999037, 2959412, 2963181, 2991713, 2908491, 2993276, 3126879, 3192190]
5928C192190J54479j17209L6607J8671O7535M2861m6339P361j00448j04135L1342
5917C182915j53164J4060q1539j78751k34958j55263q3614j56781p646k75301
5907A869958n1760N4314j2046o9090n9068J90548J11834J0944l7568j63292k44501
5896A600273j11217m6433M567J0996n4187j50857j77013L3755j03282r8466k038
5885I06098j00729m9173J1214j3497J33132l0101r6610j2652J3279m6281n8008
5874F56672K1701K3629m813N7642j0799P1225K4295l1651n2616p1998k4072k17
5862F58998j66987P9407j3005O5984l6420k20940K9378K51926J882m6039q3626
5851E20558l0568k4339m3454n8349o2837o0735J30147P9488l8458r9723k9828
$$ y = [3192190, 3346669, 3229460, 3266067, 3284738, 3352273, 3395134, 3348795, 3356156, 3255708, 3151573, 3182915, 3029751, 3043811, 2962272, 2783521, 2548563, 2393300, 2309686, 2152905, 2145259, 1869958, 1818198, 1872512, 1860466, 1791376, 1732308, 1922856, 2034690, 2045634, 2008066, 1844774, 1600273, 1489056, 1442623, 1447190, 1458186, 1403999, 1253142, 1076129, 1109884, 1006602, 908136, 906098, 805369, 756196, 767410, 753913, 887045, 856944, 760334, 747682, 760961, 714680, 656672, 678373, 702002, 697189, 754831, 744032, 815257, 839552, 807901, 755285, 683287, 659215, 658998, 492011, 571418, 558413, 624397, 587977, 367037, 396415, 648341, 650223, 604184, 520558, 489990, 465651, 422197, 363848, 301011, 240276, 370423, 449911, 411453, 311730, 281902]
5840B81902j7593K04936n6760n0443k8414J06101J8574j03710K7504r8526l7521
5829B46050J16103J4718r2370P3025j07898R5538p06p5016N9152J01168o6509
5818C63255n9435o8915m372n4220l2858O9150j52194M7912K70765n5530o0962
5807B62596M7420P3471R2995J92349J96828O7375j10662j10048r4755K006n391
5796F14184K9737j06256j57967o5136O1592r3086J02722j9181m8763rJ22704o0601
5784C79940J37754J51327J02489J49081p1514k4440j08283k16045K4176J08487
5774F32972j02392L2452J20659L0599l0219m0151j0096j77876j66406q5306J80756
5763C84992J56873o2544o7367o5078J7712N0571K888j02733P6625o0646J18192
$$ y = [281902, 264309, 469245, 412485, 362042, 333628, 439729, 458303, 354593, 382097, 283571, 246050, 362153, 376871, 284501, 357526, 249628, 345166, 344460, 269444, 328596, 429764, 363255, 303820, 234905, 230533, 176313, 143455, 212605, 60411, 108323, 379088, 323558, 262596, 310016, 383487, 476482, 668831, 865659, 933034, 822372, 712324, 617569, 619575, 614184, 643921, 537665, 379698, 314562, 376154, 283068, 385790, 366609, 317846, 317837, 440541, 379940, 517694, 669021, 771510, 920591, 849077, 824637, 716354, 500309, 524485, 632972, 530580, 563032, 683691, 714290, 684071, 643920, 633824, 455948, 289542, 204236, 384992, 541865, 479321, 411954, 346876, 364588, 415159, 418047, 315314, 391939, 331293, 449485]
5752D49485R4701j05344K871M7211q2140R190p924q8022r9748M4197j7048k06128
5740D1301J16143Q5436p3769N734R9873j4659j61582k6301J38911o6023m1827
5729A03237j42733j18742J42588k1556m8601j25013J2288j4970j8318m4482J06556
5718a69746m172J19680n1849o3844O1881p6742K2637k0617J06609j2354J6476
5707g2041n6067k1579l2668N2553n0363J10397N1133P366R069j86717J01556N3410
5695c3951m6951p6331n4430m1034N7417K7277q682n9101j55741N2361K1388r0180
5683d07958J47136L09561J67022N6771j25246j43043j08286j7939J07480o4125
5673g8627j8843p0918k6755K2393r2922J13591J45947J0472j23156J1079J32377
$$ y = [449485, 544186, 438842, 441713, 488924, 406784, 415974, 408050, 320028, 220280, 264477, 247429, 41301, 157444, 242880, 169111, 174845, 274718, 260059, 98477, 72176, 211087, 145064, 103237, -39496, -158238, -15650, -37206, -85807, -210820, -198532, -213502, -231820, -276302, -169746, -173918, -54238, -106087, -169931, -108050, -184792, -162155, -182772, -76163, -88517, -72041, -128108, -149687, -182355, -129802, -180165, -69768, -18635, -11269, -2200, -188917, -87361, -33951, -80902, -157233, -211663, -252697, -195280, -168003, -176685, -235786, -391527, -339166, -317778, -407958, -260822, 48739, 215761, 272532, 147286, 4243, -104043, -121982, -14502, -78627, -97470, -168388, -195143, -172750, -265672, -152081, -6134, 4338, -118818, -107739, 24638]
5662B4638J10288j06346o1444M7974O1665l0079n7997N675k6688M0497k5489L0936
5650A3630l7030N258K20419k2983q0866J05659j19178m1o7224P846j143M4016
5638F8363m7196m7874k98K7214l430j01149J7031J1666J26337p6423m4268P2495
5626B468J00889M1833p6906q2756p9531M5778j02973J22054K3426m4347P4049
5615B3984L31153J88820O8478L5587k35858o0634j28871n3301J11821J37325J88680
5604F07184O4663J0399j64676j06700j23952k03288j92002M2240N0240j8807Q584
5593b6115n4407J29449J94806K26226L27578n2340j55604j16734j05145j80518
5583A87196p2505R3426J57796K07622l4875J9854m0019j43272j10962j82676o9142
$$ y = [24638, 134926, 28580, -32864, 15110, 76775, 46696, -11301, -5626, -32314, 8183, -17306, 13630, -23400, -18142, 202277, 179294, 98428, 204087, 84909, 84868, 17644, 25490, 24347, 68363, 21167, -26707, -27005, 209, -3221, -104370, -87339, -75673, 50664, -25759, -70027, 2468, 103357, 145190, 68284, -14472, -94003, -48225, -151198, -29144, -5718, -50065, 23984, 355137, 543957, 612435, 648022, 412164, 351530, 222659, 169358, 281179, 418504, 607184, 671847, 682246, 517570, 410870, 286918, 83630, -108372, -66132, -15892, -34699, -26115, -80522, 48927, 243733, 469959, 797537, 745197, 589593, 472859, 367714, 187196, 114691, 208117, 365913, 573535, 538660, 558514, 518495, 375223, 264261, 81585, 12443]
5572A2443j80203o099O712j01470j07458J7734J42881j65731M3651q38M7670r7551
5560c88259N8123Q4842j30435o6805L9412K0942j3301m1199q7638M4671l1416
5549e11063j3214R7142n2452j6509k6377N5825j96087Q0223L6705Q8773m5848
5538e02882k6489R5776p0065l2272M9319l3111R1248O191P1458l7592J8875m94
5526c70038R0420o0196k2365m1882K8582l9105m3001O4570K9452N4750n5284j12444
5514d76541p5866M3682N6534R7997k6008j39602m2643P5329n4515K5717P8550
5503d37366J16553m1323q0218Q168J37193j00577L9055k11390l0570l8471J5616
5492f23330J13233J9850o4704n0781J9868R8467q0679m7699N7323o8153L03p7077
$$ y = [12443, -167760, -173859, -167147, -268617, -376075, -358341, -215460, -381191, -337540, -338378, -290708, -388259, -330136, -245294, -375729, -442534, -403122, -382180, -395481, -436680, -524318, -479647, -511063, -524277, -427135, -479587, -496096, -522473, -466648, -662735, -582512, -545807, -457034, -502882, -529371, -433595, -503660, -535932, -486613, -519724, -428476, -422285, -350827, -388419, -369544, -370038, -279618, -339814, -362179, -404061, -375479, -414584, -457585, -393015, -363563, -308813, -364097, -476541, -552407, -508725, -452191, -354194, -380202, -519804, -562447, -487118, -541633, -515916, -437366, -320813, -362136, -442354, -434186, -296993, -397570, -358515, -569905, -600475, -638946, -623330, -510097, -490247, -554951, -605732, -585864, -487397, -568076, -615775, -558452, -626605, -626302, -703379]
5480g03379j4712Q0071P1755J31213k2953Q745n559j04092j6965J3486P872J19320
5468d35198J14128M393J3715P5548l0103J1386k5176j68720p7322p2251Q3010
5457e06590J59876l3380j04530m6285o995L904K9694m7162J3277n6635l8499j03900
5445g37225J74937M4452k1173J21133j21810l9270l0563Q7612m4872R4175Q6918
5434c85686l2089M7774j11996j23107J3674m5374J7161p2232M1034J23410j0581
5423e38012L0305j0456m6624j2683R5963j0214k7414N5572P70j41986J31861J56537
5411c16381n9231p7788J06019n437p3315J56178J05488j73537j04700J9386O129
5400d17189Q5355O6784K4572p3187o7135j5179Q8463J83041j4744P0320Q2392
$$ y = [-703379, -718091, -638020, -566265, -435052, -458005, -449260, -454819, -558911, -575876, -562390, -554518, -435198, -321070, -316677, -302962, -227414, -257517, -246131, -271307, -440027, -517349, -589600, -506590, -346714, -380094, -484624, -530909, -537904, -534000, -504306, -551468, -538191, -594826, -633325, -737225, -562288, -517836, -539009, -417876, -539686, -578956, -609519, -521907, -566779, -472604, -385686, -417775, -370001, -481997, -605104, -591430, -636804, -619643, -691875, -650841, -527431, -538012, -507707, -518163, -564787, -577470, -481507, -491721, -519135, -463563, -462793, -604779, -472918, -316381, -375612, -453400, -347381, -352818, -426133, -269955, -164467, -338004, -442704, -423318, -417189, -331834, -265050, -240478, -313665, -380800, -395979, -307516, -124475, -139219, -68899, 13493]
5389A3493q160K3102p6489R9729r5677n1277J97987N1589j3870j0889j47289J4267
5377c484R811m9132J35566R7038k6613k1314q4424k9055Q9338O1012Q1994N021
5365B65758k4803l7394L1680J14802M4330N21J24983l5264r7976q864p0865j30011
5353A76897N2163J10800L2609K9599l6303K0433J4948P2541o1610j04224J10463
5342D18316J15846O6275P135J22841M6267o2417j65151l2426K3957N5568L721
5331E99932l3844J90089J6667Q8444O6560M9602j18543l0605L0798J32204j12740
5320H78564Q5846K18636J75921O6428J53130J67523k359n8519j0973o0750J21474
5309A734921j02757j6215M7539P1159J17171K12225J39622J55016K55861M2782
$$ y = [13493, 5333, 28435, -48054, 51675, -44002, -95279, 102708, 154297, 140427, 129538, -17751, -3484, 6327, -42805, 92761, 189799, 163186, 141872, 57448, 28393, 117731, 178743, 260737, 265758, 240955, 203561, 235241, 350043, 394373, 394894, 519877, 484613, 386637, 377773, 306908, 176897, 229060, 339860, 372469, 402068, 365765, 386198, 401146, 473687, 412077, 307853, 418316, 534162, 600437, 607572, 730413, 776680, 714263, 549112, 516686, 540643, 596211, 599932, 566088, 756177, 772844, 861288, 927848, 977450, 858907, 828302, 859100, 991304, 878564, 964410, 1183046, 1358967, 1425395, 1578525, 1746048, 1743689, 1685170, 1674197, 1613447, 1734921, 1632164, 1615949, 1663488, 1734647, 1851818, 2064043, 2203665, 2358681, 2614542, 2657324]
5299B657324m5565K59025K85662K74575J85590L1883L24437K99951M32129L85968
5289E090979N36743Q89711J337567K179876L507994M495617L972742J614251n54393
5280B3071087j824563k208340j835898j186997l09329R76773K364349M272854
5272B3319936O216558O614710N791292M192565K081240J153009J106823L23324
5264E0799457p53301p27995j50140L49635j5039p2861Q60148J761866J885422
5255E3937192J755600K372627K980040L886801M468804L466551J483837j267712
5247G3083740k941693l856006l092891j379030j143812k131105k069150j298601
5239E5171452o78604j269004j619785r42647l61799K78524Q05047J613217J632859
$$ y = [2657324, 2611759, 2870784, 3156446, 3431021, 3616611, 3648494, 3972931, 4272882, 4705011, 5090979, 5627722, 6517433, 7855000, 10034876, 13542870, 18038487, 22011229, 23625480, 23071087, 21246524, 19038184, 17202286, 16015289, 15705960, 16682733, 19047082, 23319936, 29536494, 36151204, 41942496, 46135061, 48216301, 49369310, 50476133, 50799457, 50046156, 49318161, 49168021, 49517656, 49502617, 49429756, 50289904, 52051770, 53937192, 55692792, 58065419, 61045459, 64932260, 69401064, 72867615, 74351452, 73083740, 70142047, 66286041, 63193150, 61814120, 60670308, 58539203, 56470053, 55171452, 54492848, 53223844, 51604059, 50661412, 50299613, 50578137, 51383184, 52996401, 54629260]
5230E4629260N38931r97501l383811n568036o418449o326693n058675l661385
5222B3753641k646128j417607k19563J367431L063507K978623R47059j336307
5214B6490656l019316l507611l111506k611699j890200j479593j148666r75268
5206H746797q85566o43657m65322n03412k99938l56548k25605n5500k97158k46509
5196D767582k08396j76705j35401j65540j46726j49885k8415k05338k05193j46973
5186C199010o2232q1934r1838j50834j14220O510j05953j85228L0706k8702m8528
5175B366757j18538j52894P5405K8319p1403o6658j7840o9012q3581j12026l2977
5164A745552j68179p1698M6963N889m5338j96641J5102R8862J79786j067j97308
$$ y = [54629260, 55168191, 54170690, 50786879, 45218843, 38800394, 32473701, 27415026, 23753641, 21107513, 19689906, 19470343, 20837774, 23901281, 26879904, 27826963, 26490656, 23471340, 19963729, 16852223, 14240524, 12350324, 10870731, 9722065, 8746797, 7861231, 7217574, 6752252, 6248840, 5948902, 5592354, 5366749, 5311249, 5014091, 4767582, 4559186, 4382481, 4247080, 4081540, 3934814, 3784929, 3756514, 3551176, 3345983, 3199010, 3136778, 3054844, 2963006, 2812172, 2697952, 2704462, 2598509, 2413281, 2443987, 2415285, 2366757, 2248219, 2095325, 2170730, 2199049, 2127646, 2060988, 2043148, 1974136, 1890555, 1778529, 1745552, 1577373, 1505675, 1552638, 1558527, 1513189, 1316548, 1331650, 1430512, 1610298, 1609231, 1411923]
5153A411923J00688L1986j52242r5551P713j52934P8891Q3816j79577K1725P7312
5142A233750m6744n9741n0368O0285o3481L5388q0794m8608P1619M6309M5267
5131A142882L3794p7278M3734O5924j02546N7354p688O2453Q1294k839p7081k7310
5119A192693J22820J0940q2146m3388p6553P3105n412K0618R163l7209O3631J79390
5107A427652J3174L8089q344J51752K9709O6526j99286M1089N0694K7717p90n4289
5095A583693K8005J8996J28363o1493j16308O9648m5398k5052R6906l5511L9162
5084A681011Q8405M0440J8465k1736J01554J6689O9611k0936l3925R4868p3885
5073A960561J40288J04670Q6173L6071k2619j04893J8516q1171O7060k094q4469
$$ y = [1411923, 1512611, 1544597, 1392355, 1296804, 1304517, 1151583, 1230474, 1314290, 1134713, 1156438, 1233750, 1187006, 1127265, 1076897, 1137182, 1073701, 1109089, 1028295, 979687, 1051306, 1097615, 1142882, 1176676, 1099398, 1143132, 1209056, 1106510, 1163864, 1156176, 1218629, 1299923, 1297084, 1220003, 1192693, 1315513, 1326453, 1244307, 1200919, 1124366, 1197471, 1192059, 1212677, 1221840, 1184631, 1248262, 1427652, 1440826, 1478915, 1470571, 1622323, 1652032, 1718558, 1519272, 1560361, 1611055, 1638772, 1637982, 1583693, 1611698, 1630694, 1759057, 1697564, 1581256, 1650904, 1605506, 1580454, 1677360, 1641849, 1681011, 1769416, 1809856, 1828321, 1806585, 1908139, 1924828, 1994439, 1973503, 1939578, 2034446, 1960561, 2100849, 2205519, 2291692, 2327763, 2305144, 2200251, 2218767, 2137596, 2204656, 2202562, 2118093]
5062B118093r796O7948p5775O5149P4099Q8248J66619K5615j69889L4811j25041
5051B260081j28194r8417l2470M783m8641j28496j19553l2326O7790k4709j6853
5040A702995p1980q6457J32029j17297Q757J3349K1822j06452m7610j4947m2395
5029A391814p7555j6005q3628j11068M5115J00663Q0419K1706k0126o7190j3793
5018A250352J2235l2860N2634r8745j8316k3434P4727J27449R0606j00842j43755
5007A190051L9855J12979K82831J51497p9292N1610R1587j00006o5501j25285
4997A550326k2419o1045K8959O0386Q4290j13776R6879J39082J44421J84565J73535
4986B265203J81146J89927J73138J11471J12308N3555J1019R394j06008p9646
$$ y = [2118093, 2108297, 2176245, 2100470, 2165619, 2239718, 2327966, 2494585, 2520200, 2350311, 2385122, 2260081, 2131887, 2033470, 2001000, 2005783, 1957142, 1828646, 1709093, 1676767, 1744557, 1719848, 1702995, 1631015, 1544558, 1676587, 1559290, 1568047, 1581396, 1603218, 1496766, 1449156, 1434209, 1391814, 1314259, 1298254, 1214626, 1103558, 1148673, 1249336, 1329755, 1351461, 1331335, 1264145, 1250352, 1262587, 1229727, 1282361, 1183616, 1165300, 1141866, 1216593, 1344042, 1434648, 1333806, 1190051, 1229906, 1342885, 1625716, 1777213, 1697921, 1749531, 1841118, 1741112, 1675611, 1550326, 1527907, 1466862, 1495821, 1556207, 1640497, 1526721, 1623600, 1762682, 1907103, 2091668, 2265203, 2446349, 2636276, 2809414, 2920885, 3033193, 3086748, 3097767, 3107161, 3001153, 2921507]
4976B921507j3495m9228j39027N4736J99523J6602p0058r5046M794J17934K17374
4965C165616J94346J37730P4202J24939O1932R8754J70693p030M2861N9255O2935
4954D186233j1526p582J263j90980j88257L6501N0942Q598K03165J16254J01696
4943D306307J78076R8308o0091j64179L7573R4918R547J15366K51460J37345L6881
4932E041511K59244J23491K11485J03980J27567K05425K20583J02643J14029J54947
4922F664905J19229P5700J49934J71032K73021L19867J58652K01354J53511J12526
4912H399731K71649L35974J40623K72801K55599J99965L56914L78329K87189L82390
4902A1281164M81747M87369O67070O39788O30920P18441N39415M75773M51545
$$ y = [2921507, 2908012, 2858784, 2719757, 2774493, 2974016, 2990618, 2920560, 2825514, 2830308, 2948242, 3165616, 3359962, 3497692, 3571894, 3696833, 3758765, 3857519, 4028212, 4021182, 4064043, 4123298, 4186233, 4174707, 4167125, 4168388, 3977408, 3789151, 3825652, 3876594, 3885192, 4088357, 4204611, 4306307, 4484383, 4582691, 4522600, 4358421, 4395994, 4490912, 4500459, 4615825, 4867285, 5004630, 5041511, 5300755, 5424246, 5635731, 5739711, 5867278, 6072703, 6293286, 6395929, 6509958, 6664905, 6784134, 6859834, 7009768, 7180800, 7453821, 7773688, 7932340, 8133694, 8287205, 8399731, 8671380, 9007354, 9147977, 9420778, 9676377, 9876342, 10233256, 10611585, 10898774, 11281164, 11762911, 12250280, 12917350, 13557138, 14188058, 14906499, 15445914, 15921687, 16373232]
4893A6373232M96568O14797Q08859J174240J506344K126979L321451N371603R538218
4884D1332291J5572591J9400964J6506251O549771m155612j1003840j2753855
4877G1448561j0983299q158278n562539l852523k651343j293922n6075J043047
4869C9933629K731839N439711J0405806J6766554K1128648K0771213J7047402
4862A34224802J4130904J0893467L891326o634892j5264771j9037793j7706114
4855A04496929j3805826r509118n863877l094006q97194Q30126K874015M718486
4847G9749535P688999J2000198J8534398K4617062K5358307J7002143L534593
4840A88485235p491234j3128977j3076832j0557832q164435o505226n794631n124028
$$ y = [16373232, 16869800, 17484597, 18293456, 19467696, 20974040, 23101019, 26422470, 31794073, 41332291, 56904882, 76305846, 92812097, 99361868, 95206256, 84202416, 71448561, 60465262, 52306984, 46744445, 42891922, 40240579, 38946657, 38890582, 39933629, 42665468, 48105179, 58510985, 75277539, 96406187, 117177400, 134224802, 148355706, 159249173, 163140499, 156505607, 141240836, 122203043, 104496929, 90691103, 81181985, 75318108, 72224102, 71326908, 72157034, 75031049, 79749535, 87438534, 99438732, 117973130, 142590192, 167948499, 184950642, 188485235, 180994001, 167865024, 154788192, 144230360, 136065925, 129560699, 123766068, 118642040]
4832A18642040m412008l220275j958977q01062R62261K752957M976256O850611
4824A23791803Q367066R493734R746770R991494J1095392J3259730J5482839J7103781
4816B18332609J6907347J4841217J1628427P623016M340232J762763k98205k463624
4808B72673782m826930o757902p839668p004220n749903m205506l243451k359388
4800B30686814p91353J931438M919088P377896Q633347Q432640O884416M913490
4792B72987776L318757L097915M095642N137502N228842M847902M605781M588358
4784C07908475M061271L090721J354156q62174k017638j936772q86863n13109
4776C10198067j266580l433773n861502p453295p411078n844298l712066k916307
$$ y = [118642040, 114230032, 111009757, 109050780, 108249718, 109211979, 111964936, 116941192, 123791803, 132158869, 141652603, 151399373, 161390867, 172486259, 185745989, 201228828, 218332609, 235239956, 250081173, 261709600, 269332616, 273672848, 275435611, 275137406, 272673782, 267846852, 261088950, 253249282, 246245062, 240495159, 236289653, 233046202, 230686814, 229895461, 231826899, 236745987, 244123883, 252757230, 261189870, 268074286, 272987776, 276306533, 279404448, 283500090, 288637592, 293866434, 298714336, 303320117, 307908475, 311969746, 315060467, 316414623, 315552449, 313534811, 311598039, 310711176, 310198067, 308931487, 305497714, 299636212, 292182917, 284771839, 278927541, 275215475, 272299168]
4768B72299168k999156l387846m090583l852563m486450o159796p591918q064585
4760B31666271p422025n898892m286740l323766l523399m320606m861482m646022
4752A93383339l373659k416548k050489k479498l691144n069841n943159o374922
4744A61984079o534973o830378p241580p654251q007869q067313p692310p105903
4736A02849502o691058o390340o141601o032504n635565m990873m358787l609996
4728E8998778k956227k740741k547477k229404k379511j967049j658122j449764
4720D1070483j391642j411425j120062j250123j197665j198782j014104q96153
4712C1590527q07422p96885n80503m98901m75436m86862o29203m67429m48580
$$ y = [272299168, 269300012, 265912166, 261821583, 257969020, 253482570, 247322774, 239730856, 231666271, 224244246, 218345354, 214058614, 210734848, 207211449, 202890843, 198029361, 193383339, 190009680, 187593132, 185542643, 183063145, 179372001, 174302160, 168359001, 161984079, 155449106, 148618728, 141377148, 133722897, 125715028, 117647715, 109955405, 102849502, 96158444, 89768104, 83626503, 77593999, 71958434, 66967561, 62608774, 58998778, 56042551, 53301810, 50754333, 48524929, 46145418, 44178369, 42520247, 41070483, 39678841, 38267416, 37147354, 35897231, 34699566, 33500784, 32486680, 31590527, 30783105, 29986220, 29405717, 28906816, 28431380, 27944518, 27315315, 26847886, 26399306]
4703B6399306o43365n06102n72952n90070n15287m02392n48000l64785m25895
4694B1830458m08182n49416l92762l95358k99453k81158l95079n58472l25417
4685A8225161m14517m48248k22443k62413k50719k70036l42577l95285l52765
4676A5266158j48720j77222l38087j89827k23055j68526k37750j36372l12156
4667A3334443k31940l82676k03679j50626k77139l48453o9947j1710k21944p1548
4657A1364781M3998R3963p4191j04429j57690j91857k2311j56520o3096k84558
4647A0448090j8738j47130j19582j94427K2505K08340n2477n0980m0764j81654
4637I873183q8014j13543k3381J17541k53224N0516K1693j4816J82755N8844o5638
$$ y = [26399306, 25755941, 25249839, 24676887, 24086817, 23571530, 23169138, 22621138, 22256353, 21830458, 21422276, 20872860, 20480098, 20084740, 19785287, 19504129, 19109050, 18550578, 18225161, 17810644, 17362396, 17139953, 16877540, 16626821, 16356785, 16014208, 15618923, 15266158, 15117438, 14940216, 14602129, 14412302, 14189247, 14020721, 13782971, 13646599, 13334443, 13102503, 12719827, 12516148, 12365522, 12088383, 11739930, 11669983, 11658273, 11436329, 11364781, 11408779, 11502742, 11428551, 11324122, 11166432, 10974575, 10952264, 10795744, 10732648, 10448090, 10429352, 10282222, 10162640, 9968213, 9990718, 10199058, 10146581, 10095601, 10054837, 9873183, 9785169, 9671626, 9648245, 9765786, 9512562, 9563078, 9584771, 9569955, 9752710, 9811554, 9745916]
4626I745916j41710j6112q5477k09232m721k245n1830K08653K19534R3713l0074
4615I726415O3141K20670R0867j9370J42719J32637n1942J36075L36665K49380
4605A1027257J96230K22757J33427K49149K46220J98861K07202L65650L77413
4596A3224166N85589N72543M60550N19086O80218Q40457J156178J374429J841420
4587B1254636K762077M558827P807884J3366951J8463548J9233682J2797501K002117
4579A02247223p288211j2646483j2595876r671808n848737j580249L628363J0087072
4571F6331294J5622018J6047868R326068q25454q936871j2873077j1477581p047327
4563F6166938m70125O920872J2034117J1857849N124779l583954j0238830j2959622
$$ y = [9745916, 9604206, 9588094, 9502617, 9293385, 9288664, 9286419, 9234589, 9443242, 9662776, 9756489, 9726415, 9789556, 10010226, 10101093, 10081723, 10224442, 10357079, 10305137, 10441212, 10777877, 11027257, 11223487, 11446244, 11579671, 11828820, 12075040, 12273901, 12481103, 12846753, 13224166, 13809755, 14382298, 14842848, 15361934, 16042152, 16882609, 18038787, 19413216, 21254636, 24016713, 28575540, 36383424, 49750375, 68213923, 87447605, 100245106, 102247223, 94959012, 82312529, 69716653, 60044845, 54196108, 52615859, 56244222, 66331294, 81953312, 98001180, 107327248, 106501794, 97564923, 84691846, 73214265, 66166938, 65696813, 72617685, 84651802, 96509651, 101634430, 98050476, 87811646, 74852024]
4555G4852024j1547402q424628m852998r58503L888280R618528J3245030J1647480
4547H7467811M298878m806180j0993327j2928652j1755637r380273o970318n291180
4539B9641122m232374l153260k365703j971783j449823r82486q45914p85537n22631
4530A3331611l16483l80672m78211l98524k45335k18315k20210l27962l77175
4521A0368724o9790k03190l22843l13490k36303j74044k57061j57916k17749j48447
4511H267891j50345j84262j32665j08620l9356j63820j60442j48975R5450J1001
4501G285857j87617j44839j3016j0747j62596P0389k8544o216q9744j73034j18661
4490F421232j08107M0086L2411q6283q6266k03742j0739O0221j3982j6055l1477
$$ y = [74852024, 63304622, 54879994, 50026996, 49068493, 52956773, 62575301, 75820331, 87467811, 91766689, 86960509, 75967182, 63038530, 51282893, 41902620, 34932302, 29641122, 25408748, 22255488, 19889785, 17918002, 16468179, 15485693, 14639779, 13854242, 13331611, 13015128, 12634456, 12156245, 11757721, 11512386, 11294071, 11073861, 10745899, 10368724, 10298934, 10095744, 9772901, 9459411, 9223108, 9049064, 8792003, 8634087, 8416338, 8267891, 8117546, 7933284, 7800619, 7691999, 7652643, 7488823, 7328381, 7179406, 7274856, 7285857, 7098240, 6953401, 6940385, 6929638, 6767042, 6837431, 6808887, 6802671, 6712927, 6539893, 6421232, 6313125, 6353211, 6385622, 6299339, 6213073, 6009331, 5998592, 6058813, 6044831, 6028776, 5997299]
4479E997299l0435m5727j81377j31468k16811j02060m4848P4998j54299j18950
4469E046322j9124N1698p1680j1363N7468q9760k9991J02544J20478m2976p1929
4458E041687j06888l9820j38614j70292j47493k21741j81696k0085Q4645j18267
4448C981436j09574o9976n0886n9397Q140J05521j01922N1899N6822n8415o2361
4437C691287P3391Q7492q4666j16934K5415J8484n6043k0905P2566n6626l5916
4426C597545L6679K39429L49927M71872M76888M13916j07831l72150m87845m46830
4416D171600k19502M8174j58720k46961q136L7153m4732j7740k0303K6706Q7424
4405C654963r1005l407N7597o808r9552r758r5103J19526j30906m923k2081Q7046
$$ y = [5997299, 5966864, 5921137, 5739760, 5608292, 5391481, 5289421, 5244573, 5319571, 5165272, 5046322, 5027198, 5078896, 5007216, 4995853, 5053321, 4963561, 4933570, 5036114, 5156592, 5113616, 5041687, 4934799, 4894979, 4756365, 4586073, 4438580, 4216839, 4035143, 4015058, 4099703, 3981436, 3871862, 3801886, 3751000, 3691603, 3699743, 3805264, 3703342, 3755241, 3812063, 3753648, 3691287, 3764678, 3852170, 3767504, 3650570, 3675985, 3694469, 3638426, 3617521, 3690087, 3633461, 3597545, 3634224, 3873653, 4223580, 4695452, 5172340, 5586256, 5478425, 5106275, 4618430, 4171600, 3952098, 4000272, 3841552, 3594591, 3586455, 3623608, 3578876, 3561136, 3540833, 3567539, 3654963, 3563958, 3560551, 3618148, 3611340, 3511788, 3502030, 3406927, 3526453, 3395547, 3390624, 3368543, 3455589]
4393C455589J08323o4477J02055J10308N3448p3499J95011R8473j51005j22476
4383C711750J19951K322J44895J29814N9492R5339m2976q2638K7538J21974M5373
4372D332834n7090j76138j76351L8510Q9466O789n3236O7465j00117J38780J62289
4361D273201J14931n1391L8284n848n6387j30294l6238M1274l9730J82057O6962
4350D396821O1589p6061o8949j46612J69019N76l9056j13257k937l4737k6219
4339D120177M0906N239O9743Q5597m567o5622J94354Q5529M5202N8696j11772
4328D523482M1476n4614j08978P1335J26207j5815P9906J39071m3709R3057n3410
4317D798008q4383J9020J06208j22108q0448R1760R8974J67072J07740O2517M5008
$$ y = [3455589, 3563912, 3499435, 3601490, 3711798, 3765246, 3691747, 3886758, 3985231, 3834226, 3711750, 3831701, 3834023, 3978918, 4108732, 4168224, 4263563, 4220587, 4137949, 4165487, 4287461, 4332834, 4275744, 4099606, 3923255, 3961765, 4051231, 4058020, 4004784, 4072249, 3972132, 4110912, 4273201, 4388132, 4336741, 4375025, 4369177, 4312790, 4182496, 4146258, 4187532, 4147802, 4329859, 4396821, 4458410, 4382349, 4313400, 4166788, 4335807, 4336383, 4297327, 4184070, 4181133, 4146396, 4120177, 4161083, 4166322, 4236065, 4321662, 4317095, 4251473, 4445827, 4531356, 4576558, 4635254, 4523482, 4564958, 4510344, 4401366, 4472701, 4598908, 4583093, 4662999, 4802070, 4758361, 4851418, 4798008, 4713625, 4732645, 4838853, 4716745, 4636297, 4728057, 4827031, 4994103, 5101843, 5164360, 5209368]
4306E209368K24764O4105J71645K93515K43360L60334K97124J89616K2618n3850
4296G022599o7813j96160m77280k69585k01297q0139r9300R642J49660j2941N7598
4285E834984K52851K82874j2634K94650N8764m5756j13910k45688k66436m93574
4275E546125l25994o6512k64831k40361q0888n9988k64252l12361r7726j1484
4265C821728N6855k0421m9961P2175L5869J0975L8952l6709k9148r7737m4519
4254C758059j31054M1094O8302K3299J7539J81809J4714n4003N6557R9158O9509
4243D144983l0101J15511O3229L3105J62249j9633q4774O4855P5528j18826K8564
4232D434690O2093j35366M5483J07683J47172M9024j6203K70967K04779j86978
$$ y = [5209368, 5434132, 5498237, 5669882, 5963397, 6206757, 6567091, 6864215, 7053831, 7076449, 7022599, 6954786, 6758626, 6281346, 6011761, 5810464, 5730325, 5631025, 5640667, 5790327, 5777386, 5834984, 6087835, 6370709, 6358075, 6652725, 6711489, 6665733, 6551823, 6306135, 6039699, 5546125, 5220131, 5153619, 4888788, 4648427, 4567539, 4507551, 4243299, 3930938, 3833212, 3821728, 3878583, 3858162, 3808201, 3880376, 3916245, 3927220, 3966172, 3929463, 3900315, 3802578, 3758059, 3627005, 3668099, 3736401, 3759700, 3777239, 3959048, 3973762, 3919759, 3976316, 4075474, 4144983, 4114882, 4230393, 4293622, 4326727, 4488976, 4469343, 4384569, 4449424, 4524952, 4406126, 4434690, 4496783, 4361417, 4406900, 4514583, 4661755, 4710779, 4694576, 4965543, 5170322, 4983344]
4222D983344j3219J59176J62436l1306L8491k1020k2908J33189J98320M4054J70917
4211E801474J95081O8912r903J46388R4194R1605N9719L7230J54667R9365M1055
4200F779787J31739K91135K12793J93229J81940J28926K04324K38197K65528L64236
4190H991834L96696L95647L88788M22160M81993O53809O51070R93432J102884
4181A4478313J115253J496713J569839J736034J781282J308106J067737Q07028
4173B5360305O16120M78985J60407j61186m42269l28189k2213K71476P16094J301955
4163B7951485K070541K913279L465800L221510K574458J728463J345419J046411
4155D6317366Q81379J049762J344506J425746J306192J087132J109009J178934
$$ y = [4983344, 4970125, 5129301, 5291737, 5260431, 5298922, 5277902, 5254994, 5388183, 5586503, 5630557, 5801474, 5996555, 6065467, 6055564, 6201952, 6296146, 6387751, 6447470, 6484700, 6639367, 6738732, 6779787, 6911526, 7202661, 7415454, 7608683, 7790623, 7919549, 8123873, 8362070, 8627598, 8991834, 9388530, 9784177, 10172965, 10595125, 11077118, 11730927, 12381997, 13375429, 14478313, 15593566, 17090279, 18660118, 20396152, 22177434, 23485540, 24553277, 25360305, 25976425, 26455410, 26615817, 26454631, 26012362, 25684173, 25661960, 25933436, 26649530, 27951485, 30022026, 32935305, 36401105, 39622615, 42197073, 43925536, 45270955, 46317366, 47198745, 48248507, 49593013, 51018759, 52324951, 53412083, 54521092, 55700026]
4147E5700026J378752J533508J790726K030697J918201J216427K18021n44327
4139F5242031m57570l9744J489106L559524N706840P632342P822226N969919L111869
4130A00036543P13570l49195m40453L19841J162543J376014J136219O64471M79286
4121A05098839N91449R31231J040699J176426Q60448J65331m43475p85481j011325
4112A07624142l73205J24019J012205K250349L719735N828853P784810R006553
4104A36977461R127346Q255196O874779N765036N210807N153187M721641L612106
4096A85697559K166663J262524J958112L000260K882999J976764L09391j308729
4088A97945543j740425j337856J2612K177280N284599Q708573J1944033J3928629
$$ y = [55700026, 57078778, 58612286, 60403012, 62433709, 64351910, 65568337, 65786358, 65242031, 64784461, 64744717, 66233823, 69793347, 75500187, 83132529, 90954755, 96924674, 100036543, 100750113, 100400918, 99960465, 100280306, 101442849, 102818863, 103955082, 104619553, 105098839, 105690288, 106621519, 107662218, 108838644, 109699092, 109864423, 109420948, 108635467, 107624142, 107250937, 107374956, 108387161, 110637510, 114357245, 120186098, 127970908, 136977461, 146104807, 154360003, 161234782, 166999818, 172210625, 177363812, 182085453, 185697559, 187864222, 189126746, 191084858, 194085118, 196968117, 198944881, 199254272, 197945543, 196205118, 194867262, 194879874, 197057154, 202341753, 211050326, 222994359, 236922988]
4080B36922988J3858388J0289155N137685L42474l087444m488607m343028l331750
4072B51299861j327882J069598M105935O443433N770020L010979P33990l88000
4064B70717934R6762Q95382N45444l08911j426708k337274m294263n701450n596837
4055B52590079l546193l64260J791281J527683k026980p656078j2029986j3903607
4047B16381939j3557661j1888487r398357o487282l464539r89184L11612K36457
4039A71144498p44520j847523k181589k507204k643189k956633l388787l515100
4031A51359953l393445l078421k770664k177130j356171p19229p28307k446945
4023A34689641m612938o338882p230502o698259n992780m979539l689058k567081
$$ y = [236922988, 250781376, 261070531, 266208216, 266550690, 263463246, 258974639, 254631611, 251299861, 249971979, 251041577, 255147512, 261590945, 267360965, 270371944, 271105934, 270717934, 270814696, 271710078, 272255522, 271946611, 270519903, 268182629, 263888366, 258186916, 252590079, 249043886, 248679626, 250470907, 251998590, 249971610, 242315532, 230285546, 216381939, 202824278, 190935791, 181537434, 175050152, 171585613, 170596429, 170908041, 171144498, 170399978, 168552455, 166370866, 163863662, 161220473, 158263840, 154875053, 151359953, 147966508, 144888087, 142117423, 139940293, 138584122, 137864893, 137136586, 134689641, 130076703, 123737821, 116507319, 109809060, 103816280, 98836741, 95147683, 92580602]
4015I2580602j719694j360483j749806k527123k789220k647475k269653j900162
4007G5616986j611526r55229r16603p62637m70686l03999m04021o19560j007039
3998F8565686j624830k265798k904605l548715l706149l365406l037010k612008
3990D5501165j909030j442897j075895q74505q53092p95183n84585n67220n66007
3981C6832751o24987p23970j095611j417334j598740j814203j760169j636515
3973B6161222j564432j299806j029635r30593j010855p34200o19530n52564m80790
3964A7938817p18196n54738m52863l73684l18184m96301m03988l47014l01153
3955A3972696j96614m07218k38425j47776l88346k13505j91152j73635k10881
$$ y = [92580602, 90860908, 89500425, 87750619, 85223496, 82434276, 79786801, 77517148, 75616986, 74005460, 73050231, 72133628, 71370991, 70900305, 70596306, 70192285, 69572725, 68565686, 66940856, 64675058, 61770453, 58221738, 54515589, 51150183, 48113173, 45501165, 43592135, 42149238, 41073343, 40198838, 39345746, 38550563, 37965978, 37398758, 36832751, 36207764, 35483794, 34388183, 32970849, 31372109, 29557906, 27797737, 26161222, 24596790, 23296984, 22267349, 21336756, 20325901, 19591701, 18972171, 18419607, 17938817, 17220621, 16665883, 16213020, 15839336, 15521152, 15024851, 14620863, 14273849, 13972696, 13776082, 13368864, 13130439, 12982663, 12594317, 12380812, 12189660, 12016025, 11805144]
3946A1805144l58229j66488q2202l30604j80897q8177j72108j10083l00208k31690
3936I784458j83042j04542r8941o6945j09421o0373l0226R192j30079P0198q2626
3925H997653j50367p9339k03730N1365M1253j73274K0598J03175k40190k34877
3915H132267J04960O538Q712l8702J0547J20184J06016n7313o8181M8917j78837
3904H195108j0464Q7140k03391R2348j65542o2200R9685J79635j1341N5896n8973
3893H197901m2741K23399L7696p3292R380N8597j17389K1861L0087O7579O9275
3882H482353q9619q5534J13660L00225J87869l6962L618J75693J37272K43819
3872I432394R4667P5820J64764J31762K95182M89117N48200L61707M60256N75258
$$ y = [11805144, 11446915, 11280427, 11198225, 10867621, 10686724, 10598547, 10426439, 10316356, 10016148, 9784458, 9601416, 9496874, 9397933, 9330988, 9221567, 9161194, 9130968, 9140160, 9010081, 9080279, 8997653, 8847286, 8767947, 8564217, 8615582, 8656835, 8483561, 8504159, 8607334, 8367144, 8132267, 8237227, 8243765, 8252477, 8213775, 8224322, 8344506, 8450522, 8393209, 8325028, 8373945, 8195108, 8184644, 8271784, 8068393, 8160741, 7995199, 7932999, 8032684, 8212319, 8200978, 8256874, 8197901, 8155160, 8378559, 8416255, 8342963, 8352343, 8410940, 8293551, 8315412, 8345499, 8413078, 8482353, 8392734, 8307200, 8420860, 8721085, 8908954, 8871992, 8875610, 9051303, 9188575, 9432394, 9527061, 9602881, 9767645, 9899407, 10194589, 10683706, 11231906, 11593613, 12053869, 12629127]
3862A2629127P48948O79330J071650J092245J159252J264520J312259J104282
3854B1061613J030411O89543J16699l99957p31882q60101j071454j278970j347094
3845A7208808j152551j043926j081073p96790o64694o62669n72422l97879n03272
3836A0333532m71572j81694l17058k43704k13912l61214j08791k89402j38508
3827H007677j83729j02084j01830q8230r2190j14957m7004j07654L0403r4621
3817G105781j20672n1770J88k07836j79899k6737r3884L3887j17350j6772q305
3806F316631m9895k45483k35641j52192l8420J09115k915r1563j81982l887Q3671
3795E507439j07307J796J9961n5928r122j70157o3711M3877j89353j51748O6029
$$ y = [12629127, 13378075, 14057405, 15129055, 16221300, 17380552, 18645072, 19957331, 21061613, 22092024, 22781567, 22898266, 22498309, 21766427, 20906326, 19834872, 18555902, 17208808, 16056257, 15012331, 13931258, 13134468, 12469774, 11807105, 11234683, 10836804, 10333532, 9861960, 9680266, 9363208, 9119504, 8905592, 8544378, 8435587, 8146185, 8007677, 7823948, 7721864, 7620034, 7531804, 7439614, 7324657, 7277653, 7169999, 7200402, 7105781, 6985109, 6933339, 6933527, 6725691, 6545792, 6519055, 6425171, 6459058, 6341708, 6324936, 6316631, 6266736, 6021253, 5785612, 5633420, 5595000, 5704115, 5701200, 5609637, 5427655, 5423768, 5507439, 5400132, 5401928, 5421889, 5365961, 5356839, 5186682, 5122971, 5166848, 4977495, 4825747, 4891776]
3784D891776n9038j05230p6225Q3856k4156J19327k6279R115m4431L28j19097
3773D649946k14389l0891k4776K4614l3284j6664K22316m662P8608j7637k5540
3762D607641Q1546j47781j40326m0260q9453j4791o1619M435J57144q497k067
3751D345972m1619j42955L8466J49196j02699o1905Q9879Q3272r7475j26729o0592
3740D072811p5600n9745r746l3421j09772K0613k7201m0597P9254O1897Q8169
3729C966662m0140p7774p4821k394K05440q2530M6915n7022j27434o3830m8551
3718C644521o5701L684O1179q376J941r9795M9939J08335J5138p6109p056M1104
3706C668804J53850O7334j39272r8670M4922P6861j45855L7178j3728J507K3416
$$ y = [4891776, 4832738, 4727508, 4651283, 4735139, 4710983, 4830310, 4804031, 4813146, 4768715, 4769043, 4649946, 4435557, 4404666, 4379890, 4404504, 4371220, 4354556, 4576872, 4572210, 4650818, 4633181, 4607641, 4689187, 4541406, 4401080, 4360820, 4271367, 4256576, 4194957, 4199392, 4356536, 4348039, 4345972, 4304353, 4161398, 4199864, 4349060, 4246361, 4184456, 4274335, 4357607, 4260132, 4133403, 4072811, 3997211, 3937466, 3927720, 3894299, 3784527, 3805140, 3777939, 3737342, 3816596, 3878493, 3966662, 3926522, 3848748, 3773927, 3771533, 3976973, 3894443, 3941358, 3884336, 3756902, 3693072, 3644521, 3578820, 3582504, 3643683, 3635307, 3637248, 3537453, 3587392, 3695727, 3710865, 3634756, 3627700, 3668804, 3822654, 3889988, 3750716, 3652046, 3696968, 3773829, 3627974, 3665152, 3651424, 3652931, 3676347]
3695C676347n4279j27465l9485J95663m3345M4259P1542l8404J0555j16054J179
3684C580513J09127O0620J0311J8491n648j4891p2573q5334o4327l06803o5539
3673C163947P2458O5073N5483P1926L2921j14257J28651o2087j01356J43405Q1282
3662C537446j21847n7127R519j94619R543j33642Q3889K6756j8341J64040R3330
3651C398947L8876m188L8005m578k08030j72042K09481R1332k77905L3565P623
3640C151086J19m1887N7415J50291J59991J5383p5054N1285O1400j06387r5240
3629C328402J13609J84693P6518k9603p4437J53504k5278J95375N0532Q9405J22262
3618D184982N0211l0217q6867p9976j24856O9615j27548J7460r8260L4934m554
$$ y = [3676347, 3622068, 3494603, 3455118, 3650781, 3607436, 3651695, 3723237, 3684833, 3695388, 3579334, 3580513, 3689640, 3750260, 3760571, 3779062, 3773414, 3758523, 3685950, 3600616, 3536289, 3229486, 3163947, 3236405, 3301478, 3356961, 3428887, 3461808, 3347551, 3476202, 3414115, 3312759, 3456164, 3537446, 3415599, 3358472, 3367991, 3173372, 3182915, 3049273, 3133162, 3159918, 3141577, 3305617, 3398947, 3437823, 3433635, 3471640, 3467062, 3259032, 3086990, 3296471, 3387803, 3109898, 3143463, 3151086, 3151205, 3109318, 3166733, 3317024, 3477015, 3492398, 3417344, 3468629, 3530029, 3423642, 3328402, 3442011, 3626704, 3703222, 3673619, 3599182, 3752686, 3727408, 3922783, 3973315, 4062720, 4184982, 4235193, 4204976, 4118109, 4038133, 3913277, 3982892, 3855344, 3872804, 3774544, 3809478, 3804924]
3607C804924n448O9285j3888j24885M6598J790K18008L51320J97371q4669m4582
3596D415824j02761n0589n9897k20933r915J05028n1969r9764j10599j03974j17996
3585C592455q2582K8594J73140O0912J25352m0517R0351Q8424R4476J45790J26377
3574D402772J24727n2982O4653Q2785J02273J9000k8456l5908k5460P6218Q2q6300
3562D643404J43876J15322J70750j0026J57687J76706J03337K38232J51369J61931
3552F052588Q5324R7957J02332L6073Q3012q37J03910n1441k5958J41845N1531
3541F676336K04125J88657L09977L35680M51055N96843M13877N82496O92722P70551
3531A1222319N23593O60445Q50622O07039N20011M37170L53424J55504j2423n4167
$$ y = [3804924, 3799476, 3868761, 3854873, 3729988, 3776586, 3778376, 3996384, 4347704, 4545075, 4460406, 4415824, 4313063, 4262474, 4202577, 3981644, 3971729, 4076757, 4024788, 3925024, 3814425, 3710451, 3592455, 3509873, 3538467, 3711607, 3772519, 3897871, 3857354, 3947705, 4036129, 4130605, 4276395, 4402772, 4527499, 4474517, 4539170, 4621955, 4724228, 4743228, 4714772, 4678864, 4653404, 4729622, 4729704, 4643404, 4787280, 4902602, 5073352, 5063326, 5221013, 5397719, 5501056, 5739288, 5890657, 6052588, 6137912, 6235869, 6338201, 6374274, 6457286, 6456449, 6560359, 6508918, 6482960, 6624805, 6676336, 6880461, 7069118, 7379095, 7714775, 8165830, 8762673, 9176550, 9759046, 10451768, 11222319, 11745912, 12406357, 13256979, 13864018, 14384029, 14821199, 15174623, 15330127, 15317704, 15263537]
3521A5263537j01654k42022l16813l34276m19188m62861l11440n72307n30192
3512A1972784o41618n86244o01646o01655l02441m73525n61423k97087m04736
3503G502409m01480k36754l04171k30670k78346k91552k32910n5354k08262r0200
3493E172710j46725k08485m0621R5653R3167j550k58667j23862j52741l6004j5902
3482D376973k79734j42145o9565M8693m7486j55824L0477M4013L3393J94482Q6357
3471D119634J16123L9783j7053N4630l812j6928n4298o2789j62999k14672p5670
3460C721949j48992J7433k43129n7824n0943J4336j7019j40142J98546J67642
3450C461857j6385o0028r813k8708O591j13499r0474L9098j41632j35306m7201
$$ y = [15263537, 15161883, 14919861, 14603048, 14268772, 13849584, 13386723, 13075283, 12502976, 11972784, 11331166, 10744922, 10143276, 9541621, 9239180, 8765655, 8204232, 7907145, 7502409, 7100929, 6864175, 6560004, 6329334, 6050988, 5759436, 5526526, 5471172, 5262910, 5172710, 5025985, 4817500, 4776879, 4872532, 4965699, 4964149, 4705482, 4581620, 4428879, 4392875, 4376973, 4097239, 3955094, 3885529, 3934222, 3886736, 3730912, 3761389, 3805402, 3838795, 4033277, 4119634, 4235757, 4275540, 4258487, 4313117, 4309305, 4292377, 4238079, 4175290, 4012291, 3797619, 3721949, 3572957, 3590390, 3347261, 3289437, 3238494, 3252830, 3235811, 3095669, 3294215, 3461857, 3445472, 3385444, 3375631, 3346923, 3353514, 3240015, 3149541, 3188639, 3047007, 2911701, 2864500]
3439B864500k09910l11387l1387M2744J54529L3545j36258j87325j19789L3050
3429B132312N3678j955J6464L4184j29302q0169M69L1400j10457r4404P4955Q2208
3417B009383o2508K9207Q9504M1197k2805M5116R0470j04818j11215K15744P9303
3406B298578q4109N7448j09014l1750J5945P1517j40274N2275R9514j64849j42068
3395A923213j49770K9227P1070J39236j34003m2617J4012R6030L9190O1183j32711
3384A914060R0643J28575o8541P8413j65816j70468j18753m1590j525m8577N4641
3373A651062m3376q2217n9769J8673r0474L8517K0194n1411Q8191J11712l4284
3362A566818j10117Q4313L176l6430O2337m6646k0936m6854r139J30863o9067
$$ y = [2864500, 2654590, 2343203, 2311816, 2354560, 2509089, 2542634, 2406376, 2219051, 2099262, 2132312, 2185990, 2184035, 2200499, 2234683, 2105381, 2025212, 2025681, 2057081, 1946624, 1852220, 1927175, 2009383, 1946875, 1976082, 2065586, 2106783, 2083978, 2129094, 2219564, 2114746, 2003531, 2219275, 2298578, 2214469, 2271917, 2162903, 2131153, 2147098, 2218615, 2078341, 2130616, 2230130, 2065281, 1923213, 1773443, 1802670, 1873740, 2012976, 1878973, 1836356, 1850368, 1946398, 1985588, 2046771, 1914060, 2004703, 2133278, 2064737, 2143150, 1977334, 1806866, 1688113, 1646523, 1644998, 1596421, 1651062, 1607686, 1525469, 1465700, 1484373, 1393899, 1432416, 1452610, 1401199, 1489390, 1601102, 1566818, 1456701, 1541014, 1544190, 1507760, 1570097, 1523451, 1502515, 1455661, 1446522, 1577385, 1508318]
3351A508318j86201p9247n823P5093Q2813J24287n3393j22692p9621K2939J69317
3340A455790k1935j03901m255j48749k5262J06605j14p8239M769K4291K2181J0754
3328A241935m119L9647O9878L9113l6693J06400j08706j5993j08858J4164M4508
3317A281276j47630k4361Q3691J8915k265m5166J04085O7822j88480o5932J18734
3306A200689O7072l5300K9200o9517m4849L9886N2364R6915M5716j50942o9505
3295A161729J72007M659n1393j07713R534j1448P5918o5273k08257J27312P4144
3284A181219J7192j53856j33742R7569J28785J13511o9084m9264J07425O212M3422
3273A289389j22868k3942Q5544K2959r0937N4870N7779N5789l8645m3640L3278
$$ y = [1508318, 1322117, 1242870, 1237047, 1312140, 1394953, 1519240, 1465847, 1343155, 1263534, 1286473, 1455790, 1433855, 1329954, 1325699, 1176950, 1151688, 1258293, 1258179, 1179940, 1184709, 1209000, 1231181, 1241935, 1237816, 1277463, 1347341, 1386454, 1349761, 1456161, 1347455, 1331462, 1222604, 1236768, 1281276, 1133646, 1109285, 1192976, 1211891, 1209626, 1164460, 1268545, 1336367, 1147887, 1081955, 1200689, 1267761, 1232461, 1261661, 1192144, 1147295, 1187181, 1239545, 1336460, 1382176, 1231234, 1161729, 1333736, 1338395, 1287002, 1179289, 1188823, 1177375, 1253293, 1188020, 979763, 1107075, 1181219, 1198411, 1044555, 910813, 1008382, 1137167, 1250678, 1181594, 1132330, 1239755, 1245967, 1289389, 1166521, 1142579, 1228123, 1251082, 1160145, 1215015, 1272794, 1328583, 1289938, 1246298, 1279576]
3262A279576p7201O5475j14644R885N6449K8610K3275k9791Q7429m6128o7723
3251A215212J21109r9364J33832N9887Q9448m4948m5903l5246O5838j7765J15527
3240A557627O4709j54566N9622R1721k08000J71343k7994l2406J17735j4237J71871
3229A797425N2348o9778l1854J44811O599K4723l0568L3638K1571J01008J50928
3218B200851O1101J42496J59509J30074K94831K38642J94239K03568K91118L14866
3208D231295K56068O102J28214k950k09135q1052K0673R2890j6697J11883M828
3197D542119j40489L7295J37305L572p1610o6198J31606J7236l1624J12656J05814
3186D777682K55384J69003M39715O25793R96501J235024J284766P17781k3955
$$ y = [1279576, 1202375, 1267850, 1153206, 1163091, 1219540, 1248150, 1271425, 1241634, 1329063, 1282935, 1215212, 1336321, 1236957, 1370789, 1430676, 1520124, 1475176, 1429273, 1394027, 1459865, 1442100, 1557627, 1622336, 1467770, 1527392, 1619113, 1411113, 1582456, 1554462, 1522056, 1639791, 1625554, 1797425, 1849773, 1779995, 1748141, 1892952, 1899551, 1924274, 1893706, 1927344, 1948915, 2049923, 2200851, 2261952, 2404448, 2563957, 2694031, 2988862, 3227504, 3421743, 3625311, 3916429, 4231295, 4487363, 4493465, 4621679, 4618729, 4409594, 4328542, 4349215, 4442105, 4425408, 4537291, 4542119, 4401630, 4438925, 4576230, 4579802, 4508192, 4441994, 4573600, 4590836, 4559212, 4671868, 4777682, 5033066, 5202069, 5641784, 6267577, 7264078, 8499102, 9783868, 10501649, 10477694]
3177A0477694m96369r16160r70069p97072q42494n82903l96335l17723l23096
3168D835473q2139j81254j09602j81546j03154o4197m5746Q4388K21076P456j636
3157D379119M0466K9234O0391R8088J16672J66685L04619K06163R8684j24645
3147E375476l6388l05997k74643k12634l37763k39129j88557j82035l76491k12962
3137C008877o9744m4888J0392n7231o1845j0489J4047M792m8786p8272j64349
3126B502504j40345j32371p335k4668j46930N9740j64487k9681o4623J3536k7563
3115A837777j42840j26081j0263o4768j04787m28J1851q4892J2713r4634n4013
3104A179635k5306O1261n6070J10497O2277m6250r7265Q8793L3512j66021M8619
$$ y = [10477694, 9981325, 9065165, 8095096, 7298024, 6455530, 5872627, 5476292, 5158569, 4835473, 4753334, 4572080, 4462478, 4280932, 4177778, 4113581, 4067835, 4152223, 4373299, 4380755, 4379119, 4419585, 4448819, 4509210, 4607298, 4723970, 4890655, 5195274, 5401437, 5500121, 5375476, 5339088, 5033091, 4758448, 4545814, 4208051, 3968922, 3780365, 3598330, 3221839, 3008877, 2939133, 2894245, 2904637, 2847406, 2785561, 2775072, 2789119, 2793911, 2745125, 2666853, 2502504, 2362159, 2229788, 2222453, 2197785, 2050855, 2110595, 1946108, 1916427, 1851804, 1865340, 1837777, 1694937, 1568856, 1558593, 1493825, 1389038, 1388610, 1400461, 1315569, 1328282, 1233648, 1179635, 1154329, 1215590, 1159520, 1270017, 1332294, 1286044, 1188779, 1277572, 1311084, 1145063, 1193682]
3093A193682M1062m9833n0929m340j11733o7193j755N0933n6853K5211p8391j17344
3081G72517J19373J74834P2906n7014n7188j01949k00319M9372k1441K5123Q720
3070G84934N305r1718N5250J41027k492K5175j99254O8203P6444p1396k460p8786
3058G10232p446q761L3134p3267o9883J42331o5412m9031j15718J72873p4291
3047E94761p1850O6162M2692R4832r5400j18187q0124L7049J91146k0689l9691
3036F00701q873J0597P2572l5534l6197j64275O2773K5749l7969j00279R0497
3025D79762J03230k9150J1253j75889N5692r0889m5122J49593J09933p5723r9421
3014C93269O5726K5147l0505j39298j33576J27969N6351m0435Q1639o3024J00841
$$ y = [1193682, 1234744, 1184911, 1133982, 1129642, 1017909, 950716, 948961, 999894, 943041, 968252, 889861, 772517, 891890, 1066724, 1139630, 1082616, 1025428, 923479, 723160, 772532, 751091, 776214, 784934, 790239, 698521, 753771, 894798, 892306, 917481, 718227, 786430, 862874, 791478, 789018, 710232, 702786, 694025, 727159, 653892, 584009, 726340, 660928, 611897, 496179, 669052, 594761, 522911, 589073, 631765, 726597, 631197, 513010, 432886, 469935, 661081, 640392, 600701, 591828, 602425, 674997, 639463, 603266, 438991, 501764, 527513, 489544, 389265, 479762, 582992, 553842, 565095, 389206, 444898, 354009, 308887, 458480, 568413, 492690, 393269, 458995, 484142, 453637, 314339, 180763, 308732, 365083, 324648, 406287, 343263, 444104]
3003D44104o0145j30914R4727J71815k5808o1702J2861r0552j00634J28776P9799
2992D62327o5697q3103N4127j12689l6139o2747R6575k8500N6314M212p1435J73203
2980C86448l28j3064j9255p9033k7156Q1536P1331k8170L5450j05998j23903J60645
2968C38503r1808n2285J8388J05433o8888m1333K867J0074q6483R4249Q3280q1248
2956B30749O5969N2352o9306j25509k9051J65914P926o199n619J28660J16046
2945E31932j15883q9182j11410j1073K0189N1604K0255O7811K6527q3867m6564
2934B60339J6460m6411r231k3041R0611r4540J22278p2993J8362j6475l235K0565
2922B62689r0799q3620P058q2526N0258J12722l5908M5466n5062M1482J27726
$$ y = [444104, 383959, 253045, 347772, 519587, 493779, 432077, 444938, 354386, 253752, 382528, 462327, 396630, 313527, 367654, 254965, 218826, 156079, 252654, 224154, 280468, 284680, 213245, 386448, 386120, 373056, 353801, 274768, 247612, 329148, 400479, 372309, 407759, 301761, 177858, 338503, 246695, 194410, 212798, 318231, 249343, 208010, 210877, 220951, 134468, 228717, 311997, 230749, 296718, 349070, 279764, 154255, 125204, 291118, 299044, 292845, 287226, 415886, 531932, 416049, 326867, 215457, 204384, 224573, 276177, 296432, 364243, 390770, 306903, 260339, 276799, 230388, 221157, 198116, 288727, 194187, 316465, 243472, 261834, 245359, 242124, 262689, 171890, 88270, 95328, 12802, 63060, 175782, 139874, 185340, 130278, 171760, 299486]
2911B99486j11575l8613o9266p0337K283n7322K80309J30887j22505q7811K7804
2900A83340R696M9578l6276l8369q831L8868K4759Q1223L6224j4252K5656o2033
2888B89583j12428J5253J07590J8928r8325M5650p7361j4712M20m0586J297J921
2876A37230k805J30825q14J0329J35887j02789j47087K2503O816m4428K8890J5674
2864A90231o5612Q048n8808K4668J79812m2678p1545O1020j05391o1059k0226
2853C8460J8819p7571n9706J32398K0731q2824R4555J1289o5845l1028N6141L4541
2841H9960o0315O1734m7889j3650O5398j7556j45255J81455m2511j2230J26613
2830A85754n8286m0088N6976J6816l470q42p907j12267O9148L3296J36651r5659
$$ y = [299486, 187911, 149298, 80032, 9695, 11978, -45344, 234965, 365852, 243347, 155536, 183340, 193036, 242614, 206338, 167969, 159138, 198006, 222765, 303988, 340212, 325960, 351616, 289583, 177155, 192408, 299998, 318926, 220601, 266251, 188890, 174178, 174598, 134012, 135309, 137230, 134425, 265250, 264436, 274765, 410652, 307863, 160776, 183279, 190095, 145667, 174557, 190231, 124619, 132667, 73859, 98527, 278339, 235661, 164116, 225136, 119745, 58686, 38460, 57279, -20292, -79998, 52400, 73131, -9693, 84862, 96151, 30306, -722, 55419, 89960, 29645, 91379, 43490, 29840, 95238, 77682, -67573, 113882, 71371, 59141, 185754, 127468, 87380, 144356, 161172, 157702, 156860, 148953, 36686, 105834, 139130, 275781, 180122]
2818A80122j73889k0132K2516J55374J8330m6440k6279J07637o6733m0919J29566
2807B39153Q3233j28811j01749j56702J70081N181K8345q9084k7813N5896l0566
2796D7164p6651o8387R885R2277J00433N8323R5983k1510R6509j53094M355j31940
2784E3347n1471J31278j29309P4112K4022p6999j0805m1965P2442L5467Q2112
2773A62231N1592j9705N7144o3179q7657l8237k4251j5134J10110m1072o7090
2762B4752J762J26346P159m9917O659J2186N4645j10012j3709o1415l3525Q9402
2750E4333J7354M2855j07545K1957P2454j8708l0595l9963N3732l8846J9938M6440
2738I3406m7637l9337n6703K9533J10262J94188j07489o0741J029O9276l7543
$$ y = [180122, 6233, -13899, 8617, 163991, 182321, 135881, 109602, 217239, 150506, 109587, 239153, 322386, 193575, 91826, -64876, 105205, 110386, 138731, 49647, 21834, 77730, 47164, -29487, -97874, -87989, 4288, 104721, 163044, 259027, 237517, 334026, 180932, 185287, 53347, 1876, 133154, 3845, 77957, 101979, 24980, 14175, -27790, 44652, 80119, 162231, 213823, 194118, 251262, 188083, 100426, 62189, 37938, 22804, 132914, 91842, 24752, 26514, 152860, 160019, 110102, 116761, 128947, 183592, 73580, 59871, -1544, -35069, 54333, 71687, 114542, 6997, 28954, 101408, 82700, 52105, 12142, 65874, 27028, 46966, 93406, 45769, 6432, -50271, -20738, 89524, 283712, 176223, 115482, 116511, 185787, 148244]
2727A48244N6933n1223j36789Q952J424j9107K3691N3227n0378P0656j01849J5569
2715A9350P5397r9207P217k504m0637J26710l0766O7216l1103j36098L830J32814
2703I2219k8715O1972J9090m209l6591m1919j1038J35231r3750N7440j36278J09570
2691A23022R7974o3881j02408j50959R3652J23005J9786M1209m2675r6921Q697
2680E0501o3629M2637l8375m197P2362l7068o5139o9772P0074Q0670J9192r1513
2668c4257K5303j49509J33183M8773j9622J76574j7868M3098j24792j19682J18660
2657G9861K4656m4985P8831j2097J04686R0199Q8727J27309K19923J50381J16940
2646A024431o5106j44389p3170q5394k18116j18830j01383J7275l4055l1761q5303
$$ y = [148244, 205177, 153954, 17165, 26117, 27541, 8434, 32125, 85352, 34974, 105630, 3781, 19350, 94747, -4460, 2757, 253, -40384, 86326, 55560, 122776, 91673, -44425, -40595, 92219, 63504, 125476, 144566, 140357, 103766, 61847, 50809, 186040, 92290, 149730, 13452, 123022, 220996, 157115, 54707, -96252, -2600, 120405, 140191, 181400, 138725, 41804, 50501, -13128, 29509, -8866, -13063, 59299, 22231, -42908, -112680, -42606, 38064, 57256, -34257, -8954, -158463, -25280, 23493, 3871, 180445, 162577, 205675, 80883, -38799, 79861, 104517, 59532, 138363, 126266, 230952, 321151, 409878, 537187, 757110, 907491, 1024431, 959325, 814936, 741766, 656372, 438256, 319426, 218043, 235318, 201263, 169502, 84199]
2635H4199m4678j5599J6406N5573J0143K7745N6730q4644j58719R3418J0030n4000
2623c396r5400N269J48032j353N6073j9480o5979p2473J60236K41014r5242p9566
2611A77735j47985m1038J08897n720J8540r0744L0325J4004K8936M037N2043l1682
2599A17348k7157P8822J26372n0874m8452j20002p5973k5513n6022K04378Q3411
2588B06338J9298l3823j96509J39549M1148o2949N8801J29477m927p1244n2675
2577A72484k6878J1723n2087r8690J8465J6755j11190J04822O2618l1598j06062
2566c9638Q9414J95998n7877Q2596K6096j74085L4684J21008q7510L7666M774
2555B33126L0068m598n6123l4901P4380O1052l1565p6962j95411l1754J80884
$$ y = [84199, 39521, 23922, 40328, 95901, 106044, 133789, 190519, 105875, -52844, 40574, 50604, -3396, -98796, -93527, 54505, 53152, 109225, 89745, 23766, -48707, 111529, 352543, 257301, 177735, 29750, -11288, 97609, 91889, 110429, 19685, 50010, 64014, 92950, 96987, 149030, 117348, 90191, 169013, 295385, 244511, 196059, 76057, 84, -25429, -81451, 122927, 206338, 225636, 191813, -4696, 134853, 176001, 113052, 171853, 301330, 296403, 225159, 172484, 145606, 157329, 105242, 6552, 25017, 41772, -69418, 35404, 98022, 66424, -39638, 49776, 245774, 187897, 270493, 296589, 122504, 157188, 278196, 190686, 228352, 233126, 263194, 258596, 202473, 167572, 241952, 303004, 271439, 194477, -934, -32688, 148196]
2544A48196L2999O4397j19083m755l3043l737o516p987L2538l1094n2100R7753
2532A17568k8468M3253K3202N7690R8603k5440K8271o7088P055k2882P2424q8135
2520B16053J10183j17963p4507K6146L9826O9664O3463j00055j4921J790J29281
2509C48960J0193k344j33729n2866J45627R9763j02180K4273J9784r3418M0882
2498C04945Q7489j87685P9797n608J9036Q4362J1175k1825j30459J59744J01330
2487E02301k1466j8968n4204m6562M2106J13462J09423K272j94240n6255M9878
2476D27747J36888J00401L7594j09140j19162p7939P4201p5042P3002J08739Q1881
2465F59170J5169q6925N5989l9249L6632L2573j09674P4968k1082J02517l47J3734
$$ y = [148196, 181195, 245592, 126509, 121754, 88711, 84974, 78458, 70471, 103009, 71915, 19815, 117568, 89100, 132353, 155555, 213245, 311848, 286408, 314679, 247591, 254646, 231764, 304188, 216053, 326236, 208273, 133766, 159912, 199738, 269402, 332865, 232810, 217889, 219679, 348960, 359153, 356809, 223080, 170214, 315841, 415604, 313424, 337697, 357481, 264063, 304945, 392434, 204749, 284546, 278938, 297974, 382336, 393511, 371686, 241227, 400971, 502301, 480835, 461867, 407663, 361101, 403207, 516669, 626092, 628364, 434124, 377869, 427747, 564635, 665036, 702630, 593490, 474328, 396389, 470590, 395548, 468550, 577289, 659170, 674339, 587414, 643403, 604154, 640786, 673359, 563685, 638653, 617571, 720088, 719741, 733475]
2453G33475J9466N5823n8981q1534o1842N8406K07904l2333n8792J91756Q6207
2442A059555j93322j4930R1783J8216Q3145M2388N2310R5674J12852O532J44205
2431A498408J21661O2307q6480r932k5111m1843J95208J2136j02450J43110J05393
2420A872407J30023N3565J38035j6595l5565J56715J9830O4433J88853Q7305O8351
2409B727357L04046K14725Q8180L7374K78342K57328J45371K57270M21813M31880
2399E163686Q27101J122059J768248K143340J306034L86194K13548O6707M25665
2390A3422582O46707J277528J944147L431603M401758O991140J3528988L1201910
2382G6846363M8965254N0505225J6977247j3114290l1242716l7028337k7412980
$$ y = [733475, 752941, 808764, 749783, 668249, 606407, 664813, 872717, 840384, 781592, 973348, 1059555, 866233, 851303, 943086, 961302, 1044447, 1086835, 1139145, 1234819, 1347671, 1354203, 1498408, 1620069, 1682376, 1595896, 1585964, 1560853, 1519010, 1714218, 1726354, 1623904, 1767014, 1872407, 2002430, 2055995, 2194030, 2177435, 2141870, 2298585, 2318415, 2382848, 2571701, 2659006, 2727357, 3031403, 3246128, 3334308, 3371682, 3650024, 3907352, 4052723, 4309993, 4731806, 5163686, 5990787, 7112846, 8881094, 11024434, 12330468, 12716662, 12930210, 12996917, 13422582, 14069289, 15346817, 17290964, 20722567, 25124325, 32115465, 45644453, 76846363, 125811617, 176316842, 193294089, 180179799, 148937083, 111908746, 84495766]
2375H4495766k0721821j4017947j0576625p708121o558608m517053l011605j528923
2367A5855063n91108J38692n12334p08033j465666j443730j143748q37233r04141
2358H387762o11096o49673m05275l97072k40988l00893k99360l78792j85831k17663
2348D701119j85879q1639J7052k07117j67436k06533r5710j03936l3202j09610
2338C527109o0605j13595j51198j55836P5002j86550l1010k19609l837j71773
2328B508098k7181o7584m4032l3213K0300q0751p2865j8443q5965n6719J8994
2317B060639k079k16629P315o7366o4564K1789j49825n8810q3112M1998l0920
2306A458436l8819N8902r647l9033M2616r737r2856k4161l4136r1739q0657k7998
$$ y = [84495766, 63773945, 49755998, 39179373, 31471252, 24912644, 20395591, 17383986, 15855063, 15263955, 15402647, 14890313, 14182280, 12716614, 11272884, 10129136, 9291903, 8387762, 7776666, 7126993, 6721718, 6324646, 6083658, 5782765, 5483405, 5104613, 4918782, 4701119, 4515240, 4433601, 4450653, 4243536, 4076100, 3869567, 3773857, 3669921, 3636719, 3527109, 3466504, 3352909, 3201711, 3045875, 3120877, 2934327, 2903317, 2683708, 2679871, 2508098, 2480917, 2413333, 2369301, 2336088, 2356388, 2275637, 2202772, 2184329, 2098364, 2041645, 2060639, 2058560, 1841931, 1849246, 1781880, 1717316, 1739105, 1589280, 1530470, 1447358, 1489356, 1458436, 1419617, 1478519, 1468872, 1429839, 1472455, 1462718, 1369862, 1345701, 1311565, 1219826, 1139169, 1111171]
2294A111171o6671O2245p7296j61431J6618o2313K8351j4061o9010R276o1158
2283G15721q536l0328j9635o1699J08375J20877R6703q7840r3379o3272K9474
2272G06461j37539q505J24505l645j59458n3576M8176k2197o2472R3351R5954
2261F21055n4682j15852L8119L5139P9338p3065n2993M836r6970L0658L1893N3365
2249E00841r202J5798N1604j8570L5346j68650J05093o060j26631j15387M8320
2238C12502k7238P4985P5247j07241n3731L8372m6197j9475j9133K3600L693M837
2226B60221K4125k9550k3838l9165k2690K5655j5769J4585K04839j7791K8325
2215D08947j29612j77259l8091J83504J17490j01827P0161P618N5597m7203j85582
$$ y = [1111171, 1044500, 1106745, 1029449, 868018, 884636, 822323, 850674, 836613, 767603, 776879, 715721, 707185, 676857, 657222, 595523, 703898, 824775, 921478, 833638, 740259, 676987, 706461, 568922, 560417, 684922, 681277, 521819, 468243, 516419, 494222, 431750, 525101, 621055, 566373, 450521, 488640, 523779, 603117, 530052, 477059, 481895, 384925, 415583, 447476, 500841, 491639, 507437, 559041, 540471, 575817, 407167, 512260, 506200, 379569, 264182, 312502, 285264, 360249, 435496, 328255, 274524, 312896, 266699, 247224, 228091, 251691, 255384, 260221, 284346, 254796, 230958, 191793, 169103, 194758, 178989, 193574, 398413, 380622, 408947, 279335, 102076, 63985, 247489, 364979, 263152, 333313, 340931, 396528, 349325, 163743]
2204A63743j3555R7891n1708N9405r7601l282K18692r8915p2578J35809l2285
2193C05616K5908r62q8506M5493M2902n9519k3359O1491j36580j5657L6556r3495
2181I9888K3901r361L4048o1822p7093m5615J03909l9866M8514Q7941q8553o852
2169F9039K07608j12398k9878l8056j83771J02856L9666M3884l8715q2812q77
2158b3454J02366j3336J9433l0988k590k6767R4721M0388n8407K7370l2196M4140
2146A40680K5975L710k6758j16576M4488O6155j27120q397P4077J4733j049n9834
2134C0084R8692K8964l4308J0302P4981j62189k3900P0239j2673k6854J493J4361
2122F9192k2759M3135R0908J43097k5906j07803Q9852J21434J65441J49070K8385
$$ y = [163743, 150188, 248079, 196371, 255776, 158175, 154893, 373585, 274670, 202092, 337901, 305616, 331524, 330562, 242056, 287549, 330451, 270932, 247573, 309064, 172484, 156827, 193383, 99888, 123789, 114428, 148476, 86654, 9561, -36054, 67855, 27989, 76503, 164444, 75891, 69039, 276647, 164249, 134371, 96315, -87456, 15400, 55066, 98950, 60235, -22577, -23454, 78912, 65576, 85009, 54021, 51431, 24664, 119385, 159773, 101366, 128736, 96540, 140680, 166655, 170365, 143607, 27031, 71519, 137674, 10554, 2157, 76234, 90967, 89918, 30084, 128776, 157740, 123432, 133734, 208715, 46526, 22626, 92865, 80192, 53338, 54831, 69192, 46433, 89568, 180476, 323573, 297667, 189864, 279716, 401150, 566591, 715661, 744046]
2111G44046k5955R4810J00552o9713j73813j44686k53653M630p9729k3064j34
2100A73291j6213J7355n6718o8004K9456R2976O8599K115n8626m4627o927J3207
2088A45884o7140O23o1561L7620L6623J17500r638j09775o7392o2610M2540P3527
2076G6201N7656L0890J09556j04308j77293L0927O1278o8389p6294L4880J9445
2065e451l7301k1434r2538J7934O9886J37909l1297j21494P3959J16362k1514
2054H5021M2753q6371q9213J8377J37488Q8383j43390K7732j43809J395Q1324
2043A9690M628N2120q9289K2592M8728Q9612o6864j34373n4193n9602J3237R0201
2031f3513k338o2237J06678Q0954M1995j01040n7719R9251J877n2537n3433j33895
$$ y = [744046, 718091, 812901, 913453, 843740, 669927, 525241, 271588, 276218, 196489, 173425, 173291, 157078, 174433, 117715, 49711, 79167, 172143, 240742, 242857, 184231, 139604, 132677, 145884, 78744, 79367, 17806, 55426, 92049, 209549, 199911, 90136, 22744, -39866, 2674, 76201, 133857, 164747, 274303, 169995, -7298, 23629, 84907, 16518, -59776, -24896, -5451, -42752, -64186, -156724, -138790, -68904, 69005, 37708, -83786, -9827, 106535, 85021, 127774, 41403, -47810, -29433, 108055, 196438, 53048, 80780, -63029, -61634, 19690, 24318, 76438, -12851, 9741, 58469, 148081, 81217, -53156, -107349, -166951, -153714, -63513, -65851, -128088, -21410, 59544, 101539, 499, -57220, 42031, 43908, -8629, -62062, -195957]
2019a95957J32698J56062j12817j64012o158L8576J08896r840K0366q570L2088
2008h668j3109N8185m265j20226J00165o8201o0492o8921n6492J69458J47653
1997G5087P7328j9620p3522k2287K6588O732o6706P3568p8173j42657O9571R7734
1985B3643j17731l6314J32454M1466l2819p8382m8077n3898N9983P0453m5353
1974h4575n7032R8257j05465M8758n5962k9542L6867N0832M7861J05764L1004
1963H6767n1749k3092O5189k6730k3231j3620R7389j16858o6980J46449o2868
1952A0666o7454j70962j5407K58797L4589L2810J8874l0824Q6345j18200k3590
1941A5644J6396j18609L1329J40298p3198j5931o318K4158j1183M2856j27520
$$ y = [-195957, -63259, 92803, -20014, -184026, -190184, -151608, -42712, -52552, -32186, -40756, -8668, -21777, 36408, 32143, -88083, 12082, -56119, -116611, -185532, -242024, -72566, 75087, 152415, 132795, 59273, 36986, 63574, 70306, 3600, 77168, -1005, -143662, -74091, 23643, -94088, -130402, 2052, 43518, 10699, -67683, -115760, -169658, -109675, -39222, -84575, -141607, -43350, -148815, -100057, -156019, -185561, -148694, -97862, -50001, 55763, 86767, 35018, 11926, 77115, 50385, 27154, 13534, 110923, -5935, -72915, 73534, 10666, -56788, -227750, -243157, 15640, 50229, 83039, 101913, 71089, 157434, 39234, 15644, 32040, -86569, -55240, 85058, 11860, -4071, -10389, 13769, 2586, 45442, -82078]
1930h2078l3061M2068q6339K4719k5489J6400J81345p2612j57637j1495N6090
1919a48089N0057J56762q090q6580j3609m2594J7315j6086P988P2972N4121r2548
1907d8381J68467o5356n4993o5244N5182q5657m4667J80323j22354R520J57799
1896H4639O2675j04531J93499l764j97571j02468q6043n2460j5320J84173J05190
1885F8019p5051L3344L5696P266k07150p6869J933p903K13751M4022j49160O7191
1873d4911L970N403K7745p1902j28525k411o792J33997l0469K855P081Q0988j9426
1860d2397J683q1284P2161J03702j02081j18661M2925J02793l8437r9043L0838
1849a27801K1669R1113o1084n5632Q7216l2421M4774r8852o9638L4607n913m9970
$$ y = [-82078, -115139, -73071, -159410, -134691, -160180, -143780, 37565, -35047, -192684, -204179, -148089, -98032, 58730, 50640, -35940, -49549, -92143, -74828, -90914, -82926, -9954, 44167, -48381, 120086, 54730, -263, -65507, -10325, -95982, -140649, 39674, -82680, -73160, 84639, 147314, 42783, 236282, 232518, 34947, -67521, -153564, -206024, -221344, -37171, 68019, -7032, 26312, 62008, 69274, -137876, -214745, -212812, -220715, -6964, 37058, -112102, -44911, -40941, -35538, -7793, -79695, -208220, -210631, -217423, -83426, -113895, -111040, -103959, -22971, -42397, -40714, -121998, -49837, 53865, -48216, -166877, -123952, -21159, -59596, -158639, -127801, -106132, -15019, -76103, -131735, -44519, -76940, -32166, -131018, -200656, -166049, -171962, -221932]
1837b21932j259L9795j3463m4387K07144K5681j57889R4511O9299L1859J00144
1826A29503j53553l5840j1018Q0604l277n6195R4676k3932P5815m4518k47176
1815a94911J44180M7933M4681o8818l8430J02132K8146p7712P5056K7502o8976
1804B0783n6136M749N3106k1954q6124L9705n9476r7092N6483J10964N5317p5818
1792e5493P8051l6565P9302P7749k65077r929o5129m3752N6847M8583Q8156J08914
1780F1657p3172n9065K2006J9917q6668R6383L5382l5648j217N8024k9133k7110
1768a8644K7878j31999J44375j33968q4871L5577J82615L3063q5292P2071l1527
$$ y = [-221932, -223191, -183396, -196859, -241246, -34102, -8421, -166310, -71799, -2500, 29359, 129503, -24050, -59890, -70908, 9696, 6419, -49776, 44900, 20968, 96783, 52265, -194911, -50731, -2798, 41883, -26935, -65365, 36767, 64913, -12799, 62257, 89759, 20783, -35353, -30604, 22502, 548, -85576, -45871, -105347, -202439, -145956, -34992, 20325, -55493, 22558, -14007, 65295, 143044, -122033, -131962, -197091, -240843, -183996, -135413, -47257, 61657, -11515, -70580, -48574, -28657, -115325, -18942, 16440, -19208, -20425, 37599, 8466, -18644, 9234, -122765, 21610, -112358, -197229, -161652, 20963, 54026, -31266, 40805, 9278]
$$ [...]
##END NTUPLES=NMR SPECTRUM
##END=
