##TITLE=1H_DE-80H_X3
 200.13MHz, d2o
 8 sc
 
 19ns.26.2.2025
##JCAMPDX= 6.0         $$ Bruker NMR JCAMP-DX V2.0
##DATA TYPE= NMR SPECTRUM
##DATA CLASS= NTUPLES
##ORIGIN= UXNMR, Bruker Analytische Messtechnik GmbH
##OWNER= pz
$$ XWIN-NMR		Version 3.5
$$ Fri Mar  6 10:03:36 2026 Russian Standard Time (UT+4h)  Yarkov@DPX200
##.OBSERVE FREQUENCY= 200.1313
##.OBSERVE NUCLEUS= ^1H
##.ACQUISITION MODE= SIMULTANEOUS
##.ACQUISITION SCHEME= undefined
##.AVERAGES= 8
##.DIGITISER RES= 18
##SPECTROMETER/DATA SYSTEM= spect
##.PULSE SEQUENCE= zg30
##.SOLVENT NAME= CDCl3
##.SHIFT REFERENCE= (INTERNAL, CDCl3, 0, 15.4505)
##AUDIT TRAIL= $$ (NUMBER, WHEN, WHO, WHERE, WHAT)
$$ ##TITLE= Audit trail, XWIN-NMR		Version 3.5
$$ ##JCAMPDX= 5.01
$$ ##ORIGIN= Bruker BioSpin GmbH
$$ ##OWNER= Yarkov
$$ C:/Bruker/XWIN-NMR/data/yarkov2/nmr/H-C/1/pdata/1/auditp.txt
$$ ##AUDIT TRAIL=  $$ (NUMBER, WHEN, WHO, WHERE, WHAT)
(   1,<2026-03-06 10:02:32.92 +0400>,<Yarkov>,<DPX200>,
      <created by zg, POWCHK disabled, PULCHK disabled
       configuration hash MD5:
       00 E9 B6 7A A2 85 ED C7 34 08 36 98 17 FE 4E 26
       data hash MD5: 16K
       C6 C2 C3 C9 1A 9E D5 DC 05 B1 58 73 DE F3 A6 3A>)
(   2,<2026-03-06 10:02:44.17 +0400>,<Yarkov>,<DPX200>,
      <Start of raw data processing
       efp BC_mod = 2 LB = 0.25 FT_mod = 6 PKNL = 1 PHC0 = -5299.748 PHC1 = 6.821927 SI = 16K 
       data hash MD5: 16K
       73 D3 1B 1C 20 8F 4C 55 D5 A3 04 1D 54 FA 68 E4>)
(   3,<2026-03-06 10:02:57.68 +0400>,<Yarkov>,<DPX200>,
      <pk PHC0 = 0.6 PHC1 = 0 
       data hash MD5: 16K
       B8 0B AD FF 6D 23 9A 80 1B 6B F5 3F 9B FE 30 D4>)
$$ ##END=
$$ 
$$ hash MD5
$$ C4 64 3A 02 5E C1 DB A3 20 9A CC EE E0 1E D3 26
##$RELAX= 
##$RELAX= 
##$RELAX= 
##$RELAX= 
##$RELAX= 
##$RELAX= 
$$ Bruker specific parameters
$$ --------------------------
##$DU= <C:/Bruker/XWIN-NMR>
##$EXPNO= 1
##$NAME= <H-C>
##$PROCNO= 1
##$TYPE= <nmr>
##$USER= <yarkov2>
##$AMP= (0..31)
100 100 100 100 100 100 100 100 100 100 100 100 100 100 100 100 100 100 
100 100 100 100 100 100 100 100 100 100 100 100 100 100 
##$AQSEQ= 0
##$AQ_mod= 1
##$AUNM= <au_zg>
##$AUTOPOS= <>
##$BF1= 200.13
##$BF2= 200.13
##$BF3= 200.13
##$BF4= 200.13
##$BF5= 200.13
##$BF6= 200.13
##$BF7= 200.13
##$BF8= 200.13
##$BYTORDA= 1
##$CFDGTYP= 0
##$CFRGTYP= 5
##$CHEMSTR= <none>
##$CNST= (0..31)
1 1 145 1 1 1 1 1 1 1 1 1 1 1 1 1 1 1 1 1 1 1 1 1 1 1 1 1 1 1 1 1 
##$CPDPRG= <>
##$CPDPRG1= <>
##$CPDPRG2= <>
##$CPDPRG3= <>
##$CPDPRG4= <mlev>
##$CPDPRG5= <mlev>
##$CPDPRG6= <mlev>
##$CPDPRG7= <mlev>
##$CPDPRG8= <mlev>
##$CPDPRGB= <>
##$CPDPRGT= <>
##$D= (0..31)
0 0.7 0 0 0 0 0 0 0 0 0 0.03 0 0 0 0 0 0 0 0 0 0 0 0 0 0 0 0 0 0 0 0 
##$DATE= 1772776952
##$DBL= (0..7)
120 120 120 120 120 120 120 120 
##$DBP= (0..7)
150 150 150 150 150 150 150 150 
##$DBP07= 0
##$DBPNAM0= <>
##$DBPNAM1= <>
##$DBPNAM2= <>
##$DBPNAM3= <>
##$DBPNAM4= <>
##$DBPNAM5= <>
##$DBPNAM6= <>
##$DBPNAM7= <>
##$DBPOAL= (0..7)
0.5 0.5 0.5 0.5 0.5 0.5 0.5 0.5 
##$DBPOFFS= (0..7)
0 0 0 0 0 0 0 0 
$$ [...]
##$SUBNAM2= <"">
##$SUBNAM3= <"">
##$SUBNAM4= <"">
##$SUBNAM5= <"">
##$SUBNAM6= <"">
##$SUBNAM7= <"">
##$SUBNAM8= <"">
##$SUBNAM9= <"">
##$SW= 18.0517328524113
##$SWIBOX= (0..15)
0 0 2 0 0 0 0 0 0 0 0 0 0 0 0 0 
##$SW_h= 3612.71676300578
##$TD= 16384
##$TD0= 1
##$TE= 0
##$TE2= 300
##$TE3= 300
##$TEG= 300
##$TL= (0..7)
0 120 120 120 120 120 120 120 
##$TP= (0..7)
150 150 150 150 150 150 150 150 
##$TP07= 0
##$TPNAME0= <>
##$TPNAME1= <>
##$TPNAME2= <>
##$TPNAME3= <>
##$TPNAME4= <>
##$TPNAME5= <>
##$TPNAME6= <>
##$TPNAME7= <>
##$TPOAL= (0..7)
0.5 0.5 0.5 0.5 0.5 0.5 0.5 0.5 
##$TPOFFS= (0..7)
0 0 0 0 0 0 0 0 
##$TUNHIN= 0
##$TUNHOUT= 0
##$TUNXOUT= 0
##$USERA1= <user>
##$USERA2= <user>
##$USERA3= <user>
##$USERA4= <user>
##$USERA5= <user>
##$V9= 5
##$VALIST= <valist>
##$VCLIST= <CCCCCCCCCCCCCCC>
##$VD= 0
##$VDLIST= <DDDDDDDDDDDDDDD>
##$VPLIST= <PPPPPPPPPPPPPPP>
##$VTLIST= <TTTTTTTTTTTTTTT>
##$WBST= 1024
##$WBSW= 4
##$XGAIN= (0..3)
0 0 0 0 
##$XL= 0
##$YL= 0
##$YMAX_a= 190430
##$YMIN_a= -143908
##$ZGOPTNS= <>
##$ZL1= 120
##$ZL2= 120
##$ZL3= 120
##$ZL4= 120
##$ABSF1= 0
##$ABSF2= 0
##$ABSG= 0
##$ABSL= 0
##$ALPHA= 0
##$AQORDER= 0
##$ASSFAC= 0
##$ASSFACI= 0
##$ASSFACX= 0
##$ASSWID= 0
##$AUNMP= <proc_1d>
##$AZFE= 0.1
##$AZFW= 0.1
##$BCFW= 0
##$BC_mod= 2
##$BYTORDP= 0
##$COROFFS= 0
##$CY= -3
##$DATMOD= 1
##$DC= 0
##$DFILT= <>
##$DTYPP= 0
##$F1P= 0
##$F2P= 0
##$FCOR= 1
##$FTSIZE= 16384
##$FT_mod= 6
##$GAMMA= 0
##$GB= 0
##$INTBC= 1
##$INTSCL= 3.241238e-09
##$ISEN= 128
##$LB= 0.25
##$LEV0= 0
##$LPBIN= 0
##$MAXI= 10000
##$MC2= 0
##$MEAN= 0
##$ME_mod= 0
##$MI= 1.114404
##$NCOEF= 0
##$NC_proc= -8
##$NLEV= 6
##$NOISF1= 3.799351
##$NOISF2= 2.8
##$NSP= 0
##$NTH_PI= 0
##$NZP= 0
##$OFFSET= 15.45051
##$PC= 1
##$PHC0= -5299.148
##$PHC1= 6.821927
##$PH_mod= 1
##$PKNL= yes
##$PPARMOD= 0
##$PSCAL= 0
##$PSIGN= 0
##$REVERSE= no
##$SF= 200.130014248749
##$SI= 16384
##$SIGF1= 3
##$SIGF2= 2
##$SINO= 0.751879
##$SIOLD= 32768
##$SREGLST= <19F.Aceton>
##$SSB= 0
##$STSI= 16384
##$STSR= 0
##$SW_p= 3612.71676300578
##$SYMM= 0
##$S_DEV= 0
##$TDeff= 16384
##$TDoff= 0
##$TI= <>
##$TILT= no
##$TM1= 0
##$TM2= 0
##$TOPLEV= 0
##$USERP1= <user>
##$USERP2= <user>
##$USERP3= <user>
##$USERP4= <user>
##$USERP5= <user>
##$WDW= 1
##$XDIM= 16384
##$YMAX_p= 454292634
##$YMIN_p= -1734289
$$ End of Bruker specific parameters
$$ ---------------------------------
##NTUPLES= NMR SPECTRUM
##VAR_NAME=  FREQUENCY,     SPECTRUM/REAL,   SPECTRUM/IMAG
##SYMBOL=    X,             R,               I
##VAR_TYPE=  INDEPENDENT,   DEPENDENT,       DEPENDENT
##VAR_FORM=  AFFN,          ASDF,            ASDF
##VAR_DIM=   16384,         16384,           16384
##UNITS=     HZ,            ARBITRARY UNITS, ARBITRARY UNITS
##FACTOR=    0.220516191357247, 1,           1
##FIRST=     3092.11079145858, 0,            0
##LAST=      -520.605971547205, 0,           0
##MIN=       -520.605971547205, -1734289,    0
##MAX=       3092.11079145858, 454292634,    0
$$ Real data points
##PAGE= N=1
##DATA TABLE= (X++(R..R)), XYDATA
$$ [...]
9752 1024893 1233136 919332 1002594 947794 1024046 1022395 1225412 1147146 915333 955764 1164817
9741 1164817 931004 664134 582913 575478 544814 645012 541444 452211 343035 149636
9731 149636 290428 446385 374929 385195 427813 578684 734870 674506 741379 512684 459093
9720 459093 598081 544916 556115 700872 549576 415259 710890 833596 440677 278883
9710 278883 394837 355597 283112 577903 602663 726065 632673 439246 718095 838169
9700 838169 580932 588593 415148 424318 195735 278289 194133 334973 338297 221767 153993
9689 153993 467516 567253 493456 487052 475090 576055 488327 799080 683450 434336 553552
9678 553552 694433 647119 720668 884784 533007 509689 735030 607099 738154 850793
9668 850793 782551 909984 855091 950224 1367506 1405371 1584371 1438765 1611069 1565932 1494817
9657 1494817 1455949 1867777 1997847 1944425 1833294 1739224 1680140 1363489 1045593 782223
9647 782223 817513 894387 1024615 853754 733820 791516 841153 825954 1006183 1051452 994580
9636 994580 1016754 633408 665644 761194 767369 732190 1258944 1177515 1298962 1642436 1523280
9625 1523280 1560671 1662398 1808184 1735177 1835349 1918266 1908603 1746590 1831256 1576051 1212368
9614 1212368 1183421 898462 940344 703727 651777 603876 478042 704591 692923 619192 693664
9603 693664 515990 629485 693862 828743 810873 734852 561399 650840 606448 608310 828217
9592 828217 837901 828945 718425 625773 550577 831449 835877 789903 849287 832231 854935 519631
9580 519631 191272 460446 472516 423176 382833 706679 650697 323400 271535 215362 540448
9569 540448 828392 528326 602416 651328 575863 606414 555482 430748 638754 767702 833845
9558 833845 795846 800971 829513 719237 560307 441799 765144 866961 868189 932276 535363
9547 535363 649249 785895 747743 892833 1123927 897509 779927 666392 642914 404431
9537 404431 701056 617570 524839 474146 665373 807684 939047 968333 862727 870764 630881
9526 630881 638872 665010 670891 624227 526265 567773 786352 733177 965081 756462 638465
9515 638465 758016 762930 781802 652541 611485 458854 419234 439858 573562 647940 526548
9504 526548 778210 1059016 1008024 997902 1031181 876870 922633 664290 796206 696726 824015
9493 824015 797170 1063148 916669 800731 979483 762666 656089 581322 633002 726280
9483 726280 597430 897306 1094550 1001292 730408 945290 1024424 798669 802099 627503
9473 627503 765549 631490 490585 691815 857297 1076142 970702 1002404 875557 902523
9463 902523 945172 627802 575852 748597 881818 913086 900457 788248 956451 1183769
9453 1183769 1115528 881018 954448 1142933 1237499 1130387 1049751 776801 1027551 1094617
9443 1094617 906054 985179 1289378 1447761 1187126 942546 825996 821727 983970 1220587
9433 1220587 997550 1199147 1169073 1056084 1386569 1190133 885305 872034 842858 828551
9423 828551 1081803 1283324 1222968 1204607 1291692 1272793 1130010 1125783 1338457 1375332 1323081
9412 1323081 1487598 1593664 1519168 1625350 1571108 1399556 1597104 1893559 1739982 1730849
9402 1730849 1723324 2201057 2672060 3127300 3649981 3670890 3462909 3160914 3027013 2816955
9392 2816955 2576413 2257626 2162354 2484864 2440242 2523584 2670413 2815044 2729329 2414333
9382 2414333 2409775 2344599 2227452 2052048 2021971 2172754 2069799 2283386 2108509 1845107
9372 1845107 2104342 2097446 2078545 2113947 2170692 2393965 2332076 2412980 2515492 2446636 2375855
9361 2375855 2598972 2925130 2850213 3031360 3198208 3251558 3521964 3796774 3729708 3528274
9351 3528274 3461750 3448470 3400887 3699527 3836174 3937533 4020109 4460540 4591711 4292583
9341 4292583 4047912 4111730 4195011 4363628 4188637 3779326 4212150 4447483 4537558 4519696
9331 4519696 4532641 4600400 4720780 4802055 4877979 5198843 5212987 5224365 5366030 5454682 5619695
9320 5619695 5694097 5698147 5431910 5520944 5464655 5248448 5583440 5613323 5588179 5459021 5496957
9309 5496957 5373093 5404912 5611473 5410144 5239422 5120202 5019654 4909971 4934194 4790347
9299 4790347 4502865 4443272 4667564 4632367 4344103 4186229 4003083 4017752 3953426 3636675
9289 3636675 3707406 3728911 3538679 3772007 3551843 3292457 3266291 3340745 3494837 3388142
9279 3388142 3450641 3333786 3142538 3018124 2986799 3117756 2841936 2784264 2976665 2894269
9269 2894269 2959888 2884000 3175574 3453962 3385512 3133607 3125417 3054047 2784508 2936109 3197058
9258 3197058 2897397 2509029 2418584 2298559 2404273 2381702 2322768 2236015 2284545 2770481
9248 2770481 3011020 2927668 3159567 2781920 2616313 2462515 2254294 2389045 2629807 2624109
9238 2624109 2512433 2214144 2195159 2143586 2067184 2195897 2168658 2243622 2180575 2387516 2378423
9227 2378423 2565342 2707047 2676598 2619117 2638064 2711622 2504431 2284387 2332052 2222971
9217 2222971 2045620 2166995 2164452 2192142 2239727 2328958 2280479 2150748 2175943 2473142 2607745
9206 2607745 2580876 2610144 2787431 2854875 2605843 2752676 2645783 2274977 2559928 2699650
9196 2699650 2695056 2907047 2537432 2834597 2888172 2776075 3194386 3216641 3169554 3054331
9186 3054331 2876640 2807316 2497499 2729441 2933005 3011092 2745654 2929717 3155922 3364806
9176 3364806 3323339 3173674 3140547 3217193 2948397 2811529 2758879 2718977 2614291 2589961 2954045
9165 2954045 2791276 2891136 2838733 2936853 3346766 3374372 3235759 3277659 3247352 3462453 3549498
9154 3549498 3673905 3666314 3663852 3627085 3650425 3750960 3947518 3980776 3800814 3646982 3631034
9143 3631034 3544555 3715894 3353732 3277951 3491035 3516280 3472267 3270577 3335981 3899474
9133 3899474 4201738 4253612 4609521 5102907 5728515 6091550 6156890 6502915 7019061 6739502
9123 6739502 6567207 6282919 6235880 6028896 5587982 5144524 5029067 4928281 4921745 4901675
9113 4901675 5088253 5237314 5190380 5250356 5407349 5746876 5865176 5880800 5627692 5281910
9103 5281910 4853694 4594718 4505190 4074967 3908697 4060654 3811531 3956887 3890437 4285117
9093 4285117 4875479 5266379 5811670 6378337 6649376 6567081 6603112 6370509 5827846 5467094
9083 5467094 5141289 5108143 4772380 4766304 4622686 4644985 4795671 4844877 4899477 5238824 5517252
9072 5517252 5827015 6251642 6697409 6809381 6845784 6550310 6429366 6246257 5748272 5514067
9062 5514067 5478489 5337869 5067396 4772485 4742842 5285943 5411050 5363562 5288914 5131782
9052 5131782 4916009 4783821 4797390 4550166 4613176 4481464 4553962 4716370 4540040 4720087
9042 4720087 4804496 5183696 5232692 5396465 5512942 5812282 6159951 6522632 6542973 6404516
9032 6404516 6094663 5762133 5619257 5430300 5180956 4969097 4879916 5067648 4772455 4754212
9022 4754212 4866033 5011449 5251730 5368781 5433604 5428964 5531152 5684265 5417603 5573401
9012 5573401 5592069 5479527 5609932 5654398 5632204 5534492 5479707 5546953 5822720 6053780 6208674
9001 6208674 6066809 5910549 5750006 5771044 5756679 5894882 5845662 6026788 6338999 6376454
8991 6376454 6277673 6394420 6505943 6803005 6803057 6587913 6599598 6746144 6853618 6676930 6949322
8980 6949322 6991175 7082720 7162883 7290086 7545011 8261407 8549933 8793772 9120810 9355114
8970 9355114 9237003 9352989 9453300 9565036 9580753 9955496 10314948 10772086 11133688 11326841
8960 11326841 11505355 11983190 12300320 12874988 13133636 12995126 12722679 13326972 13364654 13398355
8950 13398355 13723855 14128274 14778756 15369499 16004317 16752506 17696210 18767375 19866742
8941 19866742 20916852 22173629 23586249 25127399 27388745 30206253 33348924 36845648
8933 36845648 40933009 45812203 53323646 65903390 94098996 148987883 220900337 273204293
8925 273204293 269811776 239996311 202073104 159428668 124014534 98776593 80162606
8918 80162606 66493923 56898981 49695250 46092670 44460517 44592154 46715688 51268071
8910 51268071 60431101 75554542 95635161 116535201 131927777 139006243 135043216 122403696
8902 122403696 106520167 90715585 76875811 66167236 57842864 51840229 48133530
8895 48133530 46209148 46054369 47347521 50595543 57440014 70184488 88772142 110425207
8887 110425207 129625941 141522839 143290591 133955132 118482620 101830426 86351938
8880 86351938 73677499 64118681 57111784 52268585 49119422 47742365 48173364 49494051
8872 49494051 53027679 60594531 74032039 95194712 122618741 150569223 171426529
8865 171426529 181127351 175569776 158318159 136671732 115082306 96259129 81938457
8858 81938457 71915778 65797379 62340885 60850937 61096793 63033274 66959389 74647000
8850 74647000 90057229 112858791 139905075 163643008 177572435 178793028 166161197
8843 166161197 145443720 123533908 103098596 85969386 73604657 64885798 59346613
8836 59346613 56545935 55478749 55408133 56397263 57445083 59409075 63918925 73021865 88523001
8827 88523001 109550510 131714387 149328213 158268456 156451974 145799391 131551763
8820 131551763 118021114 109250547 107389584 115392267 132567093 154518091 173843852
8813 173843852 184467239 183527422 170909700 150471608 128572660 107589844 89697639
8806 89697639 75343746 64990511 57362185 52460811 49344193 47590036 47049847 47147214
8798 47147214 47914692 48806224 50195635 50645107 50317735 49096393 47128711 45976237 45466717
8789 45466717 45896090 47847482 52018373 60815185 75297546 95521724 118344131 138203509
8781 138203509 150160918 151907529 142691676 128017854 112654495 100458280 94233623
8774 94233623 96493814 108168832 127086991 147280958 161460890 165828280 158830602 142274167
8766 142274167 121721219 101387732 83451905 68661877 57243866 48798968 42985969
8759 42985969 38972583 36756593 35260347 34406153 33189952 31645776 29522203 27131770
8751 27131770 24546662 21947453 20214049 18780661 17394688 16066353 15420160 14867325
8743 14867325 14199872 13645131 13059221 12547367 12417358 12158030 11864786 11654194 11279300
8734 11279300 10978621 10573917 10413591 10200801 10103344 10180202 10080309 9512812 9365984 9050003
8724 9050003 8999160 9400425 9496114 9521597 9854095 9960476 10019326 10361607 10312003 10136858
8714 10136858 10043931 9707781 9237042 8728428 8617588 8193991 7975602 8027373 8148379 8236175
8704 8236175 8108349 8100570 8011454 7805998 7613965 7891539 7974372 8069243 7853948 7711906
8694 7711906 7368820 7383829 7339647 6846131 6958470 6902559 6898692 6928501 7119254 7322389 7555390
8683 7555390 7623757 7622946 7476962 7877525 7872931 7814903 7842994 7931129 8208537 8487179 8804131
8672 8804131 8642255 8686526 8591490 8632733 8562667 8535526 8394654 8859965 9294462 9656297
8662 9656297 9615440 9958319 10114037 10444447 10791197 11141543 11487227 12160042 12699313 13239656
8652 13239656 14257255 15300344 16582973 17992620 19601865 22042659 25052244 29676608
8644 29676608 38045906 51153312 68184448 85206677 95646637 96378915 89765778 79476371
8636 79476371 68456565 59338705 53601899 52129880 55793198 64953024 77310105 87723268
8628 87723268 90908563 86008141 76498689 65135836 54230823 44770569 37678966 32698459
8620 32698459 29156818 26721782 25236753 24178830 23137886 22520721 22619024 22725044 23079025
8611 23079025 23985530 25413981 27573796 29898877 32659885 36201421 41799427 50102694
8603 50102694 63488233 82236886 104835430 127574709 145875317 155879481 154381219
8596 154381219 143313822 127519410 111789566 99846890 94786028 97481226 107652366
8589 107652366 121406600 133979057 141866552 141503785 131991271 116194214 97859209 80701084
8581 80701084 65676485 53816220 44792920 38111960 32616332 28977376 26412224 24460156
8573 24460156 23201372 21652818 21269943 20716898 20819201 21293523 21931046 22859857 24048333
8564 24048333 25742947 28421415 33065658 41080536 52452276 65953194 76846128 81149225
8556 81149225 78863595 72865471 65392134 57642874 51574426 47902812 47866990 52349201
8548 52349201 60557477 69270018 74352565 73045480 67298779 59196061 50229688 42008630
8540 42008630 34562918 28735973 24441097 20752137 18133295 16025997 14479476 12800574
8532 12800574 11540041 10554395 9568656 8641754 7920909 7692258 7679096 7438189 7109925
8523 7109925 7021850 6817063 6503182 6545621 6779769 7077527 7460501 8071127 8834764 9603581
8513 9603581 9726819 9200070 8371065 7394655 6550233 5891959 5708368 5685669 5469439 6273010
8503 6273010 6845555 7052818 6736107 6402829 5940083 5222016 4696269 4173920 3905929 3369997
8493 3369997 2820814 2657809 2715570 2465920 2240181 2084183 2092151 1706409 1592642 1807369
8483 1807369 1983623 1744562 1772929 1737660 1718568 1398286 1458925 1587902 1546051 1668002
8473 1668002 1667295 1499609 1303033 1144913 1114965 1014223 836040 1091028 1363891 1216076
8463 1216076 1399983 1245458 1249556 1356563 1498570 1993253 1753930 1709511 1666843 1532700
8453 1532700 1609888 1521573 1587313 2159112 2420541 2629085 2304862 1959369 1851247 1503457
8443 1503457 1098211 916288 783007 678795 518403 617242 697501 769897 723474 510061
8433 510061 481050 613398 371854 128748 92632 128968 155535 149010 287701 195532 114256
8422 114256 308215 575070 418030 318524 406862 694610 859425 1006564 1054462 1105818
8412 1105818 923627 769274 778944 692935 581359 573467 506085 619943 663304 639408 667007
8401 667007 835827 912106 638349 516970 507395 481904 622265 593633 640240 267812 117691
8390 117691 207044 -74422 74137 151855 -180265 -455609 -95135 174738 179232 -33578
8380 -33578 -250764 -189826 -309951 -152260 -6863 52282 198894 253660 -84821 -216636
8370 -216636 -196264 -385406 -192147 -131709 -248128 -401514 -212261 -361274 -157169 135400
8360 135400 151979 -187759 -315782 -384977 -543067 -258008 -183686 -108739 -452096 -228006
8350 -228006 -90455 -87317 -145440 -206349 -117048 254071 44686 -169473 -201959 -319803 -370163
8339 -370163 -367601 -365359 -323119 -15236 57466 117693 -158094 -402123 -259454 -263658 -399965
8328 -399965 -311906 -179412 -112406 -70451 117015 27490 -37881 -217429 -316707 -336911 -204498
8317 -204498 -189049 -152424 -468783 -500279 -406708 -507233 -542978 -503969 -217380 -58692 140028
8306 140028 -163374 -237840 -130444 -153336 -270219 -203672 -332194 -242037 -181721 -268638 -31152
8295 -31152 -339234 -191965 -100314 -189508 -355718 -450574 -267214 -318028 -265723 -164362 -59801
8284 -59801 76424 -138722 -296795 -627487 -236774 60700 -127273 -83290 14387 -6095
8274 -6095 191472 470772 513563 294083 219620 129656 220493 228963 172509 143711 117692 407901
8262 407901 419321 205307 328798 277089 201546 221911 131901 37888 14568 84692 -33174
8251 -33174 -302 -111593 25419 169909 213722 73617 26884 9298 -10380 -90083 137730
8240 137730 155493 211333 188606 187994 214221 379633 474775 480669 431048 502324 616642 817350
8228 817350 831944 800018 489296 320332 512434 442981 750351 698969 636588 766456 728202
8217 728202 511658 794448 725483 208878 189180 -118630 -217281 -122837 -90433 -151050 -74651
8206 -74651 59397 129269 -230105 -384843 -450240 -106003 26307 -128023 -428578 -245893
8196 -245893 -220900 15541 5232 843058 4111435 2242541 908007 769879 430286 428066
8186 428066 470466 499397 341804 622428 367098 416636 284202 428080 548606 457541
8176 457541 565038 847308 583940 477081 678992 668408 568676 676449 359674 108790
8166 108790 163809 66085 -39618 179522 261427 157820 246590 -31563 -112762 12014 101349
8155 101349 133333 -51868 206595 -90110 -106391 -847 -149803 74730 367701 136615
8145 136615 -66557 -64282 -15878 42494 -23989 10625 -3349 -22595 110367 116777 -50386
8134 -50386 -127684 -129991 -282628 -74589 -247550 -38466 -30671 186126 -205041 -395431 -281947
8123 -281947 -121421 236173 3221 -144190 -154330 135186 113515 123669 237012 117013
8113 117013 11535 -64955 -366552 -447911 -70060 132098 -79670 36700 -105288 -277956
8103 -277956 -172262 -82350 -214304 -195233 -273612 -378036 -181172 -344639 -476477 -101922
8093 -101922 -246526 -397562 -181155 -43631 -65573 -46820 -25926 -13795 -56276 -229282 -90250
8082 -90250 91033 -159197 -174459 -29296 29578 980 -65201 -209485 126703 84720 -236589
8071 -236589 -43929 197591 58850 2971 -11132 -72341 -68323 -12246 3461 123377 240606
8060 240606 411031 195855 -345947 -255135 -37405 -40061 80922 192934 185175 30113 18752
8049 18752 -287346 -524664 -393368 -365479 -449030 -240423 6772 -171207 46993 -65925
8039 -65925 -78049 -240428 -415750 -158737 150974 274618 -26042 -33071 -204950 -385359
8029 -385359 -431784 -123465 -169692 -361855 -188258 -102066 -166115 10386 317622 73289
8019 73289 11067 -36863 -235127 -205174 1237 162350 8918 -4640 99273 43833 -260315
8008 -260315 -402741 -243005 -27185 -84363 -203506 -274765 66275 6031 13076 -33804 -123734
7997 -123734 -189348 -573721 -357459 -150694 -51409 -141198 -30784 618 -63509 -170359 -43544
7986 -43544 -200907 -378640 -355978 -158147 -83242 13564 -255194 -402029 -354545 6524 243419
7975 243419 112698 93948 -52602 -296150 -222586 -11192 19698 -158839 31220 173672
7965 173672 90090 426103 252311 215722 138282 -40924 104420 277640 118173 150819
7955 150819 36070 -122128 6365 70736 56935 30610 -17744 -11190 -906 -306322 -200387
7944 -200387 -68767 -56841 -180132 135543 3333 32635 -157575 -325463 -124278 43506
7934 43506 -30958 -333192 -201131 -126055 -73515 -30456 318635 129605 -234500 -235631 -108331
7923 -108331 -92027 -84705 116898 171503 275968 39776 42981 166889 39852 -129616 -440355
7912 -440355 -205762 -109522 -74497 -331555 -237423 46268 254153 135319 46874 51094 -131030
7901 -131030 197806 373796 251907 157651 111434 -134293 100195 -1464 99085 67481
7891 67481 -88272 86200 98319 -119826 -283128 -177860 -306991 82684 218763 140267
7881 140267 -12918 -45709 47372 -188386 -238391 4532 63349 156120 -106169 -198940 -49087
7870 -49087 63665 -47432 160527 91894 207412 360225 371858 472279 571275 449097
7860 449097 408258 140730 34441 222480 205555 -43684 -66474 321379 512437 315833
7850 315833 -173277 -40244 -3515 96646 360298 330993 295223 325529 254820 240423 165689
7839 165689 159671 180201 248406 167276 179857 68308 113745 435423 263503 56400 319467
7828 319467 126591 -94037 -161175 -61594 -101053 -69363 -157239 14919 193011 86262 42089
7817 42089 51201 -23472 182339 113791 4089 -262144 -140957 -149037 -145467 -645256 -101543
7806 -101543 859514 407124 439395 260209 29755 13784 -62632 -407186 -160896 -129241
7796 -129241 167195 254506 42761 -299246 -299629 -174598 18654 202456 142571 -198213 -114196
7785 -114196 -28798 7477 19613 26722 165498 118243 82754 -74608 -3113 176169 118493
7774 118493 187925 240759 -92365 -1065 -43067 -17915 93332 32525 -17166 137469 78884
7763 78884 -1159 236605 76798 221877 276613 342887 337531 80488 73243 140928 396750
7752 396750 451131 325398 358094 152325 51130 60432 47464 49150 28333 -200136 114280
7741 114280 4026 -116055 185631 33437 -22145 -27 -91002 99933 165055 80097 -50310
7730 -50310 -62822 -1124 -67125 54537 73328 74297 -110696 134772 159955 77891 90162 98766
7718 98766 22496 -20458 -4760 130619 135696 244415 166153 32503 28967 90496 157563 283653
7706 283653 336572 29889 72828 19236 -24294 -87156 91340 255164 161588 242577 117677
7695 117677 -112897 -188561 54147 40318 69774 256499 160129 141768 153880 199044 375925
7684 375925 269975 98787 65626 193422 -110981 -138533 68533 120761 177267 172685 6444
7673 6444 531 48772 274770 273981 233836 58767 106895 108703 50285 2373 109032 108090 182771
7660 182771 23818 -234297 -223992 3072 46800 67184 112918 -86958 118712 -28629
7650 -28629 -99339 -88005 -250789 34931 419425 208165 82308 125283 251060 205431 438792
7639 438792 132365 -18226 25333 41443 78165 46840 26063 421255 201332 -2835 171004
7628 171004 229289 207651 104407 208338 212124 7100 66173 381096 257071 144801 477090
7617 477090 441238 282147 224384 198598 197194 311023 95976 -10029 23992 79136 50415
7606 50415 60236 93691 287354 308661 234232 365827 218708 187376 39758 30288 -115270
7595 -115270 -118023 -81895 -179047 13224 335456 221974 241858 474016 399157 378987 268491
7584 268491 470293 594200 147782 239201 303051 302933 44014 137862 119422 234379 377650
7573 377650 149664 165697 243099 97229 110059 115865 124350 548448 327328 42160 -170252
7562 -170252 -123035 36718 -58566 41188 232746 156048 177104 228798 144701 141418 202609
7551 202609 390342 334156 212569 143835 44652 116743 251120 154857 102499 183261 66269
7540 66269 211471 201472 165674 373012 284962 109432 341384 331545 172380 113773 189495
7529 189495 209029 116148 237043 512692 557619 193013 59112 206958 -169 167265
7519 167265 223438 167663 231000 160595 -994 144393 313869 78768 130168 142386 7832
7508 7832 46365 315957 224672 234739 480275 362121 318451 165575 52945 195807 204287
7497 204287 239849 181137 137791 56703 -116014 1168 263256 275277 393899 185973 144876
7486 144876 194648 304129 394106 306565 254263 282242 196458 251988 421946 677548 563065
7475 563065 468861 628158 403937 180869 320383 230628 284975 214247 200367 465507 500901
7464 500901 452623 568147 487085 410335 576938 526364 424110 306052 505934 522618 348837
7453 348837 336353 457618 420534 248109 267452 269871 53815 208842 495782 604897 342049
7442 342049 261588 535683 527886 381694 352974 379396 180439 332882 429208 197490 11803
7431 11803 28989 196653 244425 155027 163961 444850 308537 139461 527297 206336 -95951
7420 -95951 -243473 236039 436789 254406 191688 296925 467995 172842 109145 87066
7410 87066 221868 346331 361893 278288 270706 421210 276290 215983 411158 178533 467778
7399 467778 289987 259582 323582 156244 257879 290645 353620 277925 243515 385582 597965
7388 597965 386939 442076 504032 390817 247850 82533 215430 268415 172498 27194
7378 27194 121342 241484 221894 -44850 101382 349736 295719 33281 -13039 89776 92446
7367 92446 169118 368195 586164 143293 63621 432512 107738 30363 98691 200367 513830
7356 513830 278286 263895 248525 309583 534578 459736 526817 423107 360399 459974 222690
7345 222690 47980 445935 474700 304764 280606 478669 132519 286704 109248 235558
7335 235558 576766 389944 528382 532519 377668 230086 137717 338354 326121 251038 216324
7324 216324 127237 -6596 38268 140883 66980 147160 319443 219650 384544 417741 428645
7313 428645 528073 538450 284092 50880 190968 515440 627145 519556 200118 63186
7303 63186 -111457 50282 352754 257247 371682 82710 307829 220586 538985 432353
7293 432353 415902 403171 491870 207812 514224 611787 419254 429718 601627 780481 685407
7282 685407 221365 152701 29366 230326 403012 528389 560348 273270 262850 159056
7272 159056 78415 212368 309678 432145 334199 211100 284767 249216 255526 285440 328322
7261 328322 485890 620214 480441 674461 433059 274429 341626 135073 -32630 149323
7251 149323 191296 476068 220932 272440 441495 373036 321994 302461 403266 363951 332888
7240 332888 239564 123459 296239 264883 380419 463367 298350 395085 498570 523029 618003
7229 618003 737355 716200 711561 596249 521686 375445 257247 426554 330499 310000 225673
7218 225673 222965 428198 498425 673751 356042 148565 309997 462239 555849 624177 417158
7207 417158 333843 76446 255199 531439 547668 658822 666950 721618 617610 685894 861656
7196 861656 554240 696306 907283 858175 863178 775193 843423 702058 643916 534645 297143
7185 297143 241925 544051 577100 717587 877199 872933 897384 939378 956139 969078 1002710
7174 1002710 1047724 1215950 1167455 883918 677836 793997 702351 778963 748511 738330 665485
7163 665485 658576 743349 853458 758941 593292 722077 857147 740760 564693 341748
7153 341748 397000 589169 600021 765928 650114 555886 467374 625464 722596 663320 478948
7142 478948 781443 710020 727128 496746 435845 625069 546036 502227 564710 391149 355807
7131 355807 445749 632769 483497 255658 298862 341035 308239 367703 383068 543144 651534
7120 651534 555935 280798 414049 447111 601717 571891 717735 875909 821726 621483
7110 621483 824010 772579 745961 726307 430225 441037 496195 442660 307803 515700 617830
7099 617830 800545 500576 762052 1006765 877511 574878 745488 745009 562452 466533
7089 466533 598781 898675 776141 797301 982544 994512 908183 901846 1213514 1274898 1363255
7078 1363255 1051379 1214714 1313993 1266656 1272671 1072739 930286 922109 1074392 849430 990019
7067 990019 951181 1071095 925015 822179 816522 533066 698401 755768 718883 513807 736455
7056 736455 923731 1111696 777230 648461 475870 682263 512722 451028 231120 234607
7046 234607 299893 474108 593633 710738 790184 616508 374513 210945 492058 536933
7036 536933 730302 806560 612601 324191 356522 409107 469942 639909 385569 344155 570541
7025 570541 762205 679536 721978 659561 479028 565816 692890 582597 317390 369983 566672
7014 566672 960154 673853 414887 404449 513888 587221 719869 890267 572607 357014
7004 357014 586521 553003 469975 499698 744076 631243 587669 637407 487301 380304 311691
6993 311691 648718 812267 783305 968365 886991 1072396 823546 533608 317262 434652
6983 434652 551910 418612 556481 605535 264602 326913 670826 704550 1050839 922972
6973 922972 717888 692694 669830 981616 928945 661405 341769 647372 440817 369021
6963 369021 691027 796311 1019567 767486 643540 679830 633958 834923 650053 293632
6953 293632 462328 550037 512295 608744 728370 905522 659383 656170 671499 494704 833612
6942 833612 773425 450499 551025 699098 660368 394382 439859 591382 693124 663460
6932 663460 612290 482672 630465 867668 795555 822914 667225 657374 691032 737636 683508
6921 683508 653940 400908 471848 721086 668452 923514 749240 649856 655483 650984 530604
6910 530604 490853 277234 502487 736649 852475 1108236 840599 644689 428879 498119
6900 498119 615303 724867 733971 825431 724594 513745 435957 699616 649139 493434 684846
6889 684846 918587 1046899 900217 618225 540965 387788 618291 680992 635968 771846
6879 771846 501479 483509 649642 421748 324586 533697 742945 991994 810879 771115
6869 771115 742302 750806 743767 694138 625566 650676 659593 762036 967196 779663 559044
6858 559044 503589 657923 543427 935869 1143429 959739 747673 601264 651075 867782
6848 867782 887635 988002 1034981 825990 577071 607732 733767 700279 622655 553426 585342
6837 585342 750467 575453 774393 992075 988964 933029 767133 721976 721125 784595 865238
6826 865238 948165 1170969 967315 444184 554380 667564 523224 660419 533299 623767
6816 623767 476591 436482 597859 858298 808037 948540 1110717 1035947 1022278 963140 737834
6805 737834 596579 612091 670639 802054 657203 412260 374914 587430 421926 644427
6795 644427 616465 586339 809159 992740 577529 661263 539955 737197 691582 559627
6785 559627 912795 949411 782913 716573 779937 678162 684800 751431 619099 864286 996262
6774 996262 1090494 992309 921000 938536 962707 974314 964250 955793 844806 693926 486438
6763 486438 627471 585422 558174 513734 563801 623586 378247 558291 771376 651967 793556
6752 793556 901591 662833 724671 867802 641678 853613 917077 766286 1044851 1052461
6742 1052461 805037 672737 783607 901311 840862 890945 889928 821168 737820 671209 922448
6731 922448 877740 627410 417839 668722 759287 709255 565077 594227 610064 595726 816215
6720 816215 748941 912950 1130003 838065 703666 827495 761175 943860 886100 1040982
6710 1040982 778339 708022 767957 807719 461873 599833 663122 895530 1108431 925066
6700 925066 825893 777796 1045939 633360 880258 888419 746057 707750 637846 897596 997893
6689 997893 960030 889183 937746 782329 880175 842721 487638 499412 470423 674493 1068045
6678 1068045 1123855 1024708 817105 867523 847713 888411 895482 954981 1054263 1066094 943982
6667 943982 952976 1018453 723105 747727 1169187 1520966 940996 687112 940759 1146425
6657 1146425 894763 771535 943103 896256 897664 988443 837453 838732 1110667 1180077 1084943
6646 1084943 1030713 991809 1044163 845965 734793 920899 898652 1146062 1333652 1400726
6636 1400726 1422081 1370420 1208649 1155409 1464309 1504870 1533263 1664765 1441387 1535600 1444638
6625 1444638 1416138 1281439 1471138 1427911 1799518 2029443 1711048 1665130 1882489 1525372
6615 1525372 1181419 1260461 954282 1033095 1210686 1432640 1550552 1860574 1842145 2039052
6605 2039052 1934173 1837442 1847995 1722085 1860811 2103064 2268658 2183810 2017109 1855980
6595 1855980 1974900 1978338 1711644 1818040 1946541 1927259 1989673 1990051 1922106 2016366 1843954
6584 1843954 1961608 2136398 2121177 2096225 2012595 1736659 1472762 1575432 1832963 1850708
6574 1850708 1808085 1721668 1629450 1924117 1629548 1647104 1591718 1271035 1081128 1457405
6564 1457405 1572715 1484611 1415766 1602345 1843168 1946234 1898581 1985341 1829403 1776293
6554 1776293 1899503 1692905 1824951 2001640 1975216 1990281 2056169 2246247 1976098 1813547
6544 1813547 1843585 1807070 1754060 1974083 2003125 1901254 2233729 2392876 2538241 2356498
6534 2356498 2706918 2639416 2480723 2738672 3019617 3070714 3012357 3155207 2884229 2757793
6524 2757793 2714546 2418850 2432505 2527074 2588792 2545764 2374340 2499467 2871137 3229554
6514 3229554 3205001 3099925 2926384 2860052 2764906 2495487 2329828 2353621 2352055 2042459 1882122
6503 1882122 1768261 2018818 2132747 2155978 1853036 1958399 2072462 2325560 2386026 2139600
6493 2139600 1937649 1974843 2178352 2021727 2355857 2236202 1944013 1896958 2037860 2401154
6483 2401154 2306935 2020689 1970147 2023198 1833961 1830641 1862046 2130288 2121500 2112710 1918951
6472 1918951 1900133 1805615 1780700 1680719 1902780 2062784 2161011 2060927 1693275 1686869 2131581
6461 2131581 2244997 2242024 2144060 2045601 2190017 2078726 1968924 1948648 1993785 1789138 1992389
6450 1992389 1911074 2077630 2103098 2306227 2229646 2122847 2201836 1927117 1881169 1923131 1843561
6439 1843561 1852616 1998985 2020626 2005083 1856294 1886652 2207765 2202993 2002062 2048757 2046420
6428 2046420 2090815 2507672 2477783 2597863 2351609 2337465 2657485 2608690 2714302 2659635
6418 2659635 2370891 2461674 2619384 2653523 2561017 2551322 2740742 2605294 2477862 2753969
6408 2753969 2895865 3023438 2892271 2838142 2863992 3266373 3224977 3272459 3526046 3682813
6398 3682813 4005440 3742521 3643103 3648263 3808271 3660199 3768013 3684297 3638270 3813227
6388 3813227 3619977 3652680 3450346 3685227 3730131 4141780 4169039 4197750 4174365 4031078
6378 4031078 4254847 4663744 4819763 4900273 5018687 4657776 4458133 4515232 4410969 4279240
6368 4279240 4301922 4265004 4366295 4217926 4502432 4552623 4747505 4872799 4683680 4762876
6358 4762876 4908815 4968616 4964205 4973709 5132368 5237188 5232136 5345971 5536347 5689021 5757526
6347 5757526 6055224 6268721 6300203 6402450 6812909 7070103 7226932 7299183 7262008 7347959
6337 7347959 7740748 8131124 8203293 9189146 9615891 9803776 10286256 10705213 11523035 12201093
6327 12201093 12845877 13690524 14673618 15771654 17135008 18758661 20940753 23109632 25850793
6318 25850793 30310772 36933818 48129868 63283707 80825433 96164343 104390980 104299825
6310 104299825 97052423 85978419 74517440 64281075 56534496 51356198 48799220 49285455
6302 49285455 54286733 64872962 79680623 94941260 106129186 109051575 102952919 91410475
6294 91410475 77447380 63968267 52675634 43746774 36774871 31307540 26949198 23920280
6286 23920280 21329964 18951728 17289330 16025414 15286145 14646555 13743792 13085199 13059365
6277 13059365 13007565 12914160 12991463 13272467 13367555 13397024 13649739 13855028 13793208 13372131
6267 13372131 13521480 13908538 14630263 15220099 15504100 15761588 16202294 17058122 18045556
6258 18045556 18973141 20013699 21256316 22516312 24104778 26214587 28820387 31239195
6250 31239195 34646348 38924461 44061859 51355762 62504363 80468284 106889146 139258914
6242 139258914 169867306 190210952 194954274 184940779 165707246 143812992 123748471
6235 123748471 107357935 95676451 89385034 88233461 94462296 109748172 134205798
6228 134205798 162325877 185024235 194962026 189083639 170496072 145678190 120767542
6221 120767542 98285642 79701074 65134687 54021328 44874414 37874013 32814317
6214 32814317 28597049 25140043 22405578 19952946 18135325 16557892 15285983 14828596
6206 14828596 13996529 13161912 12608080 12162949 11963758 11630030 11211038 10827991 10414860
6197 10414860 9956358 9418082 9222625 9174488 8674554 8434345 8384172 8177672 8206123 8222068
6187 8222068 7891015 7767309 7757685 7521532 7417436 7089132 6963193 6717412 6668163 6527256
6177 6527256 6473160 6405860 6339121 6184039 6266268 6276897 6144634 5854524 5945381 5963941 6083407
6166 6083407 6084809 6010401 5869573 5741012 5992029 5593406 5447015 5580804 5679415 5899784
6156 5899784 5602154 5479944 5730703 5790629 5630525 5600416 5720895 5785711 5911247 5652203
6146 5652203 5801607 5925998 5985948 5869313 5828826 6078335 6290336 6387057 6508372 6319280
6136 6319280 6207221 6558353 6845625 6809061 6790258 6952638 6984185 7114395 7448190 7545011
6126 7545011 7481284 7657262 8043698 8113531 8266451 8521284 9100227 9272375 9262096 9689470
6116 9689470 10052315 10400250 10543468 10998751 11848748 12325838 12781272 13359142 14372210
6107 14372210 15414468 16180564 17065029 18261623 19670706 21502777 23617185 26349801
6099 26349801 29453125 32954466 37491165 43221919 51616373 64488507 84769289 113362021
6091 113362021 146091010 173264834 186188007 182577365 166074993 142916413 119198595
6084 119198595 98608531 82459740 69892566 60422582 54006240 49571700 47268978 46714791
6076 46714791 47852396 49837551 53158466 59561318 71608954 91824692 120771260 154217850
6068 154217850 181953006 194485949 188924347 169749166 144462805 118586619 95484666
6061 95484666 76827758 62546752 51644074 42563002 35777818 30927624 27260342 24472363
6053 24472363 21998826 19974437 18538919 17614914 16628432 15935195 15531355 14855159 14551061
6044 14551061 14540056 14119540 13639438 13368062 13310026 12896414 12958219 13298442 13263386 13829318
6034 13829318 14084938 14544837 15215424 15721238 16529531 17889258 19341940 21075495 22974194
6025 22974194 25024883 28193869 33653671 42717406 56729230 73969327 90594025 100548100
6017 100548100 100729113 93118601 81356461 68587863 56540449 47002455 39585655 34512061
6009 34512061 30765591 28045125 26474487 26037923 26354998 27127342 28497243 31376887 36794867
6000 36794867 46025976 60492587 78799362 96106661 106128321 105942688 97412504 84111026
5992 84111026 69577837 56627440 45686467 37102563 30701414 25511578 21481187 18227777
5984 18227777 15860229 13801302 12348313 10956173 10151141 9474907 8794683 8212015 7842954
5975 7842954 7574840 7319943 7309840 7310266 7165869 6669732 6514956 6044382 5800222 5588557
5965 5588557 5778568 5480954 5509418 5253559 5039373 5143632 4946258 4509538 4016611 3808305
5955 3808305 3924321 3873083 3658650 3660254 3494841 3361196 3146638 3177849 2979131 3048121
5945 3048121 3116713 2678250 2726723 3076151 2687824 2602636 2520727 2559858 2593130 2562409 2517970
5934 2517970 2781780 3096526 2887912 3160553 3459464 3362292 3173899 2976709 3094349 3000013
5924 3000013 2756319 2663174 2631803 2712224 2481253 2655576 2949245 3042997 3074123 2904380
5914 2904380 3032314 3084915 2800090 2759363 2713751 2557231 2068285 1985368 1789470 2076479
5904 2076479 1976334 1864732 1832865 1566640 1518828 1578285 1739769 1868548 1574681 1222056
5894 1222056 1581409 1546051 1382852 1303008 1301944 1254178 984481 1038222 1122592 1164297 1047318
5883 1047318 1150465 1180811 1339147 1303970 1039857 1153828 1184789 1477612 1497704 1263615
5873 1263615 1310839 1264583 1064011 1224680 1232836 1148707 1102456 1516361 1361525 1161678 1391938
5862 1391938 1076500 1121713 1128546 1024779 998189 1014521 1108506 1125697 1063058 1201109 1078911
5851 1078911 976264 1204267 1282297 1317342 1026219 986746 1152723 1284951 974101 959014
5841 959014 973216 884660 947781 1050671 913873 1099330 1031399 833645 649206 658765 646956
5830 646956 789494 984622 817137 901461 1179465 1120052 1015197 1124833 1049914 817232
5820 817232 795676 806774 741258 1094284 1198311 915885 918895 971009 1118254 966822 818119
5809 818119 681975 1016294 1087026 715811 939247 990160 840348 889517 885694 1213785 1473965
5798 1473965 1464209 1462985 1659474 1797929 1678854 1622091 1569317 1496426 1333219 1372470 1372285
5787 1372285 1366816 1111447 1210886 1213795 1127201 1547811 1608520 1650672 1860258 1926901 2207012
5776 2207012 2276443 2314049 2542464 2475942 2216548 2108398 1897084 1651857 1509914 1461840
5766 1461840 1135314 1272327 1084943 1148213 1071513 1294549 1481331 1324730 1406774 1496001
5756 1496001 1623067 1821448 1771697 1820475 1900951 1879697 1600284 1162769 1344547 1387766
5746 1387766 1147727 1255553 1302107 1232508 1230761 1175606 1180837 1247479 1124996 1050647 992511
5735 992511 756009 764711 595185 619781 801815 842164 911843 1163647 1193731 1240988 1166457
5724 1166457 1030272 1044137 1284166 1230933 1031366 824772 726299 1057277 996309 1026009
5714 1026009 1057532 1149273 1156953 1149098 1469555 1655823 1544957 1352957 1447342 1570114 1626073
5703 1626073 1582194 1283765 1275786 1033541 983295 940257 1399441 1395969 1230435 1263479 918172
5692 918172 1171333 1114119 1344440 1432690 1579259 1501429 1417918 1789061 1925376 1804464
5682 1804464 1599684 1687223 1492507 1401234 1554209 1757489 1658238 1418872 1300933 1028607
5672 1028607 1142850 1231957 1125306 1300345 1450467 1523165 1600276 1472753 1651032 1742161
5662 1742161 1642004 1553804 1477385 1808768 1929857 1865359 1824012 1739856 2038474 2039895 1966967
5651 1966967 1827339 1995042 2032703 2181565 2118362 2053888 2029618 2189106 2186363 2307168 2201606
5640 2201606 1695301 1528438 1699128 1941895 1908432 1697504 1727937 1913310 2015839 2042867
5630 2042867 1932019 1722491 1579234 1683373 1740737 1949261 1828807 1692077 1594677 1731980
5620 1731980 1932687 1786060 1453793 1318689 1438552 1456112 1423728 1344538 1666042 1983579
5610 1983579 1741397 1603171 1664002 1564038 1600186 1661694 1416608 1528408 1536584 1441634 1476991
5599 1476991 1503883 1456148 1456876 1550217 1401483 1125343 1073999 1152482 1345330 1481789 1531034
5588 1531034 1549286 1554286 1404105 1563463 1701702 1510807 1361062 1361713 1581802 1489834 1222176
5577 1222176 1126640 1504674 1537322 1639535 1632205 1443565 1539095 1246110 1096839 1294771
5567 1294771 1489375 1420184 1387677 1440087 1276003 1309154 1389178 1301971 1451663 1359767 1425286
5556 1425286 1500310 1693791 1584708 1391865 1452540 1514187 1622632 1409803 1633941 1543854
5546 1543854 1484649 1737875 1547805 1623531 1913623 1833529 1809613 1654857 1621281 1547688 1618915
5535 1618915 1485237 1339593 1620863 1404116 1560708 1724726 1693761 1768621 1798685 1749566
5525 1749566 1812291 1902352 1754553 1867934 2066022 2150266 2144022 1987829 1823958 1751701 1911820
5514 1911820 1907716 1892703 1704429 1637985 1767152 1726240 1751140 1878035 1678065 1775691 1943144
5503 1943144 1837153 1590160 1808091 1812048 1632271 1642235 1584294 1650502 1632883 1546284 1700798
5492 1700798 2094233 2137519 1799972 1799607 1814221 1753447 1956608 1905587 1749807 1875206 1993576
5481 1993576 1831991 1834132 1856779 1826652 1911621 1657195 1712094 1791616 1945594 2148920 2054790
5470 2054790 2086257 1862808 1849870 1883091 1877683 2032679 2097555 1890142 1937862 1875111 2186637
5459 2186637 2120832 2049851 1943092 2019448 2009779 2020979 2037249 2124785 2043196 1802428 2063970
5448 2063970 2251423 2329121 2253870 2124484 2154085 2025736 2157635 2216967 2197186 2121225 2003009
5437 2003009 2452241 2278968 2292097 2269912 2287824 2251705 2491143 2367507 2412581 2607032
5427 2607032 2806114 2599193 2379847 2368617 2767725 2769378 2765409 2912873 2849075 2730390 2540193
5416 2540193 2737544 2842880 3078689 3035258 3021593 3091075 3346698 3350922 3448473 3378635 3676140
5405 3676140 3658126 3654706 3583573 3529657 3535058 3626775 3444137 3326960 3543113 3470489 3761723
5394 3761723 3790306 3999408 4385820 4326140 4583919 4288858 4225040 4462600 4238422 4270910
5384 4270910 4274552 4069491 4123927 4255235 4184805 4163780 4558341 4715239 4606730 4543937 4856542
5373 4856542 4972331 4919106 4903082 4785766 4864151 4823243 4560333 4515113 4572089 4772616 4946264
5362 4946264 4990937 5171063 5008890 5000908 5049069 5020873 4841762 4666501 4552587 4840056
5352 4840056 5247853 5204573 4984773 4962801 4902366 5031046 5019828 5035935 4916142 5056294
5342 5056294 5165088 4971140 5128679 5076945 5218866 5292061 5435906 5729491 5674593 5753247
5332 5753247 5731766 5466353 5380065 5412626 5810040 5735935 5780390 6130248 6217928 6031058 6038841
5321 6038841 6402762 6526956 6603101 6701413 6753471 6569594 6582738 6725430 6863909 7212438
5311 7212438 7558916 7696975 7575403 7641912 7842373 7807245 8173717 8408534 8388759 8659749
5301 8659749 9041424 9294716 9795818 10054704 10313925 10788866 11189463 11384006 12248183 12897961
5291 12897961 13099776 13587646 14482438 15282565 16348505 17387049 19170620 21924570 26173065
5282 26173065 32386036 40513632 47545112 50672613 50153012 47713075 44268717 41615565
5274 41615565 39779961 39477643 41489484 46207546 54337892 65190191 76817433 86204747
5266 86204747 94199169 99733596 102575017 105207571 106516085 104897496 103544212 103961357
5258 103961357 104503107 103213582 102408217 103748241 107447089 111307169 114739972 119435506
5250 119435506 125112245 131416748 139108777 145521110 147305382 144294388 138808287 132967812
5242 132967812 127792790 124474199 121703779 116182540 111030133 108795323 107363085 104960921
5234 104960921 101901438 100595764 100777649 100782411 101635589 103923990 105697105 104676539 101501321
5225 101501321 94926251 84450275 73255677 62446095 53179164 46029110 41126313 38095842
5217 38095842 37776420 40408725 45264106 49844294 50994974 48275607 43126435 36996108
5209 36996108 31302220 26513146 22626025 19467716 17090272 15210727 13668882 12689304
5201 12689304 11888395 11317808 10825612 10318628 9641193 9109819 8794421 8570530 8330527
5192 8330527 8206990 7970199 7785756 7578557 7078675 6907576 7018417 6789042 6691605 6482748
5182 6482748 6235342 6261035 6089840 5670541 5491919 5504932 5477431 5446945 5475375 5286630
5172 5286630 5312373 5309190 5129294 4958191 4717014 4925356 4798209 4401801 4571253 4397200
5162 4397200 4441844 4564563 4328113 3910181 3756137 3953665 3972970 3820763 3860204 3876148
5152 3876148 3778531 3659927 3613944 3811264 4114067 4127568 3785614 3602410 3622375 3688961
5142 3688961 3536159 3669288 3940768 3910136 3637671 3433671 3456575 3607335 3685613 4070311
5132 4070311 3872238 3903437 3998558 3932630 4020043 3965948 4037920 4009677 4281867 4758780 4952633
5121 4952633 4990807 4900343 4905847 4883121 4702958 4630466 4589148 4492540 4469229 4443041 4525688
5110 4525688 4580064 4646873 4791455 4816947 4822993 5036695 5162314 5361458 5227533 5233055 5196212
5099 5196212 5477945 5620776 5267047 5407191 5548987 5379079 5264145 5473923 5422923 5315858
5089 5315858 5221288 5189080 5148834 5145003 5267827 5180908 5231080 5427151 5769835 5830144 5753148
5078 5753148 5695801 5622217 5637544 5873133 5965244 5848649 5861161 6220802 6585686 6893807
5068 6893807 6720341 6531763 6382661 6171631 6236317 6291241 6039857 6119831 6392505 6339873
5058 6339873 6615003 7057238 6889700 6897006 7286459 7279432 7166239 7227591 7244879 7074612 6842114
5047 6842114 6867490 6737849 6450405 6356754 6345333 6372055 6262055 6494403 6406603 6295724
5037 6295724 6280091 6394749 6205590 6360868 6528705 6356457 6493850 6515959 6379676 6240484
5027 6240484 6319218 6303761 6220150 6528814 6796190 6813941 6905810 6961891 6663190 6687257 6819334
5016 6819334 6644903 6357900 6547670 6593194 6611834 6504946 6600899 6600504 6812090 6954159 6837379
5005 6837379 6862139 7153492 7184134 7131624 7212458 7110360 7384221 7510758 7616747 7524539
4995 7524539 7400554 7596412 7723357 8039804 8194559 8078108 8091657 8365485 8296338 8256119
4985 8256119 8352786 8380039 8507436 8518430 8747725 8966277 9166955 9116405 9252452 9468486
4975 9468486 9647901 9808521 9915480 10202137 10157102 10313959 10480420 10562017 10709799 11119919
4965 11119919 10928597 10963115 11226261 11215822 11327046 11021392 11163849 11536439 11770007 12118775
4955 12118775 12303252 12579240 12771990 13016713 13459329 13349489 13181669 13095112 13028243 13051460
4945 13051460 13104027 13316784 13566378 13807173 13967512 14251469 14900711 15150036 15081442 15121081
4935 15121081 15289577 15561181 15754836 15818455 16162792 16550407 16935953 17317116 17974864 18360703
4925 18360703 18805592 19039685 19377731 19608621 19814743 20051503 20014913 20324533 20602219 21098669
4915 21098669 21650989 21880286 22298976 22065516 22190193 22729822 23173935 23661247 24401598
4906 24401598 24883540 25266614 25835837 26585929 27340347 28232167 29366496 30351284 31587301
4897 31587301 32528835 33121938 33876594 34736930 35740483 36453285 37362687 38180670 39446425
4888 39446425 41119322 43365984 45835668 48779560 52792872 58732004 67908192 83305353
4880 83305353 108916930 141945413 172565533 187403373 183589344 168436650 148617610
4873 148617610 128709790 112000239 99696872 90951772 85517399 82555253 82298474 84812826
4865 84812826 90226809 100200742 117448709 144984066 180958020 217204497 246566668
4858 246566668 271515878 292757596 302818228 293221843 267901318 236128963 203833646
4851 203833646 175516932 154282167 140004970 131786448 128248993 128401900 132041598 139267116
4843 139267116 150553235 168587093 196758931 236629220 280903432 314962822 328155899
4836 328155899 322476248 305770001 284696104 264191886 247245629 233543587 222553236
4829 222553236 213173301 204545800 197214571 191125587 186278745 182743785 181133193 181185853
4821 181185853 184045450 189651489 197959557 209365900 222784964 236888625 252012268
4814 252012268 268095393 285755909 305235102 325728401 344680414 359344704 368345696
4807 368345696 372645137 373230418 372157578 369618424 365063481 358214364 349492234 339280183
4799 339280183 328256440 317486022 307850806 300302510 296181989 295675434 298026019 302091373
4791 302091373 306413188 311528286 317157151 322265400 326216440 327994374 327816738 326230992
4783 326230992 323280834 319375519 314557704 309962369 306856335 306719671 310135182 317113059
4775 317113059 326026665 335973649 346394093 355094387 361042394 365438066 369337488 374203629
4767 374203629 379490885 383220459 382768675 376117911 363322466 345464416 325391852 305250702
4759 305250702 285910519 268060667 251925933 236992898 223641714 212251507 202435648
4752 202435648 194502374 188560161 185153912 184657037 186789133 190403651 194576914 198240937
4744 198240937 200621816 202093415 203559553 205477800 207346096 207070880 203122132 194909311
4736 194909311 183229577 169662541 155641771 142323133 129717530 118216384 107293794
4729 107293794 96872182 87321851 78533057 70494762 63319599 57285881 52207566 47675089
4721 47675089 44130779 40888445 38235447 35601742 33448425 31726471 29876476 28656379
4713 28656379 27516329 26073019 25054067 24312391 23454497 22628043 22042422 21493113 20884828
4704 20884828 20274033 19914409 19536140 19168389 18876587 18536054 18308047 17896618 17344709
4695 17344709 16904917 16495949 16230069 15876014 15374293 15202815 14981047 14612831 14291817
4686 14291817 14098558 13795954 13326439 12932588 13100874 13265158 12962108 12712135 12514757
4677 12514757 12342375 12234140 11879559 11549217 11575953 11620904 11341428 11139034 11223047 11442213
4667 11442213 11602565 11574589 11341779 11167534 10864219 10640423 10458928 10121421 10202559 9980255
4657 9980255 9929339 10009013 9986091 9875339 9667840 9645630 9442473 9265914 9271218 9382353 9422195
4646 9422195 9782313 9965825 9570115 9123529 8740648 8768710 8747001 8652977 8781062 8840658
4636 8840658 8859936 9230488 9149289 9153137 9032955 9011290 9054022 8895794 8615443 8775286 8983006
4625 8983006 8671668 8734248 8764830 8733286 8830534 9158742 9183882 9110206 9161344 9357405 9447156
4614 9447156 9511391 9703697 10101523 10262877 10637451 10864249 11320813 11618914 11757042 11872261
4604 11872261 12025984 12270685 12823092 12909217 13092351 13708608 14180981 14563589 15277233 15936773
4594 15936773 16469727 17326062 18340331 19163162 20073030 21513195 22811894 24314809 26310138
4585 26310138 28759937 31936294 35512756 39781591 45678239 54789133 69811884 93728987
4577 93728987 126083530 158687020 179854405 183003844 171304459 152361959 132430420
4570 132430420 115437974 104493159 100846235 106919219 124424130 151040889 177549655
4563 177549655 192256075 189711909 174704878 154660137 135722174 123087221 120903278
4556 120903278 131532121 150802936 169830858 177924773 171539407 155323604 135243662
4549 135243662 115621343 100040844 90379623 87739044 94037931 110220940 132292735
4542 132292735 151106637 156972585 148308649 130298403 108625590 87900804 70300438
4535 70300438 56507251 45667638 37325902 30934754 26446300 23050406 20837482 19256328
4527 19256328 17996088 16819342 15593481 14620594 13449172 12948015 12232257 12043726 12160619
4518 12160619 11808158 11445432 10826583 10544860 10116391 9678350 9231626 8866562 8613070
4509 8613070 8188251 7977339 7684365 7492691 7483987 6959084 6715516 6753601 6547668 6372018
4499 6372018 6121234 5848665 5986146 5951836 5622449 5563875 5375633 5177732 5429646 5141961
4489 5141961 5174534 5185896 4978698 4786828 4883486 4981928 4999799 4733266 4568961 4837643
4479 4837643 4941997 4837629 4977762 5032137 4964809 4595664 4314711 4600985 4344668 4142938
4469 4142938 4157196 4135110 3922274 3750642 3494048 3640913 3821742 3877403 4247036 4835359
4459 4835359 5230660 5740339 5750462 5738703 6164347 6116758 5973555 5915762 5717862 5672399
4449 5672399 5813108 5888525 5737490 5484656 5077647 4696945 4440021 4314628 3936353 3893678
4439 3893678 3925598 3697502 3319302 3280318 3657921 3790547 3378114 3162579 3269354 3196913
4429 3196913 3118760 3068600 2987796 3028746 2951360 2989264 3344944 3505490 3309024 3477673 3337093
4418 3337093 3144350 3490726 3601151 3753913 3955230 4126045 5047839 6433563 8361790
4409 8361790 10217817 10931957 10589266 9317786 8234057 7084977 5965905 5343725 4847495
4400 4847495 4509567 4135621 3968601 4147503 4069576 3778023 3559094 3813947 3830326 3663875
4390 3663875 3465107 3500140 3295482 3454587 3708278 3566487 3632693 3616097 3430315 3663374
4380 3663374 3954749 4049373 4008687 3923264 4340262 4112116 4049629 4353707 4383258 4407006 4743405
4369 4743405 4576314 4521596 4487757 4520800 4588053 4783379 4507584 4303927 4472127 4248093
4359 4248093 4466501 4176804 3928013 3845415 4187126 4354209 4396771 4051198 4016352 4149597
4349 4149597 4443456 4629039 4756721 4670784 4864381 5201324 4950853 4919037 5041396 5031283
4339 5031283 5052242 5005019 4687012 4723962 4698996 4880529 5234294 5244512 4983272 5086350
4329 5086350 4872481 4640409 4799910 4723547 4751655 4838586 5041219 5409659 5453305 5422115
4319 5422115 5945070 6101571 6220570 6418511 6147735 6024031 5805314 5317583 5491381 5592287
4309 5592287 5579866 5450595 5731977 6127020 6041326 6281962 6416366 6111098 5600372 5917742
4299 5917742 6129627 6156417 6172689 6144329 5902380 6209298 6416558 6271210 6085742 6016237
4289 6016237 5850299 5607057 5417280 5428257 5329518 5402061 5594737 5634969 5503795 5591036
4279 5591036 5540469 5135515 4953436 5043252 5269390 5206868 5018297 5004039 5088332 4947667
4269 4947667 4938662 4886355 4912625 4838300 5157911 5205430 5318478 5124468 4989336 4977871 5093965
4258 5093965 5605075 5596673 5466877 5389187 5534951 5725265 5492115 5518975 5513953 5590762 5992095
4247 5992095 6038311 5858848 5904863 6096199 6413075 6645401 6788195 7232116 7175853 7207947
4237 7207947 7264548 7369170 7402013 7614617 8074868 8296546 8276145 8235613 8218069 8256486 8242316
4226 8242316 8014628 8249975 8524291 8595923 8626697 8817886 9148228 9491544 9568220 9645221
4216 9645221 9912963 9907686 9725130 9880948 10003909 9971422 9822471 10047858 10250583 10425882
4206 10425882 10915735 11087274 11213742 11385647 11642315 11546289 11613360 11991971 12107974 12373631
4196 12373631 12829284 13089257 13098525 13475775 13623507 13601162 13895081 14157112 14616223 15147205
4186 15147205 15593807 15876122 16260210 16581643 17114362 18017994 19118706 20168851 20721456
4177 20721456 21580266 22775905 23857309 25111922 26496569 28216279 30663323 33584984
4169 33584984 36845862 40279206 43684262 46393946 48377346 50075965 51170002 51394221
4161 51394221 50868605 50338986 49580380 49000251 48665648 49203050 51034317 53692720 57694163
4152 57694163 62727321 68369041 73634417 77920230 80693630 82680676 84536541 86773826
4144 86773826 88905691 91289720 94093186 96343489 98165633 99220820 100007300 101390622
4136 101390622 103410828 105591457 107852282 109488613 109821026 108956940 107564614 106850925
4128 106850925 108427160 112617285 120537401 131974807 145268850 157606534 165671263 168468233
4120 168468233 167840427 165850475 164459499 164320843 165203860 166383678 167607913 168710602
4112 168710602 169321716 170208450 171799180 173383494 174718324 174927667 173618322 171121729
4104 171121729 167764698 163796860 160200855 157926941 158119187 161644270 169063192 180014348
4096 180014348 193041323 205974042 216410599 223747117 228746011 233022633 237897887 243967807
4088 243967807 249370397 252806749 254934899 256893325 259669072 262703194 264340739 263020594
4080 263020594 259176742 253532911 247175544 241960854 238033310 237028782 239450071 245545657
4072 245545657 254670351 265381808 276331243 286548517 293739081 296302219 293373889 286973749
4064 286973749 278648093 270619952 263936740 259582581 257594793 257813867 259847141 264027480
4056 264027480 269472846 274147554 275864706 274580516 271562323 268616145 266958901 266542392
4048 266542392 266079570 263583215 259753737 256392623 255331464 256030133 255801963 251090591
4040 251090591 241415957 227827834 212593583 197370163 184005606 173854781 167931216
4033 167931216 165306985 165656615 168001444 171254910 174253402 177102380 178992887 179943812
4025 179943812 180236089 179129942 176816882 174026283 169831867 164883255 159961494 156361786
4017 156361786 155170405 156722659 160389905 164019073 164365835 159997009 151371203 140406781
4009 140406781 129144928 119060829 111136755 105624851 102769264 101838067 101393140 100056020
4001 100056020 98248869 95725233 92808820 90359751 88549013 86677913 84719282 83099384
3993 83099384 81626059 79889538 78328500 77029688 76085092 75031675 73582425 71322975
3985 71322975 67653899 62770121 57444698 52271226 47598205 44161040 41437608 39416203
3977 39416203 38551989 38161609 37527934 36771405 36442559 36049199 35684906 35187832 34561346
3968 34561346 33323315 31576076 29224370 26805600 24112384 21394539 19516675 17975761
3960 17975761 16537641 15326934 14212622 13247744 12409809 11504775 10747307 9969024 9750470
3951 9750470 9355832 8818430 8663971 8310055 7802458 7497176 7013176 6820546 6526195 6184728
3941 6184728 5951336 5879098 5876174 5615344 5523915 5082767 4912437 4683607 4694317 4645865 4330129
3930 4330129 4169057 4149371 4186861 4094292 4083374 4079126 3918334 3911423 3992024 3825368 3685171
3919 3685171 3672726 3504832 3483772 3511841 3162421 3132940 3135760 3252801 3199343 3328573 3546729
3908 3546729 3396303 3388621 3333312 3166013 2979099 3152727 3284721 3386379 3567470 3464310
3898 3464310 3285808 3608873 3640114 3529440 3338994 3183121 3586965 3372068 3415473 3549832
3888 3549832 3685045 3512957 3346638 3667925 3599599 3738981 3411646 3513131 3715016 3742060
3878 3742060 3809963 3489937 3668407 3721496 3586357 3738902 3856920 3619756 3463164 3388273
3868 3388273 3622751 3956666 4003546 3988721 3994242 3981959 3867070 3975666 4161503 3879928
3858 3879928 3709373 3777950 3710974 3998436 4158178 3902915 3746709 3687145 3914526 3807674
3848 3807674 3997938 4303154 4202715 3994281 3975725 3818545 4170585 4207198 4421588 4473174
3838 4473174 4197032 4451016 4669363 4711214 4639325 4749863 5038140 5502915 5567177 5958871
3828 5958871 6177292 6688929 6940374 7318405 7929077 8765082 9843127 11223182 12711778
3819 12711778 14860212 18180120 23575466 32300136 43817687 55321635 61676397 60464167
3811 60464167 54535857 46284730 37577705 29862815 23952518 19224858 15458937 12787942
3803 12787942 10860256 9559650 8625520 7671276 7109936 6613142 6002237 5629247 5209129
3794 5209129 4937037 4754233 4721423 4713986 4800426 4492557 4414070 4100689 3800688 3692332
3784 3692332 3469898 3404290 3327035 3428421 3501043 3310959 3324144 3192484 3161047 2829577
3774 2829577 2951857 3069943 2952330 2847881 2918369 2723709 2799232 2882690 2947315 3054242
3764 3054242 3272359 3340206 3079268 3060511 3011831 2797722 2630303 2627337 2789291 2710467 2683228
3753 2683228 2800753 2647406 2712002 2675342 2715561 2728380 2717771 2622095 2861213 2764362 2538875
3742 2538875 2720964 2665624 2657418 2739563 2596217 2668152 2637787 2832134 2706140 2429175 2379957
3731 2379957 2443331 2361849 2420648 2529277 2360376 2226963 1986536 1835413 2025185 2354545
3721 2354545 2419180 2316836 2338257 2322176 2156191 2093227 2075188 2146017 2474522 2667972 2618114
3710 2618114 2685182 2892892 2975699 2877055 2743014 2618262 2491915 2393679 2276247 2275727 2000861
3699 2000861 2056322 2160902 2287994 2354562 2459866 2556064 2632535 2820017 3143033 3302591
3689 3302591 3253892 3338900 3295129 3318042 2904527 2659963 2512675 2473989 2275928 2332308 2543509
3678 2543509 2313135 2207116 2366107 2238340 2394821 2304893 2173971 2364131 2299958 2240482
3668 2240482 2307701 2208779 2263938 2347440 2362935 2482299 2419220 2435265 2420481 2348626 2204320
3657 2204320 2144362 2365902 2221054 2293345 2569441 2723232 2831843 2873233 2851082 2966725
3647 2966725 2546513 2327086 2345585 2400586 2731718 2569998 2570904 2500349 2723798 2831602 3114304
3636 3114304 3285845 3407309 3480977 3620050 3535954 3851911 4000702 3721541 3641661 3835618
3626 3835618 3980213 3754268 3837391 3830723 4171311 4397361 4668678 4501931 4410276 4334885
3616 4334885 4136153 3828991 3666305 3863113 4026410 4036820 4156033 4432059 4227410 4028003
3606 4028003 3987153 4427217 4501429 4895785 5428299 5435617 5515919 5623375 5340858 5476701
3596 5476701 5280726 5073729 5240646 5052846 5175564 5043145 4992215 4990712 5209862 5417394
3586 5417394 5386736 5601121 5665392 5809880 5809554 6003441 6161116 6165066 6394526 6296484 6506824
3575 6506824 6739766 6886301 6959760 6953936 7266188 7364898 7465017 7522308 7482321 7533193 7669289
3564 7669289 7817886 7914194 8645189 9057172 9477144 10066375 10521820 11018582 11576403 11943481
3554 11943481 12272607 12479293 12549578 12496727 12550933 12761806 12706086 12741783 13146236 13807123
3544 13807123 13951723 14018001 14334929 14836062 14975170 15475707 16182665 16554230 17109663 17428976
3534 17428976 17858273 18178709 18438746 19012025 19839865 19963581 20266347 21216296 21825624
3525 21825624 22192895 22609596 23282017 23894969 24722622 25752506 27355529 29014212 31258194
3516 31258194 33533394 36131098 38872544 41539357 44336659 47559324 50813545 53247702
3508 53247702 55348832 57061181 58563837 59323001 59798177 59844901 59589110 59126880 58471547
3499 58471547 57133435 55439279 53385746 50499183 47812456 45076666 42106996 39170657
3491 39170657 36736437 34492711 32365117 30622152 28887645 27161215 25446570 24120405
3483 24120405 22878191 21870094 20868890 19874453 19407512 18721417 17928346 17441453 17103787
3474 17103787 16912510 16736171 16559698 15971035 15570969 15158777 14248591 13429059 13183897
3465 13183897 12791144 12382760 12089321 11558353 11404750 11159881 10773205 10241584 9915180
3456 9915180 9736486 9657537 9454597 9154555 8750200 8415569 8282610 7900446 7770451 7386924
3446 7386924 7132217 7053487 6896617 6657119 6661010 6392166 6108294 5695743 5793803 5518038
3436 5518038 5103452 5220165 5141753 5072534 4784507 5076930 5027929 4690322 4590503 4702782
3426 4702782 4559148 4639151 4631456 4306068 4217296 4402147 4353086 4544140 4334403 4174620
3416 4174620 4523909 4249451 3921667 3934790 3772116 3657040 3732890 3665045 3798857 3578300
3406 3578300 3342838 3561176 3610207 3545622 3340045 3431122 3605388 3485838 3458371 3437013
3396 3437013 3357274 3126875 3173476 3277568 3078777 3135441 2989361 2886060 2725975 2662978
3386 2662978 2606720 2497399 2534918 2441642 2576656 2646990 2567555 2276416 2095580 2047381 2375067
3375 2375067 2322290 2232527 2223475 2215990 1951420 1694241 1610028 1764796 1936405 1975598 2028572
3364 2028572 1940709 1732505 1913021 2105401 1896678 1996307 2041784 2060539 1642721 1540465
3354 1540465 1577505 1675444 1834937 2246944 2086821 1858999 1888680 1645091 1662862 1597248
3344 1597248 1769691 1777065 1855171 1808318 1745877 2151649 1879140 1801436 1756195 1594324 1535925
3333 1535925 1480518 1367153 1621028 1623109 1493899 1348167 1317519 1466083 1710022 1851445
3323 1851445 1499907 1446349 1254385 1069687 1366773 1586011 1572011 1509982 1467540 1469888 1205438
3312 1205438 1069702 1042840 960955 1073300 1245358 1180725 1352183 1484994 1482476 1581545 1792671
3301 1792671 1474522 1472472 1572741 1373070 1184322 1314701 1523562 1325387 1135354 1035557
3291 1035557 1383880 1370544 1373757 1196360 1072711 1130420 1036335 1009319 998277 856761 890146
3280 890146 1208332 1336540 1383866 1012117 856679 1088750 1095399 1131655 1311123 1442334
3270 1442334 1311111 1389468 1331519 1378807 1604545 1415748 1405645 1387191 1308536 1078464 1312367
3259 1312367 1512638 1719995 1603235 1405808 1316494 1577447 1613310 1723280 1803081 1960538
3249 1960538 1757909 1634040 1664964 1782161 1760084 1993484 2106991 2295359 2350423 2027253
3239 2027253 1923005 2013017 2191934 2174009 2512458 2525547 2439145 2437152 2635116 2573986 2473410
3228 2473410 2633505 2913923 2699932 2780465 3095334 3065656 3151006 3048535 3066846 3280747
3218 3280747 3610298 3772157 3738761 3971488 3919390 3942912 4110722 4496058 4410657 4499322
3208 4499322 4701159 4996434 5224831 5574867 5930333 6109510 6523250 7434738 7848286 8426476
3198 8426476 8991860 9153257 9905845 10908555 12232552 13129024 13983657 15082496 15659589
3189 15659589 16139443 16218347 16370462 16463443 16327323 16337333 16239133 16438524 16304338 16145438
3179 16145438 16404375 16502315 16237536 16295648 16712747 16741909 17113878 17464062 17816242 18328540
3169 18328540 18967914 19818737 20940024 22521560 24706006 28584245 33300515 38238393
3161 38238393 41233789 41566766 39989328 37061398 33477532 29914942 26837490 24001171
3153 24001171 21763762 20094963 18799969 17781969 17170742 16746827 16336560 16122301 16150499
3144 16150499 16334908 16433867 16480790 16854006 17129607 17570371 18023556 18497655 19385583 20295577
3134 20295577 21100753 22171376 22788709 22992266 22873978 22460377 21738406 20474069 18979827
3125 18979827 17693069 16120122 14797220 13917181 12771256 11969880 11814451 11369298 10864582
3116 10864582 10345172 10200696 10170660 9964718 9920232 9743426 9684111 9438210 9420034 9048263
3106 9048263 8920836 8497607 8392062 8229836 7565632 7060822 6607607 6048413 5449631 5130294
3096 5130294 4968210 4701454 4259536 4183089 3923924 3692186 3468668 3224548 3062777 3042256
3086 3042256 3016029 2900278 2540460 2609237 2718404 2679209 2438150 2248989 2327765 2304118
3076 2304118 1956661 1728241 1859427 1698072 1712367 1291960 1276963 1113932 1196796 1251649
3066 1251649 918826 684805 932418 857012 908203 825896 949711 750295 182739 253065
3056 253065 465178 453639 530169 613529 762414 347902 467893 478205 245242 408110
3046 408110 293525 51449 -67420 -61873 65035 320166 256570 491474 77416 -199626
3036 -199626 -114593 -175713 -209817 -141105 -76402 -35194 -121942 -141907 -262078 -97744 -399054
3025 -399054 -488231 -694232 -709056 -250276 -362348 -328615 -342027 -556778 -372488 -282879 -210483
3014 -210483 -174750 -212932 -455653 -227354 -204127 -355765 -525286 -228280 -299479 -492994
3004 -492994 -435215 -567628 -446529 -549093 -549899 -621140 -793651 -850451 -658919 -877221 -961201
2993 -961201 -1064911 -1041401 -713496 -339432 -470724 -650371 -795462 -981780 -738827 -690414
2983 -690414 -744583 -464788 -409369 -750082 -846117 -804726 -758317 -742841 -867287 -1166451 -1210135
2972 -1210135 -1077479 -909011 -1171926 -1047022 -947038 -825430 -771699 -829660 -722172 -902926
2962 -902926 -903255 -945767 -1223893 -1240331 -1327597 -1413171 -1171364 -938061 -1154071 -1264730 -1199425
2951 -1199425 -1103681 -1170842 -1298021 -1142237 -1176880 -1152701 -959553 -1009460 -966390 -866599 -1077025
2940 -1077025 -1303386 -1416505 -1009248 -862897 -858291 -1070550 -1079387 -1204511 -1057808 -1135253
2930 -1135253 -1099493 -1250940 -1180901 -999219 -986808 -663639 -1038846 -986588 -981077 -690683 -589289
2919 -589289 -746914 -903382 -1180821 -1191127 -1052521 -1099616 -819019 -858855 -1251729 -1059842
2909 -1059842 -1215413 -1264035 -1322033 -1157369 -1256430 -1089815 -1310784 -1202891 -1436541 -1199119
2899 -1199119 -851271 -990944 -1120191 -1255010 -1153146 -1089125 -984364 -1001371 -759511 -686964
2889 -686964 -1062164 -940478 -843644 -1044978 -1004826 -1203228 -1158328 -1093285 -965198 -903506 -731682
2878 -731682 -948449 -986350 -1034203 -686119 -683568 -836644 -1216712 -1243158 -1255344 -1208413 -1061731
2867 -1061731 -873473 -887857 -857571 -1051021 -933394 -942214 -1148706 -971959 -1038666 -865134
2857 -865134 -931757 -953247 -771988 -782820 -1008628 -979927 -990044 -726250 -524008 -755135 -789033
2846 -789033 -770134 -830741 -919420 -826057 -732982 -977780 -1018985 -1027760 -1264031 -1135395 -1092571
2835 -1092571 -1177395 -1002362 -863492 -875489 -837890 -1015097 -1012882 -1086406 -1043888 -859084 -1048709
2824 -1048709 -1359977 -1341430 -1088854 -1094641 -1053301 -945667 -696685 -879067 -948714 -822544
2814 -822544 -768184 -1021745 -1174512 -1089439 -1327898 -870751 -767436 -1053678 -1041935 -1230256
2804 -1230256 -935717 -1015666 -1037632 -1258164 -1438528 -1220884 -1087065 -1098094 -969763 -984020
2794 -984020 -1088925 -1154033 -1174609 -993173 -742847 -798694 -1029837 -1170291 -957408 -1048379
2784 -1048379 -1072746 -1075143 -943218 -1002808 -960329 -829864 -639526 -757689 -780288 -886563 -1067783
2773 -1067783 -1093899 -1223304 -1225165 -1306514 -1165048 -1054468 -1168827 -919397 -872595 -1251327
2763 -1251327 -1276345 -1157294 -1022808 -973994 -1133901 -1015627 -828133 -798801 -833610 -811585
2753 -811585 -851456 -860900 -758687 -823298 -1142159 -1225386 -906456 -773277 -868878 -935337 -1062725
2742 -1062725 -883073 -917227 -983326 -890029 -1230714 -907256 -637576 -593887 -879866 -1063120
2732 -1063120 -947839 -906242 -657586 -648396 -1010558 -968041 -1264616 -1132484 -994025 -1055538
2722 -1055538 -1140731 -1177753 -1022518 -758221 -1037854 -1103523 -958202 -890107 -984564 -820158
2712 -820158 -879453 -952113 -938177 -879554 -760319 -811562 -951192 -1135471 -986955 -1033229 -948429
2701 -948429 -910401 -960384 -879268 -794671 -732755 -1059213 -1072817 -889158 -859600 -940496 -829238
2690 -829238 -971943 -803557 -795773 -839574 -827168 -1110043 -862000 -432448 -574779 -891848
2680 -891848 -794478 -801681 -648192 -683082 -891549 -1022771 -1109336 -974042 -1036739 -770903 -761640
2669 -761640 -711835 -551338 -632425 -724550 -821954 -811512 -590091 -535021 -1023794 -1112092 -865042
2658 -865042 -690100 -901926 -1075705 -988848 -650335 -651723 -864698 -790874 -806537 -712975 -746556
2647 -746556 -855981 -796336 -703698 -558128 -537478 -290223 -321168 -586993 -755032 -590204
2637 -590204 -390859 -687417 -672400 -653020 -476914 -33103 360862 793017 1297796 1548911
2627 1548911 1203054 964520 718003 435166 -141828 -165028 -10650 -187429 -516605 -787635
2617 -787635 -672434 -532387 -397557 -364385 -678696 -545950 -296560 -513403 -526428 -299708
2607 -299708 -595345 -638537 -352313 -423904 -809812 -729852 -465282 -271428 -430541 -645694
2597 -645694 -848757 -691745 -347209 -408822 -645445 -367258 -444578 -449632 -733664 -650357 -544872
2586 -544872 -392645 -432966 -516318 -538600 -409112 -580897 -723875 -597975 -498041 -450415 -579030
2575 -579030 -634032 -793363 -827319 -572198 -565778 -632566 -427175 -535400 -764175 -644471 -609170
2564 -609170 -869106 -793006 -662812 -632412 -685352 -913608 -574745 -520918 -812900 -545661
2554 -545661 -561035 -425863 -289405 -528373 -651264 -755262 -618494 -239227 -562071 -477998
2544 -477998 -381515 -287159 -409820 -437683 -347233 -272985 -192012 -86493 -201159 -294686 -584482
2533 -584482 -494018 -635361 -497798 -202893 -253637 -79002 41377 26549 60574 71151 -162446
2522 -162446 32674 142673 -87633 -75833 21417 -85371 -117648 -182320 -490672 -329783
2512 -329783 -225200 -40148 -163084 -309270 72683 7476 234628 440027 291138 386589
2502 386589 376255 229099 351385 351155 93704 186018 218777 17595 142512 421030 354546
2491 354546 270270 -23625 286957 424059 440630 454193 487789 479587 672415 472182 470242
2480 470242 489276 575728 454324 288288 515392 543273 308069 331250 424928 869992 509155
2469 509155 640528 859940 939943 765402 690835 948930 991380 1061987 1356058 1157994
2459 1157994 1202961 1244785 1294582 1178374 1283483 1348008 1190292 1220501 1418947 1755611
2449 1755611 1678003 1525516 1541735 1503630 1554133 1800811 1651547 1869551 1779797 1762570 1820154
2438 1820154 2013890 1814449 1917175 2243289 2291577 2380742 2497164 2667599 2480195 2125694
2428 2125694 2491346 2869863 2935480 2873192 2999709 2864741 2565812 2487103 2886404 2701425
2418 2701425 2707010 2747746 2926292 3034155 3438468 3406403 3524573 3622900 4035784 4257920
2408 4257920 4411515 4810841 5149553 5093799 5099418 5021756 5549760 5543128 5552890 5887975 6330111
2397 6330111 6250876 6436445 6647532 7081600 7499068 8505251 8707980 9237883 9527147 9977025
2387 9977025 10205016 10514626 11126324 12140022 13075246 14453873 15931372 18308816 20746281
2378 20746281 24617312 28586326 32170303 33374455 34588395 35489238 37551765 39786770
2370 39786770 44101887 49259758 57204678 67593264 83828578 111498126 173072826 274072940
2362 274072940 389557693 454292634 425005275 366671753 300091357 229323103 171557562
2355 171557562 130841983 99374624 76773338 59136985 46857234 38708809 34960145
2348 34960145 32969809 32369394 31535316 28603892 24816251 21994476 19090214 16627961
2340 16627961 14850068 13518838 12477095 11325121 10621463 9983318 9478865 8854833 8296175
2331 8296175 7498834 6907993 6394483 6054979 6056554 6368887 6062647 5464741 5102362 4717510
2321 4717510 4463837 4424626 4315440 4085642 3683752 3443400 3347965 3351051 3086963 3134157
2311 3134157 3211182 3122913 2851347 2677695 2582309 2663083 2648905 2479572 2231851 1868586
2301 1868586 1814669 2144563 1784155 1645802 1323526 1295198 1009339 942751 623854 539104
2291 539104 466731 699836 620993 866079 670796 380633 406832 89939 305099 263190
2281 263190 -171137 -321568 -104597 -144664 -66786 74771 -63804 -438277 -756360 -509032
2271 -509032 -398189 36431 -126145 -502637 -489096 -234813 -450535 -498740 -712126 -605814
2261 -605814 -626369 -580921 -267541 -270268 -322568 -627657 -787563 -572615 -563432 -669096 -1043376
2250 -1043376 -1081388 -955456 -1128154 -948379 -737259 -421530 -712755 -604171 -529676 -819517
2240 -819517 -957826 -1004672 -994401 -1034261 -1022379 -960658 -984321 -1465265 -1139812 -965296 -947121
2229 -947121 -661904 -594461 -839093 -708581 -874562 -1040305 -1109305 -997729 -1109788 -1175945
2219 -1175945 -1175398 -1271783 -1135823 -947688 -1001965 -875513 -857696 -1275583 -1067114 -1054234 -1216325
2208 -1216325 -1012123 -1029676 -1171824 -1051080 -1019600 -1198242 -1574218 -1553286 -1556685 -1485648 -1316193
2197 -1316193 -1465228 -1384683 -1444038 -1158609 -1009058 -1068734 -1416284 -1199232 -958813 -991287
2187 -991287 -1103739 -889209 -850916 -1141839 -1184080 -1222482 -1200057 -1350513 -1299410 -1132220 -928041
2176 -928041 -1133888 -955793 -1263535 -1226470 -1233935 -1364440 -1274198 -904512 -840858 -855942 -1068479
2165 -1068479 -1147016 -1107577 -1141569 -1278484 -1288796 -1434125 -1466621 -1469183 -1390274 -1054962 -1010426
2154 -1010426 -1206354 -1287641 -1180626 -1163340 -1120889 -1278768 -1580909 -1487141 -1317116 -1096903
2144 -1096903 -1023181 -997745 -1055866 -1124191 -1032800 -1008011 -1046686 -1076692 -719302 -710273 -1191505
2133 -1191505 -1183183 -1251129 -1101016 -1045195 -1055041 -985658 -1061801 -1274947 -1149779 -1153202 -1238492
2122 -1238492 -1014762 -869636 -1154834 -1528668 -1395612 -1148266 -1144368 -1198102 -1302217 -1016592
2112 -1016592 -1074465 -1096221 -1156673 -1465946 -1384192 -1114094 -967506 -955586 -939024 -1113169 -1081204
2101 -1081204 -1001105 -858946 -921102 -931571 -762292 -469829 -241506 58885 516332 818157
2091 818157 801276 837933 730301 310112 15132 -382179 -428238 -523907 -788309 -967090
2081 -967090 -950545 -806489 -967543 -999238 -1131388 -1187294 -1176551 -1119471 -1497845 -1288908 -1022762
2070 -1022762 -1126948 -1398763 -1339400 -1364028 -1473819 -1309283 -865346 -967263 -639955 -727282
2060 -727282 -955498 -1097722 -1284307 -1184633 -1058416 -835506 -795637 -858372 -1259402 -1514353
2050 -1514353 -1518518 -1547463 -1512818 -1410168 -1237169 -1270052 -1279782 -1268723 -1421193 -1300195 -1181595
2039 -1181595 -862099 -1104961 -988336 -1116595 -1275590 -1267647 -1231119 -1317627 -1352692 -1362233 -1198963
2028 -1198963 -1269904 -1197790 -1143331 -1131095 -1032308 -1099066 -1220088 -1306290 -1257064 -1177970 -1361253
2017 -1361253 -1468758 -1273999 -1294371 -1426762 -1408573 -1212672 -1301734 -1286088 -1150768 -1288510
2007 -1288510 -1339593 -1333557 -1051083 -791602 -1088449 -1057157 -1124800 -995056 -950306 -1107873 -1129596
1996 -1129596 -1042704 -907322 -1264427 -1287462 -1196891 -1291039 -1206797 -1326045 -1085760 -982610
1986 -982610 -1077159 -1423271 -1340273 -1594635 -1265429 -1277669 -1469358 -1272261 -1307829 -1233636 -1073467
1975 -1073467 -1024546 -952227 -830971 -1118628 -1142502 -1173989 -1258664 -1587766 -1435111 -1264125
1965 -1264125 -1239108 -1188643 -1046301 -954769 -1177472 -1238106 -1222656 -1188634 -1161785 -1254340 -1317465
1954 -1317465 -1147103 -868159 -826523 -1131690 -1334742 -1195677 -1104291 -1057111 -1052698 -1138013 -1277810
1943 -1277810 -1104841 -878556 -1187899 -1147320 -843847 -892488 -997468 -1005070 -851117 -562858
1933 -562858 -832920 -982370 -952454 -1099775 -1351588 -1308343 -966296 -1050175 -1169817 -1058084
1923 -1058084 -1122348 -1282798 -1359292 -1148848 -1130441 -943238 -884986 -1085472 -922279 -1170076
1913 -1170076 -1018139 -1186608 -1250578 -1117410 -923575 -903336 -918955 -922547 -970514 -814866 -822091
1902 -822091 -1152986 -1216860 -964375 -1372174 -1452609 -1299839 -1192007 -1397979 -1445331 -1254270
1892 -1254270 -1318100 -1238726 -1090313 -1116498 -1213476 -1249760 -1352329 -1246861 -1508646 -1358755
1882 -1358755 -948118 -1116752 -979696 -923672 -1183023 -1143714 -1168282 -955291 -1063463 -923989
1872 -923989 -1053608 -947451 -898526 -960944 -1200502 -1323439 -984880 -1010072 -942529 -933181 -1241783
1861 -1241783 -1476196 -1434294 -1272423 -1089538 -1068908 -1154091 -1106472 -936703 -897525 -1098414
1851 -1098414 -863384 -935703 -1006102 -907784 -1088823 -1080906 -1284855 -1199496 -1236149 -1083351 -1050859
1840 -1050859 -1100449 -1127807 -1158996 -1245726 -1178559 -1005653 -968027 -1134174 -1078747 -1005123 -1075124
1829 -1075124 -961305 -934863 -1173913 -1369169 -1195868 -1100943 -1309520 -1404647 -1130146 -1310438
1819 -1310438 -1328554 -1186440 -1012147 -1102134 -1213558 -1282116 -1279723 -1435403 -1220987 -867836
1809 -867836 -1013353 -903424 -1182499 -1301798 -1442771 -1305111 -1134484 -998767 -1303920 -1228036
1799 -1228036 -1075609 -1032790 -1227856 -1326402 -1270492 -1310240 -1187023 -1232860 -1156005 -1010903 -1189779
1788 -1189779 -1392125 -1488453 -1222820 -980807 -781614 -759317 -770062 -670367 -666652 -893462 -894378
1777 -894378 -732253 -598776 -481828 -702437 -701495 -826356 -1134382 -1054126 -930994 -1078928
1767 -1078928 -808860 -572337 -644959 -1039177 -1088898 -951318 -818340 -1031117 -1128297 -1103646
1757 -1103646 -872467 -639486 -782720 -836374 -888948 -785848 -969298 -960611 -1078061 -1303513
1747 -1303513 -1457500 -1430468 -961000 -937023 -1064630 -983966 -983743 -1136771 -1396851 -1504788 -1241343
1736 -1241343 -993038 -1168689 -1051770 -913189 -1006654 -1032562 -1027224 -969554 -1069378 -844288 -960316
1725 -960316 -1136904 -1019214 -1174891 -1211418 -1046968 -1108168 -1192030 -899748 -968574 -806268
1715 -806268 -1103370 -1337667 -1174186 -1141433 -1197851 -1056536 -972397 -1111766 -903069 -1113156
1705 -1113156 -1219142 -1180566 -1079092 -994273 -1068300 -1059051 -1027511 -1104478 -1165209 -972626 -1092460
1694 -1092460 -1231587 -1021574 -849697 -960422 -1034513 -1166417 -1207142 -1032501 -1165487 -820832
1684 -820832 -931987 -916983 -993224 -920515 -1104862 -1224616 -1063927 -999762 -1243802 -1352623
1674 -1352623 -1138311 -902342 -997474 -1113619 -1061791 -1070754 -768352 -898748 -1070613 -1215336
1664 -1215336 -1194270 -1106253 -1271429 -1198301 -1191133 -1187013 -1038055 -995260 -904646 -790703 -784849
1653 -784849 -664877 -732887 -1088656 -1026986 -883275 -748750 -926808 -815688 -732582 -858578
1643 -858578 -1125240 -1140198 -1119215 -1081656 -1055504 -1036113 -1134689 -969223 -995651 -1045488 -1007634
1632 -1007634 -994867 -1026037 -1040255 -848444 -1009369 -790457 -950649 -1191236 -1022553 -886989
1622 -886989 -1195508 -1498091 -1204662 -933861 -784531 -786768 -956340 -1002274 -1174557 -1170336 -1133301
1611 -1133301 -1127953 -961890 -967042 -1102175 -1059808 -937494 -619526 -573645 -521698 -723100 -841585
1600 -841585 -1014069 -1097487 -1047808 -1052387 -817541 -698945 -704414 -1232274 -1195626 -1231033 -1280996
1589 -1280996 -1118752 -973266 -907030 -735160 -752801 -777083 -678349 -534688 -668870 -978512
1579 -978512 -993231 -1154844 -1233089 -1029502 -911026 -842755 -733089 -1174404 -1140000 -835782
1569 -835782 -933454 -1231599 -1143144 -1040392 -1083460 -1041388 -1019476 -1175955 -1186275 -1030052 -767384
1558 -767384 -810365 -836613 -1070623 -1014840 -967157 -1057903 -952032 -818585 -806388 -899458 -1145201
1547 -1145201 -1027832 -974383 -1184179 -793214 -913606 -777949 -862736 -794632 -851617 -882347
1537 -882347 -1134547 -1013753 -941729 -1067575 -1050256 -846067 -1103918 -1034012 -666382 -857627
1527 -857627 -893637 -814102 -940739 -1075094 -769664 -940004 -876558 -823128 -653683 -572104 -448098
1516 -448098 -527243 -676803 -562426 -602072 -655429 -668335 -758521 -971117 -970418 -1002024 -1059707
1505 -1059707 -976536 -854444 -862158 -963025 -997364 -727390 -701296 -936382 -885991 -1056247 -1129811
1494 -1129811 -1009280 -854991 -738573 -927553 -971179 -1075675 -938254 -794533 -762062 -975953
1484 -975953 -963432 -875105 -705749 -691125 -658775 -781746 -936685 -957646 -919369 -1084438 -1192990
1473 -1192990 -894435 -715268 -787734 -946845 -978210 -1023188 -1044803 -1206449 -1105931 -1160665
1463 -1160665 -913840 -722098 -831955 -658471 -597205 -899255 -712909 -727130 -792621 -872141
1453 -872141 -885151 -645985 -871574 -1090517 -1072279 -1237081 -1056539 -917532 -1169766 -953681
1443 -953681 -784128 -824720 -746853 -637278 -772358 -878780 -810564 -884979 -840644 -944784 -984394
1432 -984394 -1068142 -861938 -889484 -1027206 -1043330 -1166356 -1334108 -1000287 -968100 -1001044 -841931
1421 -841931 -1143916 -1145569 -906106 -1006359 -748147 -655650 -847309 -614174 -555548 -434006
1411 -434006 -412983 -644192 -857711 -834549 -871254 -903988 -856942 -831624 -1103390 -1037282 -970483
1400 -970483 -1016730 -953467 -862532 -906783 -929801 -1145211 -1142156 -821668 -835412 -790064 -506976
1389 -506976 -556915 -800177 -881302 -1055042 -760796 -581138 -694858 -762352 -769017 -867425 -1262075
1378 -1262075 -1152438 -1202094 -1197363 -864180 -928606 -728548 -936506 -836553 -750267 -998182 -1079324
1367 -1079324 -1217410 -627967 -549884 -876147 -909980 -981109 -1172045 -1439587 -1336797 -1218214
1357 -1218214 -1302591 -1101556 -823432 -775612 -894403 -1049992 -1073428 -1044232 -918611 -1069059
1347 -1069059 -998199 -858362 -691214 -901854 -719531 -873221 -1085181 -983134 -865166 -816116
1337 -816116 -924578 -850242 -904223 -686865 -810407 -856891 -1053823 -1061131 -761113 -586496 -759372
1326 -759372 -785738 -666357 -708521 -960356 -965954 -952327 -635782 -376785 -446325 -670640 -698882
1315 -698882 -714578 -688179 -954044 -873099 -848140 -912863 -963511 -1055791 -1135897 -1117216 -1114552 -1013910
1303 -1013910 -643085 -510127 -851379 -976578 -985542 -704588 -643601 -829802 -697891 -819026
1293 -819026 -825243 -989588 -802255 -601258 -760800 -1102695 -1069552 -940645 -1071155 -999627
1283 -999627 -1102055 -1332330 -1132367 -879369 -715064 -1020360 -1133206 -943083 -973153 -994031
1273 -994031 -912406 -930168 -637576 -695472 -630421 -958916 -1004128 -714562 -538159 -711943 -732615
1262 -732615 -755843 -1158231 -1296199 -1027280 -864862 -896739 -864389 -854374 -709674 -739459 -735371
1251 -735371 -759257 -969798 -994277 -847993 -890435 -885548 -948742 -736671 -971599 -1043330 -1049247
1240 -1049247 -1246217 -1052474 -1054888 -1071909 -695497 -870974 -919388 -815989 -734375 -866450
1230 -866450 -881160 -609373 -725289 -764500 -649312 -562602 -687508 -922561 -804311 -935324
1220 -935324 -728701 -805090 -974071 -832991 -959081 -788784 -793872 -723738 -837187 -898878 -804391
1209 -804391 -765809 -910896 -943680 -1162827 -1041545 -805449 -585582 -746773 -1043172 -1133860
1199 -1133860 -912895 -1023985 -1027758 -870867 -838605 -933251 -904911 -850586 -1021751 -956031 -783811
1188 -783811 -623361 -974427 -1202092 -1017857 -1030758 -911782 -851867 -765309 -615021 -510106
1178 -510106 -408604 -761720 -784737 -852326 -1032513 -1381419 -702341 -546760 -534695 -635916
1168 -635916 -553831 -588471 -669553 -783733 -1239524 -1145827 -1038344 -1135924 -1068639 -715713 -1043065
1157 -1043065 -1030433 -1051266 -872303 -864563 -720950 -671701 -713372 -561487 -874164 -952264 -1053037
1146 -1053037 -1091930 -1179943 -927686 -996040 -1221741 -1001083 -774471 -730153 -641502 -585453 -771808
1135 -771808 -943603 -1181248 -1187682 -1148603 -928751 -940421 -607392 -522779 -544732 -778937 -956600
1124 -956600 -969870 -1018685 -1143275 -962244 -1042715 -1051012 -674610 -755061 -739510 -836288 -676564
1113 -676564 -658122 -806859 -852849 -1285183 -1232643 -973042 -1055524 -843504 -765870 -615890 -478491
1102 -478491 -513098 -691641 -959905 -1082322 -1020597 -1062744 -994979 -980444 -911408 -876395 -1087927
1091 -1087927 -903465 -1028100 -1010681 -880418 -964316 -894141 -787975 -893020 -812825 -627311
1081 -627311 -753796 -838849 -996251 -879875 -804500 -734650 -765294 -1204854 -1051849 -799117
1071 -799117 -607050 -664084 -793868 -989424 -900109 -601166 -772840 -654650 -659187 -911275
1061 -911275 -964259 -919604 -846530 -807871 -732467 -964324 -701059 -558514 -685095 -857363 -992805
1050 -992805 -736100 -768452 -513948 -563484 -563308 -646328 -771991 -751640 -884859 -970742 -797327
1039 -797327 -875795 -739880 -869202 -623706 -635903 -708566 -755136 -882973 -863470 -773133 -862906
1028 -862906 -749583 -694524 -913500 -1296111 -1032138 -789610 -882207 -840441 -935887 -969554 -1032981
1017 -1032981 -1096685 -1077669 -1009982 -915157 -972018 -862517 -879181 -1002866 -996687 -1087114 -1024461
1006 -1024461 -787895 -678784 -848958 -747614 -964033 -1080114 -1013715 -1066342 -1171037 -1054094
996 -1054094 -790427 -873410 -840728 -487355 -729100 -867078 -761042 -596575 -782695 -1123497
986 -1123497 -933192 -752815 -912677 -883395 -585752 -584382 -745867 -877409 -710966 -787592
976 -787592 -973418 -753302 -758039 -714244 -955488 -899666 -819352 -633531 -818202 -981945 -928211
965 -928211 -1005656 -905487 -955312 -791124 -461171 -419654 -514936 -971870 -933098 -926427 -1066491
954 -1066491 -939672 -789995 -707285 -699386 -857210 -985822 -776145 -483598 -638555 -540283
944 -540283 -720574 -738298 -676868 -689391 -706607 -944776 -1038638 -835152 -692304 -1014987 -901005
933 -901005 -761707 -869635 -836551 -828220 -729407 -735421 -642169 -631024 -834556 -1074572 -746990
922 -746990 -830282 -694105 -641230 -549708 -441677 -692491 -958945 -1208306 -1243369 -1116793 -1065429
911 -1065429 -961886 -664573 -788076 -676397 -734021 -690013 -727360 -498184 -528374 -542605 -522671
900 -522671 -686646 -670938 -529665 -743455 -787195 -1027649 -1249667 -1026081 -818665 -765666
890 -765666 -755615 -702478 -708380 -1008226 -787806 -865754 -748969 -792900 -896712 -867017 -863046
879 -863046 -1219947 -1342872 -1210730 -1148130 -1051164 -885303 -788930 -895425 -1104578 -946177
869 -946177 -712463 -446577 -550283 -522305 -426121 -552590 -612305 -754646 -820826 -926935 -858057
858 -858057 -1031177 -1122782 -923906 -714205 -638055 -685267 -941557 -641753 -681544 -808929 -602861
847 -602861 -644893 -809537 -848278 -1170495 -857314 -684546 -508955 -431302 -725549 -667379 -748399
836 -748399 -764645 -842280 -758980 -753019 -960760 -927963 -969787 -814786 -951079 -994797 -758053
825 -758053 -775493 -842139 -1053180 -1064518 -785235 -602640 -723194 -818275 -866005 -581406 -531945
814 -531945 -611034 -972895 -716719 -558971 -666023 -836229 -781037 -993541 -1137485 -1301275
804 -1301275 -1407846 -791130 -783966 -976861 -998236 -979540 -759052 -773127 -928477 -996902 -1140918
793 -1140918 -949523 -641131 -501622 -680552 -868075 -605400 -418140 -1158829 -933617 -655290
783 -655290 -534294 -824404 -908866 -964926 -755401 -930705 -814886 -547805 -658999 -715783
773 -715783 -978924 -809615 -841595 -765030 -981528 -722831 -823238 -792546 -932629 -1159562
763 -1159562 -1025048 -932903 -799147 -829543 -963496 -1041774 -877400 -774651 -385726 -494690
753 -494690 -725038 -855751 -790441 -740680 -632902 -791468 -818707 -636656 -642282 -497660 -463497
742 -463497 -915724 -1068823 -571182 -557272 -473139 -701184 -1002018 -816064 -728524 -610842
732 -610842 -582406 -608256 -488263 -796683 -842035 -829166 -1040092 -946927 -938847 -736076 -596981
721 -596981 -600791 -498440 -788021 -899330 -839308 -630253 -700344 -963170 -897387 -822478 -734516
710 -734516 -904904 -1038421 -981183 -675936 -882753 -723700 -776044 -905255 -846520 -648533
700 -648533 -654888 -754015 -627430 -737558 -1251284 -1296556 -930435 -889815 -760444 -898496 -911474
689 -911474 -813731 -858551 -627671 -619951 -579886 -741606 -682674 -418526 -415839 -228551 -292179
678 -292179 -463607 -751676 -692842 -671776 -627911 -639777 -616409 -509653 -504608 -298879 -463526
667 -463526 -532063 -579598 -750501 -797506 -1051017 -948022 -971694 -904858 -827880 -1019792 -1043520
656 -1043520 -977017 -1107328 -756818 -841637 -896496 -952448 -598844 -615858 -804214 -647484 -435536
645 -435536 -509025 -523398 -516562 -606601 -637709 -883354 -899534 -874656 -1185525 -976364 -990648
634 -990648 -1016533 -718291 -563864 -775706 -849722 -582916 -759803 -790656 -744866 -846112 -876272
623 -876272 -650166 -698939 -678538 -715608 -745961 -741466 -910235 -1074569 -1023997 -911603 -704769
612 -704769 -646558 -823565 -1020821 -1041550 -873867 -849123 -683524 -682152 -593497 -771127 -835019
601 -835019 -683111 -842133 -775362 -591457 -413187 -486964 -661675 -854819 -937113 -803788
591 -803788 -806524 -590843 -717009 -831206 -851548 -845496 -1044471 -1006717 -576592 -796241 -828132
580 -828132 -915590 -830579 -696356 -910495 -839529 -464766 -688943 -713540 -598761 -707400 -935287
569 -935287 -747232 -781915 -596320 -477339 -725274 -921687 -1119107 -957208 -765965 -940162
559 -940162 -935194 -803048 -865572 -885834 -931451 -947563 -845861 -932692 -934450 -923417 -741232 -732906
547 -732906 -620019 -722957 -736849 -695724 -628374 -661559 -889533 -1237257 -1080483 -797054 -631469
536 -631469 -560762 -492922 -414205 -671926 -604101 -642194 -648972 -544255 -591733 -580770 -433785
525 -433785 -640921 -595354 -614768 -793045 -735463 -849147 -788426 -577949 -561477 -867742 -843186
514 -843186 -825416 -958498 -871003 -660096 -473743 -451272 -689772 -916647 -722264 -525203
504 -525203 -542932 -622545 -936361 -888940 -727744 -624059 -602277 -536458 -932029 -1056629 -533057
493 -533057 -556436 -668899 -929537 -878635 -771373 -651899 -823389 -1002295 -1045948 -835849
483 -835849 -714247 -758816 -760247 -754356 -780845 -705373 -605681 -536009 -830147 -892571 -1002384 -819279
471 -819279 -872114 -846284 -749310 -843053 -821535 -837070 -780054 -702372 -706621 -483622 -526440 -477516
459 -477516 -607492 -583788 -625442 -566428 -502011 -741300 -1061010 -893439 -714459 -809224 -888621
448 -888621 -987378 -1296985 -1102669 -789965 -741967 -843845 -1004393 -681738 -554795 -522304
438 -522304 -532122 -412694 -533760 -849137 -660449 -736628 -954959 -758016 -878698 -729201
428 -729201 -654738 -757885 -756468 -697763 -693234 -671209 -669788 -846956 -947189 -735988 -943308
417 -943308 -861897 -744278 -956316 -802071 -933462 -956530 -700760 -790567 -791005 -787481 -833909
406 -833909 -670073 -693586 -764505 -434011 -696977 -570077 -620511 -732007 -841619 -820519 -878527
395 -878527 -557277 -521104 -641474 -643763 -736910 -976504 -754956 -620439 -699623 -783441 -931038
384 -931038 -1154618 -1179143 -1043446 -1170865 -916597 -774502 -579288 -679061 -617055 -678892 -716989
373 -716989 -720411 -981750 -814865 -744407 -569940 -573862 -982460 -894846 -781445 -900624 -1151060
362 -1151060 -954988 -890468 -831897 -973351 -1048301 -774538 -1044660 -1166845 -1205467 -1013165
352 -1013165 -947975 -731760 -730009 -761402 -667235 -783816 -748857 -672068 -633428 -649320 -669585
341 -669585 -639454 -667792 -789103 -569875 -481612 -533247 -914054 -853130 -880233 -820543 -880698
330 -880698 -865918 -797518 -516569 -276109 -724237 -843392 -867987 -932444 -679137 -483628 -600671
319 -600671 -816915 -597550 -646391 -459289 -654008 -925758 -930327 -1014338 -843630 -649131 -764756
308 -764756 -903124 -701547 -779215 -905642 -819576 -752614 -810608 -607464 -648665 -417314 -428244
297 -428244 -574333 -817290 -869512 -700397 -744523 -651556 -989694 -1036776 -1065813 -1086041 -987051
286 -987051 -816912 -890257 -989127 -1168255 -1148446 -894916 -691904 -660227 -672517 -723284 -781598
275 -781598 -907479 -981699 -618635 -759425 -527012 -651659 -811964 -909802 -724785 -665644
265 -665644 -963977 -757126 -676514 -711227 -618297 -808050 -1104373 -835107 -682554 -597283 -701289
254 -701289 -850561 -869616 -824894 -761631 -694841 -707543 -751402 -730301 -564303 -881051 -856880
243 -856880 -462793 -578498 -597834 -728372 -922017 -994025 -1006745 -1241581 -875132 -685279
233 -685279 -769258 -910899 -987454 -894851 -776839 -740109 -849633 -749290 -712883 -856960 -878331
222 -878331 -899662 -1057399 -1198668 -898775 -732685 -547742 -656772 -671732 -511522 -700617
212 -700617 -763704 -842722 -827972 -818255 -853630 -891407 -843186 -615597 -490628 -658882 -734555
201 -734555 -455158 -234741 -527255 -654328 -603185 -347038 -377061 -612392 -676793 -635746 -817613
190 -817613 -1028840 -1038587 -786573 -577256 -621736 -604686 -797905 -806151 -803142 -842980 -780020 -727101
178 -727101 -696049 -607419 -548143 -624950 -729916 -905054 -1015057 -978368 -956372 -957892 -730345
167 -730345 -653922 -784515 -828467 -726424 -646712 -648476 -620223 -554505 -813117 -796189 -831964
156 -831964 -1022466 -836778 -634839 -826056 -666959 -476625 -683531 -983313 -848735 -759214
146 -759214 -947403 -855032 -745188 -385275 -485501 -669284 -716130 -558970 -663055 -741693
136 -741693 -843525 -774512 -655450 -566013 -666672 -713304 -738645 -713691 -755944 -771050 -589417
125 -589417 -732936 -764265 -863344 -814622 -597900 -705242 -662094 -739971 -1034108 -852744 -903257
114 -903257 -932075 -949138 -701128 -601206 -914758 -897552 -846552 -759143 -652310 -540617 -472612
103 -472612 -622386 -565221 -894905 -911405 -744171 -727509 -910835 -1081366 -1038293 -977450 -1050830
92 -1050830 -988982 -896471 -973437 -1005137 -796926 -646416 -828613 -709805 -604467 -818963 -969235
81 -969235 -859652 -739036 -713093 -835526 -741290 -585170 -730333 -656971 -554894 -417178 -602322
70 -602322 -750465 -597767 -549599 -692087 -831695 -1025762 -938761 -965629 -1102225 -751205 -552885
59 -552885 -746562 -844877 -854607 -769966 -808056 -804372 -716586 -847346 -817893 -722580 -707317 -1119178
47 -1119178 -967123 -843020 -769055 -634477 -659563 -880049 -904416 -767688 -602844 -635392 -697188
36 -697188 -768533 -816543 -875924 -713746 -695907 -754591 -801568 -924191 -913852 -803791 -920334
25 -920334 -941413 -931074 -982539 -845557 -882916 -1002393 -1076592 -865663 -823140 -1034857 -996236
14 -996236 -752653 -848756 -839356 -790392 -834155 -684541 -851455 -926104 -898883 -916769 -854889 -780701
2 -780701 -863109 -876561
0 -876561
$$ Imaginary data points
##PAGE= N=2
##DATA TABLE= (X++(I..I)), XYDATA
16383 -2617277 -2616248 -2679205 -2589760 -2646231 -2383474 -2250882 -2369350 -2280882 -2088760 -1963927
16373 -1963927 -1916514 -1925161 -1952771 -1825699 -1773352 -1862466 -1808284 -1857786 -1600622 -1638818 -1653439
16362 -1653439 -1563582 -1655646 -1441343 -1344011 -1376765 -1308477 -1312968 -1260732 -1015544 -1106385 -1103980
16351 -1103980 -1047198 -1098639 -1151995 -1190706 -886848 -803790 -822131 -832172 -887965 -730171 -757929
16340 -757929 -730532 -719388 -541607 -556159 -717913 -506451 -393132 -348893 -279272 -248093 -244733
16329 -244733 -164245 -328229 -128283 105242 199480 83860 28709 45149 140398 218253 288368
16318 288368 352523 392431 464618 362235 529243 655882 608205 375404 418541 571351
16308 571351 521100 561232 652580 721401 814015 822001 1023750 987720 1033835 1001091 854311
16297 854311 874808 954634 901286 1168487 1207547 1421687 1247596 1141187 1306123 1200369
16287 1200369 1381384 1519026 1531515 1496618 1666586 1622530 1701042 1707597 1577367 1723906
16277 1723906 1768541 1766289 1808408 1855009 1971472 2087915 1814391 1714937 1998068 2096521 2190401
16266 2190401 2167250 2176906 2255768 2299816 2252398 2266601 2280650 2216138 2267256 2445501 2459845
16255 2459845 2456211 2619704 2483728 2346731 2223915 2344606 2531306 2405412 2458713 2693492
16245 2693492 2615670 2505274 2661979 2552911 2592009 2726022 2688752 3024107 2894442 3054524
16235 3054524 3323430 3281864 3057385 3009818 3125453 3148754 2861518 2876037 2975783 2895729
16225 2895729 2860679 2620841 2798105 2889799 2887214 2992387 3274583 3232488 3214774 3118304 3460961
16214 3460961 3442931 3351806 3509340 3501881 3633876 3408005 3260546 3313474 3349461 3313198 3194702
16203 3194702 3259892 3613948 3700106 3582422 3330030 3551367 3663170 3828763 4099997 3559628
16193 3559628 3539088 3435290 3512105 3768436 4183590 4151446 3950410 3770788 3702546 3623035
16183 3623035 3647702 3797625 4000023 3998151 4016734 3805671 3849497 3876900 3940946 4078032 3958514
16172 3958514 4121807 4066336 3933497 3830338 3707372 3615603 3845656 3862123 3955370 3715257
16162 3715257 3776388 3977707 4126327 3937114 3769829 3971908 3986152 3981723 3953541 3824530
16152 3824530 3839799 4168958 4123875 4191273 4092713 4124659 4134365 4168368 4217535 4073493 4073734
16141 4073734 4224160 4322957 4407185 4620792 3971502 3908526 4047585 4274965 4419611 4285490
16131 4285490 4387325 4465667 4518582 4415420 4389354 4266687 4074184 4065602 3938332 4209289
$$ [...]
##END NTUPLES=NMR SPECTRUM
##END=
