##TITLE=1H_DE-80H_X3
 200.13MHz, d2o
 8 sc
 
 19ns.26.2.2025
##JCAMPDX= 6.0         $$ Bruker NMR JCAMP-DX V2.0
##DATA TYPE= NMR SPECTRUM
##DATA CLASS= NTUPLES
##ORIGIN= UXNMR, Bruker Analytische Messtechnik GmbH
##OWNER= pz
$$ XWIN-NMR		Version 3.5
$$ Fri Mar  6 10:16:07 2026 Russian Standard Time (UT+4h)  Yarkov@DPX200
##.OBSERVE FREQUENCY= 200.1313
##.OBSERVE NUCLEUS= ^1H
##.ACQUISITION MODE= SIMULTANEOUS
##.ACQUISITION SCHEME= undefined
##.AVERAGES= 8
##.DIGITISER RES= 18
##SPECTROMETER/DATA SYSTEM= spect
##.PULSE SEQUENCE= zg30
##.SOLVENT NAME= CDCl3
##.SHIFT REFERENCE= (INTERNAL, CDCl3, 0, 15.4395)
##AUDIT TRAIL= $$ (NUMBER, WHEN, WHO, WHERE, WHAT)
$$ ##TITLE= Audit trail, XWIN-NMR		Version 3.5
$$ ##JCAMPDX= 5.01
$$ ##ORIGIN= Bruker BioSpin GmbH
$$ ##OWNER= Yarkov
$$ C:/Bruker/XWIN-NMR/data/yarkov2/nmr/H-C/1/pdata/1/auditp.txt
$$ ##AUDIT TRAIL=  $$ (NUMBER, WHEN, WHO, WHERE, WHAT)
(   1,<2026-03-06 10:15:18.89 +0400>,<Yarkov>,<DPX200>,
      <created by zg, POWCHK disabled, PULCHK disabled
       configuration hash MD5:
       00 E9 B6 7A A2 85 ED C7 34 08 36 98 17 FE 4E 26
       data hash MD5: 16K
       DD B5 CC 69 1C 74 CA 06 38 D8 10 C4 96 8A FE B1>)
(   2,<2026-03-06 10:15:26.89 +0400>,<Yarkov>,<DPX200>,
      <Start of raw data processing
       efp BC_mod = 2 LB = 0.25 FT_mod = 6 PKNL = 1 PHC0 = -5299.148 PHC1 = 6.821927 SI = 16K 
       data hash MD5: 16K
       E9 F0 AF 61 3E AD F1 5C 30 51 3A 44 2B 2A 2E DA>)
$$ ##END=
$$ 
$$ hash MD5
$$ 6E A1 9C 59 67 54 23 EE 8B AE 98 86 BB 83 99 93
##$RELAX= 
##$RELAX= 
##$RELAX= 
##$RELAX= 
##$RELAX= 
##$RELAX= 
$$ Bruker specific parameters
$$ --------------------------
##$DU= <C:/Bruker/XWIN-NMR>
##$EXPNO= 1
##$NAME= <H-C>
##$PROCNO= 1
##$TYPE= <nmr>
##$USER= <yarkov2>
##$AMP= (0..31)
100 100 100 100 100 100 100 100 100 100 100 100 100 100 100 100 100 100 
100 100 100 100 100 100 100 100 100 100 100 100 100 100 
##$AQSEQ= 0
##$AQ_mod= 1
##$AUNM= <au_zg>
##$AUTOPOS= <>
##$BF1= 200.13
##$BF2= 200.13
##$BF3= 200.13
##$BF4= 200.13
##$BF5= 200.13
##$BF6= 200.13
##$BF7= 200.13
##$BF8= 200.13
##$BYTORDA= 1
##$CFDGTYP= 0
##$CFRGTYP= 5
##$CHEMSTR= <none>
##$CNST= (0..31)
1 1 145 1 1 1 1 1 1 1 1 1 1 1 1 1 1 1 1 1 1 1 1 1 1 1 1 1 1 1 1 1 
##$CPDPRG= <>
##$CPDPRG1= <>
##$CPDPRG2= <>
##$CPDPRG3= <>
##$CPDPRG4= <mlev>
##$CPDPRG5= <mlev>
##$CPDPRG6= <mlev>
##$CPDPRG7= <mlev>
##$CPDPRG8= <mlev>
##$CPDPRGB= <>
##$CPDPRGT= <>
##$D= (0..31)
0 0.7 0 0 0 0 0 0 0 0 0 0.03 0 0 0 0 0 0 0 0 0 0 0 0 0 0 0 0 0 0 0 0 
##$DATE= 1772777718
##$DBL= (0..7)
120 120 120 120 120 120 120 120 
##$DBP= (0..7)
150 150 150 150 150 150 150 150 
##$DBP07= 0
##$DBPNAM0= <>
##$DBPNAM1= <>
##$DBPNAM2= <>
##$DBPNAM3= <>
##$DBPNAM4= <>
##$DBPNAM5= <>
##$DBPNAM6= <>
##$DBPNAM7= <>
##$DBPOAL= (0..7)
0.5 0.5 0.5 0.5 0.5 0.5 0.5 0.5 
##$DBPOFFS= (0..7)
0 0 0 0 0 0 0 0 
##$DE= 6
##$DECBNUC= <off>
##$DECIM= 32
##$DECNUC= <off>
##$DECSTAT= 4
##$DIGMOD= 1
##$DIGTYP= 9
##$DL= (0..7)
0 120 120 120 120 120 120 120 
##$DP= (0..7)
$$ [...]
##$SUBNAM2= <"">
##$SUBNAM3= <"">
##$SUBNAM4= <"">
##$SUBNAM5= <"">
##$SUBNAM6= <"">
##$SUBNAM7= <"">
##$SUBNAM8= <"">
##$SUBNAM9= <"">
##$SW= 18.0517328524113
##$SWIBOX= (0..15)
0 0 2 0 0 0 0 0 0 0 0 0 0 0 0 0 
##$SW_h= 3612.71676300578
##$TD= 16384
##$TD0= 1
##$TE= 0
##$TE2= 300
##$TE3= 300
##$TEG= 300
##$TL= (0..7)
0 120 120 120 120 120 120 120 
##$TP= (0..7)
150 150 150 150 150 150 150 150 
##$TP07= 0
##$TPNAME0= <>
##$TPNAME1= <>
##$TPNAME2= <>
##$TPNAME3= <>
##$TPNAME4= <>
##$TPNAME5= <>
##$TPNAME6= <>
##$TPNAME7= <>
##$TPOAL= (0..7)
0.5 0.5 0.5 0.5 0.5 0.5 0.5 0.5 
##$TPOFFS= (0..7)
0 0 0 0 0 0 0 0 
##$TUNHIN= 0
##$TUNHOUT= 0
##$TUNXOUT= 0
##$USERA1= <user>
##$USERA2= <user>
##$USERA3= <user>
##$USERA4= <user>
##$USERA5= <user>
##$V9= 5
##$VALIST= <valist>
##$VCLIST= <CCCCCCCCCCCCCCC>
##$VD= 0
##$VDLIST= <DDDDDDDDDDDDDDD>
##$VPLIST= <PPPPPPPPPPPPPPP>
##$VTLIST= <TTTTTTTTTTTTTTT>
##$WBST= 1024
##$WBSW= 4
##$XGAIN= (0..3)
0 0 0 0 
##$XL= 0
##$YL= 0
##$YMAX_a= 226065
##$YMIN_a= -186495
##$ZGOPTNS= <>
##$ZL1= 120
##$ZL2= 120
##$ZL3= 120
##$ZL4= 120
##$ABSF1= 0
##$ABSF2= 0
##$ABSG= 0
##$ABSL= 0
##$ALPHA= 0
##$AQORDER= 0
##$ASSFAC= 0
##$ASSFACI= 0
##$ASSFACX= 0
##$ASSWID= 0
##$AUNMP= <proc_1d>
##$AZFE= 0.1
##$AZFW= 0.1
##$BCFW= 0
##$BC_mod= 2
##$BYTORDP= 0
##$COROFFS= 0
##$CY= -3
##$DATMOD= 1
##$DC= 0
##$DFILT= <>
##$DTYPP= 0
##$F1P= 0
##$F2P= 0
##$FCOR= 1
##$FTSIZE= 16384
##$FT_mod= 6
##$GAMMA= 0
##$GB= 0
##$INTBC= 1
##$INTSCL= 3.241238e-09
##$ISEN= 128
##$LB= 0.25
##$LEV0= 0
##$LPBIN= 0
##$MAXI= 10000
##$MC2= 0
##$MEAN= 0
##$ME_mod= 0
##$MI= 1.114404
##$NCOEF= 0
##$NC_proc= -8
##$NLEV= 6
##$NOISF1= 3.799351
##$NOISF2= 2.8
##$NSP= 0
##$NTH_PI= 0
##$NZP= 0
##$OFFSET= 15.43949
##$PC= 1
##$PHC0= -5299.148
##$PHC1= 6.821927
##$PH_mod= 1
##$PKNL= yes
##$PPARMOD= 0
##$PSCAL= 0
##$PSIGN= 0
##$REVERSE= no
##$SF= 200.130016452656
##$SI= 16384
##$SIGF1= 3
##$SIGF2= 2
##$SINO= 0.751879
##$SIOLD= 32768
##$SREGLST= <19F.Aceton>
##$SSB= 0
##$STSI= 16384
##$STSR= 0
##$SW_p= 3612.71676300578
##$SYMM= 0
##$S_DEV= 0
##$TDeff= 16384
##$TDoff= 0
##$TI= <>
##$TILT= no
##$TM1= 0
##$TM2= 0
##$TOPLEV= 0
##$USERP1= <user>
##$USERP2= <user>
##$USERP3= <user>
##$USERP4= <user>
##$USERP5= <user>
##$WDW= 1
##$XDIM= 16384
##$YMAX_p= 508004413
##$YMIN_p= -1721173
$$ End of Bruker specific parameters
$$ ---------------------------------
##NTUPLES= NMR SPECTRUM
##VAR_NAME=  FREQUENCY,     SPECTRUM/REAL,   SPECTRUM/IMAG
##SYMBOL=    X,             R,               I
##VAR_TYPE=  INDEPENDENT,   DEPENDENT,       DEPENDENT
##VAR_FORM=  AFFN,          ASDF,            ASDF
##VAR_DIM=   16384,         16384,           16384
##UNITS=     HZ,            ARBITRARY UNITS, ARBITRARY UNITS
##FACTOR=    0.220516191357247, 1,           1
##FIRST=     3089.90545142167, 0,            0
##LAST=      -522.81131158411, 0,            0
##MIN=       -522.81131158411, -1721173,     0
##MAX=       3089.90545142167, 508004413,    0
$$ Real data points
##PAGE= N=1
##DATA TABLE= (X++(R..R)), XYDATA
$$ [...]
$$ plain form
7645 -16551 -44574 -486952 -414950 111357 341581 351401 314969 345646 432532 -75628 -283192
7634 -283192 -92626 -82356 165659 75513 62131 -81552 -219822 -81487 -42253 22638 -47056
7623 -47056 67679 358668 105057 7993 23126 12537 -12248 -165104 -92598 -38588 335050
7612 335050 264022 -28580 -20602 51802 -137956 -210497 -31949 258304 -13161 -7851 72407
7601 72407 -6684 -290275 -101062 -50702 -136893 -82915 -129072 -206129 129973 69548 -6783
7590 -6783 202746 -108221 129977 70019 -32457 317 -141465 -193491 -108673 -206805 -230453
7579 -230453 160825 71691 105833 110424 -179190 209051 440714 234166 108635 347901
7569 347901 158523 170700 196435 218613 107680 -4565 -148451 -87999 59140 100738 -142155
$$ packed form
7645a6551k8023m42378P2002N26307K30224R820l6432L0677Q6886n08160k07564
7634b83192J90566J0270K48015r0146j3382j43683j38270J38335L9234O4891o9694
7623d7056J14735K90989k53611r7064J5133j0589k4785j52856P2506N4010L73638
7612C35050p1028k92602P978P2404j89758p2541J78548K90253k71465N310Q0258
7601G2407p9091k83591J89213N0360q6191N3978m6157p7057L36102o0425p6331
7590f783K09529l10967K38198n9958j02476L2774j41782n2026Q4818r8132k3648
7579b30453L91278q9134L4142M591k89614L88241K31663k06548j25531K39266
7569C47901j89378J2177K5735K2178j10933j12245j43886O0452J47139M1598k42893
$$ plain form
7558 -142155 62033 75006 -66780 -15608 166934 -77846 -234912 -340495 -242837 -205636
7548 -205636 -216350 -107181 -89829 -2376 -67323 -291652 -123078 33179 15745 248784 85266
7537 85266 4480 257842 202497 -8900 82306 268410 327997 279084 -238049 -397390 -69365
7526 -69365 -341217 -139591 -24291 200294 103422 12523 -2871 -98565 -399932 -304140 -151570
7515 -151570 17587 31255 -182550 -93058 57784 -124265 131240 -15290 242184 304306
7505 304306 -133785 114922 232175 303775 252907 162020 284421 379430 259814 81796
7495 81796 -28565 -16909 112684 -53214 -135321 -130138 24943 67682 -243416 -182837 -77437
7484 -77437 -108953 -377718 -296961 -348711 -194336 124970 12258 -155870 -202111 -262544 -165911
$$ packed form
7558a42155K04188J2973j41786N1172J82542k44780j57066j05583R7658L7201
7548b05636j0714J09169J7352Q7453o4947k24329J68574J56257j7434K33039j63518
7537H5266q0786K53362n5345k11397R1206J86104N9587m8913n17133j59341L28025
7526f9365k71852K01626J15300K24585r6872r0899j5394r5694l01367R5792J52570
7515a51570J69157J3668k13805Q9492J50842j82049K55505j46530K57474O2122
7505C04306m38091K48707J17253P1600n0868r0887J22401R5009j19616j78018
7495H1796j10361J1656J29593j65898q2107N183J55081M2739l11098O0579J05400
7484g7437l1516k68765Q0757n1750J54375L19306j12712j68128m6241o0433R6633
$$ plain form
7473 -165911 -69123 -254474 -58150 -133805 -148134 -151302 30431 -172152 -169159 6092 35753
7462 35753 -71485 -100830 -221150 -202582 -87518 -211817 -288020 -43382 177763 65398
7452 65398 40566 15583 17838 125446 330347 156265 282653 172594 106037 -38234 29594
7441 29594 -194540 -269678 -204307 -279603 -110172 57264 -66454 -47867 -61157 53127 49991
7430 49991 77399 -68235 43809 38909 24890 -30134 8699 22480 3162 6234 162139 181997
7418 181997 -146925 -232120 -293683 -243847 -101202 7711 -102644 -189539 -250348 -31563 -24931
7407 -24931 -221290 28340 104637 97704 -106164 -319991 -402531 -249492 -79975 -83666 -147467
7396 -147467 -166690 -176545 -82625 149494 -167434 -304477 -246501 -119296 -49370 -238847 -353013
$$ packed form
7473a65911R6788j85351J96324p5655j4329l168J81733k02583K993J75251K9661
7462C5753j07238k9345j20320J8568J15064j24299p6203K44638K21145j12365
7452F5398k4832k4983K255J07608K04901j74082J26388j10059o6557j44271O7828
7441B9594k24134p5138O5371p5296J69431J67436j23718J8587j3290J14284l136
7430D9991K7408j45634J12044m900j4019n5024L8833J3781j9318L072J55905J9858
7418A81997l28922q5195o1563M9836J42645J08913j10355q6895o0809K18785O632
7407b4931j96359K49630P6297o933k03868k13827q2540J53039J69517l691o3801
7396a47467j9223r855R3920K32119l16928j37043N7976J27205O9926j89477j14166
$$ plain form
7385 -353013 -203505 -258950 -97516 97188 -145593 -248924 -307739 -350510 -200914 -311229
7375 -311229 -261540 -311551 -49572 -55623 -77958 -90485 13559 147321 52519 -43578 212707
7364 212707 176683 18121 -240007 -499246 -346312 -85637 90015 124131 97998 17746
7354 17746 147488 285965 166521 -152579 -199084 -183578 -164618 4342 289802 137888
7344 137888 41695 295941 160009 49114 57846 1386 -83720 -180907 -324781 -302600 -143086
7333 -143086 -58598 -25271 -77538 -97705 -155391 212300 363389 196019 6324 89892 -10682
7322 -10682 132420 78793 -25357 -194284 -171752 45896 282833 209314 114585 -136832 -75264
7311 -75264 34086 -148184 36267 176292 195779 -2582 -78262 112828 -193329 -49677
$$ packed form
7385c53013J49508n5445J61434J94704k42781j03331n8815m2771J49596j10315
7375c11229M9689n0011K61979o051k2335j2527J04044J33762r4802r6097K56285
7364B12707l6024j58562k58128k59239J52934K60675J75652L4116k6133q0252
7354A7746J29742J38477j19444l19100m6505J5506J8960J68960K85460j51914
7344A37888r6193K54246j35932j10895Q732n6460q5106r7187j43874K2181J59514
7333a43086Q4488L3327n2267k0167n7686L67691J51089j67370j89695Q3568j00574
7322a0682J43102n3627j04150j68927K2532K17648K36937p3519r4729k51417O1568
7311g5264J09350j82270J84451J40025J9487j98361p5680J91090l06157J43652
$$ plain form
7301 -49677 102370 -120409 -48201 37528 178949 53456 -12411 100509 258767 -144176
7291 -144176 -103247 15862 169048 -200619 -282076 -96607 -39451 73823 96522 -22490
7281 -22490 93051 242639 56480 -99760 -309033 -21675 -127575 -68563 -205109 -195034
7271 -195034 -8479 -2789 -50260 -60806 144469 -86980 74673 -126620 -127104 -49366 -240490
7260 -240490 -244217 -81038 -91891 -148639 32204 121627 65901 206120 -27326 62937 -147766
7249 -147766 54296 104372 144011 225169 289004 306677 287829 327827 88095 163844 211790
7238 211790 152535 148306 80617 11966 -62954 29233 231731 89734 -2611 -4295 -118607
7227 -118607 -317196 -46573 192181 148695 -30523 27815 98401 203554 217902 -37926
$$ packed form
7301d9677J52047k22779P2208Q5729J41421j25493o5867J12920J58258m02943
7291a44176M0929J19109J53186l69667q1457J85469N7156J13274K2699j19012
7281b2490J15541J49588j86159j56240k09273K87358j05900N9012j36546J0075
7271a95034J86555N690m7471j0546K05275k31449J61653k01293m84P7738j91124
7260b40490l727J63179j0853n6748J80843Q9423n5726J40219k33446R0263k10703
7249a47766K02062N0076L9639Q1158O3835J7673j8848L9998k39732P5749M7946
7238B11790n9255m229o7689o8651p4920R2187K02498j41997r2345j684j14312
7227a18607j98589K70623K38754m3486j79218N8338P0586J05153J4348k55828
$$ plain form
7217 -37926 -154145 38775 -163762 185727 753580 721087 724693 439005 309857 95504
7207 95504 72104 247618 250814 353581 207875 59845 328062 496789 379043 646074
7197 646074 727119 464196 447958 607870 203815 220583 134453 235001 143335 217035 239818
7186 239818 308593 205768 255505 424771 521001 511970 476705 472023 329715 235980 142361
7175 142361 319259 403185 432144 461763 239853 301902 313721 209191 317937 269562 368082
7164 368082 381063 289380 311813 32603 -90542 30191 292782 99039 -42246 164194
7154 164194 243194 252458 188605 105673 281183 305887 176435 104864 319644 255069 117142
7143 117142 18968 -25826 222866 43708 200391 342594 380997 602798 532667 77408
$$ packed form
7217c7926j16219J92920k02537L49489N67853l2493L606k85688j29148k14353
7207I5504k3400J75514L196J02767j45706j48030K68217J68727j17746K67031
7197F46074Q1045k62923j6238J59912m04055J6768q6130J00548r1666P3700K2783
7186B39818O8775j02825M9737J69266R6230r031l5265m682j42308r3735r3619
7175A42361J76898Q3926K8959K9619k21910O2049J1819j04530J08746m8375R8520
7164C68082J2981r1683K2433k79210j23145J20733K62591j93743j41285K06440
7154A64194P9000R264o3853q2932J75510K4704j29452p1571K14780o4575j37927
7143A17142r8174m4794K48692j79158J56683J42203L8403K21801p0131m55259
$$ plain form
7133 77408 -179705 -150124 2776 -100338 -74955 -99092 -73583 27288 201875 16182 25046
7122 25046 123822 -52520 -20477 87184 58489 181963 220468 242996 33549 -71403 227962
7111 227962 463997 68696 158702 353712 336520 350815 588316 340315 227631 328291
7101 328291 371848 391201 330080 477729 542393 339970 281173 266948 234464 317937 348011
7090 348011 434332 481732 548429 804122 673200 442921 419157 531667 546682 584058 750632
7079 750632 813027 710223 650518 417792 456750 488218 191758 307168 329343 560923 294251
7068 294251 253410 458514 402018 386795 448321 287524 227909 42363 11369 295020 444977
7057 444977 284080 146987 626428 409095 71667 212005 414002 512604 491923 339735
$$ packed form
7133G7408k57113K9581J52900j03114K5383k4137K5509J00871J74587j85693Q864
7122B5046R8776j76342L2043J07661k8695J23474L8505K2528k09447j04952K99365
7111B27962K36035l95301R0006J95010j7192J4295K37501k48001j12684J00660
7101C28291M3557J9353o1121J47649O4664k02423n8797j4225l2484Q3473L0074
7090C48011Q6321M7400O6697K55693j30922k30279k3764J12510J5015L7376J66574
7079G50632O2395j02804n9705k32726L8958L1468k96460J15410K2175K31580k66672
7068B94251m0841K05104n6496j5223O1526j60797n9615j85546l0994K83651J49957
7057D44977j60897j37093M79441k17333l37428J40338K01997R8602k0681j52188
$$ plain form
7047 339735 317254 292865 210204 137141 61133 83593 39462 123593 64929 176537 390690
7036 390690 667244 519747 317394 136096 85930 125431 170600 5162 -118934 73607
7026 73607 170735 220773 509285 443337 329135 339083 355151 312211 142427 92410 231044
7015 231044 209267 149444 136689 338638 492438 290642 322137 338998 302966 207947 -52278
7004 -52278 236089 575405 389393 417661 663665 594617 493812 520557 475706 324704 54726
6993 54726 208178 371830 -422446 -410342 3998 39196 77299 288000 343578 -44697 85260
6982 85260 216985 217409 333570 137621 184494 50841 28118 118429 88987 194097 -17787
6971 -17787 -82392 178444 159567 258418 32215 -174017 -95483 95615 179722 178767 276009
$$ packed form
7047C39735k2481k4389q2661p3063p6008K2460m4131Q4131n8664J11608K14153
7036C90690K76554j47497k02353j81298n0166L9501M5169j65438j24096J92541
7026G3607R7128N0038K88512o5948j14202R948J6068m2940j69784n0017J38634
7015B31044k1777n9823j2755K01949J53800k01796L1495J6861l6032r5019k60225
7004e2278K88367L39316j86012K8268K46004o9048j00805K6745m4851j51002k69978
6993E4726J53452J63652p94276J2104M14340L5198L8103K10701N5578l88275J29957
6982H5260J31725M24J16161j95949M6873j33653k2723R0311k9442J05110k11884
6971a7787o4605K60836j8877R8851k26203k06232P8534J91098Q4107r55R7242
$$ plain form
6960 276009 -942 -35098 -291054 -200368 57951 400339 403641 320408 -38882 77087 258800
6949 258800 308104 170206 362246 338929 243624 53322 75996 18755 165356 333718 -38774
6938 -38774 194015 42979 -68007 164953 21555 247894 299446 197517 137416 173311
6928 173311 378116 171520 -68310 -115959 -154898 -122883 72990 -199827 -167447 -61765
6918 -61765 14109 -168388 -45857 72388 106636 413255 197229 148251 363840 169384
6908 169384 -67351 -12750 276560 319483 -81510 -353908 -98341 204901 138662 -209101
6898 -209101 129632 442610 594495 400220 274358 326241 261379 129977 198087 301943
6888 301943 368746 580614 342715 -22094 -262878 -367509 -27721 288177 150595 41749
$$ packed form
6960B76009k76951l4156k55956R0686K58319L42388L302q3233l59290J15969J81713
6949B58800M9304j37898J92040k3317r5305j90302K2674n7241J46601J68362l72492
6938c8774K32789j51036j10986K32960j43398K26339N1552j01929o0101L5895
6928A73311K04805k06596k39830m7649l8939L2015J95873k72817L2380J05682
6918f1765P5874j82497J22531J18245L4248L06619k16026m8978K15589j94456
6908A69384k36735N4601K89310M2923m00993k72398K55567L03242o6239l47763
6898b09101L38733L12978J51885j94275j25862N1883o4862j31402O8110J03856
6888C01943O6803K11868k37899l64809k40784j04631L39788L15898j37582j08846
$$ plain form
6878 41749 -134762 -141824 -253570 -176236 -16250 18315 -69414 28501 95711 59438 309533
6867 309533 308367 451418 428316 283180 -103214 -53080 138307 117371 -115679 -229973 68415
6856 68415 163525 111249 16049 277512 279127 325401 221026 -58394 339304 428750 261175
6845 261175 80982 70429 61652 32832 136909 151515 76303 46550 -78189 -180545 136551
6834 136551 136409 -58768 286217 278330 169822 242261 223014 146202 39689 202304 28328
6823 28328 309354 304326 123960 -4526 -52652 -156390 163726 529509 471789 127256 3616
6812 3616 187997 254927 283368 299738 85997 81436 -168444 -143437 34511 -200767 -90270
6801 -90270 312045 181796 184473 317930 399314 254801 57287 138418 13132 347025 380092
$$ packed form
6878D1749j76511p062j11746P7334J59986L4565q7729R7915O7210l6273K50095
6867C09533j166J43051k3102j45136l86394N0134J91387k0936k33050j14294K98388
6856F8415R5110n2276r5200K61463J615M6274j04375k79420L97698Q9446j67575
6845B61175j80193j0553q777k8820J04077J4606p5212k9753j24739j02356L17096
6834A36551j42j95177L44985p887j08508P2439j9247p6812j06513J62615j73976
6823B8328K81026n028j80366j28486m8126j03738L20116L65783n7720l44533j23640
6812C616J84381O6930K8441J6370k13741m561k49880K5007J77948k35278J10497
6801i0270M02315j30249K677J33457Q1384j44513j97514Q1131j25286L33893L3067
$$ plain form
6790 380092 264316 -23247 84178 257750 234742 343109 456190 483865 354916 355914 209941
6779 209941 97984 357793 156333 -6017 341159 508068 379963 324058 454746 564102
6769 564102 473407 601090 650574 290416 100416 131018 207890 124376 -68050 -159517 77218
6758 77218 93505 26686 -10316 11449 227883 513756 387905 158310 131654 220569 407710
6747 407710 361920 294994 347532 353473 487816 357049 185560 345911 371944 234250 144147
6736 144147 191029 325149 555173 546315 463172 112079 223038 437847 368793 212021 425988
6725 425988 467041 190221 296947 342564 158380 157681 176190 39007 110967 355546 293806
6714 293806 532001 567630 611392 311198 27284 94086 91130 143424 372313 360132 213309
$$ packed form
6790C80092j15776k87563J07425J73572k3008J08367J13081K7675j28949R98j45973
6779B09941j11957K59809k01460j62350L47176J66909j28105n5905J30688J09356
6769E64102r0695J27683M9484l60158j90000L0602P6872q3514j92426r1467K36735
6758G7218J6287o6819l7002K1765K16434K85873j25851k29595k6656Q8915J87141
6747D07710m5790o6926N2538N941J34343j30767j71489J60351K6033j37694r0103
6736A44147M6882J34120K30024q858q3143l51093J10959K14809o9054j56772K13967
6725D25988M1053k76820J06726M5617j84184o99J8509j37183P1960K44579o1740
6714B93806K38195L5629M3762l00194k83914O6802k956N2294K28889j2181j46823
$$ plain form
6703 213309 221599 238584 264806 486950 628264 554936 624031 594949 332501 134773 453287
6692 453287 377513 225345 304982 114292 94270 387237 214361 -6856 4556 354591
6682 354591 529228 622529 526554 247843 91243 38084 127613 286241 425827 346829 314721
6671 314721 326661 81917 57691 652034 476790 178901 180557 -81633 13785 304006 274822
6660 274822 342361 519640 530629 412992 106343 -19220 -9891 54608 46159 188420 554626
6649 554626 484070 648054 651472 469919 410247 560462 464108 478611 640780 544390 647900
6638 647900 681440 508504 426641 669276 456214 424264 603157 564914 402517 475311 429569
6627 429569 687039 780732 915345 902554 953581 892890 736781 477289 495425 707680 926587
$$ packed form
6703B13309Q290J6985K6222K22144J41314p3328O9095k9082k62448j97728L18514
6692D53287p5774j52168P9637j90690k0022K92967j72876k21217J1412L50035
6682C54591J74637R3301r5975k78711j56600n3159Q9529J58628J39586p8998l2108
6671C14721J1940k44744k4226N94343j75244k97889J656k62190R5418K90221k9184
6660B74822O7539J77279J0989j17637l06649j25563R329O4499q449J42261L66206
6649E54626p0556J63984L418j81553n9672J50215r6354J4503J62169r6390J03510
6638F47900L3540j72936q1863K42635k13062l1950J78893l8243j62397P2794m5742
6627D29569K57470R3693J34613j2791N1027o0691j56109k59492J8136K12255K18907
$$ plain form
6616 926587 834346 902134 1013917 717071 629684 613419 625296 852728 1095954 1170301 996790
6605 996790 969151 704175 713797 741201 463372 614841 931102 930852 637514 583757 532071
6594 532071 528994 587325 487434 443745 448792 420091 518050 275176 485810 662035 613060
6583 613060 483063 391907 560383 974863 889365 887922 958197 944415 833254 908311 743515
6572 743515 657099 1068060 1057056 961019 887799 850070 909707 821834 856037 928063 901643
6561 901643 959439 1026540 982436 1078953 1285661 1177620 1342905 1503609 1443714 1536303 1821342
6550 1821342 1526006 1392016 1215600 1053273 1071191 991546 1454263 1441927 1213438 1317214
6540 1317214 1467660 1500987 1891963 1939845 1843316 1779172 1628772 1466513 1394754 1332986 1121050
$$ packed form
6616I26587r2241O7788J11783k96846q7387j6265J1877K27432K43226P4347j73511
6605I96790k7639k64976R622K7404k77829J51469L16261k50k93338n3757n1686
6594E32071l077N8331r9891m3689N047k8701R7959k42874K10634J76225m8975
6583F13060j29997r1156J68476M14480q5498j443P0275j3782j11161P5057j64796
6572G43515q6416M10961j1004r6037p3220l7729N9637q7873L4203P2026k6420
6561I01643N7796O7101m4104R6517K06708j08041J65285J60704n9895R2589K85039
6550A821342k95336j33990j76416j62327J7918p9645M62717j2336k28489J03776
6540A317214J50446L3327L90976M7882r6529o4144j50400j62259p1759o1768k11936
$$ plain form
6529 1121050 1248284 1011033 987114 1092606 954506 1002746 1186121 1144907 951284 964911
6519 964911 827211 899203 947095 1044627 949609 941789 803945 1052809 1356125 1402880 1419653
6508 1419653 1159144 1142474 1110255 1232828 1212462 1466262 1553412 1376359 1385240 1325287 1668708
6497 1668708 1869954 1545038 1519501 1513172 1326783 1184574 1394025 1303690 1346144 1495612
6487 1495612 1373463 1613559 1567240 1359682 1453352 1488043 1461117 1367418 1270688 1029259 1119261
6476 1119261 1290227 1077656 1090340 1146474 1338715 1309637 1342666 1278911 1355194 1391490 1242428
6465 1242428 890260 910684 947913 1000901 1175898 1317967 1474925 1360950 1465635 1339518
6455 1339518 1187104 1249456 1082723 1004817 1102525 1203922 1373176 1324064 1146435 1325611
$$ packed form
6529A121050J27234k37251k3919J05492j38100M8240J83375m1214j93623J3627
6519I64911j37700P1992M7892R7532r5018p820j37844K48864L03316M6755J6773
6508A419653k60509j6670l2219J22573k0366K53800Q7150j77053Q881n9953L43421
6497A668708K01246l24916k5537o329j86389j42209K09451r0335M2454J49468
6487A495612j22149K40096m6319k07558R3670L4691k6926r3699r6730k41429R0002
6476A119261J70966k12571J2684N6134J92241k9078L3029o3755P6283L6296j49062
6465A242428l52168K0424L7229N2988J74997J42069J56958j13975J04685j26117
6455A339518j52414O2352j66733p7906R7708J01397J69254m9112j77629J79176
$$ plain form
6445 1325611 1313759 1057954 1138516 1387116 1551928 1599741 1241114 1143714 1412256 1566081
6435 1566081 1638999 1546096 1484739 1286987 1294203 1347736 1492793 1605539 1453632 1613870 1703643
6424 1703643 1684467 1727245 1703876 1546110 1605788 1902804 1750597 1641656 1839548 1999279
6414 1999279 1988411 1986063 1769543 2004296 1772212 1544502 1312901 1821120 2035800 2073174
6404 2073174 2137840 2133755 2138401 2348391 2646263 2693655 3030417 3328107 3055062 2845923 2937498
6393 2937498 3024690 2721534 2714181 2742645 2391176 2557142 2915403 2778207 2464387 2677209
6383 2677209 2699698 3104342 3122925 3042939 3138820 3528720 3748259 3839278 3891383 3821005 3936806
6372 3936806 4025072 3563463 3672336 3632522 3861338 4008804 3966146 3906993 4004308 4213516
$$ packed form
6445A325611j1852k55805Q0562K48600J64812M7813l58627r7400K68542J53825
6435A566081P2918r2903o1357j97752P216N3533J45057J12746j51907J60238Q9773
6424A703643j9176M2778k3369j57766N9678K97016j52207j08941J97892J59731
6414A999279j0868k348k16520K34753k32084k27710k31601N08219K14680L7374
6404B073174O4666m085M646K09990K97872M7392L36762K97690k73045k09139R1575
6393B937498Q7192l03156p353K8464l51469J65966L58261j37196l13820K12822
6383B677209K2489M04644J8583p9986R5881L89900K19539R1019N2105p0378J15801
6372C936806Q8266m61609J08873l9814K28816J47466m2658n9153R7315K09208
$$ plain form
6362 4213516 3929264 3981563 4079725 4164542 4266285 4207381 4228482 4420504 4618716 4787977
6352 4787977 4895061 4949128 5040129 5290202 5442281 5514807 5621198 5885993 6042924 6345835
6342 6345835 6623487 6945648 7166414 7327423 7551070 7765287 8074246 8475100 8948962 9457671
6332 9457671 9834842 10506316 11052466 11751873 12544752 13702241 15244828 16719623 18545851
6323 18545851 20572543 22723157 25523098 29833422 36607119 47188313 62546233 80317797
6315 80317797 96265957 105295426 104517402 96151112 83583265 70861025 60264571 52592608
6307 52592608 47864219 45571407 46601663 52322839 63249792 79192679 95760266 107520679
6299 107520679 110210123 103192997 89397423 73515492 59125995 47642517 38813415
$$ packed form
6362D213516k84252N2299R8162Q4817J01743n8904K1101J92022J98212J69261
6352D787977J07084N4067R1001K50073J52079P2526J06391K64795J56931L02911
6342F345835K77652L22161K20766J61009K23647K14217L08959M00854M73862N08709
6332I457671L77171O71474N46150O99407P92879J157489J542587J474795J826228
6323A8545851K026692K150614K799941M310324O773697J0581194J5357920J7771564
6315H0317797J5948160R029469p78024q366290j2567847j2722240j0596454p671963
6307E2592608m728389k292812J030256N721176J0926953J5942887J6567587J1760413
6299A07520679K689444p017126j3795574j5881931j4389497j1483478q829102
$$ plain form
6292 38813415 31969447 27033582 23652249 20757163 18354837 17003601 15628259 14693359
6284 14693359 14181837 13889020 13360477 12905480 12672613 12732827 12749711 12606927 12431946 12256718
6274 12256718 12500614 12496217 12509526 12982661 13105075 13533078 14131165 14126194 14452560 15084831
6264 15084831 15773525 16246219 16933190 17805532 18491398 19411292 20661713 22266628 23914308
6255 23914308 25887471 28425926 31420418 34745882 38709650 43381381 49840601 60576713
6247 60576713 77996645 104497727 137695160 169989926 191726026 196797580 185459033
6240 185459033 163611106 138583469 116393532 99898225 88986443 82764235 82215073
6233 82215073 89237283 105641199 131452729 161600560 186169865 196382399 188858818
$$ packed form
6292C8813415o843968m935865l381333k895086k402326j351236j375342r34900
6284A4693359n11522k92817n28543m54997k32867O0214J6884j42784j74981j75228
6274A2256718K43896m397J3309M73135J22414M28003N98087m971L26366O32271
6264A5084831O88694M72694O86971Q72342O85866R19894J250421J604915J647680
6255B3914308J973163K538455K994492L325464L963768M671731O459220J0736112
6247F0576713J7419932K6501082L3197433L2294766K1736100N071554j1338547
6240A85459033k1847927k5027637k2189937j6495307j0911782o222208n49162
6233H2215073P022210J6403916K5811530L0147831K4569305J0212534p523581
$$ plain form
6226 188858818 167529659 139818854 112413441 89133174 71171097 57747260 47458454
6219 47458454 39670938 33547838 28941465 25430802 22644447 20351629 18687185 17409401
6211 17409401 16323918 15298520 14367400 13239844 12272560 11909385 11801554 11351672 11140461
6202 11140461 10976133 10744844 10287491 9855212 9674957 9228891 9092986 8907764 8873356 8864020
6192 8864020 8394607 8305015 7869738 7694373 7497366 7134572 7171686 7354884 7230189 6752422
6182 6752422 6613692 6491941 6401135 6220553 6161601 6020907 6225750 6230188 6038563 6083666
6172 6083666 6102652 6028567 5984305 5934116 5743713 5676210 5772254 5752221 5652120 5858755 5502044
6161 5502044 5593676 5706341 5347745 5074327 5379997 5609602 5677589 5785371 5480101 5250740
$$ packed form
6226A88858818k1329159k7710805k7405413k3280267j7962077j3423837j0288806
6219D7458454p787516o123100m606373l510663k786355k292818j664444j277784
6211A7409401j085483j025398r31120j127556r67284l63175j07831m49882k11211
6202A1140461j64328k31289m57353m32279j80255m46066j35905j85222l4408r336
6192H864020m69413q9592m35277j75365j97007l62794L7114J83198j24695m77767
6182F752422j38730j21751r0806j80582n8952j40694K04843M438j91625M5103
6172F083666J8986p4085m4262n0189j90403o7503R6044k0033j00101K06635l56711
6161E502044R1632J12665l58596k73418L05670K29605O7987J07782l05270k29361
$$ plain form
6151 5250740 5197829 5116378 5512397 5628293 5614670 5440251 5511003 5439714 5456384 5759991 5839741
6140 5839741 5925271 6415034 6692746 6541637 6433754 6291280 6200384 6408247 6718392 6840456
6130 6840456 7087003 6922889 6844624 7014945 7265046 7486257 7972052 8133080 8247873 8509190
6120 8509190 8839467 8687405 8876722 9077170 9643812 10009678 10013670 10358144 10735755 11390499
6110 11390499 12252127 12790147 13274217 13788845 14317970 15322629 16412596 17410074 18729849
6101 18729849 20307695 22450204 24912362 27612322 30926171 35085497 39607816 45767355
6093 45767355 55620642 71597097 96689515 129374986 162255302 184460189 188715430
6086 188715430 175699668 152109843 125415535 101842876 83103992 69319220 59331965
$$ packed form
6151E250740n2911q1451L96019J15896j3623j74419P0752p1289J6670L03607P9750
6140E839741Q5530M89763K77712j51109j07883j42474r0896K07863L10145J22064
6130F840456K46547j64114p8265J70321K50101K21211M85795J61028J14793K61317
6120H509190L30277j52062J89317K00448N66642L65866L992L44474L77611O54744
6110A1390499Q61628N38020M84070N14628N29125J004659J089967R97478J319775
6101A8729849J577846K142509K462158K699960L313849M159326M522319O159539
6093D5767355R853287J5976455K5092418L2685471L2880316K2204887M255241
6086A88715430j3015762k3589825k6694308k3572659j8738884j3784772r987255
$$ plain form
6079 59331965 52276404 47648466 45099243 43782996 44490802 46158905 48465009 52969146
6071 52969146 60947948 76016782 100709602 133662820 167614912 191372270 196557460
6064 196557460 182862473 157385545 128457487 102083056 80797813 64567443 52518387
6057 52518387 43419035 36543954 31218010 27249570 24014161 21309079 19625093 18480099
6049 18480099 17640444 16764796 15740797 15034724 14740069 14574940 13877910 13731487 13670602
6040 13670602 13456861 13331500 13317096 13352300 13476939 13732924 13831726 13731527 13900296 14528795
6030 14528795 15094369 15539142 16683596 18177191 19549056 21115868 23531372 25960701
6022 25960701 30039758 36831530 48506400 64940409 83727529 98451403 104109416 99532888
$$ packed form
6079E9331965p055561m627938k549223j316247P07806J668103K306104M504137
6071E2969146P978802J5068834K4692820L2953218L3952092K3757358N185190
6064A96557460j3694987k5476928k8928058k6374431k1285243j6230370j2049056
6057E2518387r099352o875081n325944l968440l235409k705082j683986j144994
6049A8480099q39655q75648j023999p06073k94655j65129o97030j46423o0885
6040A3670602k13741j25361j4404L5204J24639K55985R8802j00199J68769O28499
6030A4528795N65574M44773J144454J493595J371865J566812K415504K429329
6022B5960701M079057O791772J1674870J6434009J8787120J4723874N658013m576528
$$ plain form
6014 99532888 87808186 73254686 59649639 48603486 40329584 34756426 30547950 27668391
6006 27668391 25896950 25193526 25016497 25259539 26460743 28701874 31931453 38752188 50198816
5997 50198816 67488609 86611913 102407844 108893720 104220382 91606046 75795588
5990 75795588 60635032 48154605 38730910 31413396 25977560 21679728 18298622 15421521
5982 15421521 13376000 12125195 10971449 10051452 9379977 8817028 8188029 7721542 7361784
5973 7361784 7082446 7091821 6946307 6559480 6503368 6297913 5871968 5647755 5360004 5189971
5963 5189971 4920796 4506521 4715241 4634269 4678892 4671371 4461060 4251086 4118255 4226975
5953 4226975 4109936 4065113 3947459 3740422 3939950 3482131 3488467 3432063 3216341 3160608
$$ packed form
6014I9532888j1724702j4553500j3605047j1046153q273902n573158m208476k879559
6006B7668391j771441p03424j77029K43042J201204K241131L229579O820735J1446628
5997E0198816J7289793J9123304J5795931O485876m673338j2614336j5810458
5990G5795588j5160556j2480427r423695p317514n435836m297832l381106k877101
5982A5421521k045521j250805j153746r19997o71475n62949o28999m66487l59758
5973G361784k79338R375j45514l86827n6112k05455m25945k24213k87751j70033
5963E189971k69175m14275K08720q0972M4623p521k10311k09974j32831J08720
5953D226975j17039m4823j17654k07037J99528m57819O336n6404k15722n5733
$$ plain form
5943 3160608 3316350 3241415 2931857 3156791 3174324 2985578 2774235 2788811 2877943 3113542
5933 3113542 3310191 3321314 3417588 3315860 3274611 3524043 3465374 2875717 2855461 2772352 2799129
5922 2799129 2787343 2684876 2943119 2856735 3118720 3148786 3228168 2974950 3067263 2903188
5912 2903188 2632524 2529528 2151342 2115632 2045744 1936675 1848075 1560904 1673532 1918742
5902 1918742 1648297 1514468 1566855 1673222 1516094 1204138 935438 1139156 1285729 1337157
5892 1337157 1064385 1009498 1237561 986771 986985 995934 1064908 1070897 1219478 1171593 1236820
5881 1236820 1185543 1111634 1067117 913279 1060176 1241610 1054117 1036983 892014 1061490
5871 1061490 945799 816228 882581 806230 888768 920803 1052430 1282128 1074569 710963
$$ packed form
5943C160608J55742p4935l09558K24934J7533j88746k11343J4576Q9132K35599
5933C113542J96649J1123R6274j01728m1249K49432n8669n89657k0256q3109K6777
5922B799129j1786j02467K58243q6384K61985L0066P9382k53218R2313j64075
5912B903188k70664j02996l78186l5710o9888j09069q8600k87171J12628K45210
5902A918742k70445j33829N2387J06367j57128l11956k68700K03718J46573N1428
5892A337157k72772n4887K28063k50790K14Q949O8974N989J48581m7885O5227
5881A236820n1277p3909m4517j53838J46897J81434j87493j7134j44969J69476
5871A061490j15691j29571O6353p6351Q2538L2035J31627K29698k07559l63606
$$ plain form
5861 710963 722995 1131998 1119330 1281335 1219196 1179821 1187873 1132196 1028805 865815 1032419
5850 1032419 1091079 900045 822202 1090980 870672 1096887 1095653 944626 1153772 1333224
5840 1333224 1268743 996478 871346 873508 994890 1242531 1139441 1116007 1208596 969473
5830 969473 956585 934397 1006453 956269 1026323 806625 751340 753579 706931 934509 1041148
5819 1041148 864604 676337 799997 722873 833116 640761 879111 773992 799600 906116
5809 906116 855520 1171090 1103113 1119607 1402788 1500901 1326744 1211572 1387104 1505163
5799 1505163 1262943 1004137 1242463 1236760 1369668 1337228 1090034 1143682 930751 1096125
5789 1096125 1139290 1140532 1528160 1258662 1151774 1450941 1605440 1617881 1531923 1620163 1690106
$$ packed form
5861G10963J2032M09003j2668J62005o2139l9375Q052n5677j03391j62990J66604
5850A032419N8660j91034p7843K68778k20308K26215j234j51027K09146J79452
5840A333224o4481k72265j25132K162J21382K47641j03090k3434R2589k39123
5830I69473j2888k2188P2056n0184P0054k19698n5285K239m6648K27578J06639
5819A041148j76544j88267J23660p7124J10243j92355K38350j05119K5608J06516
5809I06116n0596L15570o7977J6494K83181R8113j74157j15172J75532J18059
5799A505163k42220k58806K38326n703J32908l2440k47194N3648k12931J65374
5789A096125M3165J242L87628k69498j06888K99167J54499J2441q5958Q8240O9943
$$ plain form
5778 1690106 1736508 1707579 1919765 1706336 1700440 1784507 1492407 1482647 1433166 1047928 931327
5767 931327 1145403 1070840 1014306 873152 1147249 1264335 1271726 995100 1368796 1583605
5757 1583605 1399909 1266838 1352311 1541332 1562542 1673067 1394249 1466003 1402798 1250842
5747 1250842 965518 967386 963067 883596 862509 930279 562902 674513 839680 828441 710244
5736 710244 646833 796680 1033955 942617 1020351 959885 822334 863866 744486 730507 558374
5725 558374 736811 942060 791021 716319 792599 726358 517940 313243 520908 904000
5715 904000 1044508 879150 918100 827283 809280 855918 895095 878450 1213134 1055803 1201297
5704 1201297 1292045 1342833 1079478 994327 1131402 1303586 1206632 830241 941065 791927
$$ packed form
5778A690106M6402k8929K12186k13429n896Q4067k92100r760m9481l85238j16601
5767I31327K14076p4563n6534j41154K74097J17086P391k76626L73696K14809
5757A583605j83696j33071Q5473J89021K1210J10525k78818P1754o3205j51956
5747A250842k85324J868m319p9471k1087O7770l67377J11611J65167j1239j18197
5736G10244o3411J49847K37275r1338P7734o0466j37551M1532j19380j3979j72133
5725E58374J78437K05249j51039p4702P6280o6241k08418k04697K07665L83092
5715I04000J40508j65358L8950r0817j8003M6638L9177j6645L34684j57331J45494
5704A201297R0748N0788k63355q5151J37075J72184r6954l76391J10824j49138
$$ plain form
5694 791927 898822 1134745 968197 1034089 1035279 1062851 984251 1013675 1082931 1245562 1425130
5683 1425130 1138475 1394104 1570364 1624616 1505030 1316580 1202462 1133483 1056146 1054092
5673 1054092 1023312 1057863 1174354 977604 1272286 1437652 1391287 1366920 1409463 1384272 1527580
5662 1527580 1734037 1613275 1269616 1248055 1362350 1224134 1296710 1221073 1387479 1185032
5652 1185032 1205429 1463137 1534992 1459816 1372423 1512621 1585614 1457826 1425184 1257082 1056647
5641 1056647 984564 1096814 1323696 1293703 1284581 1363292 1288627 1397643 1286845 1407535 1395474
5630 1395474 1640267 1685801 1635679 1414217 1633671 1254144 1124477 1048360 1198544 1092700
5620 1092700 727362 1324470 1230365 1215466 1320703 1150786 1218352 1118268 1182196 1352366
$$ packed form
5694G91927J06895K35923j66548O5892J190K7572p8600K9424O9256J62631J79568
5683A425130k86655K55629J76260N4252j19586j88450j14118o8979p7337k054
5673A054092l0780L4551J16491j96750K94682J65366m6365k4367M2543k5191J43308
5662A527580K06457j20762l43659k1561J14295j38216P2576p5637J66406k02447
5652A185032K0397K57708P1855p5176q7393J40198P2993j27788l2642j68102k00435
5641A056647p2083J12250K26882k9993r122P8711p4665J09016j10798J20690j2061
5630A395474K44793M5534n0122k21462K19454l79527j29667p6117J50184j05844
5620A092700l65338N97108r4105j4899J05237j69917O7566j00084O3928J70170
$$ plain form
5610 1352366 1149652 1383678 1402580 1227309 1396101 1398047 1322683 1294272 1113762 961005
5600 961005 944564 1154216 1216960 1403131 1315175 1125797 940252 879371 887436 1059892 1233023
5589 1233023 1108142 1106208 1018681 838594 908165 973014 1002820 933651 1214415 1183871 1118704
5578 1118704 1151723 1274339 1141880 1182908 1079225 1082737 1103849 1143693 1184302 1155148 1234356
5567 1234356 1028269 1041832 1035303 1158497 1224775 973971 883108 1046281 908315 771886
5557 771886 975557 1021658 1048367 1175669 854951 878785 1010683 1192942 1382732 1206023
5547 1206023 1064288 1191554 1172850 968898 1164597 1341113 1195677 1105038 1118425 1136577
5537 1136577 1135376 1038220 1173645 1193335 972193 1025804 1114005 1140323 1352731 1392790 1208839
$$ packed form
5610A352366k02714K34026J8902j75271J68792J946p5364k8411j80510j52757
5600I61005j6441K09652O2744J86171q7956j89378j85545o0881Q065J72456J73131
5589A233023j24881j934q7527j80087O9571O4849K9806o9169K80764l0544o5167
5578A118704L3019J22616j32459M1028j03683L512K1112L9844M0609k9154P9208
5567A234356k06087J3563o529J23194O6278k50804r0863J63173j37966j36429
5557G71886K03671M6101K6709J27302l20718K3834J31898J82259J89790j76709
5547A206023j41735J27266j8704k03952J95699J76516j45436r0639J3387J8152
5537A136577j201r7156J35425J9690k21142N3611Q8201K6318K12408M0059j83951
$$ plain form
5526 1208839 1001817 1051037 1612959 1386010 1291907 1374449 1139433 1256073 967432 1058873
5516 1058873 1373626 1355128 1211239 1232539 1156379 1385968 1549150 1445799 1017470 1278220
5506 1278220 1427432 1475310 1350166 1099975 1204759 1471352 1204487 1005427 1196551 1247307
5496 1247307 1539693 1328499 979540 1299407 1243408 1053667 1088070 1205045 1371542 1102876
5486 1102876 1526412 1611029 1344590 1417778 1587532 1430863 1298303 1290493 1346590 1356191 1250287
5475 1250287 1378690 1686158 1561049 1471123 1411103 1397860 1248150 1316356 1615874 1723396
5465 1723396 1879744 1740292 1655730 1852211 2145078 2268618 2029518 2052375 2087140 2125169
5455 2125169 1916923 1520652 1492902 1378530 1246479 1656006 1516899 1458298 1453020 1242842
$$ packed form
5526A208839k07022M9220N61922k26949r4103Q2542k35016J16640k88641R1441
5516A058873L14753j8498j43889K1300p6160K29589J63182j03351m28329K60750
5506A278220J49212M7878j25144k50191J04784K66593k66865j99060J91124N0756
5496A247307K92386k11194l48959L19867n5999j89741L4403J16975J66497k68666
5486A102876M23536Q4617k66439P3188J69754j56669j32560p810N6097R601j05904
5475A250287J28403L07468j25109q9926o0020j3243j49710O8206K99518J07522
5465A723396J56348j39452q4562J96481K92867J23540k39100K2857L4765L8029
5455B125169k08246l96271k7750j14372j32051M09527j39107n8601n278k10178
$$ plain form
5445 1242842 1375306 1715033 1431563 1592927 1782274 1650653 1435883 1657624 1742838 1550789
5435 1550789 1391441 1358428 1341818 1590903 1875055 1614526 1824471 1865061 1856688 1787436 1871340
5424 1871340 1820307 1653582 1679309 1699002 1732694 1759581 1751308 1900130 1903061 1928017 1985934
5413 1985934 2162009 1981303 1860643 1755234 1960683 1935142 2160332 2268424 2490050 2245982
5403 2245982 2027621 2361369 2195451 2387158 2407493 2325039 2391966 2598117 2564103 2229401
5393 2229401 2296980 2742358 2731845 2676510 2830176 2845784 2794412 2885707 3151033 3022584 2794624
5382 2794624 2812628 2919941 2896654 2835149 2880884 2950529 2942928 3062902 3026800 2976698 2952715
5371 2952715 3102302 3105445 3190482 3310909 3221747 3426139 3392905 3249419 3406544 3485602 3368111
$$ packed form
5445A242842J32464L39727k83470J61364J89347j31621k14770K21741Q5214j92049
5435A550789j59348l3013j6610K49085K84152k60529K09945M0590q373o9252Q3904
5424A871340n1033j66725K5727J9693L3692K6887q273J48822K931K4956N7917
5413A985934J76075j80706j20660j05409K05449k5541K25190J08092K21626k44068
5403B245982k18361L33748j65918J91707K0335q2454O6927K06151l4014l34702
5393B229401O7579M45378j0513n5335J53666J5608n1372R1295K65326j28449k27960
5382B794624J8004J07313k3287o1505M5735O9645p601J19974l6102n0102k3983
5371B952715J49587L143Q5037J20427q9162K04392l3234j43486J57125P9058j17491
$$ plain form
5360 3368111 3490772 3591939 3843738 3657515 3852013 3790470 3658037 3754436 3886604 4079039
5350 4079039 3826051 3491985 3484732 3770617 3924611 4232041 4218695 4378325 4524136 4636045
5340 4636045 4439449 4600410 4598551 4631969 4693791 4639008 4590781 4676966 4818228 4926008 4888568
5329 4888568 5002691 5164024 4998886 5188153 5429778 5736998 5761076 5769289 5708139 6105391
5319 6105391 6442613 6573179 6811644 6988539 7206043 7570033 7657014 7518914 7103792 7271680
5309 7271680 7704021 8036533 8257071 8691259 8777022 8947871 9173959 9779891 10349070 10552126
5299 10552126 10824153 11259733 11664053 12123038 12722800 13140073 13902878 15177744 16306572
5290 16306572 17525072 18940105 20658582 22856131 26873898 33901550 42632668 49364479
$$ packed form
5360C368111J22661J01167K51799j86223J94498o1543j32433R6399J32168J92435
5350D079039k52988l34066p253K85885J53994L07430j3346J59630J45811J11909
5340D636045j96596J60961j859L3418O1822n4783m8227Q6185J41262J07780l7440
5329D888568J14123J61333j65138J89267K41625L07220K4078Q213o1150L97252
5319F105391L37222J30566K38465J76895K17504L63990Q6981j38100m15122J67888
5309G271680M32341L32512K20538M34188Q5763J70849K26088O05932N69179K03056
5299A0552126K72027M35580M04320M58985N99762M17273P62805J274866J128828
5290A6306572J218500J415033J718477K197549M017767P027652Q731118O731811
$$ plain form
5282 49364479 51229008 49638947 45882040 41563498 38347927 37089672 37461608 39560924
5274 39560924 44584917 53565323 65213389 77096189 86780534 93928802 97498936 99114625
5266 99114625 100823609 101162108 99401191 97734897 97857974 98117895 96722193 96335921 98598878
5257 98598878 102515717 105697860 109070733 113628048 119010066 125898243 134150455 139944999
5249 139944999 140762499 136951003 130406173 123147148 117400150 115000930 112494829 107574029
5241 107574029 103570403 101364095 100004293 97632335 94641370 93483571 93446191 93543217 94587982
5232 94587982 97670834 99985236 99598696 97003569 89759112 78330983 66531921 55525486
5224 55525486 46791002 40643835 36734205 34000405 34380966 37878918 43393473 48473149
$$ packed form
5282D9364479J864529j590061l756907m318542l215571j258255L71936K099316
5274C9560924N023993Q980406J1648066J1882800R684345P148268L570134J615689
5266I9114625J708984L38499j760917j666294J23077K59921j395702l86272K262957
5257I8598878L916839L182143L372873M557315N382018O888177Q252212N794544
5249A39944999Q17500l811496o544830p259025n746998k399220k506101m920800
5241A07574029m003626k206308j359802k371958k990965j157799l7380R7026J044765
5232I4587982L082852K314402l86540k595127p244457j1428129j1799062j1006435
5224E5525486q734484o147167l909630k733800L80561L497952N514555N079676
$$ plain form
5216 48473149 49596084 46221931 40460935 33791164 28092270 23706991 20324687 17574221
5208 17574221 15843461 13965103 12846057 12225214 11413092 11103275 10666513 10300411 9725582
5199 9725582 9305354 9128318 8976354 8575654 8369490 8090571 7760925 7479869 7348539 7155988
5189 7155988 7131583 6931655 6696320 6891968 6614136 6299647 6200929 6144393 6081761 5662505
5179 5662505 5860875 6234534 5952240 5800186 5569013 5402427 5244465 5458318 5752964 5638551
5169 5638551 5778755 5810428 5566242 5384463 5561741 5374455 5111618 4922252 4874742 4644133
5159 4644133 4524360 4497203 4291402 4261864 4311015 4403706 4276928 3955035 3777454 3759625
5149 3759625 3765668 3931091 4116752 3956124 3789492 3971762 4004314 4066968 4143391 4015449
$$ packed form
5216D8473149J122935l374153n760996o669771n698894m385279l382304k750466
5208A7574221j730760j878358j119046o20843q12122l09817m36762l66102n74829
5199I725582m20228j77036j51964m00700k06164k78919l29646k81056j31330j92551
5189G155988k4405j99928k35335J95648k77832l14489r8718n6536o2632m19256
5179E662505J98370L73659k82294j52054k31173j66586j57962K13853K94646j14413
5169E638551J40204L1673k44186j81779J77278j87286k62837j89366m7510k30609
5159D644133j19773k7157k05801k9538M9151R2691j26778l21893j77581j7829
5149C759625O043J65423J85661j60628j66632J82270L2552O2654P6423j27942
$$ plain form
5139 4015449 4114126 4189661 4105540 3742757 4239536 4252133 4316462 4554230 4638421 4836720 5326956
5128 5326956 5435207 5330257 5135026 4949609 4945048 5074348 5300446 5314596 5425976 4721916
5118 4721916 4711097 4794133 5101278 5366593 5576503 5746122 5637469 5402969 5483644 5409428
5108 5409428 5217879 5344095 5499680 5767356 5811414 6096076 5945991 6095911 6140861 5989361
5098 5989361 6137607 5754908 5528560 5816157 6240664 6285357 6500927 6692130 6695653 6542472
5088 6542472 6291943 5996707 6221757 6040064 5799163 6158284 6439459 6318400 6272744 6693444
5078 6693444 6824436 7083712 7282961 7169896 7389820 7832983 7778168 7646077 7681867 7740049
5068 7740049 7397763 7220818 7210716 7171311 7000690 6896822 7153659 7094051 7340143 7512207
$$ packed form
5139D015449R8677P5535q4121l62783M96779J2597O4329K37768Q4191J98299M90236
5128E326956J08251j04950j95231j85417m561J29300K26098J4150J11380p04060
5118D721916j0819Q3036L07145K65315K09910J69619j08653k34500Q0675p4216
5108E409428j91549J26216J55585K67676M4058K84662j50085J49920M4950j51500
5098E989361J48246l82699k26348K87597M24507M4693K15570J91203L523j53181
5088F542472k50529k95236K25050j81693k40901L59121K81175j21059m5656M20700
5078F693444J30992K59276J99249j13065K19924M43163n4815j32091L5790N8182
5068G740049l42286j76945j0102l9405j70621j03868K56837n9608K46092J72064
$$ plain form
5058 7512207 7586570 7959163 8060026 8256327 8342817 8044011 7883092 7683104 7486171 7438136
5048 7438136 7281640 7044320 6688377 6581005 6769156 6506780 6531118 6435863 6548894 6668451
5038 6668451 6839030 7030225 6936282 6837327 7177398 7282050 7213002 7218665 6971775 6964535 6733484
5027 6733484 6537370 6594496 6538106 6368871 6346836 6578683 6526165 6148520 6376255 6355935
5017 6355935 6426044 6416393 6544012 6740259 6757802 6841780 6802322 6618123 6683753 6568756 6640049
5006 6640049 6650275 6601984 6777324 6760199 6887117 7168954 6798172 6868841 7362603 7520360
4996 7520360 7481678 7295417 7272685 7621735 7608480 7648348 7951889 8065910 8289412 8521089
4986 8521089 8749539 8713889 8819812 9083792 8926997 9192266 9557459 9484513 9762853 10180798
$$ packed form
5058G512207P4363L72593J00863J96301Q6490k98806j60919j99988j96933m8035
5048G438136j56496k37320l55943j07372J88151k62376K4338r5255J13031J19557
5038F668451J70579J91195r3943r8955L40071J04652o9048N663k46890p240k31051
5027F733484j96114N7126n6390j69235k2035K31847n2518l77645K27735k0320
5017F355935P0109r651J27619J96247J7543Q3978l9458j84199O5630j14997P1293
5006F640049J0226m8291J75340j7125J26918K81837l70782P0669M93762J57757
4996G520360l8682j86261k2732L49050j3255L9868L03541J14021K23502K31677
4986H521089K28450l5650J05923K63980j56795K65269L65193p2946K78340M17945
$$ plain form
4976 10180798 10462440 10771766 10834054 10714628 10859996 10795581 10922427 11008881 10885840 10951423
4966 10951423 11062359 11264085 11505209 11703520 11965684 12332927 12536521 12738330 12970176
4957 12970176 13161960 13378348 13652578 13850906 13882399 13826607 13649490 13832188 14000713 14033197
4947 14033197 13799708 13889102 14104632 14423502 14844707 15222549 15573446 15805181 15777990 15867129
4937 15867129 16246191 16497675 16551419 16771866 17078784 17014051 17313569 17977881 18571194 19175459
4927 19175459 19501336 19886514 20416606 21112997 21693420 21946901 22481115 22973633 23250754
4918 23250754 23631233 23885954 24226477 24859433 25376308 25615713 26153983 26404651 26784654
4909 26784654 27591340 28446704 29502019 30610630 31685604 32397197 33477863 34487545 35391762
$$ packed form
4976A0180798K81642L09326O2288j19426J45368o4415J26846Q6454j23041O5583
4966A0951423J10936K01726K41124J98311K62164L67243K03594K01809K31846
4957A2970176J91784K16388K74230J98328L1493n5792j77117J82698J68525L2484
4947A4033197k33489Q9394K15530L18870M21205L77842L50897K31735k7191Q9139
4937A5867129L79062K51484N3744K20447L06918o4733K99518O64312N93313O04265
4927A9175459L25877L85178N30092O96391N80423K53481N34214M92518K77121
4918B3250754L80479K54721L40523O32956N16875K39405N38270K50668L80003
4909B6784654Q06686Q55364J055315J108611J074974P11593J080666J009682R04217
$$ plain form
4900 35391762 36194440 36812640 37614611 38350567 39212517 40354526 41439639 42756704 44339525
4891 44339525 45871532 48213282 51033899 54751403 59528691 66469274 78142990 98838095
4883 98838095 130278624 165775198 191620077 196464933 183401862 160546827 136587653
4876 136587653 117211259 103345315 93768896 87701333 84659121 83686294 85586570 89463248
4868 89463248 96920279 109876800 132502717 165908133 205096495 240272923 268014690
4861 268014690 291562499 307794088 307927401 287866525 255347341 218779747 186347721
4854 186347721 162058031 146569953 137671107 133672304 134141304 137407581 143566740 152808833
4846 152808833 167065327 189580497 225150311 271446823 316885322 343746988 346294984
$$ packed form
4900C5391762Q02678O18200Q01971P35956Q61950J142009J085113J317065J582821
4891D4339525J532007K341750K820617L717504M777288O940583J1673716K0695105
4883I8838095L1440529L5496574K5844879M844856j3063071k2855035k3959174
4876A36587653j9376394j3865944r576419o067563l042212r72827J900276L876678
4868H9463248P457031J2956521K2625917L3405416L9188362L5176428K7741767
4861B68014690K3547809J6231589J33313k0060876l2519184l6567594l2432026
4854A86347721k4289690j5488078q898846l998803M69000L266277O159159R242093
4846A52808833J4256494K2515170L5569814M6296512M5438499K6861666K547996
$$ plain form
4839 346294984 331218604 306868658 283171454 264462621 251183314 241796594 234431984
4832 234431984 227656534 221889889 217247761 213866321 212640105 214187462 218124057 224198195
4824 224198195 232378499 242905393 255670411 270734504 287700097 305718426 325341832
4817 325341832 346685630 369377870 393093749 415214736 433362539 445858275 452846893
4810 452846893 456055573 457908358 459262286 460960498 461596020 458997857 451913887 441092786
4802 441092786 428760266 418975293 413941010 413886475 417359366 422430827 427694399 432819399
4794 432819399 438727932 444978426 451366998 457194194 460976779 461707679 460079956 455975629
4786 455975629 450041868 443138228 437322168 435879845 439926274 448834260 461270858 473898155
$$ packed form
4839C46294984j5076380k4349946k3697204j8708833j3279307r386720p364610
4832B34431984o775450n766645m642128l381440j226216J547357L936595O074138
4824B24198195Q180304J0526894J2765018J5064093J6965593J8018329J9623406
4817C25341832K1343798K2692240K3715879K2120987J8147803J2495736O988618
4810D52846893L208680J852785J353928J698212O35522k598163p083970j0821101
4802D41092786j2332520r784973n034283n4535L472891N071461N263572N125000
4794D32819399N908533O250494O388572N827196L782585P30900j627723m104327
4786D55975629n933761o903640n816060j442323M046429Q907986J2436598J2627297
$$ plain form
4778 473898155 483793568 489922848 492437827 493841728 496481769 500906027 505584543 508004413
4770 508004413 504772405 495970919 484249971 470140945 454888596 438303551 420005991
4763 420005991 401768094 384915638 370069966 356523638 342779037 328939683 315851126
4756 315851126 305356027 297749352 293948979 293133614 292938461 291107913 287465898 283496953
4748 283496953 280663540 279470144 279430181 279030946 276300018 269167541 258278734 244812467
4740 244812467 230562297 216095533 201920198 188728712 175823601 162898254 150529565
4733 150529565 138685192 127590941 117120371 106541744 96887760 88206898 81079736
4726 81079736 75228608 70371790 66321229 62161655 58642545 55152959 52041843 49763909
$$ packed form
4778D73898155R895413O129280K514979J403901K640041M424258M678516K419870
4770E08004413l232008q801486j1720948j4109026j5252349j6585045j8297560
4763D20005991j8237897j6852456j4845672j3546328j3744601j3839354j3088557
4756C15851126j0495099p606675l800373q15365j95153j830548l642015l968945
4748B83496953k833413j193396l9963l99235k730928p132477j0888807j3466267
4740B44812467j4250170j4466764j4175335j3191486j2905111j2925347j2368689
4733A50529565j1844373j1094251j0470570j0578627r653984q680862p127162
4726H1079736n851128m856818m050561m159574l519110l489586l111116k277934
$$ plain form
4718 49763909 47442353 45648707 44269725 42932201 41793283 40446539 38651527 37348034
4710 37348034 36254328 35041206 34019654 32994622 32457511 31656654 30751126 30048543 29575621
4701 29575621 29091734 28680318 28277813 27850806 27330342 26629875 26018822 25264317 24651028
4692 24651028 24105571 23729769 23036655 22613497 22185078 21623061 21301211 21227723 21332968 21136568
4682 21136568 21012110 20877801 20285846 19555135 19385200 18948596 18332527 18173728 17462813
4673 17462813 17374939 17136411 16867586 16766224 16440523 16182076 16359781 15951550 15426592 15073228
4663 15073228 14618058 14221095 14106443 13879569 13719594 13559905 13383678 13592228 13689590 13520273
4653 13520273 13255078 13246151 12899756 12792204 12680764 12210551 12194124 12167550 11886398 11674082
$$ packed form
4718D9763909k321556j793646j378982j337524j138918j346744j795012j303493
4710C7348034j093706j213122j021552j025032n37111q00857r05528p02583m72922
4701B9575621m83887m11416m02505m27007n20464p00467o11053p54505o13289
4692B4651028n45457l75802o93114m23158m28419n62017l21850p3488J05245j96400
4682B1136568j24458j34309n91955p30711j69935m36604o16069j58799p10915
4673A7462813q7874k38528k68825j01362l25701k58447J77705m08231n24958l53364
4663A5073228m55170l96963j14652k26874j59975j59689j76227K08550R7362j69317
4653A3520273k65195q927l46395j07552j11440m70213j6427k6574k81152k12316
$$ plain form
4643 11674082 11800048 11683229 11504059 11619910 11779395 11876554 11780250 11861476 12162600 12092273
4633 12092273 11956278 11932869 11950290 12180750 12362697 12358453 12613369 12700298 12731131 12685758 12622592
4622 12622592 12819608 12933155 13048386 13373900 13765686 14274088 14820740 14788221 15083707 15284303
4612 15284303 15416884 15611067 15639663 15548742 15952114 16293819 16554856 16754757 17471131 18179006
4602 18179006 18771677 19220475 19725083 19861258 20174664 20761378 21367928 22228650 23387847
4593 23387847 24672076 25946424 27830300 29944757 32477223 35241522 38581308 42907752
4585 42907752 48956966 58869433 75366147 101796587 136740062 170590549 189222283
4578 189222283 187292252 170008098 145719396 122971981 106186674 96736663 95694045
$$ packed form
4643A1674082J25966j16819j79170J15851J59485R7159r6304Q1226L01124p0327
4633A2092273j35995k3409J7421K30460J81947m244K54916Q6929L0833m5373o3166
4622A2622592J97016J13547J15231L25514L91786N08402N46652l2519K95486K00596
4612A5284303J32581J94183K8596r0921M03372L41705K61037J99901P16374P07875
4602A8179006N92671M48798N04608J36175L13406N86714O06550Q60722J159197
4593B3387847J284229J274348J883876K114457K532466K764299L339786M326444
4585D2907752O049214R912467J6496714K6430440L4943475L3850487J8631734
4578A89222283j930031j7284154k4288702k2747415j6785307r450011j042618
$$ plain form
4571 95694045 104937348 126047150 156002659 184096581 197199977 190856014 171136792
4564 171136792 147087608 126514556 114997116 116119452 130890141 154045527 174298074
4557 174298074 180438997 169799835 149328899 125746863 105483392 91185124 83408369
4550 83408369 82938996 91913160 111323339 136433641 155979404 159708229 147102605 125110478
4542 125110478 100578478 79502887 63100411 50722876 42054388 35212087 29881373
4535 29881373 25844655 23015797 21041567 19564791 18591413 17813826 17082333 16525775 15812120
4526 15812120 15163453 14712601 14751457 14271790 13575370 13251430 12980013 12753668 12325339 12027659
4516 12027659 11815581 11510475 11369672 11195555 10986169 10708366 10229690 10103925 10163165 10035234
$$ packed form
4571I5694045R243303K1109802K9955509K8093922J3103396o343963j9719222
4564A71136792k4049184k0573052j1517440J122336J4770689K3155386K0252547
4557A74298074O140923j0639162k0470936k3582036k0263471j4298268p776755
4550H3408369m69373Q974164J9410179K5110302J9545763L728825j2605624k1992127
4542A25110478k4532000k1075591j6402476j2377535q668488o842301n330714
4535B9881373m036718k828858j974230j476776r73378p77587p31493n56558p13655
4526A5812120o48667m50852L8856m79667o96420l23940k71417k26345m28329k97680
4516A2027659k12078l05106j40803j74117k09386k77803m78676j25765N9240j27931
$$ plain form
4506 10035234 9615819 9415390 9249048 9136633 9063547 8950185 8834310 8750494 8763411 8755793
4496 8755793 8448577 8157746 7897198 7354626 7559732 7771911 7941404 7981662 7769324 7862135
4486 7862135 7749308 7756487 7828664 7569774 7358434 7360403 7747754 7972483 7619637 7285619
4476 7285619 7349684 7069689 6872739 6571153 6384033 6459324 6428276 6382988 6536255 6407218
4466 6407218 6347526 6502137 6251138 6311190 6638380 6526829 6485508 6621632 6774858 6761881
4456 6761881 6362819 6286687 5855790 5557821 5498830 5125767 4793600 4621425 4538694 4535499
4446 4535499 4738852 4762035 4623939 4480287 4631299 4717145 4787228 4863145 4735617 4876747
4436 4876747 4856474 4514652 4614006 4637518 4648573 4390217 4402605 4429562 4307019 4250670 4163284
$$ packed form
4506A0035234m19415k00429j66342j12415p3086j13362j15875q3816J2917p618
4496H755793l07216k90831k60548n42572K05106K12179J69493M0258k12338R2811
4486G862135j12827P179P2177k58890k11340J969L87351K24729l52846l34018
4476G285619O4065k79995j96950l01586j87120P5291l1048m5288J53267j29037
4466F407218n9692J54611k50999O0052L27190j11551m1321J36124J53226j2977
4456F761881l99062p6132m30897k97969n8991l73063l32167j72175q2731l195
4446D535499K03353K3183j38096j43652J51012Q5846P0083P5917j27528J41130
4436D876747k0273l41822R9354K3512J1055k58356J2388K6957j22543n6349q7386
$$ plain form
4425 4163284 4517709 4729068 4577542 4548195 4847642 5337568 6128024 7094719 8430506 9256465
4415 9256465 9339349 8604145 7615190 6775182 6179087 5728077 5233116 5127942 5498499 5244391
4405 5244391 5235535 5486443 5346511 5457971 5395378 5525386 5316551 5498625 5958500 5816119
4395 5816119 5755385 5622162 5511149 5654276 5704124 5601612 5932192 6005985 5954588 6178695
4385 6178695 6265662 6270297 6224935 6156033 6510359 6574587 6711145 6924736 7373074 7336022 7237181
4374 7237181 7226226 7133454 7031998 6791918 6650835 6712247 6620654 6289561 6303147 6311378 6574337
4363 6574337 6629172 6657346 6888472 6896323 6956536 6890052 7187913 7170977 7045786 7089999 7074104
4352 7074104 7087882 7168554 7129246 7014666 7144915 7095866 7138137 7162405 7424678 7355129 7140097
$$ packed form
4425D163284L54425K11359j51526k9347K99447M89926P90456R66695J335787Q25959
4415I256465Q2884p35204r88955q40008n96095m51010m94961j05174L70557k54108
4405E244391q856K50908j39932J11460o2593J30008k08835J82074M59875j42381
4395E816119o0734j33223j11013J43127M9848j02512L30580P3793n1397K24107
4385F178695Q6967M635m5362o8902L54326O4228J36558K13591M48338l7052r8841
4374G237181j0955r2772j01456k40080j41083O1412r1593l31093J3586Q231K62959
4363F574337N4835K8174K31126P851O0213o6484K97861j6936j25191M4213j5895
4352G074104J3778Q0672l9308j14580J30249m9049M2271K4268K62273o9549k15032
$$ plain form
4341 7140097 6947645 6687275 6557323 6642145 6987786 7333426 7125125 7253268 7322632 7444356
4331 7444356 7422910 7512106 7878520 8022610 8008610 8031282 7793211 7836168 7644539 7893284
4321 7893284 8167625 8274790 8349053 8305035 8008578 7843267 8044223 8186076 8166299 7826137
4311 7826137 7784126 7961966 8221531 8626555 8847105 8683315 8229163 7869976 7972775 8056753
4301 8056753 8140813 8130526 8231864 8234259 8561432 8404957 8300365 8249204 7579652 7309720
4291 7309720 7179189 7017585 7128104 7283889 7106290 7135068 7208437 7202426 7023528 7078085
4281 7078085 7052719 6916533 7019124 6842909 6731265 6565078 6594770 6546787 6754842 6828711
4271 6828711 6818974 6746203 6796876 7004674 6911394 6907584 6665606 6429814 6557422 6538553 6728609
$$ packed form
4341G140097j92452k60370j29952Q4822L45641L45640k08301J28143O9364J21724
4331G444356k1446Q9196L66414J44090j4000K2672k38071M2957j91629K48745
4321G893284K74341J07165P4263m4018k96457j65311K00956J41853j9777l40162
4311G826137m2011J77840K59565M05024K20550j63790m54152l59187J02799Q3978
4301H056753Q4060j0287J01338K395L27173j56475j04592n1161o69552k69932
4291G309720j30531j61604J10519J55785j77599K8778P3369o011j78898N4557
4281G078085k5366j36186J02591j76215j11644j66187K9692m7983K08055P3869
4271F828711r737p2771N0673K07798r3280l810k41978k35792J27608j8869J90056
$$ plain form
4260 6728609 6970899 6995853 6625538 6818106 7086287 6910724 7022079 7325952 7348649 7218815
4250 7218815 7519712 7893091 7647221 7439558 7622266 7796495 7984998 8518872 8700091 8689164
4240 8689164 8603340 8661895 8840787 9105389 9429472 9179053 9366737 9453979 9345691 9838179
4230 9838179 9910432 9849718 9817362 10041183 10273663 10014928 10237132 10336866 10244944 10561329
4220 10561329 10840120 11171236 11360305 11340056 11434712 11583543 11910730 11870506 12066443 12331095
4210 12331095 12638716 13087748 13371749 13561716 13721833 14048784 14495163 14576654 14652187 15022405
4200 15022405 15131068 15131267 15574342 15841871 16170356 16685109 17324606 17628186 18042533 18743125
4190 18743125 19108499 19742792 20074670 20619300 21445409 22220095 23296432 24430323 25981034
$$ packed form
4260F728609K42290K4954l70315J92568K68181j75563J11355L03873K2697j29834
4250G218815L00897L73379k45870k07663J82708J74229J88503N33874J81219j0927
4240H689164q5824N8555J78892K64602L24083k50419J87684Q7242j08288M92488
4230I838179P2253o0714l2356K23821K32480k58735K22204R9734r1922L16385
4220A0561329K78791L31116J89069k0249R4656J48831L27187m0224J95937K64652
4210A2331095L07621M49032K84001J89967J60117L26951M46379Q1491P5533L70218
4200A5022405J08663J99M43075K67529L28485N14753O39497L03580M14347P00592
4190A8743125L65374O34293L31878N44630Q26109P74686J076337J133891J550711
$$ plain form
4181 25981034 26985651 28270196 29470148 30950180 33031840 35099513 38240369 41467598
4173 41467598 44476874 47787388 50547655 52446832 54056906 54901199 55432518 55653992 55134540
4164 55134540 54243558 53569411 53634669 54553170 56110831 59110034 63714389 69947215 76368601
4155 76368601 82086710 86377810 88826800 90701782 92708218 94458786 97107714 99988072
4147 99988072 102721205 105298837 107282530 109040049 110566630 112881158 115537376 118731541
4139 118731541 122349799 125344170 125910507 124737245 122957053 122035070 123086391 127673461
4131 127673461 136518387 149995711 165794461 179987957 189078922 191695216 190234348 188039959
4123 188039959 186870855 187646150 189459304 191151324 192200050 193015464 193553841 194289468 196126918
$$ packed form
4181B5981034J004617J284545J199952J480032K081660K067673L140856L227229
4173D1467598L009276L310514K760267J899177J610074Q44293N31319K21474n19452
4164E5134540q90982o74147O5258R18501J557661K999203M604355O232826O421386
4155G6368601N718109M291100K448990J874982K006436J750568K648928K880358
4147I9988072K733133K577632J983693J757519J526581K314528K656218L194165
4139A18731541L618258K994371N66337j173262j780192r21983J051321M587070
4131A27673461Q844926J3477324J5798750J4193496R090965K616294j460868k194389
4123A88039959j169104P75295J813154J692020J048726Q15414N38377P35627J837450
$$ plain form
4114 196126918 198281266 200507081 201821173 201918767 201215983 199697564 197944623 196315698
4106 196315698 195440235 197121906 202065198 211448666 225295304 242689911 260874420 276425731
4098 276425731 287987094 295502189 300430727 306724469 314609410 322009041 326088795 327367193
4090 327367193 328801844 333335016 340409833 345741257 346478739 342719606 337589695 333560388
4082 333560388 331729918 333415283 339723534 352036854 370577920 392353457 413464986
4075 413464986 429683073 439692410 443337769 441202543 434293079 424829399 415659787 408979359
4067 408979359 406977051 410517641 417695946 422777149 423702609 423897977 426324904 431387398
4059 431387398 435732338 435332339 430973196 425412298 421278847 417079778 411520536 403362766
$$ packed form
4114A96126918K154348K225815J314092R7594p02784j518419j752941j628925
4106A96315698q75463J681671M943292R383468J3846638J7394607J8184509J5551311
4098B76425731J1561363P515095M928538O293742P884941P399631M079754J278398
4090C27367193J434651M533172P074817N331424P37482l759133n129911m029307
4082C33560388j830470J685365O308251J2313320J8541066K1775537K1111529
4075D13464986J6218087J0009337L645359k135226o909464r463680r169612o680428
4067D08979359k002308L540590P178305N081203R25460J95368K426927N062494
4059D31387398M344940l99999m359143n560898m133451m199069n559242q157770
$$ plain form
4051 403362766 395548557 392247649 395116233 400565527 399309099 387162619 366860523 342515955
4043 342515955 317448430 294478183 274717724 260851819 253358151 250914928 252145179
4036 252145179 254192789 254231860 253105232 251903920 250589726 248561203 245469192 241580949
4028 241580949 237609367 232712817 227148827 221156604 214909673 209757322 206776493 206522667
4020 206522667 207015400 205499733 199722263 189476202 177026237 164490445 153036686 143290763
4012 143290763 136068068 131870647 129500828 128168355 126468943 123480249 119577091 115687204
4004 115687204 112491523 110041138 108419002 107296927 106020578 104803708 104038186 102998981
3996 102998981 101529313 99622744 97199370 94345743 91415862 86967123 81311548 75046792
$$ packed form
4051D03362766p814209l300908K868584N449294j256428j2146480k0302096k4344568
4043C42515955k5067525k2970247j9760459j3865905p493668k443223J230251
4036B52145179K047610L9071j126628j201312j314194k028523l092011l888243
4028B41580949l971582m896550n563990n992223o246931n152351k980829k53826
4020B06522667M92733j515667n777470j0246061j2449965j2535792j1453759r745923
4012A43290763p222695m197421k369819j332473j699412k988694l903158l889887
4004A15687204l195681k450385j622136j122075j276349j216870p65522j039205
3996A02998981j469668j906569k423374k853627k929881m448739n655575o264756
$$ plain form
3988 75046792 68957151 63291247 59085235 56063198 53906080 53229995 52554219 51862282 51290885
3979 51290885 50475535 49145094 48170421 47291457 46059688 44185456 41711820 38865240 35995138
3970 35995138 32815866 30131536 28063240 26230993 24647351 23414739 22254443 21307881
3962 21307881 20188417 19102124 18280484 17340382 16796870 16231883 15624326 15101950 14570664
3953 14570664 13969089 13948470 13843359 13539861 12968618 12518902 12233454 11979094 11377636 11178294
3943 11178294 11020217 10811376 10724426 10558105 10383498 10108677 10034756 9619341 9118015 8874762
3933 8874762 8858681 9154501 9127567 8735814 8502438 8452260 8465816 8349334 8422546 8234848
3923 8234848 7923000 7847247 7973490 7621045 7664880 7789579 7767595 7672644 7542744 7572895
$$ packed form
3988G5046792o089641n665904m206012l022037k157118o76085o75776o91937n71397
3979E1290885q15350j330441r74673q78964j231769j874232k473636k846580k870102
3970C5995138l179272k684330k068296j832247j583642j232612j160296r46562
3962B1307881j119464j086293q21640r40102n43512n64987o07557n22376n31286
3953A4570664o01575k0619j05111l03498n71243m49716k85448k54360o01458j99342
3943A1178294j58077k08841q6950j66321j74607k74821p3921m15415n01326k43253
3933H874762j6081K95820k6934l91753k33376n0178J3556j16482P3212j87698
3923H234848l11848p5753J26243l52445M3835J24699k1984r4951j29900L0151
$$ plain form
3913 7572895 7669187 7713282 7853001 8070370 7971702 8153426 7916244 7959449 7995293 7941115 7930187
3902 7930187 8080599 8109721 8161129 8305343 8631882 8395505 8036741 8030826 8000232 8336218
3892 8336218 8480486 8572072 8724445 8776010 8959348 9031193 8773224 8746738 8857972 9056447
3882 9056447 9095874 9133586 8958606 9155727 9303156 9527824 9638994 9947849 10239244 10044368
3872 10044368 10054171 10314113 10708102 10743871 10586223 10632487 10545856 10876990 11069320 11644916
3862 11644916 11998998 12075789 12212576 12757127 13124720 13409544 13893130 14457441 15471314
3853 15471314 16257869 16945679 17704714 18762756 20096710 21118056 21642424 22092482 22936449
3844 22936449 23900830 24735536 25078145 25341429 25787743 26058573 26172425 26433725 26257594
$$ packed form
3913G572895R6292M4095J39719K17369r8668J81724k37182M3205L5844n4178j0928
3902G930187J50412K9122N1408J44214L26539k36377l58764n915l0594L35986
3892H336218J44268R1586J52373N1565J83338P1845k57969k6486J11234J98475
3882I056447L9427L7712j74980J97121J47429K24668J11170L08855K91395j94876
3872A0044368R803K59942L93989L5769j57648M6264q6631L31134J92330N75596
3862A1644916L54082P6791J36787N44551L67593K84824M83586N64311J013873
3853A5471314P86555O87810P59035J058042J333954J021346N24368M50058Q43967
3844B2936449R64381Q34706L42609K63284M46314K70830J13852K61300j76131
$$ plain form
3835 26257594 25950403 25275421 24287824 22876108 21315948 20048122 18436138 16920315 15423959
3826 15423959 14269663 13093447 12233899 11375214 10828078 10608380 10346185 9748216 9765007
3817 9765007 9650508 9298825 8908519 8810317 8388285 8464783 8392181 7912549 7744255 7647218
3807 7647218 7568453 7433445 7615590 7492188 7334131 7070773 6566883 6285137 6076752 6061779
3797 6061779 6312430 6069005 5892214 5745630 5540134 5591341 5619656 5714527 5535119 5419334
3787 5419334 5371996 5363222 5371668 5047657 4557845 4614700 4610563 4545161 4543052 4559846 4498793 4641676
3775 4641676 4663241 4518625 4809758 4927129 4841772 4551957 4814719 4818276 4643715 4752823
3765 4752823 4637233 4591603 4554409 4450617 4408327 4465663 4452805 4246536 4064620 3918542
$$ packed form
3835B6257594l07191o74982r87597j411716j560160j267826j611984j515823j496356
3826A5423959j154296j176216q59548q58685n47136k19698k62195n97969J6791
3817I765007j14499l51683l90306r8202m22032P6498p2602m79632j68294r7037
3807G647218p8765j35008J82145j23402j58057k63358n03890k81746k08385j4973
3797F061779K50651k43425j76791j46584k05496N1207K8315R4871j79408j15785
3787E419334m7338q774Q446l24011m89812N6855m137o5402k109J6794o1053J42883
3775D641676K1565j44616K91133J17371q5357k89815K62762L557j74561J09108
3765D752823j15590m5630l7194j03792m2290N7336j2858k06269j81916j46078
$$ plain form
3755 3918542 3975129 3905735 3796092 3868106 4085023 4306340 4247546 4331547 4490560 4562681 4744177
3744 4744177 4810853 4574432 4385807 4309985 4274757 4109553 4156148 4006811 3601160 3665199
3734 3665199 3740600 3565636 3535025 3610596 3559244 3665243 3668364 3560847 3561392 3703458 3839272
3723 3839272 3643466 3457731 3565978 3434896 3665959 3780407 3993174 4028494 3907004 3734787
3713 3734787 3807643 3777328 3793845 4053641 4345319 4186115 4078640 4283651 4249032 4310221
3703 4310221 4218924 4302329 4131545 4175338 4015022 3782680 3600313 3756079 4087284 4338533
3693 4338533 4340133 4397238 4771524 4795084 4820833 4697280 4855687 4870534 4775629 4574248 4513171
3682 4513171 4734756 4611594 4381056 3998864 3785571 3891688 4123076 4244329 4175009 3856197
$$ packed form
3755C918542N6587o9394j09643P2014K16917K21317n8794Q4001J59013P2121J81496
3744D744177O6676k36421j88625p5822l5228j65204M6595j49337m05651O4039
3734C665199P5401j74964l0611P5571n1352J05999L121j07517N45J42066J35814
3723C839272j95806j85735J08247j31082K31063J14448K12767L5320j21490j72217
3713C734787P2856l0315J6517K59796K91678j59204j07475K05011l4619O1189
3703D310221r1297Q3405j70784M3793j60316k32342j82367J55766L31205K51249
3693D338533J600N7105L74286K3560K5749j23553J58407J4847r4905k01381o1077
3682D513171K21585j23162k30538l82192k13293J06117K31388J21253o9320l18812
$$ plain form
3672 3856197 3788444 3776093 3590915 3913014 4200268 4287898 4186825 4285969 4398931 4255694
3662 4255694 4252884 4427650 4434897 4627431 4529281 4551466 4139263 4090382 4432189 4797313 4863898
3651 4863898 4788711 4919585 5048597 5025984 4900024 4928903 4734693 5050523 5027086 5081444
3641 5081444 5272474 5126773 4769396 5155971 5396626 5610106 5786798 5698160 5952275 6191983
3631 6191983 6237528 6505234 6796840 6897904 6834106 7152566 7643610 8037594 8393217 8701484
3621 8701484 8931548 9277666 9158667 8951949 8912756 8733336 8616232 8490588 8206725 8232846
3611 8232846 8168332 8391225 8554920 8512237 8665825 8844420 9455087 10009945 10469455 11296803
3601 11296803 11519546 11595383 11572141 11518083 11660890 12083785 12065483 12222617 12306169 12584801
$$ packed form
3672C856197o7753j2351j85178L22099K87254Q7630j01073R9144J12962j43237
3662D255694k810J74766P247J92534r8150K2185m12203m8881L41807L65124O6585
3651D863898p5187J30874J29012k2613j25960K8879j94210L15830k3437N4358
3641E081444J91030j45701l57377L86575K40655K13480J76692q8638K54115K39708
3631F191983M5545K67706K91606J01064o3798L18460M91044L93984L55623L08267
3621H701484K30064L46118j18999k06718l9193j79420j17104j25644k83863K6121
3611H232846o4514K22893J63695m2683J53588J78595O10667N54858M59510Q27348
3601A1296803K22743P5837k3242n4058J42807M22895j8302J57134Q3552K78632
$$ plain form
3591 12584801 13005959 13061336 13233981 13302254 13363370 13388408 13339792 13135605 13276569 13168401
3581 13168401 13456496 13430142 13730483 13752833 13876720 14187551 14621661 15306824 15917870 16548275
3571 16548275 17238891 18130650 19131534 19947529 21018272 21766539 22507764 23454209 24497187
3562 24497187 25282493 26247705 27085549 27880157 29090503 29954662 30861436 31385740 31630387
3553 31630387 31680585 31756925 31614802 31714555 32136079 32484503 33185047 34004648 34848578 35955711
3543 35955711 37715820 39744622 42124465 44277693 45952236 47553193 48978573 50262133
3535 50262133 51464294 52578470 53513080 54836307 56408255 58120142 60640000 63800137
3527 63800137 68439182 74370956 81089317 88728352 97146905 105061995 112912778 120693165
$$ packed form
3591A2584801M21158N5377J72645O8273O1116K5038m8616k04187J40964j08168
3581A3168401K88095k6354L00341K2350J23887L10831M34110O85163O11046O30405
3571A6548275O90616Q91759J000884Q15995J070743P48267P41225R46445J042978
3562B4497187P85306R65212Q37844P94608J210346Q64159R06774N24304K44647
3553C1630387N0198P6340j42123R9753M21524L48424P00544Q19601Q43930J107133
3543C5955711J760109K028802K379843K153228J674543J600957J425380J283560
3535E0262133J202161J114176R34610J323227J571948J711887K519858L160137
3527F3800137M639045N931774O718361P639035Q418553P915090P850783P780387
$$ plain form
3519 120693165 128027081 133558799 136481671 137048978 134720925 131027644 125888453 119146732
3511 119146732 112190961 105562204 99026730 93794957 89447438 85166147 80534959 75845659
3503 75845659 71536238 67380913 63350599 59769448 56508970 53231631 49788681 47057724
3495 47057724 44118588 41396027 38820661 36559007 34204686 32187805 30230749 28017312
3487 28017312 26114960 24671068 23200972 21877890 21401919 20678394 19986272 19506524 18912676
3478 18912676 18164207 17498864 17254297 17004347 16459395 15934827 15482767 15138904 14226854
3469 14226854 13268534 12664697 12267763 11749513 11162826 10890164 10596755 10136282 9915425
3460 9915425 9531697 9065074 8907157 8734312 8739834 8282241 7899142 7733371 7505192 7323641
$$ packed form
3519A20693165P333916N531718K922872N67307k328053l693281n139191o741721
3511A19146732o955771o628757o535474n231773m347519m281291m631188m689300
3503G5845659m309421m155325m030314l581151l260478l277339l442950k730957
3495D7057724k939136k722561k575366k261654k354321k016881j957056k213437
3487B8017312j902352j443892j470096j323082m75971p23525o92122m79748n93848
3478A8912676p48469o65343k44567k49950n44952n24568m52060l43863r12050
3469A4226854r58320o03837l96934n18250n86687k72662k93409m60473k20857
3460I915425l83728m66623j57917j72845N522m57593l83099j65771k28179j81551
$$ plain form
3450 7323641 6696815 6410873 6268328 5848323 5611113 5577573 5247955 5044609 4587354 4595597
3440 4595597 4515926 4698193 4513885 4169510 3872058 3998699 3821475 3381488 3394502 3510820
3430 3510820 3372551 3209012 3422413 3109965 2988042 3041071 2739165 2624687 2711981 2628424
3420 2628424 2671952 3023002 3282747 3103225 2881381 2868424 2816825 2597987 2894997 2856690
3410 2856690 2709541 2573505 2599147 2370828 2378198 2319221 2153389 2159652 2254130 2406505 2286943
3399 2286943 2431745 2386000 2275208 2167565 1983764 2124478 2228825 2040907 1844684 1952927
3389 1952927 1796788 1636386 1563572 1670610 1598730 1685962 1700717 1488152 1487589 1261802 1127931
3378 1127931 1169238 1188464 1240770 1235641 1069873 1108259 1425239 1132800 1285642 1036753 1024325
$$ packed form
3450G323641o26826k85942j42545m20005k37210l3540l29618k03346m57255Q243
3440D595597p9671J82267j84308l44375k97452J26641j77224m39987J3014J16318
3430C510820j38269j63539K13401l12448j21923N3029l01906j14478Q7294q3557
3420B628424M3528L51050K59745j79522k21844j2957n1599k18838K97010l8307
3410B856690j47149j36036K5642k28319P370n8977j65832O263R4478J52375j19562
3399B286943J44802m5745j10792j07643j83801J40714J04347j87918j96223J08243
3389A952927j56139j60402p2814J07038p1880Q7232J4755k12565n63k25787j33871
3378A127931M1307J9226N2306n129j65768L8386L16980k92439J52842k48889j2428
$$ plain form
3367 1024325 1228535 1359873 1464474 1456259 1348232 1253616 1232464 1213302 1277731 1310733 1461383
3356 1461383 1412955 1377227 1082030 1002902 873880 877885 1529299 1678537 1589534 1738757 1617470
3345 1617470 1342583 1241566 1164781 1298063 1380694 1457793 1476545 1068054 1152760 1057496 856115
3334 856115 802493 1098832 745294 772304 893010 1199293 1307529 1080448 873622 809036
3324 809036 964854 1082867 832117 730561 706459 660329 779185 982520 1008815 802744
3314 802744 770284 1292907 1182206 1147292 1015051 928823 878784 958073 1003335 1124999 1529251
3303 1529251 1482244 1206127 1265480 1264791 1177067 1284407 1210010 1244376 1187738 1390550 1501625
3292 1501625 1423308 1459138 1604134 1167965 1381827 1898923 1786542 1616249 1795432 1823320
$$ packed form
3367A024325K04210J31338J04601q215j08027r4616k1152j9162O4429L3002J50650
3356A461383m8428l5728k95197p9128j29022M005O51414J49238q9003J49223j21287
3345A617470k74887j01017p6785J33282Q2631P7099J8752m08491Q4706r5264k01381
3334H56115n3622K96339l53538K7010J20706L06283J08236k27081k06826o4586
3324H09036J55818J18013k50750j01556k4102m6130J18856K03335K6295k06071
3314H02744l2460N22623j10701l4914j32241q6228n0039P9289M5262J21664M04252
3303A529251m7007k76117N9353o89q7724J07340p4397L4366n6638K02812J11075
3292A501625p8317L5830J44996m36169K13862N17096j12381j70293J79183K7888
$$ plain form
3282 1823320 1903665 1703780 1565464 1665304 1991928 2058341 1875221 2000603 2006090 2395793
3272 2395793 2243872 2103561 2209496 2250784 2486936 2481560 2462235 2694667 2532166 2471215
3262 2471215 2608193 2779276 2846504 2946476 2966990 2941759 3017541 3191275 3347612 3461694
3252 3461694 3545915 3450133 3651372 3684875 3943780 4192386 4451224 4395702 4349116 4404961 4701322
3241 4701322 4800711 4877550 4988252 5248623 5207540 5212058 5242098 5484349 5946648 6155503 6154456
3230 6154456 6413297 6482525 6941161 7300789 7504873 7728505 7777136 8012679 8291641 8378916
3220 8378916 8992217 9814672 10292714 10563216 11517665 12173322 12962305 14053509 15028734
3211 15028734 16324575 17413051 18971839 20580623 22584462 24961151 27325405 29971381
$$ packed form
3282A823320Q0345j99885j38316R9840L26624O6413j83120J25382N487L89703
3272B395793j51921j40311J05935M1288K36152n376j9325K32432j62501o0951
3262B471215J36978J71083O7228R9972K0514k5231P5782J73734J56337J14082
3252C461694Q4221r5782K01239L3503K58905K48606K58838n5522m6586N5845K96361
3241D701322R9389P6839J10702K60371m1083M518L0040K42251M62299K08855j047
3230F154456K58841O9228M58636L59628K04084K23632M8631K35543K78962Q7275
3220H378916O13301Q22455M78042K70502R54449O55657P88983J091204R75225
3211A5028734J295841J088476J558788J608784K003839K376689K364254K645976
$$ plain form
3203 29971381 32908294 36168972 39136801 41948873 44076191 44552941 44120899 43456572 42785681
3194 42785681 42040985 41678154 41517775 41500599 41546256 41602204 41143868 40789898 40764586 40622130
3184 40622130 40968156 41559916 42199637 42866540 43698652 44661745 46157799 48399708 51615922
3175 51615922 56932484 66092586 79728084 96725991 111608863 115953449 109707258 98348997
3167 98348997 85842537 73298112 62604398 54340647 47964149 43062313 39374753 36505311
3159 36505311 34750586 33326537 31789009 30536297 29618874 28825543 28423707 28377821 28467220
3150 28467220 28452497 28412168 29142910 30219694 31115512 32594287 34869423 37605810 39856377
3141 39856377 41875276 43235639 42820871 40630661 37459206 33514753 30029501 26957450
$$ packed form
3203B9971381K936913L260678K967829K812072K127318M76750m32042o64327o70891
3194D2785681p44696l62831j60379j7176M5657N5948m58336l53970k5312j42456
3184D0622130L46026N91760O39721O66903Q32112R63093J496054K241909L216214
3175E1615922N316562R160102J3635498J6997907J4882872M344586o246191j1358261
3167I8348997j2506460j2544425j0693714q263751o376498m901836l687560k869442
3159C6505311j754725j424049j537528j252712r17423p93331m01836m5886Q9399
3150B8467220j4723m0329P30742J076784Q95818J478775K275136K736387K250567
3141C9856377K018899J360363m14768k190210l171455l944453l485252l072051
$$ plain form
3133 26957450 24082949 21425946 19348024 17666147 16078631 14495993 13422617 12737028
3125 12737028 12294842 11563190 10796527 9980277 9256574 8924317 8651317 8293941 7650709
3116 7650709 7086839 6666303 6364378 6136851 5852351 5486446 5080138 4783831 4676682 4079872
3106 4079872 3790917 3368872 3368401 3326252 3044159 2971406 3121936 3069391 2691297 2425863 2422952
3095 2422952 2182370 2162777 2219483 2071729 2154428 2107650 1815528 1812859 1660971 1798984 1612320
3084 1612320 1172064 1086936 1354596 1112243 1049044 1200796 1016948 925772 649247 539459
3074 539459 735196 887674 734097 805568 658654 338118 339781 503189 265107 40398
3064 40398 254045 486877 610271 319086 164123 304711 182711 164676 225061 395711
$$ packed form
3133B6957450k874501k657003k077922j681877j587516j582638j073376o85589
3125A2737028m42186p31652p66663q16250p23703l32257k73000l57376o43232
3116G650709n63870m20536l01925k27527k84500l65905m06308k96307j07149n96810
3106D079872k88955m22045m71m2149k82093p2753J50530n2545l78094k65434k911
3095B422952k40582j9593N6706j47754Q2699m6778k92122k669j51888J38013j86664
3084A612320m40256q5128K67660k42353o3199J51752j83848r1176k76525j09788
3074E39459J95737J52478j53577P1471j46914l20536J663J63408k38082k24709
3064D0398K13647K32832J23394k91185j54963J40588j22000j8035O0385J70650
$$ plain form
3054 395711 329578 154799 75786 -36412 76855 -46634 65853 20466 7291 -4893 -90646
3043 -90646 23120 -63552 -195248 -127252 150560 -104707 -412465 -442211 -301255 -371142 -430556
3032 -430556 -626430 -859184 -520832 -364985 -375661 -234812 -275519 -651081 -654185 -608971 -291321
3021 -291321 -408108 -684699 -410387 -163583 -51222 -71653 -272468 -568542 -546013 -685645
3011 -685645 -599054 -313273 -141834 -155926 -252086 -272442 -418290 -495607 -519077 -630346 -495079
3000 -495079 -590247 -585825 -659621 -754280 -757049 -723736 -558406 -765694 -569721 -430481 -469372
2989 -469372 -835175 -714941 -568526 -557200 -889780 -746847 -505425 -637842 -689918 -620781
2979 -620781 -592953 -597903 -499556 -491612 -593016 -773837 -857219 -828016 -971379 -721922 -657564
$$ packed form
3054C95711o6133j74779p9013j12198J13267j23489J12487m5387j3175j2184q5753
3043i0646J13766q6672j31696O7996K77812k55267l07758k9746J40956o9887n9414
3032d30556j95874k32754L38352J55847j0676J40849m0707l75562l104M5214L17650
3021b91321j16787k76591K74312K46804J12361k0431k00815k96074K2529j39632
3011f85645Q6591K85781J71439j4092r6160k0356j45848p7317k3470j11269J35267
3000d95079r5168M422p3796r4659k769L3313J65330k07288J95973J39240l8891
2989d69372l65803J20234J46415J1326l32580J42933K41422j32417n2076O9137
2979f20781K7828m950R8347P944j01404j80821q3382K9203j43363K49457O4358
$$ plain form
2968 -657564 -715059 -488947 -733067 -740341 -846750 -933446 -1017941 -986490 -792415 -924341 -826269
2957 -826269 -612426 -742679 -791526 -664812 -699002 -894342 -541412 -903870 -959146 -739633
2947 -739633 -847016 -946832 -1018707 -1068712 -1022135 -929646 -840600 -835458 -890433 -965570 -719101
2936 -719101 -814346 -775847 -797597 -723429 -587973 -679691 -480023 -697356 -1071979 -834376 -801201
2925 -801201 -589892 -522897 -432151 -685797 -494505 -430408 -668454 -675827 -645420 -646077 -670915
2914 -670915 -708397 -603843 -433945 -493241 -542516 -561826 -692006 -1063298 -1082798 -840142 -470717
2903 -470717 -585770 -519442 -596235 -636591 -636655 -375640 -584020 -802956 -668038 -382966 -280904
2892 -280904 -414618 -604996 -557391 -190265 -41126 -25958 -91359 -168465 -186759 -200806 -265753
$$ packed form
2968f57564n7495K26112k44120p274j06409q6696q4495L1451J94075j31926R8072
2957h26269K13843j30253m8847J26714l4190j95340L52930l62458n5276K19513
2947g39633j07383r9816p1875n0005M6577R2489Q9046N142n4975p5137K46469
2936g19101r5245L8499k1750P4168J35456r1718J99668k17333l74623K37603L3175
2925h01201K11309O6995R0746k53646J91292O4097k38046p373L0407o57k4838
2914f70915l7482J04554J69898n9296m9275j9310j30180l71292j9500K42656L69425
2903d70717j15053O6328p6793m0356o4K61015k08380k18936J34918K85072J02062
2892b80904j33714j90378M7605L67126J49139J5168o5401p7106j8294j4047o4947
$$ plain form
2881 -265753 -126975 -216359 -508895 -682377 -702256 -607470 -633265 -527182 -457779 -689310 -684144
2870 -684144 -545781 -619175 -701292 -515038 -536730 -685162 -624157 -768309 -885614 -758604
2860 -758604 -660466 -631059 -305740 -374695 -648470 -710969 -788981 -789014 -897081 -744825 -612076
2849 -612076 -619217 -733328 -882151 -800858 -695527 -668946 -681025 -714675 -622627 -517909 -613456
2838 -613456 -740445 -787249 -1055550 -1164447 -996582 -1175097 -873840 -700817 -854561 -990769
2828 -990769 -877707 -940592 -594909 -320230 -570941 -572856 -695806 -762440 -659152 -863449
2818 -863449 -941932 -661746 -650675 -648687 -627870 -955283 -971705 -910182 -971836 -1193580 -1103749
2807 -1103749 -921870 -1095169 -970850 -910863 -856995 -757946 -682923 -713361 -1015496 -767298
$$ packed form
2881b65753J38778q9384k92536j73482j9879R4786k5795J06083O9403k31531N166
2870f84144J38363p3394q2117J86254k1692j48432O1005j44152j17305J27010
2860g58604R8138K9407L25319o8955k73775o2499p8012l3j08067J52256J32749
2849f12076p141j14111j48823Q1293J05331K6581j2079l3650R2048J04718r5547
2838f13456j26989m6804k68301j08897J67865j78515L01257J73023j53744j36208
2828i90769J13062o2885L45683K74679k50711j915j22950o6634J03288k04297
2818h63449p8483K80186J1071J988K0817l27413j6422O1523o1654k21744Q9831
2807a103749J81879j73299J24319N9987N3868R9049P5023l0438l02135K48198
$$ plain form
2797 -767298 -631178 -837347 -660164 -623748 -586605 -712633 -606294 -810934 -722283 -411738
2787 -411738 -573155 -606133 -506277 -465890 -493973 -595576 -714948 -543665 -456338 -588109 -847150
2776 -847150 -729047 -669531 -875803 -1000271 -804286 -791740 -762542 -821988 -822868 -771696 -797980
2765 -797980 -885967 -1007532 -1205559 -937036 -882012 -803961 -716176 -768164 -787657 -1064156 -1021887
2754 -1021887 -468065 -699697 -935563 -906542 -842376 -501236 -746884 -766976 -726057 -516004
2744 -516004 -555889 -601344 -590361 -726922 -804168 -612747 -620039 -889858 -773592 -804815 -791925
2733 -791925 -935111 -1003590 -594614 -538213 -571964 -896671 -745334 -803086 -777673 -807748 -748728
2722 -748728 -603230 -524717 -267519 -383303 -674453 -806278 -965284 -980281 -760996 -726089
$$ packed form
2797g67298J36120k06169J77183L6416L7143j26028J06339k04640Q8651L10545
2787d11738j61417l2978R9856M0387k8083j01603j19372J71283Q7327j31771k59041
2776h47150J18103N9516k06272j24468J95985J2546K9198n9446q80N1172k6284
2765g97980q7987j21565j98027K68523N5024P8051Q7785n1988j9493k76499M2269
2754a021887N53822k31632k35866K9021O4166L41140k45648k0092M0919K10053
2744e16004l9885m5455J0983j36561p7246J91421p292k69819J16266l1223J2890
2733g91925j43186o8479M08976N6401l3751l24707J51337n7752K5413l0075N9020
2722g48728J45498P8513K57198j15784k91150j31825j59006j4997K19285L4907
$$ plain form
2712 -726089 -944529 -667226 -929874 -826627 -911661 -1113733 -995437 -1101110 -986840 -799403
2702 -799403 -608846 -667599 -726257 -608756 -737036 -819268 -744031 -586414 -659196 -860712 -734093
2691 -734093 -862143 -859512 -706544 -687900 -554185 -675949 -748235 -677487 -746674 -508148 -595208
2680 -595208 -781300 -562044 -523993 -584027 -536379 -289272 -242251 -521810 -445892 -456630 -298979
2669 -298979 -128407 -253590 -341532 -353534 -399557 -530278 -410857 -310947 -315557 -557031 -423574
2658 -423574 -260604 -382955 -463382 -595099 -567745 -661560 -411743 -188882 -234819 -351749
2648 -351749 -319916 -523602 -578827 -477569 -256791 -315246 -127575 277396 866448 1313496
2638 1313496 1531910 1705092 1472942 1045056 514417 418133 94308 -117373 -113872 -196778
$$ packed form
2712g26089k18440K77303k62648J03247q5034k02072J18296j05673J14270J87437
2702g99403J90557n8753n8658J17501j28280q2232P5237J57617p2782k01516J26619
2691g34093j28050K631J52968J8644J33715j21764p2286P0748o9187K38526q7060
2680e95208j86092K19256L8051o0034M7648K47107M7021k79559P5918j0738J57651
2669b98979J70572j25183q7942j2002m6023j30721J19421R9910m610k41474J33457
2658d23574J62970j22351q0427j31717K7354r3815K49817K22861m5937j16930
2648c51749L1833k03686n5225J01258K20778n8455J87671M04971N89052M47048
2638A313496K18414J73182k32150m27886n30639r6284l23825k11681L501q2906
$$ plain form
2628 -196778 -345311 -261691 -532118 -712212 -373505 -232229 -329924 -400186 -218795 -332135
2618 -332135 -331770 -163150 -111938 -240829 -489958 -499168 -223371 -501224 -608837 -535885 -388183
2607 -388183 -257407 -153076 -87207 -84785 -353765 -583801 -605104 -452766 -281596 -267759 -446025
2596 -446025 -657477 -627133 -688809 -787680 -702611 -700523 -563160 -377742 -478166 -569790 -139434
2585 -139434 -166761 -417830 -435879 -422386 -671371 -810046 -653993 -463102 -120409 -245481
2575 -245481 -358017 -249161 -527634 -746721 -548650 -611839 -311038 -194962 -175153 -171398
2565 -171398 -338223 -385300 -190565 -251060 -263646 -3270 -225987 -384448 -215702 -19197
2555 -19197 36044 -34553 -44968 -159207 -187751 -75792 -336925 -431077 -369586 -316462 -179351
$$ packed form
2628a96778j48533Q3620k70427j80094L38707J41276r7695p0262J81391j13340
2618c32135L65J68620N1212j28891k49129r210K75797k77853j07613P2952J47702
2607c88183J30776J04331O5869K422k68980k30036k1303J52338J71170J3837j78266
2596d46025k11452L0344o1676r8871Q5069K088J37363J85418j00424r1624M30356
2585a39434k7327k51069j8049J3493k48985j38675J56053J90891L42693j25072
2575b45481j12536J08856k78473k19087J98071o3189L00801J16076J9809L755
2565a71398j66825m7077J94735o0495j2586K60376k22717j58461J68746J96505
2555a9197N5241p0597j0415j14239k8544J11959k61133r4152O1491N3124J37111
$$ plain form
2544 -179351 -192918 -135067 -355973 -258543 -51843 -94180 -25624 -18254 -219477 -301925 -114380
2533 -114380 -283795 -267590 -35651 109177 136014 -50953 -123328 185963 89409 -82009
2523 -82009 -247898 60481 112483 -112361 -52740 89772 333661 340412 314030 227410 357084
2512 357084 326919 350648 274058 281046 318749 379154 389710 322178 -15155 58922 229102
2501 229102 -22787 36905 -31186 55447 439930 702781 629493 361795 8098 56717 167402
2490 167402 539123 545411 402898 582715 579393 615610 638686 488642 572970 806012 466930
2479 466930 583034 751812 540405 491079 516861 798778 1023735 847677 763060 698119
2469 698119 1188061 1273842 1253551 1293170 1478525 1509927 1615353 1632537 1412912 1113432 1185973
$$ packed form
2544a79351j3567N7851k20906R7430K06700m2337O8556P370k01223q2448J87545
2533a14380j69415J6205K31939J44828K6837j86967p2375L09291r6554j71418
2523h2009j65889L08379N2002k24844N9621J42512K43889O751k6382q6620J29674
2512C57084l0165K3729p6590O988L7703O0405J0556o7532l37333P4077J70180
2501B29102k51889N9692o8091Q6633L84483K62851p3288k67698l53697M8619J10685
2490A67402L71721O288j42513J79817l322L6217K3076j50044Q4328K33042l39082
2479D66930J16104J68778k11407m9326K5782K81917K24957j76058q4617o4941
2469F98119M89942Q5781k0291L9619J85355L1402J05426J7184k19625k99480P2541
$$ plain form
2458 1185973 1418922 1366886 1368708 1459943 1655620 1554758 1612120 1640432 1754441 1746350 1602958
2447 1602958 2028068 2058884 2164315 1984470 2202542 2066744 1974876 2199892 2200943 2355876
2437 2355876 2325067 2259136 2398687 2238994 2428143 2649472 2737878 2867430 2872532 2633411
2427 2633411 2768239 2815670 2900905 3287117 3598020 3757774 3819400 4118293 4064404 4432396
2417 4432396 4587796 4367175 4667248 4886206 5224445 5506529 5722331 5643921 6198981 6747023
2407 6747023 7115327 7332670 7734886 7775490 7832872 7813047 8149168 8529240 8829516 9586519
2397 9586519 10058110 11033790 11977813 12664937 13575251 14377161 15635953 17581104 19896834
2388 19896834 23357913 27556771 31105865 31826917 32643765 33688050 35558400 38158476
$$ packed form
2458A185973K32949n2036J822R1235J95677j00862N7362K8312J14009q091j43392
2447A602958M25110L0816J05431j79845K18072j35798r1868K25016J051J54933
2437B355876l0809o5931J39551j59693J89149K21329Q8406J29552N102k39121
2427B633411J34828M7431Q5235L86212L10903J59754O1626K98893n3889L67992
2417D432396J55400k20621L00073K18958L38239K82084K15802p8410N55060N48042
2407F747023L68304K17343M02216M0604N7382j9825L36121L80072L00276P57003
2397I586519M71591R75680R44023O87124R10314Q01910J258792J945151K315730
2388A9896834L461079M198858L549094P21052Q16848J044285J870350K600076
$$ plain form
2380 38158476 42681924 47973649 55906912 65596709 81594114 110778812 174508599 270693913
2372 270693913 382931376 435258707 386518247 307894872 235486827 172082194 126878338
2365 126878338 96295715 73657630 56995922 44711131 36007665 30106820 27766827
2358 27766827 26985617 27958090 27602950 25289956 22353359 19502943 16836630 14978116 13252956
2349 13252956 11855103 10980535 10665436 9685421 9294889 8924758 8430621 8142378 7904039
2340 7904039 7473449 6825287 6179052 6072821 5799260 5854423 5506950 5398234 5380425 5320824
2330 5320824 5031725 4940916 4571765 4545471 4431747 4141033 3772186 3744412 3565263 3787474
2320 3787474 3844936 3669019 3730643 3567504 3411128 3105653 2972129 3016007 2852178 2670141
$$ packed form
2380C8158476M523448N291725P933263R689797J5997405K9184698O3729787R6185314
2372B70693913J12237463N2327331m8740460p8623375p2408045o3404633m5203856
2365A26878338l0582623k2638085j6661708j2284791q703466n900845k339993
2358B7766827p81210R72473l55140k312994k936597k850416k666313j858514j725160
2349A3252956j397853q74568l15099r80015l90532l70131m94137k88243k38339
2340G904039m30590o48162o46235j06231k73561N5163l47473j08716j7809n9601
2330E320824k89099r0809l69151k6294j13724k90714l68847k7774j79149K22211
2320C787474N7462j75917O1624j63139j56376l05475j33524M3878j63829j82037
$$ plain form
2310 2670141 2548419 2765610 2476410 2029953 1970161 1857451 1884378 1959412 1752149 1615137
2300 1615137 1417179 1360781 1280832 1107208 1383652 1362318 1214554 1093414 926456 832743
2290 832743 1010186 1235200 1032666 751799 866949 1117415 825152 588093 562802 860334
2280 860334 886189 412218 183256 576283 453592 423971 440138 322007 455910 298677
2270 298677 190611 -84830 -99225 46444 191731 115752 -68982 -20513 67541 272710
2260 272710 329030 186442 229663 402090 169986 -106218 -173083 -111518 -22589 -71945 -139560
2249 -139560 -286400 -125529 -288632 -228588 -453202 -314761 -94118 35596 -99133 -304853
2239 -304853 -138660 -200466 -367202 -308984 -423016 -96586 -273406 -634901 -507071 -376756
$$ packed form
2310B670141j21722K17191k89200m46457n9792j12710K6927P5034k07263j37012
2300A615137j97958n6398p9949j73624K76444k1334j47764j21140j66958r3713
2290H32743J77443K25014k02534k80867J15150K50466k92263k37059k5291K97532
2280H60334K5855m73971k28962L93027j22691k9621J6167j18131J33903j57233
2270B98677j08066k75441j4395J45669J45287p5979j84734M8469Q8054K05169
2260B72710N6320j42588M3221J72427k32104k76204o6865O1565Q8929m9356o7615
2249a39560j46840J60871j63103O0044k24614J38441K20643J29714j34729k05720
2239c04853J66193o1806j66736N8218j14032L26430j76820l61495J27830J30315
$$ plain form
2229 -376756 -363767 -398981 -328840 -524112 -597110 -494585 -304438 -260714 -394831 -233777 -242713
2218 -242713 -366572 -633936 -551097 -461533 -501970 -819378 -1005141 -596987 -501477 -570259 -403895
2207 -403895 -579365 -691455 -808017 -575767 -409293 -339131 -187210 -323162 -513417 -363519
2197 -363519 -403428 -633037 -739084 -536204 -450539 -566064 -723346 -812887 -628315 -878249
2187 -878249 -835738 -681842 -650187 -544900 -698636 -366788 -400826 -440456 -699893 -650495 -558260
2176 -558260 -612598 -522702 -818579 -661230 -626652 -572372 -708842 -715707 -793023 -650667 -789011
2165 -789011 -888646 -759683 -666673 -438198 -605030 -394623 -262598 -514461 -761003 -717401
2155 -717401 -728588 -833428 -928527 -1072678 -996982 -1008694 -988098 -672237 -628505 -656524 -690874
$$ packed form
2229c76756J2989l5214P0141j95272p2998J02525J90147M3724j34117J61054q936
2218b42713j23859k67364Q2839Q9564m0437l17408j85763M08154R5510o8782J66364
2207d03895j75470j12090j16562K32250J66474P0162J51921j35952j90255J49898
2197c63519l9909k29609j06047K02880Q5665j15525j57282q9541J84572k49934
2187h78249M2511J53896L1655J05287j53736L31848l4038l9630k59437M9398R2235
2176e58260n4338Q9896k95877J57349L4578N4280j36470o865p7316J42356j38344
2165g89011r9635J28963R3010K28475j66832K10407J32025k51863k46542M3602
2155g17401j1187j04840r5099j44151P5696j1712K0596L15861M3732k8019l4350
$$ plain form
2144 -690874 -644520 -628368 -797808 -986906 -810461 -514299 -798532 -860574 -830216 -834329 -1067572
2133 -1067572 -835819 -680045 -615900 -936754 -884319 -706354 -691654 -945883 -902008 -890014
2123 -890014 -969940 -623892 -686062 -932932 -668285 -543231 -435653 -612498 -816076 -913784
2113 -913784 -819598 -557973 -589181 -769286 -881243 -650054 -291092 -281819 12748 650535
2103 650535 862986 1110120 1356702 919522 405652 191597 -229722 -360219 -500691 -436446
2093 -436446 -388140 -648952 -809239 -785953 -924430 -810397 -722279 -614622 -665091 -752504 -659889
2082 -659889 -758790 -637911 -669123 -771459 -722322 -794789 -933165 -1092624 -992513 -936432 -690708
2071 -690708 -715212 -613629 -944957 -1080133 -916723 -1164821 -1070783 -1083273 -815587 -675543
$$ packed form
2144f90874M6354J6152j69440j89098J76445K96162k84233o2042L0358m113k33243
2133a067572K31753J55774O4145l20854N2435J77965J4700k54229M3875J1994
2123h90014p9926L46048o2170k46870K64647J25054J07578j76845k03578r7708
2113i13784R4186K61625l1208j80105j11957K31189L58962R273K94567O37787
2103F50535K12451K47134K46582m37180n13870k14055m21319j30497j40472O4245
2093d36446M8306k60812j60287K3286j38477J14033Q8118J07657n0469q7413R2615
2082f59889r8901J20879l1212j02336M9137p2467j38376j59459J00111N6081K45724
2071f90708k4504J01583l31328j35176J63410k48098R4038j2490K67686J40044
$$ plain form
2061 -675543 -548873 -625757 -932728 -875728 -642828 -611555 -356417 -658413 -712815 -701141 -678310
2050 -678310 -807413 -992968 -988292 -1075925 -1057378 -950402 -712461 -1070147 -911435 -748521
2040 -748521 -868798 -854328 -738789 -976821 -1073823 -850637 -799388 -905550 -906041 -891548 -884543
2029 -884543 -998918 -1061569 -1141135 -1188957 -1125312 -1053065 -794471 -749889 -677353 -795233 -996615
2018 -996615 -878247 -750752 -726667 -760317 -609151 -738904 -834087 -742205 -777695 -816143 -754075
2007 -754075 -742214 -630277 -637848 -960495 -720457 -619962 -779515 -724282 -800205 -809161 -698323
1996 -698323 -904555 -1008882 -748726 -830605 -699850 -798365 -761557 -585460 -510369 -763204
1986 -763204 -782101 -756858 -832071 -584967 -620963 -823137 -1072396 -999087 -1078903 -1374971 -1439040
$$ packed form
2061f75543J26670p6884l06971N7000K32900L1273K55138l01996n4402J1674K2831
2050f78310j29103j85555M676q7633J8547J06976K37941l57686J58712J62914
2040g48521j20277J4470J15539k38032r7002K23186N1249j06162m91J4493P005
2029h84543j14375o2651p9566m7822O3645P2247K58594M4582P2536j17880k01382
2018i96615J18368J27495K4085l3650J51166j29753r5183R1882l5490l8448O2068
2007g54075J1861J11937p571l22647K40038J00495j59553N5233p5923q956J10838
1996f98323k06232j04327K60156q1879J30755r8515L6808J76097P5091k52835
1986g63204j8897K5243p5213K47104l5996k02174k49259P3309p9816k96068o4069
$$ plain form
1975 -1439040 -1102962 -1135780 -913964 -836147 -832890 -890479 -712669 -541513 -760749 -640651
1965 -640651 -710657 -884810 -770425 -897053 -945650 -1065962 -1010586 -738135 -596241 -410033
1955 -410033 -571873 -515665 -816145 -1029640 -973416 -873394 -911030 -751961 -711169 -907187
1945 -907187 -870104 -852031 -753711 -583706 -658952 -772932 -493231 -669103 -955885 -1311632
$$ packed form
1975a439040L36078l2818K21816P7817L257n7589J77810J71156k19236J20098
1965f40651p0006j74153J14385j26628m8597j20312N5376K72451J41894J86208
1955d10033j61840N6208l00480k13495N6224J00022l7636J59069M0792j96018
1945i07187L7083J8073R8320J70005p5246j13980K79701j75872k86782l55747
$$ [...]
##END NTUPLES=NMR SPECTRUM
##END=
