##TITLE=1H_DE-80H_X3
 200.13MHz, d2o
 8 sc
 
 19ns.26.2.2025
##JCAMPDX= 6.0         $$ Bruker NMR JCAMP-DX V2.0
##DATA TYPE= NMR SPECTRUM
##DATA CLASS= NTUPLES
##ORIGIN= UXNMR, Bruker Analytische Messtechnik GmbH
##OWNER= pz
$$ XWIN-NMR		Version 3.5
$$ Thu Mar  5 10:19:06 2026 Russian Standard Time (UT+4h)  Yarkov@DPX200
##.OBSERVE FREQUENCY= 200.1313
##.OBSERVE NUCLEUS= ^1H
##.ACQUISITION MODE= SIMULTANEOUS
##.ACQUISITION SCHEME= undefined
##.AVERAGES= 8
##.DIGITISER RES= 18
##SPECTROMETER/DATA SYSTEM= spect
##.PULSE SEQUENCE= zg30
##.SOLVENT NAME= DMSO
##.SHIFT REFERENCE= (INTERNAL, DMSO, 0, 15.4626)
##AUDIT TRAIL= $$ (NUMBER, WHEN, WHO, WHERE, WHAT)
$$ ##TITLE= Audit trail, XWIN-NMR		Version 3.5
$$ ##JCAMPDX= 5.01
$$ ##ORIGIN= Bruker BioSpin GmbH
$$ ##OWNER= Yarkov
$$ C:/Bruker/XWIN-NMR/data/yarkov2/nmr/H-C/1/pdata/1/auditp.txt
$$ ##AUDIT TRAIL=  $$ (NUMBER, WHEN, WHO, WHERE, WHAT)
(   1,<2026-03-05 10:18:08.21 +0400>,<Yarkov>,<DPX200>,
      <created by zg, POWCHK disabled, PULCHK disabled
       configuration hash MD5:
       00 E9 B6 7A A2 85 ED C7 34 08 36 98 17 FE 4E 26
       data hash MD5: 16K
       64 8F 64 C2 E1 89 1C 41 22 3C 06 77 39 AC 64 10>)
(   2,<2026-03-05 10:18:15.76 +0400>,<Yarkov>,<DPX200>,
      <Start of raw data processing
       efp BC_mod = 2 LB = 0.25 FT_mod = 6 PKNL = 1 PHC0 = -5299.748 PHC1 = 6.821927 SI = 16K 
       data hash MD5: 16K
       E8 21 DB 22 43 C9 5A A2 13 1D 29 B8 4B 29 49 80>)
$$ ##END=
$$ 
$$ hash MD5
$$ EA AC DF 72 01 56 2C 27 72 25 B9 E3 F7 70 05 38
##$RELAX= 
##$RELAX= 
##$RELAX= 
##$RELAX= 
##$RELAX= 
##$RELAX= 
$$ Bruker specific parameters
$$ --------------------------
##$DU= <C:/Bruker/XWIN-NMR>
##$EXPNO= 1
##$NAME= <H-C>
##$PROCNO= 1
##$TYPE= <nmr>
##$USER= <yarkov2>
##$AMP= (0..31)
100 100 100 100 100 100 100 100 100 100 100 100 100 100 100 100 100 100 
100 100 100 100 100 100 100 100 100 100 100 100 100 100 
##$AQSEQ= 0
##$AQ_mod= 1
##$AUNM= <au_zg>
##$AUTOPOS= <>
##$BF1= 200.13
##$BF2= 200.13
##$BF3= 200.13
##$BF4= 200.13
##$BF5= 200.13
##$BF6= 200.13
##$BF7= 200.13
##$BF8= 200.13
##$BYTORDA= 1
##$CFDGTYP= 0
##$CFRGTYP= 5
##$CHEMSTR= <none>
##$CNST= (0..31)
1 1 145 1 1 1 1 1 1 1 1 1 1 1 1 1 1 1 1 1 1 1 1 1 1 1 1 1 1 1 1 1 
##$CPDPRG= <>
##$CPDPRG1= <>
##$CPDPRG2= <>
##$CPDPRG3= <>
##$CPDPRG4= <mlev>
##$CPDPRG5= <mlev>
##$CPDPRG6= <mlev>
##$CPDPRG7= <mlev>
##$CPDPRG8= <mlev>
##$CPDPRGB= <>
##$CPDPRGT= <>
##$D= (0..31)
0 0.7 0 0 0 0 0 0 0 0 0 0.03 0 0 0 0 0 0 0 0 0 0 0 0 0 0 0 0 0 0 0 0 
##$DATE= 1772691487
##$DBL= (0..7)
120 120 120 120 120 120 120 120 
##$DBP= (0..7)
150 150 150 150 150 150 150 150 
##$DBP07= 0
##$DBPNAM0= <>
##$DBPNAM1= <>
##$DBPNAM2= <>
##$DBPNAM3= <>
##$DBPNAM4= <>
##$DBPNAM5= <>
##$DBPNAM6= <>
##$DBPNAM7= <>
##$DBPOAL= (0..7)
0.5 0.5 0.5 0.5 0.5 0.5 0.5 0.5 
##$DBPOFFS= (0..7)
0 0 0 0 0 0 0 0 
##$DE= 6
##$DECBNUC= <off>
##$DECIM= 32
##$DECNUC= <off>
##$DECSTAT= 4
##$DIGMOD= 1
##$DIGTYP= 9
##$DL= (0..7)
0 120 120 120 120 120 120 120 
##$DP= (0..7)
$$ [...]
##$SUBNAM2= <"">
##$SUBNAM3= <"">
##$SUBNAM4= <"">
##$SUBNAM5= <"">
##$SUBNAM6= <"">
##$SUBNAM7= <"">
##$SUBNAM8= <"">
##$SUBNAM9= <"">
##$SW= 18.0517328524113
##$SWIBOX= (0..15)
0 0 2 0 0 0 0 0 0 0 0 0 0 0 0 0 
##$SW_h= 3612.71676300578
##$TD= 16384
##$TD0= 1
##$TE= 0
##$TE2= 300
##$TE3= 300
##$TEG= 300
##$TL= (0..7)
0 120 120 120 120 120 120 120 
##$TP= (0..7)
150 150 150 150 150 150 150 150 
##$TP07= 0
##$TPNAME0= <>
##$TPNAME1= <>
##$TPNAME2= <>
##$TPNAME3= <>
##$TPNAME4= <>
##$TPNAME5= <>
##$TPNAME6= <>
##$TPNAME7= <>
##$TPOAL= (0..7)
0.5 0.5 0.5 0.5 0.5 0.5 0.5 0.5 
##$TPOFFS= (0..7)
0 0 0 0 0 0 0 0 
##$TUNHIN= 0
##$TUNHOUT= 0
##$TUNXOUT= 0
##$USERA1= <user>
##$USERA2= <user>
##$USERA3= <user>
##$USERA4= <user>
##$USERA5= <user>
##$V9= 5
##$VALIST= <valist>
##$VCLIST= <CCCCCCCCCCCCCCC>
##$VD= 0
##$VDLIST= <DDDDDDDDDDDDDDD>
##$VPLIST= <PPPPPPPPPPPPPPP>
##$VTLIST= <TTTTTTTTTTTTTTT>
##$WBST= 1024
##$WBSW= 4
##$XGAIN= (0..3)
0 0 0 0 
##$XL= 0
##$YL= 0
##$YMAX_a= 226392
##$YMIN_a= -170903
##$ZGOPTNS= <>
##$ZL1= 120
##$ZL2= 120
##$ZL3= 120
##$ZL4= 120
##$ABSF1= 0
##$ABSF2= 0
##$ABSG= 0
##$ABSL= 0
##$ALPHA= 0
##$AQORDER= 0
##$ASSFAC= 0
##$ASSFACI= 0
##$ASSFACX= 0
##$ASSWID= 0
##$AUNMP= <proc_1d>
##$AZFE= 0.1
##$AZFW= 0.1
##$BCFW= 0
##$BC_mod= 2
##$BYTORDP= 0
##$COROFFS= 0
##$CY= -3
##$DATMOD= 1
##$DC= 0
##$DFILT= <>
##$DTYPP= 0
##$F1P= 0
##$F2P= 0
##$FCOR= 1
##$FTSIZE= 16384
##$FT_mod= 6
##$GAMMA= 0
##$GB= 0
##$INTBC= 1
##$INTSCL= 3.241238e-09
##$ISEN= 128
##$LB= 0.25
##$LEV0= 0
##$LPBIN= 0
##$MAXI= 10000
##$MC2= 0
##$MEAN= 0
##$ME_mod= 0
##$MI= 1.114404
##$NCOEF= 0
##$NC_proc= -8
##$NLEV= 6
##$NOISF1= 3.799351
##$NOISF2= 2.8
##$NSP= 0
##$NTH_PI= 0
##$NZP= 0
##$OFFSET= 15.46263
##$PC= 1
##$PHC0= -5299.748
##$PHC1= 6.821927
##$PH_mod= 1
##$PKNL= yes
##$PPARMOD= 0
##$PSCAL= 0
##$PSIGN= 0
##$REVERSE= no
##$SF= 200.130011822182
##$SI= 16384
##$SIGF1= 3
##$SIGF2= 2
##$SINO= 0.751879
##$SIOLD= 32768
##$SREGLST= <19F.Aceton>
##$SSB= 0
##$STSI= 16384
##$STSR= 0
##$SW_p= 3612.71676300578
##$SYMM= 0
##$S_DEV= 0
##$TDeff= 16384
##$TDoff= 0
##$TI= <>
##$TILT= no
##$TM1= 0
##$TM2= 0
##$TOPLEV= 0
##$USERP1= <user>
##$USERP2= <user>
##$USERP3= <user>
##$USERP4= <user>
##$USERP5= <user>
##$WDW= 1
##$XDIM= 16384
##$YMAX_p= 473005180
##$YMIN_p= -1879752
$$ End of Bruker specific parameters
$$ ---------------------------------
##NTUPLES= NMR SPECTRUM
##VAR_NAME=  FREQUENCY,     SPECTRUM/REAL,   SPECTRUM/IMAG
##SYMBOL=    X,             R,               I
##VAR_TYPE=  INDEPENDENT,   DEPENDENT,       DEPENDENT
##VAR_FORM=  AFFN,          ASDF,            ASDF
##VAR_DIM=   16384,         16384,           16384
##UNITS=     HZ,            ARBITRARY UNITS, ARBITRARY UNITS
##FACTOR=    0.220516191357247, 1,           1
##FIRST=     3094.5363791197, 0,             0
##LAST=      -518.180383886078, 0,           0
##MIN=       -518.180383886078, -1879752,    0
##MAX=       3094.5363791197, 473005180,     0
$$ Real data points
##PAGE= N=1
##DATA TABLE= (X++(R..R)), XYDATA
$$ [...]
7666e1785J76921Q1000k19175M0402j92552K06390m5410R9007J01691j60934R6706
7655A32261N3624j41479o6457L384r1526O3613n7302o9103J85327N5044n0509
7644A6877K7559o0871o6655J9610k67686Q1661L24013K37207j34434K5524j91690
7633A1115k17490P9006l7040K38080R4057k67196j73894k20j80044J48983J8386
7622b86257q4651J74497N9515L37480j65499J5243o8150j0384j29162q1539q236
7611b47143j4944K89427j54165l11897N0516J61971M1568J56178j57073k12150
7601c97712J61642J46096m7035J09909j94706k43059K41024r152K83223j40575
7591i0345k05806J21995q8880K67837j52066r2427J22957P5680j87214J05982
$$ plain form
7666 -51785 125136 206136 -13039 27363 -165189 41201 -4209 94798 196489 35555 132261
7655 132261 185885 44406 -22051 -18667 -110193 -46580 -103882 -172985 12342 67386 16877
7644 16877 44436 -16435 -83090 -63480 -331166 -249505 74508 311715 177281 202805 11115
7633 11115 -206375 -127369 -164409 73671 167728 -99468 -273362 -273582 -453626 -304643 -286257
7622 -286257 -370908 -196411 -136896 200584 35085 50328 -17822 -28206 -157368 -238907 -247143
7611 -247143 -262087 27340 -126825 -438722 -388206 -226235 -184667 -28489 -185562 -397712
7601 -397712 -236070 -89974 -137009 -27100 -221806 -464865 -223841 -232993 50230 -90345
7591 -90345 -296151 -174156 -263036 4801 -147265 -239692 -116735 -41055 -228269 -122287
7581a22287J26531j67021L3865L8547o8501J37483K58371l33816Q937k68839n1172
7570d07902L0448J97377k09479Q7110J99794n2933L24517j60377k07418J21750
7560g7113K30765k99008j60793J28951l7200j8188K48k18813K24578J41745K05283
7549A20455Q1057j68141j15537L9398o2969j29866p857K28686J07914q7179K10925
7538B16886Q2017k95227j83725J61018L52968l15763M6377k1118j00345m7503
7528a04415j90881J53823J22939k31069r1484L88052Q8250j40959k84855L4453
7518b56146L59778J987M7991K3286J56050k20927j66801J4118p5830j84376K75733
7507b5137Q5844l3576P8128J02813L00312j75407J52630j86227j39358j52948
$$ plain form
7581 -122287 4244 -162777 -128912 -90365 -158866 -21383 236988 -96828 -87891 -356730 -407902
7570 -407902 -377454 -180077 -389556 -302446 -102652 -155585 168932 8555 -198863 -77113
7560 -77113 153652 -145356 -306149 -177198 -214398 -232586 -232338 -451151 -226573 -84828 120455
7549 120455 201512 33371 -82166 -42768 -105737 -235603 -243460 -14774 93140 5961 216886
7538 216886 298903 3676 -180049 -19031 333937 18174 64551 43433 -56912 -104415
7528 -104415 -295296 -141473 -18534 -249603 -341087 46965 135215 -5744 -290599 -256146
7518 -256146 103632 105619 153610 176896 332946 112019 -54782 -40664 -116494 -300870 -25137
7507 -25137 60707 27131 105259 208072 508384 332977 485607 299380 160022 7074
7497G074J66130k20245k9612o6499j43516J32346L43712k76765m8507K60063q5121
7486C9060K61919L938j9494k58529o4647K49556K25385j00322o7044K51213j49661
7475C71374k43827O1780J18829R7817k8705j55938j77395k3001J56328N8233J71215
7464D06710J60313n4636Q5481l23085R0129J76152J47257J00197j80132J93331
7454H01717J36005J65792P9705m6007J48053J30412J68573p0520J63683j97222
7444A480191j36379L05827L25578m0021n4754P2924K50206J55702J59716J19324
7434B638314m20993m0045J94454J2391J04509Q7631l4876r0175m52107j96581
7424A802522j0672j36204J4347j17143O3297o7983l24575K0932J71086j87093
$$ plain form
7497 7074 173204 -47041 -76653 -143152 -286668 -154322 189390 -87375 -135882 124181 39060
7486 39060 300979 304917 285423 26894 -37753 211803 437188 336866 269822 521035 371374
7475 371374 127547 189327 308156 405973 377268 221330 43935 20934 177262 235495 406710
7464 406710 567023 512387 597868 274783 364912 541064 688321 788518 608386 801717
7454 801717 937722 1103514 1183219 1137212 1285265 1415677 1584250 1513730 1677413 1480191
7444 1480191 1343812 1649639 1975217 1935196 1880442 1953366 2203572 2359274 2518990 2638314
7434 2638314 2217321 2177276 2371730 2384121 2488630 2576261 2541385 2451210 1999103 1802522
7424 1802522 1791850 1655646 1669993 1552850 1616147 1548164 1223589 1244521 1415607 1228514
7414A228514k3607m7734o3123k27445P0682M2768m9451k58174k04702L02940o0674
7403G09994L868o4194j24943j62864J9899Q0650J60514l54011O9199J62159l46634
7392A53637J49084K29572q7391J41501k07719l508K29221j24603k08059J4499
7382B86234J49485k3248j2293O8319j13189j61111N4862J98300j54325r2051k04396
7371c413j28175O2209O9848l7768j76691K57991J88847j04523k28162O1847K36647
7360A98657k10318L7287R9782J75891J2488J18674p5442j62954j15027j21564
7350d2526J75739l05038j72587L39456K94178J62024r3395N200O2623K2379j30926
7339C17127l5928k04644p3880L39646J1484j83871K107L02585J38559L85923L66847
$$ plain form
7414 1228514 1204907 1157173 1094050 866605 937287 980055 930604 672430 467728 770668 709994
7403 709994 713862 649668 524725 361861 381760 462410 622924 268913 338112 500271 153637
7392 153637 302721 532293 444902 586403 378684 375176 604397 479794 271735 286234
7382 286234 435719 412471 400178 468497 355308 194197 249059 447359 293034 200983 -3413
7371 -3413 -131588 -69379 469 -37299 -213990 44001 232848 128325 -99837 -37990 198657
7360 198657 -11661 25626 125408 301299 313787 432461 357019 194065 79038 -42526
7350 -42526 133213 -171825 -344412 -4956 289222 451246 357851 363051 425674 448053 317127
7339 317127 281199 76555 2675 342321 353805 169934 172041 474626 613185 999108 1365955
7328A365955J1585k67933l55698J6820j94873l74991o0664J54559n071p6442j50920
7317F2327P0117q3938j42369p722k59117J72294J76081R3648k77464M1318P3121
7306h1704M1139j88125k1471R263K25184r1159O5819j65433N9987j13786j951
7295b62237R5547m1953o853N5856n8695J04838Q66l43564J27319j03146J06169
7284c25853R21L1755L16684M9379j46211l9381r8367O1992o40j2438R8777Q2850
7272A9468k83831L1960J78901K2464n9045J16444k57885K09372L1061j89925j9447
7261b00463K44771N2401k1246p1543k56015P9624K27027M458l3537L0670k76701
7250b20554K33321L5970P6373O4948l33522R7046j6182j96924l9216J57444M9857
$$ plain form
7328 1365955 1377540 1109607 753909 770729 575856 200865 140201 294760 289689 213247 62327
7317 62327 132444 48506 -93863 -101585 -360702 -188408 -12327 81321 -196143 -154825 -81704
7306 -81704 -40565 -228690 -250161 -240898 -15714 -106873 -41054 -206487 -146500 -260286 -262237
7295 -262237 -166690 -208643 -215496 -159640 -218335 -113497 -112631 -456195 -328876 -432022 -325853
7284 -325853 -324932 -293177 23507 72886 -73325 -112706 -211073 -149081 -149721 -162159 -63382 19468
7272 19468 -264363 -232403 -53502 -31038 -90083 26361 -231524 -22152 8909 -181016 -200463
7261 -200463 44308 96709 75463 3920 -252095 -172471 54556 59014 25477 56147 -220554
7250 -220554 12767 48737 125110 190058 -143464 -46418 -62600 -259524 -298740 -141296 -91439
7239i1439J75823l5565m6443k03147L47722K79990j63732m2236k95981k18198
7229b93206k2049K026L4122K25126J01477M017k71679j59M39391r8890j58290
7218c8114O7716r1407J74673p0553j78143K1835J5670j24320K3795n2016K1164
7207b29700k4861l0329j51654J01715K47774j20040J23473K18178k52983j67182
7197b85609l0169M3786k94401J32467m9907M60351J61767m13029Q352K41270O7380
7186D2258m02531K23263J85102j50835J76630P4127K0551k50955N272j10146j0975
7175a98239J30222k0952K31622J45572j75247j9892n9340O205J41640j73570P4172
7164H2193j13120J8972n8952O7696K18642j10455k0200P5753J63151J50558k48463
$$ plain form
7239 -91439 84384 48819 2376 -200771 146951 426941 263209 220973 -75008 -293206
7229 -293206 -315255 -313229 -279107 -53981 47496 51513 -220166 -220325 219066 120176 -38114
7218 -38114 29602 -61805 112868 42315 -135828 -113993 -98323 -222643 -198848 -250864 -229700
7207 -229700 -254561 -284890 -436544 -334829 -87055 -207095 -83622 134556 -118427 -285609
7197 -285609 -315778 -271992 -566393 -433926 -483833 -23482 138285 -274744 -266392 -25122 42258
7186 42258 -360273 -137010 48092 -102743 73887 148014 168565 -82390 -77118 -187264 -198239
7175 -198239 -68017 -88969 142653 288225 112978 93086 33746 39951 181591 8021 82193
7164 82193 -30927 -11955 -70907 -3211 215431 104976 84776 160529 323680 474238 225775
7153B25775k02947k07144P5560L29015K31460l11800k73863o8924N5662J21253
7143b5953M4732o090K48345J5073q4323N0921r0859q8000J17310N4786k1184k05150
7131I608M24671L324l49370K36298J39590J47523j60581l27839R1741j98373l3496
7120a6904K94605J34209j73177m2244M32519n9878J24649j35419L8833L43100
7110I40293R2498J19899l06944J44898J44243j60297m532J54661j08458K5388
7100A041649N8538j2257K38484J46068j87615K88229J03416k79907L87358R678
7090A793641N0823J85320R9979L70269q9953k13749j13072J37706n9365K28850
7080B390449j73098M030j00411K47897J94613n6868J11855k83909J33717r3397
$$ plain form
7153 225775 22828 -184316 -108756 220259 451719 139919 -133944 -202868 -147206 -25953
7143 -25953 18779 12689 261034 276107 191784 242705 151846 63846 181156 235942 214758 9608
7131 9608 434279 437603 88233 324531 464121 611644 451063 123224 214965 16592 -16904
7120 -16904 277701 411910 238733 196489 629008 569130 693779 558360 597193 940293
7110 940293 1032791 1152690 845746 990644 1134887 974590 970058 1124719 1016261 1041649
7100 1041649 1100187 1087930 1326414 1472482 1284867 1573096 1676512 1396605 1783963 1793641
7090 1793641 1844464 2029784 2129763 2500032 2410079 2196330 2083258 2220964 2161599 2390449
7080 2390449 2217351 2221381 2120970 2368867 2563480 2506612 2618467 2334558 2468275 2374878
7070B374878O8457j5331N5504O8121J85325K3663k13016m27984K90560k0106l30247
7059B059824L24338K51901m45764j20294j7695J22681L9139j63229p0255j74592
7049A806054n47109J5687j16134N2992n4057k50284J29480p2126K36898k07281
7039I94120J49021K6851l78110j88686j72558L99488l6595J23612J30775l99128
7029F48790j30505o0641N2706j02581k6192J12958j4739K01170J37512j89433
7019F29045j84953K41467r1785o5163O2256M507K5343j85675L02818j96730j45426
7008C95704J15913o2809j27138j1271k845J20915J27665n9620j55144j85606j253
6997A54511Q2908J53356J7587l16984q1282r3155j08339J09458j5860J81865J17541
$$ plain form
7070 2374878 2443335 2428004 2483508 2551629 2736954 2760617 2547601 2119617 2410177 2390071 2059824
7059 2059824 2384162 2636063 2190299 2070005 2052310 2174991 2214130 2050901 1980646 1806054
7049 1806054 1258945 1274632 1158498 1211490 1157433 907149 1036629 964503 1201401 994120
7039 994120 1143141 1169992 791882 603196 430638 830126 793531 917143 1047918 648790
7029 648790 518285 457644 510350 407769 381577 494535 479796 680966 818478 629045
7019 629045 444092 685559 593774 528611 590867 595374 620717 435042 737860 541130 395704
7008 395704 511617 448808 321670 310399 307554 428469 556134 496514 341370 155764 154511
6997 154511 237419 390775 408362 91378 10096 -83059 -191398 -81940 -97800 84065 201606
6986B01606n2882j36867n8466K22223K5025p1571p8479o2915L26614J78092M247
6975D96627Q4018j61413q2883j6727R9727j56569j43243K10627k4234J87141P2498
6964E65569j8163j18382j53934j74448m6547M07291j1030j37928J50306l9411
6954D23323K65212k92659k9638K15187L66472P050k77688K83999k30120K64910
6944I96048K34969j10169k65124J31050J07133n3141J41381l48467j82778J06705
6934G57607L6925r3209j61947k161L22374n2365l39646k3685k05908N7908N1157
6923C47050j14807N4314j26150o0633J19692l2190j58917K37477Q2857j79696
6913A68997M5397k41385J23809K9702l06493J82139J12057l9040o6701J5877J5320
$$ plain form
6986 201606 148724 11857 -46609 175614 200639 129068 50589 -12326 314288 492380 496627
6975 496627 580645 419232 336349 319622 419349 262780 119537 330164 305930 493071 565569
6964 565569 547406 429024 275090 100642 54095 461386 450356 312428 462734 423323
6954 423323 688535 395876 366238 581425 947897 954947 677259 961258 731138 996048
6944 996048 1231017 1120848 855724 986774 1093907 1040766 1182147 833680 650902 757607
6934 757607 794532 701323 539376 537215 859589 807224 467578 443893 237985 295893 347050
6923 347050 232243 286557 160407 99774 219466 187276 28359 265836 348693 168997
6913 168997 214394 -26991 96818 126520 -179973 2166 114223 75183 8482 24359 39679
6902C9679q4774M441M1510q8410j57365K00927k5040m8706j17580P4524O1119
6891i9675K14748L9051J18179m2919j14747N6679k3923J04083k29745k02634J41552
6880c9351k4505k0093P7837J1158m6933J64408O7904j89030m1712j98994j15524
6869c54835j67621L62039K06240J95876j23912l42579n6193k1503Q2213R700N635
6858b04940q6566M5572m6946Q9198L0976J8920q9579K43262L0947q4082L7609
6847a5629J78875r4685R8040m9311n2386j39924J8383n5153K3599O3251Q5327
6836F0387J50925J20960L466l76482R251l45367O9798J10302l8121J40199J29405
6825C4723j66793J01746K14608K16859k40911j86726l39763n9888K95612q26k64893
$$ plain form
6902 39679 -45095 -40654 856 -87554 -244919 -43992 -69032 -117738 -235318 -160794 -99675
6891 -99675 115073 154124 272303 229384 114637 171316 147393 251476 21731 -180903 -39351
6880 -39351 -63856 -83949 -6112 5046 -41887 122521 190425 1395 -40317 -239311 -354835
6869 -354835 -522456 -160417 45823 241699 117787 -224792 -280985 -302488 -220275 -210575 -204940
6858 -204940 -291506 -245934 -292880 -203682 -172706 -153786 -243365 -103 30844 -53238 -15629
6847 -15629 163246 68561 166601 117290 64904 -75020 -56637 -111790 -88191 -24940 60387
6836 60387 211312 332272 335738 -40744 -31493 -376860 -307062 -196760 -234881 -94682 34723
6825 34723 -132070 -30324 184284 401143 160232 -26494 -366257 -426145 -130533 -131359 -396252
6814c96252K12353J03520M911R0338n6364l15743J13515Q0166m8188P8523J27603
6803e618J58760k60108M3292j32323J74787N9366j51938j24036m31126K18203
6793d50741J34203J22101K3697j10154M9125Q6599M4712J83682q4351k49668J11415
6782a39380L13955j86922l5681M805l9645p9096J27317m076j81098q3917K9304
6771b74434J4402Q2947k5011l2952P7683L2086J29991k07284J53149M0372m8594
6760e7645r1251Q7618j65520Q8596K83813j16371M9056K03717J0113p2188p9853
6749A40085j67812q5643R8872j34492J63096R6908L8353l1110n6772J00299J00818
6738B62602r1925n3616L23958j92923O5232k63431k4229r8884j03677K59346r7447
$$ plain form
6814 -396252 -183899 -80379 -75468 14870 -41494 -357237 -243722 -163556 -211744 -133221 -5618
6803 -5618 153142 -106966 -63674 -195997 -21210 38156 -113782 -237818 -668944 -450741
6793 -450741 -316538 -194437 -170740 -280894 -231769 -145170 -100458 83224 -1127 -250795 -139380
6782 -139380 174575 -12347 -48028 -43223 -82868 -161964 -34647 -38723 -219821 -303738 -274434
6771 -274434 -260032 -177085 -202096 -235048 -157365 -125279 4712 -202572 -49423 -9051 -57645
6760 -57645 -148896 -61278 -226798 -138202 145611 29240 78296 282013 292126 219938 140085
6749 140085 -27727 -113370 -14498 -148990 14106 111014 149367 118257 61485 161784 262602
6738 262602 170677 117061 441019 248096 313328 49897 25668 -73216 -176893 82453 -14994
6727a4994J14059l4423o9663k11054J84269K17347M1624j00996j40701k27723
6717b42255M81669j75885j75588k395M6934J42963m9195M8253J97740j62300j99219
6706h9278L61516K0518j31760k66423J20956K37043M804L15604j02192n75287
6696a04499m5657m1558J4141O326L6440q49k77117K37321M5770K35430N3294J81294
6684C40336O6812j57435k3490P4406J02142m02585k70925K27281R2826j12139
6674f2771N0337K77290j27325j52219K09556j17588k4131j4984J14501n1098J22673
6663B24241J32932J07762j7007k54378o243Q9200J34913K68213K2982L36335n7565
6652I81385k52273J83065p279j10769p3449j67392j01185J68200j73240l46501
$$ plain form
6727 -14994 99065 64642 -5021 -216075 -31806 185541 227165 126169 -14532 -242255
6717 -242255 239414 63529 -112059 -114454 -67520 75443 26248 74501 272241 109941 -89278
6706 -89278 272238 292756 160996 -105427 15529 252572 257376 572980 470788 -104499
6696 -104499 -150156 -191714 -177573 -171247 -134807 -135656 -412773 -175452 -129682 105748 159042 340336
6684 340336 407148 249713 226223 300629 402771 186 -270739 -43458 49368 -62771
6674 -62771 -12434 264856 137531 -14688 194868 77280 53149 38165 152666 101568 224241
6663 224241 357173 464935 447928 193550 187307 276507 411420 679633 702615 1038950 981385
6652 981385 729112 912177 904898 794129 720680 553288 452103 620303 447063 100562
6642A00562K54997J63604L1917J0505j29016j6197j42982l4411k11460j34716
6632a07197K06559j0541k6238J42010k7481r4545K26181j71729r719L7605L0486
6621A95391k58942l7749J42225J00297p6339N1366q894m8719N6231P8718L00766
6610D94351k01031l52888J94631P4446m9798J27419M8604q3166k1807R0161J45274
6599D66196K5348l0056L0506P8766R7132M4742M3587l3525K05781l42076k8974
6588E57427j66859J90311J06592n5840J88816P2410J87045N31372j09092k34859
6578A267323m05815j0205J27987R2556J48878l53055l1931J6585K6143r4170O5703
6567H49999J55534R0458m0738m90383j04247Q3053j24653l3768l8621r4792O958
$$ plain form
6642 100562 355559 519163 551080 561585 432569 416372 273390 238979 27519 -107197
6632 -107197 99362 88821 62583 204593 177112 82567 308748 137019 127300 164905 195391
6621 195391 -63551 -101300 40925 141222 64883 116249 107355 58636 114867 193585 494351
6610 494351 293320 -59568 135063 209509 159711 287130 335734 252568 230761 320922 466196
6599 466196 491544 461488 491994 570760 667892 712634 756221 722696 928477 586401 557427
6588 557427 390568 580879 687471 631631 820447 892857 1079902 1611274 1502182 1267323
6578 1267323 861508 851303 979290 1071846 1220724 867669 835738 852323 878466 784296 849999
6567 849999 1005533 1095991 1055253 564870 460623 543676 419023 385255 346634 251842 258800
6556B58800L23217k68783O357k44045J21219K57633K856l2569j11315j11156J23768
6545C25982k08753j67961L30603q456j28607j45115N9927J94807j37036K4305
6535A39696j87519k6762R6848p9646J28160K39611l34668j13892M40056j6035
6525B85849L9067j0051M7028k29484Q8537n5943J563K04214J89511J660r4788
6514D67163L2666O0125j80031l73187J29807R3811j30385K940K55686K911K14460
6503E75966J45494J83395j83179j10529j74703J33166P979k3793L93612j28353
6493H19055m6735J00992K82049l32545o0029N8531O1692J87814M4947p5804M44
6482A040411p7549k29406J9452P02P6151J3365J52456j05402J8147j43870p6832
$$ plain form
6556 258800 582017 313234 319591 75546 196765 454398 457254 424685 313370 202214 325982
6545 325982 117229 -50732 279871 271415 142808 -2307 57620 252427 115391 139696
6535 139696 -47823 -74585 22263 -57383 70777 310388 -24280 -138172 301884 285849
6525 285849 324916 314865 361893 132409 220946 165003 166566 370780 560291 561951 467163
6514 467163 499829 559954 379923 6736 136543 230354 99969 102909 358595 361506 575966
6503 575966 721460 904855 721676 611147 436444 569610 577589 553796 947408 819055
6493 819055 772320 873312 1155361 822816 762787 821318 883010 1070824 1115771 1039967 1040411
6482 1040411 962862 733456 752908 753610 829761 843126 995582 890180 908327 764457 687625
6471F87625K57733K25174J45031j76330j58459j47046n5453N0140J32213k7097
6461I33531K57820j06547r5961J97667q5279j35461J43168k5741q7325J82295
6451A178167k09265k0342K22270K0980J60055J27109R8493K7192q3482l1130R9465
6440A589512r0321j432q9282j73827L6402L41710K96954j38827m83564K76154
6430A563479L65008J21086k37937q656J73595q9634l70397J32121Q2245r3716
6420A637194l5473K24060J37688Q6965k7474k17248L62213l039l2557j09381L6890
6409B059838k3974j60718M6733J80769Q9984J94187J01160j58334J67932p9462
6399B418115j53326J65259K6461J15237j59542k01421K47905L75726J17349q006
$$ plain form
6471 687625 945358 1170532 1315563 1139233 980774 833728 778275 828415 960628 933531
6461 933531 1191351 1084804 988843 1186510 1101231 965770 1108938 1083197 995872 1178167
6451 1178167 968902 948560 1170830 1191810 1351865 1478974 1577467 1604659 1521177 1490047 1589512
6440 1589512 1499191 1497759 1408477 1234650 1271052 1612762 1909716 1770889 1287325 1563479
6430 1563479 1928487 2049573 1811636 1802980 1976575 1886941 1516544 1648665 1730910 1637194
6420 1637194 1601721 1825781 1963469 2050434 2022960 1805712 2167925 2164886 2132329 2022948 2059838
6409 2059838 2035864 1875146 1921879 2102648 2192632 2386819 2487979 2329645 2497577 2418115
6399 2418115 2264789 2430048 2456509 2571746 2412204 2210783 2458688 2834414 2951763 2943757
6389B943757k53427r0908K42852J94276j12653j24082j2952Q8519L01018K16055
6379C392455l4189J20196J25993R8001L85530J51558Q9396J6143K00997L75851
6369D921931K87094K03509J31337M57710Q7514M44185L81845N78097N17268M77319
6359H487809N69985Q17708P00306R49901J070454J080842J305157J835511K408181
6350A9225854K646444L074492L998935N201174P520838J0117294J2743181J3611335
6342G8139547J1409302O781662N72122m416386p100375p881497o959018m866696
6334F5678661k144624P01787M665785Q197801J0333205R864414N545252m58705
6326A02383576o383944j0079437j1472648j0784608j0141031q255393o690225
$$ plain form
6389 2943757 2690330 2599422 2842274 3036550 2923897 2799815 2786863 2875382 3176400 3392455
6379 3392455 3358266 3478462 3604455 3702456 4087986 4239544 4328940 4345083 4546080 4921931
6369 4921931 5209025 5412534 5543871 6001581 6089095 6533280 6915125 7493222 8010490 8487809
6359 8487809 9057794 9875502 10575808 11525709 12596163 13677005 14982162 16817673 19225854
6350 19225854 21872298 24946790 28945725 34146899 41667737 51785031 64528212 78139547
6342 78139547 89548849 96330511 96902633 92486247 85385872 77504375 70545357 65678661
6334 65678661 63534037 64235824 68901609 77099410 87432615 97297029 102842281 102383576
6326 102383576 95999632 85920195 74447547 63662939 53521908 45266515 38576290
6319C8576290n604792m692681l347157k625044k266513j534391j490286r84106
6311A6031320p23090q39913o48412m94063l85164l78560l16613K47923M1995l21398
6301A2214025r9785J14196O7056N6261K69370K29176J81817J07462M94163L55925
6291A3989666M07083P85764N81021J202124Q58673J015391J493374J687994J626791
6282B3647881K039894K511067L068773L925789M496511N595436P827144J1211127
6274F4323622J5110304J8897620K0673411J8913290J2792364M158728m326874
6267A50542465j0025316j2034222j1237980q825668n217736o22543M880058J0334091
6259A17793149J4087822J3791359R319921R62737p162680j3316054j6811419j6898333
$$ plain form
6319 38576290 32971498 28278817 24931660 22306616 20040103 18505712 17015426 16031320
6311 16031320 15308230 14468317 13819905 13325842 12940678 12562118 12245505 12493428 12535423 12214025
6301 12214025 12114240 12228436 12295492 12351753 12621123 12850299 13032116 13139578 13633741 13989666
6291 13989666 14396749 15182513 15763534 16965658 17824331 18839722 20333096 22021090 23647881
6282 23647881 25687775 28198842 31267615 35193404 39689915 45285351 53112495 64323622
6274 64323622 79433926 98331546 119004957 137918247 150710611 154869339 150542465
6267 150542465 140517149 128482927 117244947 108419279 103201543 102579000 107459058 117793149
6259 117793149 131880971 145672330 154992251 155954988 148792308 135476254 118664835 101766502
6251A01766502j5367125j3514692j1056591r400411p712786o155100m749981l818987
6243B9990829l114482k332082k129738k222775j552799j548358j058861q60450
6235A5171284r54282q04474n87046m27244o80815l94157n47415l13552o40086
6226I822213j04316r4551j95870k61346o07652l63324Q0623j50012l48831p3582
6216G703352m04721m0682j00114l45371r1131R9253l97769j90963m8135j00977
6206F082742k73906k10669K69430l93015j56429l31o49k10410k67839p6196r2627
6195D670101J05940k81339o454J59195o2313r7855n7424l9606k18124j63800j88463
6184C819858K67604j02845m03918j21049K73539J69797N9436j22878K31080k13403
$$ plain form
6251 101766502 86399377 72884685 61828094 52427683 44714897 38559797 33809816 29990829
6243 29990829 26876347 24544265 22414527 20191752 18638953 17090595 16031734 15171284
6235 15171284 14217002 13412528 12825482 12398238 11717423 11323266 10775851 10462299 9822213
6226 9822213 9717897 9623346 9427476 9166130 8558478 8195154 8275777 8125765 7776934 7703352
6216 7703352 7298631 7257949 7157835 6812464 6721333 6820586 6422817 6231854 6183719 6082742
6206 6082742 5808836 5598167 5867597 5474582 5318153 5317822 5317173 5106763 4838924 4762728 4670101
6195 4670101 4776041 4494702 4488248 4647443 4585130 4487275 4429851 4390245 4172121 4008321 3819858
6184 3819858 4087462 3984617 3580699 3459650 3733189 3902986 3962422 3839544 4070624 3857221
6174C857221q1846L48549j76412k73687R2473k61042j70737J37004N1763M1255
6164C564541J75271j73877n3474J9745j49992R7387k38649L1456r8602j62264
6154C011542L34056O5060k63572j39994m08577J61178J24412j26719L66256J26734
6144C250376k01387j48462K16573J18138k82884r6624n1602k34685J29284L37810
6134C036537J01320j00028K38882N8473j5742K71760j85507k748K64896J48003
6124C815846j36867k01853K44092J17707L7680n3061j04816J42932j6758K3511
6114C868413J24981K31309R9096k93299R0382R440O7145K84J44491K10460M1680
6103D594382j43341j00011J28586K09646L32766k77451j39451Q5358n0494J71093
$$ plain form
6174 3857221 3775375 4123924 3947512 3673825 3766298 3505256 3334519 3471523 3523286 3564541
6164 3564541 3739812 3565935 3512461 3532206 3382214 3479601 3240952 3272408 3173806 3011542
6154 3011542 3345598 3410658 3147086 3007092 2598515 2759693 2884105 2757386 3123642 3250376
6144 3250376 3048989 2900527 3117100 3235238 2952354 2855730 2804128 2569443 2698727 3036537
6134 3036537 3137857 3037829 3276711 3335184 3319442 3591202 3405695 3402947 3667843 3815846
6124 3815846 3678979 3477126 3721218 3838925 3876605 3823544 3718728 3861660 3844902 3868413
6114 3868413 3993394 4224703 4323799 4030500 4120882 4130322 4197467 4197751 4342242 4552702 4594382
6103 4594382 4451041 4351030 4479616 4689262 5022028 4744577 4605126 4690484 4639990 4811083
6093D811083J71377K78335K44400J44901J78188l2924j44003K51028J97431k1522
6083F078294J84784l3901M9679R5335L04841j25572Q6180L93533R1697L37955
6073G462825L67673O2008L85349L78910M83641J42785K94391M22537P79266O87670
6063A1467055K62245L61976N26345N61778Q36810J161805J158363J030932J186580
6054A8553889J608842J603390K034143K522496L060625L721267M400594N806352
6046D3311598Q172466J1281934J5500024J9007550K0171779J6819977Q917390
6039A43182718q04390r058000j3176855j4505183j3922858j2104769r841111p999656
6031F1769896o324154m374139k553180j136873j38758J102078J602883L129654
$$ plain form
6093 4811083 4982460 5260795 5505195 5650096 5828284 5795360 5651357 5902385 6099816 6078294
6083 6078294 6263078 6229177 6278856 6374191 6679032 6553460 6639640 7033173 7124870 7462825
6073 7462825 7830498 7892506 8277855 8656765 9140406 9283191 9577582 10000119 10779385 11467055
6063 11467055 11729300 12091276 12617621 13179399 14016209 15178014 16336377 17367309 18553889
6054 18553889 20162731 21766121 23800264 26322760 29383385 33104652 37505246 43311598
6046 43311598 51484064 62765998 78266022 97273572 117445351 134265328 143182718
6039 143182718 142378328 133320328 120143473 105638290 91715432 79610663 69769552 61769896
6031 61769896 55445742 51071603 48518423 47381550 47242792 48344870 49947753 53077407
6023E3077407M829687P420402J1845844J6042120J9912504K0834223J5964493
6016A49926680O727818l872115j1610617j6033599j6721769j5487468j3452758
6009G9476172j1248926r408330p608198o265951m948453m058748l199924k520109
6001C0217533k321597j607280j543019j624286r78417j143204o91150m42675k79931
5992A9585974m35323m18496k05275J06225L11515j30811P6642Q66751M70843N37863
5982B0765908J064606R56275J317292J929895J823952K245781L205446M278076
5974C7587231O240066Q832781J2000065J3664902J2463132P931743J515510m589819
5966I5645611q357461r422188r047386p581458o090560m938310l603273k241205
$$ plain form
6023 53077407 57907094 65327496 77173340 93215460 113127964 133962187 149926680
6016 149926680 156654498 152782383 141171766 125138167 108416398 92928930 79476172
6009 79476172 68227246 58818916 51210718 44944767 39996314 35937566 32737642 30217533
6001 30217533 27895936 26288656 24745637 23121351 22142934 20999730 20308580 19865905 19585974
5992 19585974 19150651 18732155 18526880 18633105 18944620 18813809 18890451 19757202 20228045 20765908
5982 20765908 21830514 22786789 24104081 26033976 27857928 30103709 33309155 37587231
5974 37587231 43827297 52660078 64660143 78325045 90788177 98719920 100235430 95645611
5966 95645611 87288150 77865962 68818576 61237118 55146558 50208248 46604975 44363770
5958D4363770j303272l79652N70820Q43026J164895J652845K552028L885124O110740
5949E9460324R259220J1791581J3428342J1743649O115257m97536o630085j0164450
5941I4506302j1327143j0646597r338874p793918o435512n227321m310453l760611
5933C5665873k476930k091158j503595j635425j625113j272706p43670q50005
5925B3467271j059793p99549p63218p97583n08285p60523r68207n96952o66336
5916A6546825o84247o26243l83828m27533o34576m67398k91555o20821q14228
5907A1596396l03092k20280n55675m39404o85206l8122l63045n47263j57319k58936
5897H028054n36044j77738l64620j34529j0020j34254K6942l20568L4Q259L124
$$ plain form
5958 44363770 43060498 42680846 43251666 44094692 45259587 46912432 49464460 53349584 59460324
5949 59460324 68719544 80511125 93939467 105683116 111798373 111300837 104670752 94506302
5941 94506302 83179159 72532562 63193688 55399770 48964258 43736937 39426484 35665873
5933 35665873 33188943 31097785 29594190 27958765 26333652 25060946 24317276 23467271
5925 23467271 22407478 21607929 20844711 20047128 19538843 18778320 17810113 17213161 16546825
5916 16546825 15862578 15236335 14852507 14424974 13790398 13323000 13031445 12410624 11596396
5907 11596396 11293304 11073024 10517349 10077945 9392739 9354617 8991572 8444309 8286990 8028054
5897 8028054 7492010 7314272 6949652 6815123 6805103 6670849 6697791 6377223 6377257 6385516 6388640
5886F388640l5560m72011r1833l3959J29700J15231j83437r3828J18874q8596
5876E753221j02794k65661k36798k7471o3745J61616l52367j54842j91473j87485
5866D332201M9765l31903j51031L45925j52963j64924J41958K52246r0336k69774
5856C961164L5235J33697l5137k53118l7326k35019p5112k1326l5467J740k59922
5845C179409l47834k82451O1591K92252o1788j63043P1155P2323k94956J05767
5835B632425L65878o8625K0681j91548M7501q762k14530R8960k13942j57082K14550
5824B525506r9351k63450J17086K65864l4401j44687j50657P1843O5497O2160
5814B415410K05647P201k5227R5821k34261k45159M8968L0266j76740j07977Q5
$$ plain form
5886 6388640 6353080 5881069 5789236 5755277 5884977 6000208 5816771 5722943 5841817 5753221
5876 5753221 5650427 5384766 5147968 5120497 5056752 5218368 4866001 4711159 4519686 4332201
5866 4332201 4381966 4050063 3899032 4244957 4091994 3927070 4069028 4321274 4230938 3961164
5856 3961164 3996399 4130096 4094959 3841841 3804515 3569496 3494384 3473058 3437591 3439331 3179409
5845 3179409 2831575 2549124 2610715 2902967 2841179 2678136 2749291 2821614 2526658 2632425
5835 2632425 2998303 2929678 2950359 2758811 2806312 2797550 2583020 2681980 2468038 2310956 2525506
5824 2525506 2426155 2162705 2279791 2545655 2511254 2366567 2215910 2287753 2353250 2415410
5814 2415410 2621057 2628258 2603031 2698852 2464591 2219432 2268400 2298666 2121926 2013949 2014034
5803B014034j5426M9948O0632P4348J70339l6873N8662m13394K93928M83538J50903
5792B890639l5188J12852R2615j61070P9990K64832L38991l4057M24133j18569
5782C855168K14542K34731K40427J93974L77464K77356N08591P55960Q26761P48140
5772H233114Q29613J281195J427964J914663L170976N320138J0918302J7017549
5764E0113514K1157170J8689763M048401r267385j5610468j4134825j1711316
5757D3284854r290713p168374n965018m523319l581431k310264j229520j124870
5749H091345r14750p95915o70683l35183l08574m57334m97958Q5278O7504j22608
5739D141122l09402j18732j94794j81302k109Q2271q6226j94995k6778j21305
$$ plain form
5803 2014034 1998608 2048556 2109188 2183536 2353875 2317002 2375664 1962270 2256198 2739736 2890639
5792 2890639 2855451 2968303 3060918 2899848 2979838 3244670 3583661 3549604 3973737 3855168
5782 3855168 4069710 4304441 4544868 4738842 5116306 5393662 5902253 6658213 7484974 8233114
5772 8233114 9062727 10343922 11771886 13686549 16857525 22177663 33095965 50113514
5764 50113514 71270684 89960447 94008848 84741463 69130995 54996170 43284854
5757 43284854 33994141 26825767 20860749 16337430 12755999 10445735 9216215 8091345
5749 8091345 7176595 6380680 5709997 5374814 5066240 4608906 4110948 4196226 4263730 4141122
5739 4141122 3831720 3712988 3518194 3336892 3334783 3417054 3330828 3135833 3109055 2987750
5729B987750j07122L28811J66167j62286n8819k61958J55620j99583j20072p1461
5719B657047j46932K22052j46872N4392k68560J45290j50356m4941O4177p9480
5709B305817O78K16117k04708j03690p9409n1830N7037j60246P3957J26998K77784
5698B458505k86230m24903j78207n5769L19778j49433r8591l49236j22381J55534
5688A269067J57489j57799j61604K3891K86381j65202J73477j32929j41746J54228
5678A305253n5369J84650j95526k40123k83636J68535L3851J43128L31692l05291
5668A087164K18908J11169J70005p2633k7523k91829J54053P7341k21029K33949
5658A439575m21203J54610Q1886N7953N9082o0718r8720L5943P9661J01679l9533
$$ plain form
5729 2987750 2880628 3209439 3375606 3213320 3154501 2892543 3048163 2848580 2728508 2657047
5719 2657047 2510115 2732167 2585295 2639687 2371127 2516417 2366061 2321120 2385297 2305817
5709 2305817 2306495 2522612 2317904 2214214 2134805 2082975 2140012 1979766 2053723 2180721 2458505
5698 2458505 2172275 1747372 1569165 1513396 1833174 1683741 1585150 1235914 1113533 1269067
5688 1269067 1426556 1268757 1107153 1131044 1417425 1252223 1425700 1292771 1151025 1305253
5678 1305253 1249884 1434534 1239008 998885 715249 883784 917635 1060763 1392455 1087164
5668 1087164 1306072 1417241 1587246 1514613 1487090 1195261 1349314 1426655 1205626 1439575
5658 1439575 1018372 1172982 1254868 1312821 1371903 1311185 1212465 1248408 1328069 1429748 1390215
5647A390215J27072J37813m6060k42375l97435N6598K6668j58728K61869r2320
5637A063317p1927j64625J38143m1921m3751K07691J46345p8258r6282k3433j6780
5626A018519P7063K58143j68915m04227K03754j11637N7276j9363k18562N3578
5616G45629K59719k9719k94003J03729K07602K31128k4540N8583k32904p4760
5606I50464k4205j3504J32328j27805j22199l3299K53791M79127P5683j2487k62950
5595A294944j04998Q2155K34073p5171O3448n358J2970R475j32881j81983J14037
5584A310711J93798q4659j8952j35591k0259J1661n7196J81585J84267M9246Q2549
5573A697160J65829M2392j24560j67873K92105j81359q4624p087j00389l38499
$$ plain form
5647 1390215 1517287 1655100 1609040 1366665 969230 1025828 1052496 893768 1155637 1063317
5637 1063317 991390 826765 964908 922987 879236 1086927 1233272 1155014 1058732 1035299 1018519
5626 1018519 1095582 1353725 1184810 780583 984337 872700 929976 910613 692051 745629
5616 745629 1005348 975629 681626 785355 992957 1224085 1199545 1258128 1025224 950464
5606 950464 926259 912755 1045083 917278 795079 761780 1015571 1494698 1570381 1557894 1294944
5595 1294944 1189946 1272101 1506174 1431003 1494451 1489093 1502063 1511538 1378657 1196674 1310711
5584 1310711 1504509 1419850 1400898 1265307 1245048 1256709 1199513 1381098 1565365 1614611 1697160
5573 1697160 1862989 1905381 1780821 1612948 1905053 1723694 1639070 1631983 1531594 1193095
5563A193095K09121K45174k67339o4560l16328L05268l4004R114q9186j84731
5553A005624k47886K19001K50156j15537k14483j77214O7923k8951k83815K24113
5543F98931J43890J90990K8377l03726N4617O9296k1749J498k17247N8667r1048
5532F12496L03858j22250j01389L6192M8578R0079L14358j65563j60382q5372
5522G70605J85695J52759K0235P856k3884n3766J29507J72948k42611R6999J79284
5511A395627j74488o9601J11606j08544q41Q2758L4142q8344L10066o2131k22985
5500A207265J79630J29038q1496N913R1158j23733p8199M4174j09425r841O1797
5489A316281o5216O817o5112J14861J50954Q9827j68009m0904L19989p7062k19090
$$ plain form
5563 1193095 1402216 1647390 1380051 1315491 999163 1304431 1270427 1279541 1190355 1005624
5553 1005624 757738 976739 1226895 1111358 896875 719661 787584 758633 474818 698931
5543 698931 842821 1033811 1062188 758462 813079 882375 860626 862124 644877 703544 612496
5532 612496 916354 794104 692715 728907 777485 867564 1181922 1016359 855977 770605
5522 770605 956300 1109059 1129294 1137150 1113266 1059500 1189007 1361955 1119344 1216343 1395627
5511 1395627 1221139 1151538 1263144 1154600 1153759 1236517 1270659 1182315 1492381 1430250 1207265
5500 1207265 1386895 1515933 1434437 1440350 1531508 1407775 1329576 1373750 1264325 1254484 1316281
5489 1316281 1251065 1257882 1192770 1307631 1458585 1548412 1380403 1339499 1659488 1582426 1363336
5478A363336j18539M7950J17109n8770j79907j38119M8138N8717l5292J18833
5468A223456k03404K73107J11367q5293l4801j55742J43435p6286p1871K73497
5458A397465k45136J91476J91625N4340k10638j41243K31873M944q4864K2505
5448A412347j61805J54907K5875q3280k560k07639J48763K91953j48941R1603
5438A521223j56042n6769o7304K94511q1744j65392n0562p4722K77304J44284
5428A584787J29190j68790j60619j51621J38716K36788m6550k35329N0082q6434
5418A290220J86853K29032k2791L10027j9389j63809k46197K39581M9914l39896
5408A513545J26265j99703l8975K55091j53412j27991J92352P0287P7237N8821
$$ plain form
5478 1363336 1244797 1292747 1409856 1351086 1171179 1033060 1081198 1139915 1104623 1223456
5468 1223456 1020052 1293159 1404526 1319233 1284432 1128690 1272125 1195839 1123968 1397465
5458 1397465 1152329 1343805 1535430 1589770 1379132 1237889 1469762 1474706 1389842 1412347
5448 1412347 1250542 1405449 1431324 1348044 1345484 1137845 1286608 1578561 1429620 1521223
5438 1521223 1365181 1308412 1241108 1535619 1453875 1288483 1237921 1163199 1440503 1584787
5428 1584787 1713977 1545187 1384568 1232947 1371663 1608451 1561901 1326572 1376654 1290220
5418 1290220 1477073 1706105 1683314 1993341 1973952 1810143 1563946 1803527 1853441 1513545
5408 1513545 1639810 1440107 1401132 1656223 1502811 1374820 1567172 1637459 1714696 1773517
5398A773517K18362j82355P4853j5797j56788p6922K22120k59420j84052O799
5388A420317R6592J96402j66101o2948K66626L34924R2463p6172O8700l1866J38565
5377B277502j93852k24360J74641m583J63329k8810j61917Q1046m8606J29279
5367B163669L7699J18513K1027m7896N3063P267J0201J05156j24254J78084o8913
5356B453616R5996l8642N2996L55159J22221K14018p340r3741n2459L19972k33732
5345C188064k11005K54259r2365J41853J60226O5989K6748r4911p641J70997R9679
5334C701893p9449Q9791K00017J15549J66686j89872J08876L49152l038p1672
5324D387933j30130j21883J39083J36258J11658j49135L71142L21092j75614J28066
$$ plain form
5398 1773517 1991879 1809524 1884377 1868580 1711792 1634870 1856990 1597570 1413518 1420317
5388 1420317 1516909 1713311 1547210 1484262 1750888 2085812 2178275 2102103 2170803 2138937 2277502
5377 2277502 2083650 1859290 2033931 2029348 2192677 2163867 2001950 2082996 2034390 2163669
5367 2163669 2201368 2319881 2340908 2293012 2346075 2353342 2363543 2468699 2344445 2522529 2453616
5356 2453616 2549612 2510970 2563966 2919125 3041346 3255364 3248024 3154283 3101824 3421796 3188064
5345 3188064 2977059 3231318 3138953 3280806 3441032 3507021 3533769 3438858 3431217 3602214 3701893
5334 3701893 3622444 3712235 3912252 4027801 4194487 4004615 4113491 4462643 4459605 4387933
5324 4387933 4257803 4135920 4275003 4411261 4522919 4373784 4744926 5066018 4890404 5018470
5314E018470j0877K40843j63583K37827M07259K01306k33521K41072P8219K32176
5304F249191r3422j33486Q6601J98183J45348j06996J87446K9827K12909K90222
5294G065823p3777J24675K8961K28587J0223K36134l6991L29999J45515J50164
5284H209313r7447O763M2353K02497K69880R9889N581J48734J47469J99308M75303
5273I709643J27259L3831r2525O0537L20523N8680K326J18471O18202L39227K3515
5262A1319689J89916K19346K68723N28513J8525L3426L23295j2437K95836K03962
5252A3388794M00036J80640M14312r3612L40734N27329L53630M42294M56778M41077
5242A6852012M82298L44596N82457O31374O98564L26029P70703P66573J051510
$$ plain form
5314 5018470 5007593 5248436 5084853 5322680 5729939 5931245 5697724 5938796 6017015 6249191
5304 6249191 6155769 6022283 6108884 6307067 6452415 6345419 6532865 6562692 6775601 7065823
5294 7065823 6992046 7116721 7145682 7374269 7384492 7620626 7583635 7913634 8059149 8209313
5284 8209313 8111866 8118629 8160982 8363479 8633359 8733248 8738829 8887563 9035032 9234340 9709643
5273 9709643 9836902 9870733 9778208 9838745 10159268 10217948 10220274 10338745 10956947 11296174 11319689
5262 11319689 11509605 11728951 11997674 12526187 12544712 12578138 12901433 12888996 13184832 13388794
5252 13388794 13788830 13969470 14383782 14290170 14630904 15158233 15511863 15954157 16410935 16852012
5242 16852012 17334310 17678906 18261363 18892737 19591301 19917330 20688033 21454606 22506116
5233B2506116R70401R03657Q35445J093914R99691J172323J167551J317224J073913
5224C2040235J326457J576296J799497K063564K555222L027022L309376M217216
5216E1914885M909836N965487O405157N361097L570656J628759P80186N56472
5208H1092535J456925K450595L819581O183441Q621047J0847126J2006722J1270006
5200A37747978R239264O003457M170732M381565M609003M632623M286350M848732
5192A79919704O761489R764825J1782041J1676236R108091O135422N273953N908366
5184B46330127O821311P201192M944058K699833J424908Q94147R48281q04874
5176B70458983l452579m860960m402347k602009j669983l140791o738519j0745760
$$ plain form
5233 22506116 23476517 24380174 25215619 26309533 27309224 28481547 29649098 30966322 32040235
5224 32040235 33366692 34942988 36742485 38806049 41361271 44388293 47697669 51914885
5216 51914885 56824721 62790208 69195365 74556462 78127118 79755877 80536063 81092535
5208 81092535 82549460 85000055 88819636 95003077 103624124 114471250 126477972 137747978
5200 137747978 146987242 152990699 157161431 161542996 166151999 170784622 175070972 179919704
5192 179919704 186681193 196446018 208228059 219904295 229012386 235147808 240421761 246330127
5184 246330127 253151438 260352630 265296688 267996521 269421429 270315576 271263857 270458983
5176 270458983 267006404 262145444 257743097 255141088 253471105 250330314 243591795 232846035
5168B32846035j2151185j1417354r419575p406332o425206n313933m043223k198040
5160A74471187j741085l309987o710047r609823j1651784j2128588j0846122r134541
5152A09339210p337338n350854l406698j993633p82488l24903k090385m059440
5144H3993471n452460o151958n723392m861297m674274l584630l266941k981771
5136D7296748k487080k147399k071278j609704j570447j325214r72227j239463
5128C3873936j237634j036317o47783j045234j071127o78985p37661o32695m52099
5119B6334401o55943p68222q24896n31179m87558m96767o1105l97377o50891o56182
5109B0804281m91773l60032m01794k97842m29960m24687j85362n37144j67531
$$ plain form
5168 232846035 220694850 209277496 199857921 192451589 186026383 180712450 176669227 174471187
5160 174471187 172730102 169420115 162710068 153100245 141448461 129319873 118473751 109339210
5152 109339210 102001872 96651018 93244320 91250687 90468199 90143296 88052911 83993471
5144 83993471 78541011 72389053 66665661 61804364 57130090 53545460 50278519 47296748
5136 47296748 44809668 42662269 40590991 38981287 37410840 36085626 35113399 33873936
5128 33873936 32636302 31599985 30952202 29906968 28835841 28156856 27419195 26786500 26334401
5119 26334401 25678458 24910236 24085340 23554161 23066603 22569836 22508731 22111354 21460463 20804281
5109 20804281 20312508 19952476 19550682 19252840 18822880 18398193 18212831 17675687 17508156
5100A7508156j90052k53668l03572l63117j96035n63749q1896j65029j73797j97927
5090A5019314n59003m04756q3506j64477l46793n3910l29729k52447k41986p0387
5080A2512320M5752l97953k51301l38076j14174l87684j49434l03653n16255k69523
5070I830019n1628K26735k55501j53698N6j00644q3810m51518n04199j81427M7307
5059H321692j74188q3401K6067K05131k28243n39267M7956r236j54435L14395
5049G726471r3002k15685j72528P9633k82873K3037J29752j08911k14539j56025
5039F715330J27310Q1073k1181j99270m3149K67211l7693n1523N9737K0271R3954
5028G012070L07572m70269J9897J84023l231O8796r1493R0247k53086J22304P3132
$$ plain form
5100 17508156 17318104 17064436 16760864 16397747 16201712 15637963 15556067 15391038 15217241 15019314
5090 15019314 14460311 14055555 13972049 13807572 13460779 13406869 13077140 12824693 12582707 12512320
5080 12512320 12558072 12160119 11908818 11570742 11456568 11068884 10919450 10615797 10099542 9830019
5070 9830019 9778391 10005126 9749625 9595927 9595983 9495339 9411529 8960011 8455812 8274385 8321692
5059 8321692 8147504 8064103 8090170 8295301 8067058 7527791 7575747 7566511 7412076 7726471
5049 7726471 7633469 7417784 7245256 7324889 7042016 7065053 7194805 7085894 6871355 6715330
5039 6715330 6842640 6923713 6902532 6703262 6660113 6927324 6889631 6838108 6897845 6918116 7012070
5028 7012070 7319642 6849373 6869270 7053293 7050062 7118858 7027365 7117612 6864526 6986830 7059962
5017G059962J90484L1561o1749J10095J79364o7618N2834m7728M0958J80635M1907
5006G710705P86J59426j66713j50573m620L00832K35399M3816j94240j00246J77070
4995H011642L7015j06490l9247l8093m8212J0241m12171J08504K17547L14408
4985H055144N55316O61017N16600M89954m6120j78448L1303m08569o22973k76747
4975H776477q6485k97397m11428J79220O2348j66857j646j86604Q298r1583l8353
4964G745990k87303J9578Q7656j76493L24468J09682j18503j50077N3885R3351
4954G702234q7712J04204M48181J10283J57503j48627j82110k70164j0681R6297
4944G919408j00190p3672J43236J55251J05117J49156k58922L32177O1983j81100
$$ plain form
5017 7059962 7250446 7282007 7220258 7330353 7509717 7442099 7494933 7447205 7488163 7668798 7710705
5006 7710705 7711491 7870917 7704204 7553631 7549011 7849843 8085242 8129058 7934818 7834572 8011642
4995 8011642 8048657 7942167 7902920 7864827 7816615 7826856 7414685 7523189 7740736 8055144
4985 8055144 8610460 9271477 9788077 10278031 10231911 10053463 10084766 9676197 9053224 8776477
4975 8776477 8689992 8392595 7981167 8160387 8222735 8055878 8054232 7867628 7875926 7784343 7745990
4964 7745990 7458687 7478265 7565921 7389428 7713896 7823578 7705075 7554998 7608883 7702234
4954 7702234 7614522 7718726 8166907 8277190 8434693 8286066 8103956 7833792 7823111 7919408
4944 7919408 7819218 7745546 7888782 8044033 8149150 8298306 8039384 8371561 8433544 8252444
4934H252444K22847o1493N5511J90049N3148J96346m0407J9085k26352J05974
4924H767152L40771M09326J42343K84617L52927K62631J27464L77804K31874J62926
4914A1459835j42411j33096K19997K68515j33831J89826K3410L26911K22383M03791
4904A2705330M55478K17226M68704J63125P37861L54543j4109N56277p9067j17830
4894A5447538N842K84526J42766l4602Q3815L59253K67777J32561M38969N83096
4884A7711541L86771M39036P42617L42507M05855M69439R5710K41234K69306K62906
4874B1366922P87129P57618K21108J99460K18362O49182N48175M43061O28287
4865B5819304N38584R17250J157621J017703J311752J438290Q17028P68905Q75835
$$ plain form
4934 8252444 8475291 8413798 8469309 8659358 8712506 8908852 8868445 8887530 8661178 8767152
4924 8767152 9107923 9517249 9659592 9944209 10297136 10559767 10687231 11065035 11296909 11459835
4914 11459835 11317424 11184328 11404325 11672840 11539009 11728835 11752245 12079156 12301539 12705330
4904 12705330 13160808 13378034 13846738 14009863 14747724 15102267 15088158 15644435 15565368 15447538
4894 15447538 15453380 15737906 15880672 15846070 15929885 16289138 16556915 16689476 17128445 17711541
4884 17711541 18098312 18537348 19279965 19622472 20028327 20497766 20593476 20834710 21104016 21366922
4874 21366922 22154051 22911669 23132777 23332237 23550599 24199781 24747956 25191017 25819304
4865 25819304 26357888 27275138 28432759 29450462 30762214 32200504 33017532 33786437 34662272
4856C4662272R65192P65691R48171J568071J492256J962825J849066J696566K630740
4847D8540850K754966L017135L262866M040483M901344N558655N620488P054762
4839H4751549Q290220J0223568J3857344J9248295K2540740K3482696J5428825
4832A97823237N359882o88218o39522R59893J329873J475080J095321J75041L9457
4823B06930044P73369J041819J494326J310094J428828J096018J524438J846189
4815B17445125K424125L891997N175465P020490Q931397J0196072J1184641J1381709
4807B77651021J2044748J2499979J3250283J3685365J3295099J1830152R382233
4800C63638880N332778J389060k476663n439565p105873p033542n416896k099249
$$ plain form
4856 34662272 35627464 36393155 37341326 38909397 40401653 42364478 44213544 45910110 48540850
4847 48540850 51295816 54312951 57575817 61616300 66517644 72076299 77696787 84751549
4839 84751549 93041769 103265337 117122681 136370976 158911716 182394412 197823237
4832 197823237 203183119 202494901 201855379 202815272 204145145 205620225 206715546 206890587 206930044
4823 206930044 207703413 208745232 210239558 211549652 212978480 214074498 215598936 217445125
4815 217445125 219869250 223761247 228936712 235957202 244888599 255084671 266269312 277651021
4807 277651021 289695769 302195748 315446031 329131396 342426495 354256647 363638880
4800 363638880 368971658 370360718 367884055 362444490 355338617 348305075 342888179 340788930
4792C40788930L430369Q672982J0590416M902363p252724j8055582k2740528k1174908
4784B99161318j7623007j3145135r380680n977126k892990K61160L528787O937605
4776B60869932J0132120J4886160J9904114K3093843K3933755J8959500J1228291
4769C83007715O137771N035313L587323n756529k0004807l1851514l5707615l3419007
4761B71028650k8547210k2997310j7613614j3469167r032567n042352j521081
4754A72805349L312835Q766661J6038485K4669255L0932578L0049954J9756555
4747C06331672L523236r345154j3920597j3188573j0568165p985996n978986m732934
4739B44134503m841037m708766m878524m574124m223772l502497l068118j835744
$$ plain form
4792 340788930 344219299 352892281 363482697 368385060 361132336 343076754 320336226 299161318
4784 299161318 281538311 268393176 259012496 253035370 250142380 250403540 253932327 260869932
4776 260869932 271002052 285888212 305792326 328886169 352819924 371779424 383007715
4769 383007715 389145486 394180799 397768122 392011593 372006786 340155272 304447657 271028650
4761 271028650 242481440 219484130 201870516 188401349 179368782 174326430 172805349
4754 172805349 176118184 184884845 200923330 225592585 256525163 286575117 306331672
4747 306331672 309854908 300509754 286589157 273400584 262832419 254846423 248867437 244134503
4739 244134503 239293466 234584700 229706176 225132052 220908280 217405783 214337665 212501921
4731B12501921r49283p9164R04440K081705L765351N579675P599682J0184632
4723B41588959J2344177J3951236J5200788J4769178J4570991J4457682J3968806
4716C40851817J3909768J2092469R429463N487876L12159m656178p961878j0000610
4708C59464886j1325225j1706249j2286537j2557285j2670839j2304809j1200933
4701B75413009r511850p813356o311299m711707l111782k044183j167963m32657
4693B40308212L79791j64926j96241L5448o09063k036647l932215o353822q889863
4684B18540674j0788595j1988329j2308804j2279501j2140980j1767011j1213171
4677A36054283j0546933r929240r046081q179743p310443o553128n624087m986117
$$ plain form
4731 212501921 211552638 211473474 212377914 214459619 218224970 223804645 231404327 241588959
4723 241588959 253933136 267884372 283085160 297854338 312425329 326883011 340851817
4716 340851817 354761585 366854054 376283517 381771393 382083552 377427374 369465496 359464886
4708 359464886 348139661 336433412 324146875 311589590 298918751 286613942 275413009
4701 275413009 265901159 258087803 251776504 247064797 243953015 241908832 240740869 240308212
4693 240308212 240688003 240523077 240326836 240362284 239753221 237716574 233784359 227430537 218540674
4684 218540674 207752079 195763750 183454946 171175445 159034465 147267454 136054283
4677 136054283 125507350 115578110 106532029 98352286 91041843 84488715 78864628 73878511
4669G3878511m433191l997691l727070k968140k671195k497919k192700k063770
4661D9326835j684914j620956j307362r98919j069899q45395q53876q24883n27205
4652C9593426r22210p56823m88208o96262q24031m49458n57882m72021k42551
4643C4183980m95168k11056l89721n06528p26014n17621m64281k44246k20298
4634C0409047l58107j56905Q7417N82682O04822K033177L043619L889915L176748
4625D3312415j01377k379369l652506l003940k598620j507113j266886j381664
4617B7420940p92884r06655k33248O02152P41671J257529J654153J567466J350791
4608C2661915J028427O21432K77235P79965J637252K568962L131768K811574J839536
$$ plain form
4669 73878511 69445320 65447629 61720559 58752419 56081224 53583305 51390605 49326835
4661 49326835 47641921 46020965 44713603 43714684 42644785 41799390 40945514 40120631 39593426
4652 39593426 38671216 37914393 37426185 36729923 35905892 35456434 34898552 34426531 34183980
4643 34183980 33688812 33477756 33088035 32581507 31855493 31337872 30873591 30629345 30409047
4634 30409047 30050940 29894035 29981452 30564134 31168956 33202133 36245752 40135667 43312415
4625 43312415 43211038 40831669 37179163 34175223 31576603 30069490 28802604 27420940
4617 27420940 26628056 25721401 25488153 26090305 26831976 28089505 29743658 31311124 32661915
4608 32661915 33690342 34311774 34589009 35368974 37006226 39575188 42706956 45518530 47358066
4599D7358066M10109o35600q31128J96940J862865L113107L410281K051991k28599
4590E6708032k111870k886827k655087j927810l16560L68273O1542o47047k158077
4581D4434569k861058l121003k641450j607959j176000r26895r46038j298633
4573B9855533j814482k000256j844930j752284j872131j128201r29085j213353
4565A7300811l87949o5993k3929j61418j68765j4705l13008j85750q9741q6053
4555A5803500l8121K83057N6582M16774K88970M55508N14516J7633L15115K40583
4545A8354117L0782L36831L63161L94724Q27658R30517Q44218R22313J103908
4536B4108229Q67822J005953J076110J550441K596175K608401L140898L636227
$$ plain form
4599 47358066 47768175 47132575 46301447 46498387 48361252 51474359 54884640 56936631 56708032
4590 56708032 54596162 51709335 49054248 47126438 46809878 47178151 47239693 46592646 44434569
4581 44434569 41573511 38452508 35811058 34203099 33027099 32100204 31154166 29855533
4573 29855533 28041051 26040795 24195865 22443581 20571450 19443249 18514164 17300811
4565 17300811 16912862 16846869 16822940 16661522 16492757 16478052 16165044 15979294 15889553 15803500
4555 15803500 15765379 16048436 16105018 16521792 16810762 17266270 17780786 17798419 18113534 18354117
4545 18354117 18384899 18721730 19084891 19479615 20307273 21237790 22082008 23004321 24108229
4536 24108229 24976051 25982004 27058114 28608555 31204730 33813131 36954029 40590256
4528D0590256M770031O663800R786260J4496644K0828369K5936365K5849216J8563411
4520A67484352M849917p462739j3838202j5002297j2077505p002857j244446O291731
4512A21997954J4218396J8847660J8009007R369633l877287j3922955j7329349
4505A47313059j5871152j1698146n323119J718692R294406J5221991J5750728
4498A56406459Q319939k345876j1449747j5458685j4816083j1041444o701207
4491A02913356r67029N699189J2111044J5284210J2392019L076755q562540j6234730
4483A25712274j8046225j6573227j4525216j2125090r662294q017778o024958
4476D0737486m590016l691195k520397j823215j805784k001645j624789j075083
$$ plain form
4528 40590256 45360287 52024087 61810347 76306991 97135360 123071725 148920941 167484352
4520 167484352 172334269 164871530 151033328 136031031 123953526 116950669 115706223 121997954
4512 121997954 136216350 155064010 173073017 182442650 178565363 164642408 147313059
4505 147313059 131441907 119743761 114420642 116139334 125433740 140655731 156406459
4498 156406459 164726398 162380522 150930775 135472090 120656007 109614563 102913356
4491 102913356 101946327 107645516 119756560 135040770 147432789 150509544 141947004 125712274
4483 125712274 107666049 91092822 76567606 64442516 54780222 46762444 40737486
4476 40737486 36147470 32456275 29935878 28112663 26306879 24305234 22680445 21605362
4468B1605362p52954o86201j081549r45123q93887l85917l02508p10457l86270
4459A5460496m97706m02210n11995k97324O8309l97677k53468m77217m54461m12559
4449A1824188k37108l3701l50085r8722k62778o8180l42126J1192j96060k19542
4439A0027078q9164j12014r3108j49291r7577J68094r1902j38022R0535n9670
4429I454959J62280J03756L07651k33194j60046l8231J69934k48278l61522j9599
4419I137710m71221m87659j98968l0704N9117J2057k91201K61256J5783j31391
4409G874779j75026Q0004J95951j91536j62431K23973j84204K07896j19811m75492
4399G274103k84542n7879o5205r169K9053J43431j27988l02044o4134L46537L43612
$$ plain form
4468 21605362 20852408 20166207 19084658 18139535 17245648 16859731 16557223 15846766 15460496
4459 15460496 14962790 14560580 14048585 13751261 13819570 13421893 13168425 12691208 12236747 11824188
4449 11824188 11587080 11553379 11203294 11104572 10841794 10773614 10431488 10442680 10246620 10027078
4439 10027078 9937914 9825900 9732792 9583501 9485924 9654018 9562116 9424094 9514629 9454959
4429 9454959 9617239 9720995 10028646 9795452 9635406 9597175 9767109 9518831 9157309 9137710
4419 9137710 8666489 8178830 7979862 7949158 8008275 8020332 7729131 7990387 8006170 7874779
4409 7874779 7699753 7779757 7975708 7784172 7621741 7845714 7661510 7869406 7749595 7274103
4399 7274103 6989561 6931682 6866477 6857308 6886361 7029792 6901804 6599760 6535626 6882163 7225775
4388G225775k07909K351K7633r7803O918l0721k06107k14440p6103l19948J29295
4377F238941J85142L19293K85347L94110P20343R69929J044789P48998K47175
4368A1154067m59866l87879o88877q16055l97396k72817n45059l14360m09656
4359F862102l4311P6007j34102P7324O768J48929j06764j16563M71896J76648
4349G427934L2261L42532j92847j46852j17348J6186j17967J86826j3142m0181
4339G377402m6507j27033K52720J00062k88893j65489q8372m5066O7274N5287
4329G091385L9123O2729N17544j42387r9592k16971J66706J58907j04685j19503
4319G353256R619K3869L05619L1139j54742j39941J12119k03294O7630L93043
$$ plain form
4388 7225775 7017866 7020217 7047850 6950047 6956965 6926244 6720137 6505697 6429594 6109646 6238941
4377 6238941 6424083 6743376 7028723 7422833 8143176 9113105 10157894 10906892 11154067
4368 11154067 10694201 10306322 9617445 8801390 8403994 8131177 7586118 7271758 6862102
4359 6862102 6827791 6903798 6769696 6847020 6853788 7002717 6895953 6779390 7251286 7427934
4349 7427934 7460195 7802727 7609880 7463028 7345680 7361866 7243899 7430725 7417583 7377402
4339 7377402 7330895 7203862 7456582 7556644 7267751 7102262 7013890 6968824 7036098 7091385
4329 7091385 7130508 7193237 7710781 7568394 7468802 7251831 7418537 7577444 7472759 7353256
4319 7353256 7362875 7386744 7692363 7723502 7568760 7428819 7540938 7337644 7405274 7798317
4309G798317p2437K8523k14994k8942q1804K1238J51791O5317k32848J1580O1619
4298G507360n9507R1551j32712K12692J75120K82535J070k2296j45326l92053
4288G518434J32932J69566j33036N6899k78934j46139R7748J15362l80758K21972
4278G374046M5518k41846k8251J44711J65307n2315p2632j33388L18455l3597
4268G486008j31520j71665j09311J62432M22745j80549k69227L0766K50505J03257
4258G593441j61708j60219m34778j77873J95268J23804N6482j74673Q570j83295
4248F685019k12865K27072L09349k4873k19655O3822K57322j34383J54302P3236
4238G178346K8513L46412k55051J79544k27391o0725K8595J39810k33593l61490
$$ plain form
4309 7798317 7725880 7754403 7539409 7510467 7428663 7449901 7601692 7667009 7434161 7445741 7507360
4298 7507360 7447853 7539404 7406692 7619384 7794504 8077039 8078109 8055813 7910487 7518434
4288 7518434 7651366 7820932 7687896 7744795 7465861 7319722 7417470 7532832 7152074 7374046
4278 7374046 7419564 7177718 7149467 7294178 7459485 7407170 7334538 7201150 7519605 7486008
4268 7486008 7354488 7182823 7073512 7235944 7658689 7478140 7208913 7239679 7490184 7593441
4258 7593441 7431733 7271514 6836736 6658863 6854131 6977935 7034417 6859744 6868314 6685019
4248 6685019 6472154 6699226 7008575 6983702 6764047 6827869 7085191 6950808 7105110 7178346
4238 7178346 7206859 7553271 7298220 7477764 7250373 7189648 7218243 7358053 7124460 6762970
4228F762970L97073R122N1076J41030K31911J59127p0800o6321p0670L50974n071
4217G890421J57344j39840r7L29530m06107j70187L10453K00406r5579r902l49934
4206G716508J62269L22064J67020J94859J23744k15532j51799j94161K44149J29513
4196H498634N8781Q9531K29530o4417J79886J53375Q2002K38545J32573m6253
4186I552187L73350J91996K03399j65418L3495L54045J10830M07712L23747K74661
4176A1660004K95131J96770K33377J05372J45408L2333k3275N69341J15306J55472
4166A3485239J72407L13277M20200L61129R4845M54851O8809K10204K08039N334
4156A5794334L10547M50394K62497J16479N21279M96014N73568P51941P58810
$$ plain form
4228 6762970 7160043 7169165 7220241 7361271 7593182 7752309 7681509 7615188 7544518 7895492 7890421
4217 7890421 8047765 7907925 7907828 8237358 7831251 7661064 7971517 8171923 8076344 8066442 7716508
4206 7716508 7878777 8200841 8367861 8562720 8686464 8470932 8319133 8124972 8369121 8498634
4196 8498634 8557415 8646946 8876476 8812059 8991945 9145320 9227322 9465867 9598440 9552187
4186 9552187 9925537 10117533 10320932 10155514 10189009 10543054 10653884 11061596 11385343 11660004
4176 11660004 11955135 12151905 12385282 12490654 12636062 12668395 12645120 13214461 13329767 13485239
4166 13485239 13657646 13970923 14391123 14752252 14847097 15301948 15370757 15580961 15789000 15794334
4156 15794334 16104881 16555275 16817772 16934251 17455530 17951544 18525112 19277053 20035863
4147B0035863J068949R38791O22380J210646J333048J286470J300663J420109
4139B9216919J836414J761043K327038K537399K154476J873700J591155J542703
4131D4840847J803366J542000J501555J255983N77878J071852R08035J057613
4123E4559129J822969K410555K716382K874915L329584L416985K946352K642290
4115G6719161K167357J780890K092670K260171K407879K753112K745124K386358
4107I5312722K348851K313592K533222K550410K881233K864092K812619K676861
4099A16293602K026003K236216K274559L327264M427985O095170P223622P411829
4091A51316250O567570M923764L104776J463140R45434O71858O88427J269668
$$ plain form
4147 20035863 21104812 22043603 22665983 23876629 25209677 26496147 27796810 29216919
4139 29216919 31053333 32814376 35141414 37678813 39833289 41706989 43298144 44840847
4131 44840847 46644213 48186213 49687768 50943751 51521629 52593481 53501516 54559129
4123 54559129 56382098 58792653 61509035 64383950 67713534 71130519 74076871 76719161
4115 76719161 78886518 80667408 82760078 85020249 87428128 90181240 92926364 95312722
4107 95312722 97661573 99975165 102508387 105058797 107940030 110804122 113616741 116293602
4099 116293602 118319605 120555821 122830380 126157644 130585629 136680799 143904421 151316250
4091 151316250 157883820 162807584 165912360 167375500 168320934 168992792 169681219 170950887
4083A70950887K177840K570276L344707L566435L821330L175971J194919k56491
4075A90545874o93504l36363j90524l06113p0252O84136J903892L521382N581220
4066B00639748P992066R455591J0927061J1261450R821621R027149P675389P184883
4058B73984958P180041P302467O607211N812180M969272L736249K971836J576573
4050C14140787L86526n60609r79600q86696N4124J830020M279950O822964Q889370
4041C33976836R792566J0309898R538056N984351L094941K87844j920227k480884
4033C68583381k159830r58907L74991J786007L120581L773338L577640K905258
4025C81002459J395701j34965r49407j669070k087717k825795l757045m793825
$$ plain form
4083 170950887 173128727 175699003 179043710 182610145 186431475 189607446 190802365 190545874
4075 190545874 189852370 189516007 189325483 189019370 188949118 189633254 191537146 195058528 200639748
4066 200639748 208631814 218087405 229014466 240275916 250097537 259124686 266800075 273984958
4058 273984958 281164999 288467466 295074677 300886857 305856129 309592378 312564214 314140787
4050 314140787 314527313 313966704 312987104 312100408 312154532 313984552 318264502 325087466 333976836
4041 333976836 343769402 354079300 363617356 369601707 372696648 372984492 371064265 368583381
4033 368583381 366423551 365464644 365839635 367625642 370746223 374519561 378097201 381002459
4025 381002459 382398160 382263195 381313788 379644718 377557001 374731206 370974161 366180336
4017C66180336n607199n238955m218709l604691m202340o340072q878700j1346406
4009C16743264j3006206j2841549j2073316j0446356p706695o109201m024093
4002B50535848k743357k881107k506912k532983k874519l269055l269452l546806
3994B26911657m372356m614349m417902l977452l404180k333819j859826j775910
3986B00155863j549221k327134m095856n999551p250798p962504p502892o655349
3978A56812558n579134m763695l687975l144814l398234l094081l589972l741062
3970A25813591l453122l748388l256435k984778k821972k418969k267294j592029
3962A03270604o24037n13945k20815r3094j030377l238132m999592n360582n271846
$$ plain form
4017 366180336 360573137 355334182 351115473 347510782 343308442 336968370 328089670 316743264
4009 316743264 303737058 290895509 278822193 268375837 260669142 254559941 250535848
4002 250535848 247792491 244911384 242404472 239871489 236996970 233727915 230458463 226911657
3994 226911657 222539301 217924952 213507050 209529598 206125418 203791599 201931773 200155863
3986 200155863 198606642 196279508 192183652 186184101 178933303 170970799 163467907 156812558
3978 156812558 151233424 146469729 142781754 139636940 136238706 133144625 129554653 125813591
3970 125813591 122360469 118612081 115355646 112370868 109548896 107129927 104862633 103270604
3962 103270604 102646567 102132622 101911807 101818713 100788336 97550204 92550612 87190030 81918184
3953H1918184m372192l934753l305208k551508k295817k169424k128382j932387
3945E9228513k000737j803715j525341j573655j528489j574072j724439j868957
3937D5629108k083383k013790k235068k196825j587568j322153p87163J49337
3929C3552495N67675J210701N77291p76307k134633k595064k136891j678776j683125
3920B4903366j209074j373409r41315p54192o00947p29925l49094m64386n50436
3911A7930588l81104k26771p5595n67519p19949k48055l99017k48790k05000l09307
3901A4549481j43593j66911k27235m24859l0319j60591J86017l54280j31118l66803
3891A2729789p17516n2721j81954k95974j20036j62920Q8661j61462j20246j80020
$$ plain form
3953 81918184 77545992 73611239 70306031 67754523 65458706 63289282 61160900 59228513
3945 59228513 57227776 55424061 53898720 52325065 50796576 49222504 47498065 45629108
3937 45629108 43545725 41531935 39296867 37100042 35512474 34190321 33403158 33552495
3929 33552495 34120170 35330871 35908162 35131855 32997222 30402158 28265267 26586491 24903366
3920 24903366 23694292 22320883 21379568 20625376 20024429 19294504 18945410 18481024 17930588
3911 17930588 17549484 17322713 17247118 16679599 15959650 15711595 15312578 15063788 14858788 14549481
3901 14549481 14405888 14238977 14011742 13586883 13556564 13395973 13581990 13227710 13096592 12729789
3891 12729789 12012273 11959552 11777598 11481624 11361588 11198668 11287329 11125867 11005621 10825601
3881A0825601j45319j86472L9499k8061j40284j53759m4768P3656j8204k27267
3871I994622k88072N8935j73207k3720j18700j81659L4822M9768N5398m10797
3861H997390p1543J25919j02832l55184J64977R7037q9489k86169j76918J94707
3851H497895j23691k34962M5415j02721J33438K56853N6296n22083l94848m6820
3841G564772L29420J37198J22355j9015j36719j34989n8931M45391L9317n9605
3831H229194J79133R6145j84000j75109j46056K58832J78768k39438k6753j65904
3821H004812P9810J55202K683K92847K72171r6088J48k54144q7301K73265L5079
3810H678484j04310P320K24812O0117R5962J27348J3486k54086j32072N1345J19247
$$ plain form
3881 10825601 10680282 10493810 10533309 10505248 10364964 10211205 10166437 10240093 10221889 9994622
3871 9994622 9706550 9765485 9592278 9568558 9449858 9268199 9303021 9352789 9408187 8997390
3861 8997390 8925847 9051766 8948934 8593750 8758727 8855764 8766275 8480106 8303188 8497895
3851 8497895 8374204 8139242 8184657 8081936 8215374 8472227 8528523 8006440 7611592 7564772
3841 7564772 7894192 8031390 8153745 8134730 7998011 7863022 7804091 8249482 8288799 8229194
3831 8229194 8408327 8504472 8320472 8145363 7999307 8258139 8436907 8197469 8170716 8004812
3821 8004812 8084622 8239824 8242507 8535354 8807525 8711437 8711585 8457441 8370140 8643405 8678484
3810 8678484 8574174 8581494 8806306 8866423 8962385 9089733 9103219 8849133 8717061 8768406 8887653
3799H887653l43441L16073Q6748l7314J04591M7642k24769l72476j0793K619J2986
3788H469519k14338j94956K10081m7216J08322M9962n1961l36942O326J58396
3778H157193k36475j50898R6416N8969k876Q3239k66238m5295m59056J1377K7967
3767G274323l1778K7309j31613J28733K5788M4853K93269k08689j42829k7088
3757G252278J37777j14524L3921M4694j82927r4253o985k07485k8909K32896L3617
3746G100100j06903j64423L96641j27030n634K8493J16895m7614q4416j97619
3736F908490K02859K18415j92771j39538k0727M4451J08359L3412j27847j37342
3726F897761r9171k70292j39436p3833K75717k95417n1325k3152j3670o7962R7485
$$ plain form
3799 8887653 8544212 8860285 8947033 8909719 9014310 9061952 8837183 8464707 8453914 8456533 8469519
3788 8469519 8255181 8060225 8270306 8223090 8331412 8381374 8329413 7992471 7998797 8157193
3778 8157193 7920718 7769820 7866236 7925205 7922329 8005568 7739330 7694035 7234979 7246356 7274323
3767 7274323 7242545 7269854 7138241 7266974 7292762 7337615 7630884 7422195 7279366 7252278
3757 7252278 7390055 7275531 7309452 7354146 7171219 7076966 7069981 6862496 6833587 7066483 7100100
3746 7100100 6993197 6828774 7225415 7098385 7092751 7121244 7238139 7190525 7106109 6908490
3736 6908490 7111349 7329764 7136993 6997455 6976728 7021179 7129538 7162950 7035103 6897761
3726 6897761 6798590 6528298 6388862 6315029 6590746 6295329 6244004 6220852 6207182 6139220 6236705
3715F236705J14683l28806j7780m6616o0030J906r1505j93148k39239K65732N7923
3704E699825j72379L02818n13178m15829J10396K41423j18047j99792M6911j826
3694D980322k54684j26339N8757J80358j06199M4284r2114j88065J5293K92549
3684D804162L04367l11855k73190j95476P0315j8917r9875j65550R1452P1842
3674D277275j063R8171J4530K6664j8489q8688j49204Q2658K38071L44015j88152
3663D635788M2163j18818K25003J724n8986m7859j57790p9775j03915L8764K49289
3652D625588o9707R183P0307j17518p3486K20106K25249K00084R3635j41524Q5774
3641E127691J98261k62975q6763j9610k26874j67274J19956N7249o2952K40788
$$ plain form
3715 6236705 6351388 6022582 6004802 5958186 5898156 5900062 5808557 5615409 5376170 5641902 5699825
3704 5699825 5527446 5830264 5317086 4901257 5011653 5253076 5135029 4935237 4982148 4980322
3694 4980322 4725638 4599299 4658056 4838414 4732215 4776499 4684385 4496320 4511613 4804162
3684 4804162 5108529 4796674 4523484 4328008 4398323 4379406 4279531 4113981 4205433 4277275
3674 4277275 4276212 4374383 4388913 4415577 4397088 4308400 4159196 4241854 4479925 4823940 4635788
3663 4635788 4677951 4559133 4784136 4785860 4726874 4679015 4521225 4441450 4337535 4376299 4625588
3652 4625588 4555881 4565064 4635371 4517853 4444367 4664473 4889722 5089806 5183441 5041917 5127691
3641 5127691 5325952 5062977 4976214 4956604 4729730 4562456 4682412 4739661 4676709 4917497
3631D917497r8599m4452m0719J61958q3806K58375J92983J62088r4759J35980
3621E466546k41377O1762J92430k16029L59715l505l1497L6186q6161R7055K61108
3610E896233Q189J91610K57703k32388K3588L75225K17685l40766J08405m4488
3600F460996l05887L32118J81452J09650j75542K62300J54481J45485k5161P7934
3590G217826N5110K25341j28868p9207N14578K98297j03985n25758J67117K58898
3580G899349k65210L33120N60949o8221O7007L21200N8300K57391K53902J25658
3570I543445M70053K60870J68302K10153Q2231o9206K18249N4677j6344K11531
3560A1133961l14963L38941Q4446l53295M21540M66162J24078L11218N8922J02326
$$ plain form
3631 4917497 4818898 4774446 4733727 4895685 4811879 5070254 5263237 5425325 5330566 5466546
3621 5466546 5225169 5286931 5479361 5263332 5623047 5619542 5588045 5624231 5538070 5635125 5896233
3610 5896233 5904422 6096032 6353735 6121347 6144935 6520160 6737845 6397079 6505484 6460996
3600 6460996 6155109 6487227 6668679 6778329 6602787 6865087 7019568 7165053 7139892 7217826
3590 7217826 7272936 7498277 7369409 7290202 7804780 8103077 7999092 7473334 7640451 7899349
3580 7899349 7634139 7967259 8528208 8459987 8526994 8848194 8906494 9163885 9417787 9543445
3570 9543445 10013498 10274368 10442670 10652823 10735054 10665848 10884097 10938774 10922430 11133961
3560 11133961 10818998 11157939 11242385 10889090 11310630 11776792 11900870 12212088 12271010 12373336
3550A2373336N28139L14844N84282L34670O02967N68327N61333J28479O08455
3541A6604832Q07846L88712N56875L93025N32432M76148J60634O01854O45046
3532B1167404K91642J85024L44361O947L88989L94843L08463M42047Q24617O06239
3522B4960576L93232J095404R17572J041613J355899J189540R76783R44741N66145
3513C3441505J209110J206101J061390J023190J539367J779042J977886K283966
3505D5521557K797986L564780L808371M880334N195148N128698N522057N540137
3497H1959068M787961M036657K929863J572921j6272j021285k192586l634554
3489H8421773l920119l804649l422061k609267k540126k009867j490463j834777
$$ plain form
3550 12373336 12901475 13216319 13800601 14135271 14738238 15306565 15867898 15996377 16604832
3541 16604832 17412678 17801390 18358265 18751290 19283722 19759870 19920504 20522358 21167404
3532 21167404 21459046 21644070 21988431 21995378 22384367 22779210 23087673 23529720 24354337 24960576
3522 24960576 25353808 26449212 27366784 28408397 29764296 30953836 31930619 32875360 33441505
3513 33441505 34650615 35856716 36918106 37941296 39480663 41259705 43237591 45521557
3505 45521557 48319543 51884323 55692694 60573028 65768176 70896874 76418931 81959068
3497 81959068 86747029 90783686 93713549 95286470 95270198 94248913 92056327 88421773
3489 88421773 84501654 80697005 77274944 74665677 72125551 70115684 68625221 66790444
3481F6790444j825972j744304j915823k159582k313500k380519k471734k904302
3473D9074708k872138k812005k749929k807347k241336j989247j995201j625367
3465B9982138j424413j384622j206723j134325j039087j083784p10292q75083
3457B1123809j029943q54946m20637l79010o85755m30518k17851l49381p31389
3448A6024379m88427m18338l38675m95824k82524k52652J8801k35913l52162k10748
3438A2967917m83276l23226l36619K0759k25994l52622m16712k46326J3700l93146
3428A0224455j35193j71063k29046j5472j02771O5397j852j05152o5911J09561
3418I572953J1736m31827l26525k02918m42321l86124M350J840m10725k59446
$$ plain form
3481 66790444 64964472 63220168 61304345 59144763 56831263 54450744 51979010 49074708
3473 49074708 46202570 43390565 40640636 37833289 35591953 33602706 31607505 29982138
3465 29982138 28557725 27173103 25966380 24832055 23792968 22709184 21998892 21123809
3457 21123809 20093866 19238920 18818283 18439273 17753518 17323000 17105149 16755768 16024379
3448 16024379 15535952 15117614 14778939 14283115 14000591 13747939 13766740 13530827 13178665 12967917
3438 12967917 12484641 12161415 11824796 11845555 11619561 11266939 10850227 10603901 10617601 10224455
3428 10224455 10089262 9918199 9689153 9673681 9570910 9636307 9634455 9529303 9463392 9572953
3418 9572953 9584689 9152862 8826337 8623419 8181098 7794974 7799324 7801164 7390439 7130993
3408G130993L4942l953j09366j98677J07808J41050j20986J74882J68174J43830
3398G468697p4859k77672j54083j40968l93566l21807r2299l39372j01607j43088
3388E429376l87310J98876j2714o9030k10467k15702J26762J85270q8985O7936
3378E024012K92317k20777k00982L9959R1912q2603O2944j14211P2706j08040
3368D857237K64908K11342p2970m9716J13175P4932j84258J93249N0218j66819
3358E291298j35445R1265j87894j11436Q1667P7972o7930J2872q9603l28444k04
3347D634118K29176L56518K3268K01309J49929M9941k11406k69762q0296l35457
3337D747338L9552K1193l45567l25172k13824j08440J73787L7692j69871k31736
$$ plain form
3408 7130993 7165935 7161982 7052616 6853939 6961747 7102797 6981811 7156693 7324867 7468697
3398 7468697 7393838 7116166 6962083 6821115 6427549 6105742 6013443 5674071 5572464 5429376
3388 5429376 5042066 5240942 5228228 5159198 4948731 4733029 4859791 5045061 4956076 5024012
3378 5024012 5316329 5095552 4894570 4934529 5026441 4943838 5006782 4892571 4965277 4857237
3368 4857237 5122145 5333487 5260517 5210801 5323976 5398908 5214650 5407899 5458117 5291298
3358 5291298 5155853 5247118 5059224 4947788 5029455 5107427 5039497 5052369 4962766 4634322 4634118
3347 4634118 4863294 5219812 5243080 5444389 5594318 5644259 5432853 5163091 5082795 4747338
3337 4747338 4786890 4808083 4462516 4137344 3923520 3815080 3988867 4026559 3856688 3624952
3327C624952n3279j7972J34172N1909L6447k88683j31955L58400K8869m7631j78990
3316C516239R9763p4106j39395K90780M69844J6971J77398L9780j01383J81876
3306D477767K63357K3763K7542N2794K85159O4045p6496j8393l31847J8378l64348
3295D421721j02959k23716q2601j72026N2118L34821M5214K07302L51181J49339
3285D980394k09687n0602n8794k75341L9097l14154o4713k28941J6260l2940m06495
3274C394084j16924j01528n6667P5521J89064n4771l09821j07705r7972R2424
3264B905705L01489l9789j0109j35204q9118L5210J05254K2886Q9666j30652J31986
3253C187324m5971L55841J10337k48875K16967Q7848N6091q6631R3649N55639
$$ plain form
3327 3624952 3571673 3553701 3687873 3739782 3776229 3487546 3355591 3713991 3742860 3695229 3516239
3316 3516239 3616002 3541896 3402501 3693281 4163125 4180096 4357494 4397274 4295891 4477767
3306 4477767 4741124 4764887 4792429 4845223 5130382 5194427 5117931 5099538 4767691 4786069 4421721
3295 4421721 4318762 4095046 4012445 3840419 3892537 4227358 4272572 4479874 4831055 4980394
3285 4980394 4770707 4720105 4661311 4385970 4425067 4110913 4046200 3817259 3833519 3800579 3394084
3274 3394084 3277160 3175632 3118965 3194486 3383550 3328779 3018958 2911253 2813281 2905705
3264 2905705 3207194 3167405 3157296 3022092 2932974 2968184 3073438 3096324 3185990 3055338 3187324
3253 3187324 3141353 3497194 3607531 3358656 3575623 3663471 3719562 3632931 3726580 4282219
3243D282219K64556L55015j77398K7248r0110j66300M4328l64142n7114L26065
3233D444367J12430R247J4370J75903j32197k914J71549l081R9174L57595q1467
3222E164976j58967q399K9015J57524k5604K71498l6348R0581K27204m0393j40792
3211E530295j67910L13284K74053J76678M8501P4187K58788K6339K37104M74117
3201G245436L10479K38582O39355M44644M64052O15081O64356N31195P45665Q59508
3191A2758353Q81892R46896J054467J231050J665850J738614J861075J992890
3183B4131087K334937J791635J669695J110776J70611K46173J27996l06991m35083
3174C0840836J6868J41133k7804k17682n1035j52404k3412j17887j8952M30257
$$ plain form
3243 4282219 4546775 4901790 4724392 4751640 4661530 4495230 4539558 4175416 4118302 4444367
3233 4444367 4556797 4566044 4580414 4756317 4624120 4621206 4792755 4789674 4888848 5246443 5164976
3222 5164976 5006009 4997610 5026625 5184149 5158545 5430043 5393695 5484276 5711480 5671087 5530295
3211 5530295 5362385 5675669 5949722 6126400 6174901 6249088 6507876 6534215 6771319 7245436
3201 7245436 7555915 7794497 8433852 8878496 9342548 9957629 10621985 11153180 11898845 12758353
3191 12758353 13640245 14587141 15641608 16872658 18538508 20277122 22138197 24131087
3183 24131087 26466024 28257659 29927354 31038130 31208741 31454914 31582910 31275919 30840836
3174 30840836 30857704 30998837 30971033 30753351 30702316 30549912 30526500 30408613 30389661 30819918
3164C0819918M11755N63375M44387P53215R76531J383129K047354L377318N075120
3155D5852102O991121Q775696R537073O615019Q03337m334268o676802p245022
3147F0318256o704279n760842n185069m294951l396858k489525j762238j644503
3139B9079991j686890r34600p64697r49360l97590k40596j46067R4218M18152
3130B4472561L14295L58550Q22448Q86756J629362J472967J679122J425527J173894
3121C4235482K76338k55191j316512k021443j999401k068009j971670j863807
3113B3015787j684448j816587j722007j487175j234955p89899o02174n84794n17412
3104A2576336n37657m90625k20962k53856m72212l96907l55051j53466k77571
$$ plain form
3164 30819918 31231673 31795048 32239435 32992650 33969181 35352310 37399664 40776982 45852102
3155 45852102 52843223 61618919 71155992 77771011 78574348 74240080 67563278 60318256
3147 60318256 53613977 47853135 42668066 38373115 34976257 32486732 30724494 29079991
3139 29079991 27393101 26458501 25693804 24744444 24346854 24106258 23960191 24054409 24472561
3130 24472561 24786856 25145406 25967854 26854610 28483972 29956939 31636061 33061588 34235482
3121 34235482 34511820 34256629 32940117 30918674 28919273 26851264 24879594 23015787
3113 23015787 21331339 19514752 17792745 16305570 15070615 14280716 13678542 13093748 12576336
3104 12576336 12038679 11548054 11327092 11073236 10601024 10204117 9849066 9695600 9418029
3095I418029r1784o3627k67671k43717k36509k71017j45553n85843j40381k14982
3085G156945r9209n18306k79147m66476l81306O2264j15158q4129l20369m92085
3075D463024J44426M2570k55916j09834k62889K18591j04982J6763k95591k00251
3065C655911j12822J19234k34165l2986M2915j21786J30696j06822l03499m8442
3055B988234k14816l9580k24709j34278J67869M1724j4379n52804R546M57250
3045B484057N1649l64864l07805j58041K66316J98025j34964j001q1114j13526
3035A838732p5569R5433m82443l0936J65983l30694K96211r2629K79990L7268
3025A701346j70567j73293m0644P2405o9298m1633O4026K52992k62894j17674
$$ plain form
3095 9418029 9326245 9262618 8994947 8751230 8514721 8243704 8098151 7512308 7371927 7156945
3085 7156945 7057736 6539430 6260283 5793807 5412501 5474765 5359607 5275478 4955109 4463024
3075 4463024 4607450 4650020 4394104 4284270 4021381 4239972 4134990 4151753 3856162 3655911
3065 3655911 3543089 3662323 3428158 3395172 3438087 3316301 3446997 3340175 3036676 2988234
3055 2988234 2773418 2733838 2509129 2374851 2542720 2584444 2570065 2017261 2026807 2484057
3045 2484057 2535706 2170842 1863037 1704996 1971312 2169337 2034373 2033372 1952258 1838732
3035 1838732 1763163 1858596 1376153 1345217 1511200 1180506 1476717 1384088 1664078 1701346
3025 1701346 1530779 1357486 1316842 1389247 1319949 1278316 1342342 1595334 1332440 1214766
3015A214766P9934Q7185j70513J39474J11963m0158J4116j01796N965l83698j84736
3004G72502J30568j120q3703K6181L7095q7009j49693J99075L90875l06571N7039
2993I85239R7622k97102Q6477L14992j84803j91896o9183j0416L1754R5186k98174
2982E59696j21940Q1084j51508J89274K77214J69769o8015L6383n5073l61470
2972E55414j77143J18582j49424r1340J51238j77142J118K31631K33635p3834
2962F22735j64562o2683j01077L6193K81290p074j23344J20759k58337K43027
2952E86927L9234m3591j1013j08235K94436j48387k55973J2297o4477J11126j3980
2941C98364k04256r0735l642K48720K43700m8574m3132L2610R6437p4136P5167
$$ plain form
3015 1214766 1294700 1381885 1211372 1350846 1462809 1422651 1436767 1334971 1340936 957238 772502
3004 772502 903070 901950 818247 844428 881523 794514 644821 843896 1234771 928200 985239
2993 985239 1082861 785759 872236 1187228 1002425 810529 741346 730930 762684 857870 559696
2982 559696 437756 518840 367332 556606 833820 1003589 935574 971957 916884 555414
2972 555414 378271 496853 347429 256089 407327 230185 231303 462934 696569 622735
2962 622735 458173 395490 294413 330606 611896 604822 481478 602237 343900 586927
2952 586927 626161 582570 571557 463322 757758 609371 353398 365695 301218 412344 398364
2941 398364 194108 103373 99731 348451 592151 543577 500445 533055 629492 555356 630523
2930F30523k3087k47068j10467K06026M7080j60358j45831N197M95902n0354l18700
2919C28863O2691K58422n3413n30197J92758J81460N8986n3870m7829n9983k08620
2908A29268M13313k11614r1023j09270n4999N30233J5399k8170j38978q1961j64811
2897B07387J5863J65066l7174O1188O2202p6912J66521k81458k4941p2149j49591
2886C6002J51277J01385j9362j31543K0148K39164M63820r8510k81208j62080
2876C19093M6793L8626l67095R8367K18722K25479J69211J91733L1883j77811
2866G95001r5014j0654j72409k15937k17802l9854Q9739l5420N0224J17155O7164
2855C32193r7342q1021P0444K81426k96988j76934O3813J50383J84125l7705J24040
$$ plain form
2930 630523 607436 360368 249901 455927 503007 342649 196818 202015 697917 647563 328863
2919 328863 391554 649976 596563 66366 259124 440584 499570 445700 397871 337888 129268
2908 129268 542581 330967 239944 130674 75675 605908 621307 593137 454159 372198 207387
2897 207387 223250 388316 351142 412330 474532 397620 564141 282683 257742 185593 36002
2886 36002 187279 288664 269302 137759 157907 397071 860891 762381 481173 319093
2876 319093 365886 404512 37417 135784 354506 579985 749196 940929 972812 795001
2866 795001 699987 689333 516924 300987 83185 43331 133070 97650 147874 265029 332193
2855 332193 234851 153830 224274 505700 208712 31778 95591 245974 430099 392394 516434
2844E16434Q6871l07921o3422k23334K99456j52334K18178J10517k05905J07579
2834C86119j563j7988k17705J44769J35394j41858k02357P4067J18137R9268k27374
2823A48909j67518p594J14497K88539P6066m3865R6196l39236N1780K8354l55493
2812a09365j4890J50199P2427K63026J6837p0389K63384k96983K2916J35303O62
2801D33127l66963J27147k7415j72002J42653l8809l20565j44339L49433K5750
2791H017r2361P8374n7473K78002l1972K35989k1507k16917j33354j4415Q0600
2780A12983n0226J13900P970K5841j28947j5453R1547j03109O8122J61127j27118
2769A56637j09799j45165K02514k66558J80437J33257j13107m5199o6041J49394
$$ plain form
2844 516434 603305 295384 231962 8628 308084 155750 373928 484445 278540 386119
2834 386119 384556 366568 148863 293632 429026 287168 84811 158878 277015 376283 148909
2823 148909 -18609 -26203 88294 376833 452899 409034 505230 165994 217774 246128 -109365
2812 -109365 -124255 25944 98371 361397 378234 307845 571229 274246 297162 432465 433127
2801 433127 66164 193311 165896 -6106 136547 97738 -222827 -367166 -17733 8017
2791 8017 -84344 -5970 -63443 214559 182587 418576 397069 180152 46798 32383 112983
2780 112983 62757 176657 184627 210468 81521 66068 157615 54506 122628 283755 156637
2769 156637 46838 -98327 104187 -162371 18066 151323 38216 -6983 -73024 76370
2759G6370J50325j21324l69462J15752K39637P6980k04148M593J83600J5253m38120
2748b70544O3116J25520J9615L09295l0173M6336j05059k48710K50250J14331
2738B73977m6503L84715k15460j71943k07753o3277k57394R7184J5442J85598
2728e414K42008j64171j034M1068j29491J37829P5501n3923L5542j28382j83858
2717a34325R5601J67682j79247J53224J20014k69402K16953k28935j06602Q5539
2707g9498Q1509P3345q6610Q0435j03050J8101R5167j41396N9622L0036m39807
2696d12146K12429J15565K54233J22941n5204m1460j1758J05598j24808l9498
2686A25892Q3619j95715M1819J50108j11305j9724K55674k03310l14877J66804
$$ plain form
2759 76370 226695 105371 -264091 -148339 91298 168278 -35870 -31277 152323 167576 -270544
2748 -270544 -207428 -81908 -62293 247002 216829 263165 158106 -90604 159646 273977
2738 273977 227474 612189 396729 224786 17033 -46244 -303638 -206454 -191012 -5414
2728 -5414 236594 72423 71389 112457 -17034 120795 196296 142373 177915 49533 -134325
2717 -134325 -38724 128958 -50289 102935 222949 -46453 170500 -58435 -165037 -79498
2707 -79498 2011 75356 -11254 69181 -33869 -15768 79399 -61997 -2375 27661 -412146
2696 -412146 -199717 -84152 170081 293022 237818 196358 184600 290198 165390 125892
2686 125892 209511 13796 55615 205723 94418 74694 330368 127058 -187819 -21015
2676b1015J32281K33809j35402P3659q5638r2599q3422M4702K10874j00685l3593
2665A42971N1765J21959o9334J46792m8435j54527K35267P5755j56074l09662
2655C6477j01296Q1696k2774L5082k10874K39267J42725k06401j08988j20794
2645b35880J47863J68423m6967k50943j46394J47130L77585J14978J66066l0331
2635D11530k72980J57352J46058Q5767j45245k6460k6485o3160j39644N8567J10556
2624B95856n7488K86573Q5393K75000J42439K91477M83370M33179k5409j88715
2614B021675k97531m54789k57335o4915R3656m23568l28849j12429P5569J85329
2604D36813o3022k16636L82008N9932m8534k4180l49095L4076L20733j5197K5070
$$ plain form
2676 -21015 111266 345075 209673 283332 197694 105095 21673 66375 277249 176564 142971
2665 142971 194736 316695 247361 394153 345718 191191 426458 502213 346139 36477
2655 36477 -64819 16877 -5897 29185 -181689 57578 200303 -6098 -115086 -235880
2645 -235880 -88017 80406 33439 -217504 -363898 -216768 160817 275795 441861 411530
2635 411530 138550 295902 441960 527727 382482 356022 329537 266377 126733 185300 295856
2624 295856 238368 524941 610334 885334 1027773 1319250 1802620 2235799 2210390 2021675
2614 2021675 1724144 1269355 1012020 947105 1040761 617193 288344 175915 251484 436813
2604 436813 373791 157155 539163 599095 550561 526381 177286 211362 532095 516898 541968
2593E41968p9174k19549k01700L07107j77229q0183n5601m9148K14665n1198j07333
2582D2625K09348k43018N9346j38587k26614K72548K729L78087l9697k95617o2650
2571d1500Q9512K00342j67927k78487L91803J86639k82123j56859J19926j0735
2561E0591K68743j96858k3531j14879j34569J33621J42536j03546j12340K75486
2551A85254K41157J61594k83372l22268r7122j84457K2120M41085N4674j51803
2541F6862N1188J29437j61649k20499L52228J6972l4377K09250j08745q2311r7017
2530A21339j32568J50396M47J40393l50j3000J02400K46804j67281R6242j17472
2519D27350k80427N19813k07001m34314j65110K77646J18396J4535Q914j6264
$$ plain form
2593 541968 462794 243245 41545 348652 171423 91240 35639 -13509 201156 149958 42625
2582 42625 251973 8955 68301 -70286 -296900 -24352 -21623 356464 316767 21150 -41500
2571 -41500 48012 248354 80427 -198060 193743 380382 98259 -58600 61326 50591
2561 50591 319334 122476 98945 -15934 -150503 -16882 125654 22108 -90232 185254
2551 185254 426411 588005 304633 -17635 -114757 -299214 -277094 163991 218665 66862
2541 66862 118050 247487 85838 -134661 217567 234539 200162 409412 300667 218356 121339
2530 121339 -11229 139167 139614 280007 279657 266657 369057 615861 448580 544822 427350
2519 427350 146923 666736 459735 25421 -139689 137957 256353 270888 279802 263538
2509B63538J07827k23660j56353m2099P9298M00136K39277m1965J53387k8444
2499G50942R9726L36329J38273l47845j06806J10470j10197J29237j09303k78036
2489F12790J99060n6034m7462J6867k77356j78659K14849L10940J49974q8491
2479H56478K99002k77482o6939J97703J07090J1285j35747k36028j5541R7759
2469H37580j3496J22384N9393K79133j12684R0725j36947j06571K51265j62456
2459A108326j41081K25776L18950J1799k36234k51593J53014J00788j56364p0392
2449A062989L0769P0296r5148k6767P7762M72825L3405P9966m21616L65970j23886
2438A526565k4987N1635m32087j37078M11319L5734l11651J20974L13341J86676
$$ plain form
2509 263538 371365 147705 -8648 -50747 28551 428687 667964 625999 779386 750942
2499 750942 850668 1186997 1325270 977425 870619 981089 870892 1000129 890826 612790
2489 612790 811850 755816 708354 725221 447865 269206 484055 794995 944969 856478
2479 856478 1155480 877998 811059 1008762 1115852 1127137 991390 755362 739821 837580
2469 837580 824084 946468 1005861 1284994 1172310 1263035 1126088 1019517 1270782 1108326
2459 1108326 967245 1193021 1511971 1523770 1287536 1035943 1188957 1289745 1133381 1062989
2449 1062989 1093758 1164054 1068906 1042139 1119901 1592726 1626131 1706097 1284481 1650451 1526565
2438 1526565 1501578 1553213 1121126 984048 1395367 1431101 1119450 1240424 1553765 1740441
2428A740441j17629k86241J91860N1609J36237M21606Q9800k56230J29061K60992
2418B361506j05405k30522o5853M2900m7951o105J48845l5847L36471K47708j55045
2407B490702Q2082j8466Q4160K99386L34365R5779M62119J92347P4763o6491n1769
2396C978977k53504j41501L61560L15105K9201M9249K45476M69130K13281L61587
2386E628561J60459L04729L9916K76433K11234O97694Q58586N36830N51798Q00069
2376A0066309K20144L19083P44087R81334Q28120J393283J815979K350518K685788
2367B1404645L682731L537591M188271K414031J401641J211065K365725L585045
2359D3790745N127937O324753Q597831J2472757J9809184L8133744O7171984Q6262458
$$ plain form
2428 1740441 1622812 1336571 1528431 1580040 1716277 2137883 2227683 1971453 2100514 2361506
2418 2361506 2256101 2025579 1959726 2002626 1954675 1948570 2097415 2061568 2398039 2645747 2490702
2407 2490702 2572784 2554318 2638478 2937864 3272229 3368008 3830127 4022474 4097237 4030746 3978977
2396 3978977 3725473 3583972 3945532 4260637 4289838 4339087 4584563 5053693 5266974 5628561
2386 5628561 5789020 6093749 6133665 6410098 6621332 7319026 8177612 8714442 9266240 10066309
2376 10066309 10286453 10605536 11349623 12330957 13159077 14552360 16368339 18718857 21404645
2367 21404645 25087376 28624967 32813238 35227269 36628910 37839975 40205700 43790745
2359 43790745 48918682 55243435 63841266 76314023 96123207 134256951 201428935 287691393
2351B87691393J06617029P8696758j0686780o9776149q4367832o8432977n2482415
2344A87259027m0659778l2149805k4801555j9666046j4496949q237470m205620
2337D3041804k540440q65415j079153k980258m451677l928113l172265k329323
2329B1695160j813503j288390j307393j039608j111705q99579r00729j012377
2321A2321876o55747l69562l24950j85609k09683m75367k21870j33489k59602
2312I485997n02327k86565n54696k59540l31742k05334m07886o1058q8018k81165
2302F507666k0670k96283l17349j74841m22479R4644N2078N1849K1681m39858
2292E056438q9143L446j42093J07484l59087k7519l03503j90084j17858J3004
$$ plain form
2351 287691393 394308422 473005180 462318400 392542251 308174419 239741442 187259027
2344 187259027 146599249 114449444 89647889 69981843 55484894 47247424 43041804
2337 43041804 40501364 39635949 38556796 35576538 31124861 27196748 24024483 21695160
2329 21695160 19881657 18593267 17285874 16246266 15134561 14234982 13334253 12321876
2321 12321876 11666129 11296567 10971617 10786008 10576325 10100958 9879088 9745599 9485997
2312 9485997 8983670 8697105 8142409 7882869 7551127 7345793 6937907 6876849 6788831 6507666
2302 6507666 6486996 6190713 5873364 5698523 5276044 5370688 5422766 5474615 5496296 5056438
2292 5056438 4967295 4970741 4828648 4936132 4577045 4549526 4246023 4055939 3938081 3951085
2282C951085j98740j78243l85687n0161l5771r9282J03832k7944j86633L3047
2272B925503k25116j10500k06534K17061M7009j6833j26842j49004m2131j10020
2262B202593n2222o2391j51879l32272J62671r4040k85914K09640P6031j049J74190
2251A845358o2089k5962k92370l21424K1054j29507k07703k05243M132L65306
2241I91552J30234m79010K27860K4309M9820j9448L43273m1182k63502J43255
2231A107161j0769l92043q6548j22627n569N08077k92456j72239J75948j6610
2221F92325l81082j12961K17687L99943j81264k26326J68634o1213j93529J67687
2211D89901j737K8569k77304J86777j52463J4161j34963l02091J30171j13994
$$ plain form
2282 3951085 3752345 3574102 3188415 3138254 3102483 3003201 3107033 3079089 2892456 2925503
2272 2925503 2700387 2589887 2383353 2600414 2647423 2630590 2503748 2354744 2312613 2202593
2262 2202593 2150371 2087980 1936101 1603829 1766500 1672460 1386546 1596186 1672217 1671168 1845358
2251 1845358 1783269 1757307 1464937 1143513 1164567 1035060 827357 622114 626246 991552
2241 991552 1121786 642776 870636 894945 944765 925317 1268590 1227408 963906 1107161
2231 1107161 1096392 704349 617801 495174 489605 997682 705226 532987 708935 692325
2221 692325 311243 198282 415969 815912 634648 408322 576956 515743 322214 489901
2211 489901 488164 516733 239429 426206 273743 287904 152941 -149150 -18979 -132973
2201a32973o0751L4563K65823L66620P2420M2807r9101k06966J52329m1816j02718
2190B90237P519K4870k12132J22333J17645k21672J68118q5703R6626M572J6180
2179C28593J57449p6098Q1549l42797k5812r7654n5776j1354j54790J17423k52797
2168c32064p4140J52626P5308J10338J59766P3670J20478n5398k9392L655k4068
2157A80779L00562J22111m85466q1425K40896k35476j43893L49964j38985J52145
2147B61212J64039k39412l14660J90074j74040j75076J800L38014J11165k19022
2137e5906k3218R125j63513J67525P7653r8972L2475p419L1152j4223R7293o8151
2125a6179R1222J36045q8399j95405k00058J24109O6959R6133o2783k9974K95244
$$ plain form
2201 -132973 -193724 -159161 106662 473282 545702 588509 489408 282442 434771 392955 290237
2190 290237 297756 322626 110494 232827 350472 128800 296918 211215 307841 312413 328593
2179 328593 486042 409944 491493 148696 122884 25230 -30546 -41900 -196690 -79267 -332064
2168 -332064 -406204 -253578 -178270 -67932 91834 165504 285982 230584 201192 204847 180779
2157 180779 481341 603452 117986 36561 277457 41981 -101912 248052 109067 261212
2147 261212 425251 185839 -128821 61253 -112787 -287863 -286063 51951 163116 -55906
2137 -55906 -79124 -69999 -233512 -65987 11666 -87306 -54831 -62250 -31098 -45321 51972 -16179
2125 -16179 75043 211088 122689 -72716 -272774 -148665 -81706 14427 -48356 -78330 216914
2114B16914j24679k30275l06407K72590O3487J67471r648J64418Q7637j78231
2104A23277k55320j31285j58732L52995Q6985l5669K1412k21819M7900L60524
2094A90268J29052m2918m4335k18707K28005k37365Q8857J82965K16453J87680
2084F79955J69842M36523J98839L42345K13598J35851j19992o46598n60945m27051
2074D22367n0450j78017k01974m037j52413N2333K39752m7601k81428J67685o9621
2063a03404R6284k8190Q078l56159j65551M8908J43721K27763L05858Q1631j93124
2052F5815l2007n7180j97319K171K13413j96847j55438n0377K15206j00488P5715
2041b17336J36496R2223k3313J22537Q7849j67812l50508M5685K59711r0565k11654
$$ plain form
2114 216914 92235 -138040 -444447 -171857 -108370 59101 49453 213871 301508 123277
2104 123277 -132043 -263328 -422060 -69065 17920 -17749 3663 -218156 -170256 190268
2094 190268 319320 276402 232067 13360 241365 4000 92857 275822 492275 679955
2084 679955 849797 1286320 1485159 1827504 2041102 2176953 2056961 1410363 849418 422367
2074 422367 371917 193900 -8074 -12111 -164524 -112191 127561 79960 -201468 -33783 -103404
2063 -103404 -7120 -35310 -27232 -383391 -548942 -500034 -356313 -128550 177308 258939 65815
2052 65815 33808 -23372 -220691 -218520 -5107 -201954 -357392 -407769 -192563 -293051 -217336
2041 -217336 -80840 11383 -11930 110607 198456 30644 -319864 -274179 -14468 -105033 -316687
2030c16687j03021J19578l34920K26363Q3830j90328J00073K9397j30440K67535
2020b48620P9045r7251q0587J13566j15570j52870K09853J9135q0652K66975J41247
2009E4271j87315o4739r0880O2477P7411O249k7465r3946J5227K14655J87491
1998A53436O1079k08657j98034K23020K23026j14140K4891j13534Q211J34749
1988A94047j1396l42385k7064J8834J13931l2366k65991k19231R0583M05963J43227
1977F8152N60j54067j21943k9654r6755K35648K9591j03956l4565q2795Q4008
1966b05776K2805o2283m6210j21237K10787K0538j5229o0598o2507k14206J7564
$$ plain form
2030 -316687 -419708 -300130 -635050 -408687 -324857 -515185 -415112 -385715 -516155 -248620
2020 -248620 -169575 -266826 -347413 -233847 -349417 -502287 -292434 -273299 -353951 -86976 54271
2009 54271 -133044 -197783 -288663 -226186 -148775 -142526 -169991 -263937 -248710 -34055 153436
1998 153436 214515 5858 -192176 30844 253870 139730 164621 51087 59298 194047
1988 194047 182651 -159734 -186798 -167964 -54033 -86399 -352390 -571621 -481038 -75075 68152
1977 68152 68712 -85355 -207298 -236952 -333707 -98059 -68468 -172424 -206989 -289784 -205776
1966 -205776 -182971 -245254 -291464 -412701 -201914 -181376 -196605 -257203 -319710 -533916 -516352
$$ [...]
##END NTUPLES=NMR SPECTRUM
##END=
