##TITLE=1H_DE-80H_X3
 200.13MHz, d2o
 8 sc
 
 19ns.26.2.2025
##JCAMPDX= 6.0         $$ Bruker NMR JCAMP-DX V2.0
##DATA TYPE= NMR SPECTRUM
##DATA CLASS= NTUPLES
##ORIGIN= UXNMR, Bruker Analytische Messtechnik GmbH
##OWNER= pz
$$ XWIN-NMR		Version 3.5
$$ Thu Mar  5 10:05:03 2026 Russian Standard Time (UT+4h)  Yarkov@DPX200
##.OBSERVE FREQUENCY= 200.1313
##.OBSERVE NUCLEUS= ^1H
##.ACQUISITION MODE= SIMULTANEOUS
##.ACQUISITION SCHEME= undefined
##.AVERAGES= 8
##.DIGITISER RES= 18
##SPECTROMETER/DATA SYSTEM= spect
##.PULSE SEQUENCE= zg30
##.SOLVENT NAME= DMSO
##.SHIFT REFERENCE= (INTERNAL, DMSO, 0, 15.4714)
##AUDIT TRAIL= $$ (NUMBER, WHEN, WHO, WHERE, WHAT)
$$ ##TITLE= Audit trail, XWIN-NMR		Version 3.5
$$ ##JCAMPDX= 5.01
$$ ##ORIGIN= Bruker BioSpin GmbH
$$ ##OWNER= Yarkov
$$ C:/Bruker/XWIN-NMR/data/yarkov2/nmr/H-C/1/pdata/1/auditp.txt
$$ ##AUDIT TRAIL=  $$ (NUMBER, WHEN, WHO, WHERE, WHAT)
(   1,<2026-03-05 10:04:15.37 +0400>,<Yarkov>,<DPX200>,
      <created by zg, POWCHK disabled, PULCHK disabled
       configuration hash MD5:
       00 E9 B6 7A A2 85 ED C7 34 08 36 98 17 FE 4E 26
       data hash MD5: 16K
       BB 1F 10 A6 2D 7A B7 A8 28 80 D0 0F 7F 38 00 3F>)
(   2,<2026-03-05 10:04:19.75 +0400>,<Yarkov>,<DPX200>,
      <Start of raw data processing
       efp BC_mod = 2 LB = 0.25 FT_mod = 6 PKNL = 1 PHC0 = -5299.748 PHC1 = 6.821927 SI = 16K 
       data hash MD5: 16K
       BC 31 41 F5 CA 8D 27 D0 EF 12 0D D7 DB A0 6F ED>)
$$ ##END=
$$ 
$$ hash MD5
$$ 60 3B 0F DC 80 8B BB A0 6E 66 59 E9 6D A3 F6 B8
##$RELAX= 
##$RELAX= 
##$RELAX= 
##$RELAX= 
##$RELAX= 
##$RELAX= 
$$ Bruker specific parameters
$$ --------------------------
##$DU= <C:/Bruker/XWIN-NMR>
##$EXPNO= 1
##$NAME= <H-C>
##$PROCNO= 1
##$TYPE= <nmr>
##$USER= <yarkov2>
##$AMP= (0..31)
100 100 100 100 100 100 100 100 100 100 100 100 100 100 100 100 100 100 
100 100 100 100 100 100 100 100 100 100 100 100 100 100 
##$AQSEQ= 0
##$AQ_mod= 1
##$AUNM= <au_zg>
##$AUTOPOS= <>
##$BF1= 200.13
##$BF2= 200.13
##$BF3= 200.13
##$BF4= 200.13
##$BF5= 200.13
##$BF6= 200.13
##$BF7= 200.13
##$BF8= 200.13
##$BYTORDA= 1
##$CFDGTYP= 0
##$CFRGTYP= 5
##$CHEMSTR= <none>
##$CNST= (0..31)
1 1 145 1 1 1 1 1 1 1 1 1 1 1 1 1 1 1 1 1 1 1 1 1 1 1 1 1 1 1 1 1 
##$CPDPRG= <>
##$CPDPRG1= <>
##$CPDPRG2= <>
##$CPDPRG3= <>
##$CPDPRG4= <mlev>
##$CPDPRG5= <mlev>
##$CPDPRG6= <mlev>
##$CPDPRG7= <mlev>
##$CPDPRG8= <mlev>
##$CPDPRGB= <>
##$CPDPRGT= <>
##$D= (0..31)
0 0.7 0 0 0 0 0 0 0 0 0 0.03 0 0 0 0 0 0 0 0 0 0 0 0 0 0 0 0 0 0 0 0 
##$DATE= 1772690654
##$DBL= (0..7)
120 120 120 120 120 120 120 120 
##$DBP= (0..7)
150 150 150 150 150 150 150 150 
##$DBP07= 0
##$DBPNAM0= <>
##$DBPNAM1= <>
##$DBPNAM2= <>
##$DBPNAM3= <>
##$DBPNAM4= <>
##$DBPNAM5= <>
##$DBPNAM6= <>
##$DBPNAM7= <>
##$DBPOAL= (0..7)
0.5 0.5 0.5 0.5 0.5 0.5 0.5 0.5 
##$DBPOFFS= (0..7)
0 0 0 0 0 0 0 0 
##$DE= 6
##$DECBNUC= <off>
##$DECIM= 32
##$DECNUC= <off>
##$DECSTAT= 4
##$DIGMOD= 1
##$DIGTYP= 9
##$DL= (0..7)
0 120 120 120 120 120 120 120 
##$DP= (0..7)
$$ [...]
##$SUBNAM2= <"">
##$SUBNAM3= <"">
##$SUBNAM4= <"">
##$SUBNAM5= <"">
##$SUBNAM6= <"">
##$SUBNAM7= <"">
##$SUBNAM8= <"">
##$SUBNAM9= <"">
##$SW= 18.0517328524113
##$SWIBOX= (0..15)
0 0 2 0 0 0 0 0 0 0 0 0 0 0 0 0 
##$SW_h= 3612.71676300578
##$TD= 16384
##$TD0= 1
##$TE= 0
##$TE2= 300
##$TE3= 300
##$TEG= 300
##$TL= (0..7)
0 120 120 120 120 120 120 120 
##$TP= (0..7)
150 150 150 150 150 150 150 150 
##$TP07= 0
##$TPNAME0= <>
##$TPNAME1= <>
##$TPNAME2= <>
##$TPNAME3= <>
##$TPNAME4= <>
##$TPNAME5= <>
##$TPNAME6= <>
##$TPNAME7= <>
##$TPOAL= (0..7)
0.5 0.5 0.5 0.5 0.5 0.5 0.5 0.5 
##$TPOFFS= (0..7)
0 0 0 0 0 0 0 0 
##$TUNHIN= 0
##$TUNHOUT= 0
##$TUNXOUT= 0
##$USERA1= <user>
##$USERA2= <user>
##$USERA3= <user>
##$USERA4= <user>
##$USERA5= <user>
##$V9= 5
##$VALIST= <valist>
##$VCLIST= <CCCCCCCCCCCCCCC>
##$VD= 0
##$VDLIST= <DDDDDDDDDDDDDDD>
##$VPLIST= <PPPPPPPPPPPPPPP>
##$VTLIST= <TTTTTTTTTTTTTTT>
##$WBST= 1024
##$WBSW= 4
##$XGAIN= (0..3)
0 0 0 0 
##$XL= 0
##$YL= 0
##$YMAX_a= 168686
##$YMIN_a= -135539
##$ZGOPTNS= <>
##$ZL1= 120
##$ZL2= 120
##$ZL3= 120
##$ZL4= 120
##$ABSF1= 0
##$ABSF2= 0
##$ABSG= 0
##$ABSL= 0
##$ALPHA= 0
##$AQORDER= 0
##$ASSFAC= 0
##$ASSFACI= 0
##$ASSFACX= 0
##$ASSWID= 0
##$AUNMP= <proc_1d>
##$AZFE= 0.1
##$AZFW= 0.1
##$BCFW= 0
##$BC_mod= 2
##$BYTORDP= 0
##$COROFFS= 0
##$CY= -3
##$DATMOD= 1
##$DC= 0
##$DFILT= <>
##$DTYPP= 0
##$F1P= 0
##$F2P= 0
##$FCOR= 1
##$FTSIZE= 16384
##$FT_mod= 6
##$GAMMA= 0
##$GB= 0
##$INTBC= 1
##$INTSCL= 3.241238e-09
##$ISEN= 128
##$LB= 0.25
##$LEV0= 0
##$LPBIN= 0
##$MAXI= 10000
##$MC2= 0
##$MEAN= 0
##$ME_mod= 0
##$MI= 1.114404
##$NCOEF= 0
##$NC_proc= -7
##$NLEV= 6
##$NOISF1= 3.799351
##$NOISF2= 2.8
##$NSP= 0
##$NTH_PI= 0
##$NZP= 0
##$OFFSET= 15.47144
##$PC= 1
##$PHC0= -5299.748
##$PHC1= 6.821927
##$PH_mod= 1
##$PKNL= yes
##$PPARMOD= 0
##$PSCAL= 0
##$PSIGN= 0
##$REVERSE= no
##$SF= 200.130010058536
##$SI= 16384
##$SIGF1= 3
##$SIGF2= 2
##$SINO= 0.751879
##$SIOLD= 32768
##$SREGLST= <19F.Aceton>
##$SSB= 0
##$STSI= 16384
##$STSR= 0
##$SW_p= 3612.71676300578
##$SYMM= 0
##$S_DEV= 0
##$TDeff= 16384
##$TDoff= 0
##$TI= <>
##$TILT= no
##$TM1= 0
##$TM2= 0
##$TOPLEV= 0
##$USERP1= <user>
##$USERP2= <user>
##$USERP3= <user>
##$USERP4= <user>
##$USERP5= <user>
##$WDW= 1
##$XDIM= 16384
##$YMAX_p= 270925834
##$YMIN_p= -672205
$$ End of Bruker specific parameters
$$ ---------------------------------
##NTUPLES= NMR SPECTRUM
##VAR_NAME=  FREQUENCY,     SPECTRUM/REAL,   SPECTRUM/IMAG
##SYMBOL=    X,             R,               I
##VAR_TYPE=  INDEPENDENT,   DEPENDENT,       DEPENDENT
##VAR_FORM=  AFFN,          ASDF,            ASDF
##VAR_DIM=   16384,         16384,           16384
##UNITS=     HZ,            ARBITRARY UNITS, ARBITRARY UNITS
##FACTOR=    0.220516191357247, 1,           1
##FIRST=     3096.29950591034, 0,            0
##LAST=      -516.417257095442, 0,           0
##MIN=       -516.417257095442, -672205,     0
##MAX=       3096.29950591034, 270925834,    0
$$ Real data points
##PAGE= N=1
##DATA TABLE= (X++(R..R)), XYDATA
$$ [...]
5247E463772K17442J70302K6411J25211Q1109R8930K54283N9996N6503L07175
5237F861134J84152M8214J69266K38084L75178K06319J53592L87159L77389L14821
5227I315308L23417M01850M28990M10939M24410K96439M66862N29803N43242O38209
5217A3779469P15044J010699J254237J743641K122365K176547J703844Q54160
5209B5360006J28355j85999k83004J41988N95151J053961J855241K917533L496644
5200C5079876M161555L701820K500549J423343O41371O75450R50902J018212P81031
5191E0934109P30957J633194K956333L877387L690608K603888J443454J137833
5183F9007763K093299K889928L105216K631972J963577J716643K475629K894777
$$ y = [5463772, 5681214, 5851516, 5877927, 6003138, 6084247, 6183177, 6437460, 6497456, 6553959, 6861134, 7045286, 7093500, 7262766, 7500850, 7876028, 8082347, 8235939, 8623098, 9000487, 9315308, 9638725, 10040575, 10469565, 10880504, 11304914, 11601353, 12068215, 12598018, 13141260, 13779469, 14494513, 15505212, 16759449, 18503090, 20625455, 22802002, 24505846, 25360006, 25488361, 25302362, 25019358, 25161346, 25756497, 26810458, 28665699, 31583232, 35079876, 39241431, 42943251, 45443800, 46867143, 47508514, 48183964, 49134866, 50153078, 50934109, 51665066, 53298260, 56254593, 60131980, 63822588, 66426476, 67869930, 69007763, 71101062, 73990990, 77096206, 79728178, 81691755, 83408398, 85884027, 88778804]
5175H8778804K604298J976903J748774K336551L490290M221776L769933J867647
5167A10794976P0760p10898p13684k54987r2885l98273r00765q83496p30209r58908
5157A05221631k171962l932458n501413o345765o536812o054605n285594m455358
5149F4937664l641551k830593k036703j623441j698131k126424k833260l171141
5141D4976420l329814l160973k827681k536312k177512j833987j503152j511001
5133B6095988j104752j127753j095903j070649r19068q09451q87674o99041o63394
5124A7718303n77770o01758n03804n32337n43257m58679l33955n40462m71945
5115A3154336l11382l61222k55094l99171m08249k00786m9730l02936m24055k97280
$$ y = [88778804, 91383102, 93360005, 95108779, 97445330, 100935620, 105157396, 108927329, 110794976, 110865736, 110154838, 109441154, 109186167, 109093282, 108695009, 107794244, 106910748, 106180539, 105221631, 103049669, 99117211, 93615798, 87270033, 80733221, 74678616, 69393022, 64937664, 61296113, 58465520, 56428817, 54805376, 53107245, 50980821, 48147561, 44976420, 41646606, 38485633, 35657952, 33121640, 30944128, 29110141, 27606989, 26095988, 24991236, 23863483, 22767580, 21696931, 20777863, 19968412, 19080738, 18381697, 17718303, 17140533, 16538775, 16034971, 15502634, 14959377, 14500698, 14166743, 13626281, 13154336, 12842954, 12481732, 12226638, 11827467, 11419218, 11218432, 11168702, 10865766, 10441711, 10144431]
5105A0144431l06159k37941k19849j18112k73029j79465j67378k10667j52549
5096H279282l20818j21293j9324j63706l13300j34470j3969j92300p6918j57223
5086F765961j19960j29464p5919j90241j96541k3425j92322p4362j21843k01870
5076E440014j41917j04003m796j46301j69152j17153r2739l8827o0495j35640
5066D428991J0286r3925j6493M2475j31635p614k01398j01753l2352m7528o5787
5055C783267J7855k06798j67445j1801j0032l5843k8625P2041L7380r4637l4064
5044C321298N1945l8396j22756k07413p4813J75964k6973N7925P1249P3m0195
5033C167908o1772n7891L9231O270j87757K449Q2780J44562J23862j23692j01745
$$ y = [10144431, 9838272, 9600331, 9380482, 9262370, 8989341, 8809876, 8642498, 8431831, 8279282, 7958464, 7837171, 7817847, 7654141, 7340841, 7206371, 7192402, 7000102, 6923184, 6765961, 6646001, 6516537, 6440618, 6250377, 6053836, 6030411, 5838089, 5763727, 5641884, 5440014, 5298097, 5194094, 5189298, 5042997, 4873845, 4756692, 4663953, 4625126, 4564631, 4428991, 4439277, 4345352, 4328859, 4371334, 4239699, 4232085, 4030687, 3928934, 3896582, 3849054, 3783267, 3801122, 3594324, 3426879, 3415078, 3405046, 3369203, 3340578, 3412619, 3449999, 3355362, 3321298, 3373243, 3334847, 3212091, 3004678, 2929865, 3105829, 3078856, 3136781, 3208030, 3208103, 3167908, 3106136, 3048245, 3087476, 3093746, 2905989, 2908438, 2991218, 3135780, 3259642, 3135950, 3034205]
5022C034205k0301O155M8041q0522j6443J322J16030o9067r5283P6779o398j5716
5010B978802L3225P0337P1571k2294J55621q3166n6225J06804m9622j0692p6234
4999C118127j42945Q3389P1025j17456R1041R4868J20305K5969o4520J40966J27235
4988C548004J21337j6559J44027M54255J82217K72186J08586p2305k48319k95976
4978D197453l18392k52326m395J67884o7818k46256L2936O5554P55Q4859Q4848
4967C745102j43169j01088J54255m1326j35318j58966m3253J34689n781L5725
4957C440870M6307J3732k5575j36412o194l856m8277M2884o6494N9376N8744j1168
4945C363937J26110J42770j17843L4811J53579J551n187J49818K0147L6394n1887
$$ y = [3034205, 3013904, 3020059, 3068100, 2987578, 2971135, 2972457, 3088487, 3019420, 2924137, 3000916, 2994518, 2978802, 3012027, 3082364, 3153935, 3131641, 3287262, 3204096, 3147871, 3254675, 3205053, 3194361, 3118127, 2975182, 3058571, 3129596, 3012140, 3103181, 3198049, 3318354, 3344323, 3279803, 3420769, 3548004, 3669341, 3652782, 3796809, 4251064, 4433281, 4705467, 4814053, 4741748, 4493429, 4197453, 3879061, 3626735, 3622340, 3790224, 3722406, 3476150, 3509086, 3574640, 3575395, 3660254, 3745102, 3601933, 3500845, 3655100, 3613774, 3478456, 3319490, 3276237, 3410926, 3405145, 3440870, 3487177, 3500909, 3475334, 3338922, 3332728, 3328872, 3280595, 3323479, 3256985, 3316361, 3375105, 3363937, 3490047, 3632817, 3514974, 3549785, 3703364, 3704915, 3699728, 3849546, 3869693, 3906087, 3854200]
4934C854200j04359L9802J5780n6524r8364j1930J3501J55513P7945Q7349J25012
4923D097925q2478J25976Q3061j75097K05468J66523J57205L1361J57769J33799
4913D901512O1684O1685R5704J42299o5949J00760L1121J03555L630K6489J88043
4902E650533M2939J03093J51180J54140P3293p0211J13441m6162R3304J92881
4892F458431J78615J55754J48830n5289R3517o1314P5874J19207J89323K32728
4882G535676J60221K05826J90335K39535K93329J62426J57012J84923Q1194Q0284
4872I290761J93595K32553J55111J57122J58744J90752J48785L08805K95389K82622
4862A1414239L68171M70632N81352N42716N69132L46544L41849K96821L46069
$$ y = [3854200, 3749841, 3789643, 3805423, 3748899, 3650535, 3638605, 3652106, 3807619, 3885564, 3972913, 4097925, 4015447, 4141423, 4224484, 4049387, 4254855, 4421378, 4578583, 4609944, 4767713, 4901512, 4963196, 5024881, 5120585, 5262884, 5196935, 5297695, 5328816, 5432371, 5436001, 5462490, 5650533, 5693472, 5796565, 5947745, 6101885, 6175178, 6104967, 6218408, 6172246, 6265550, 6458431, 6637046, 6792800, 6941630, 6886341, 6979858, 6918544, 6994418, 7113625, 7302948, 7535676, 7695897, 7901723, 8092058, 8331593, 8624922, 8787348, 8944360, 9129283, 9210477, 9290761, 9484356, 9716909, 9872020, 10029142, 10187886, 10378638, 10527423, 10836228, 11131617, 11414239, 11782410, 12253042, 12834394, 13377110, 13946242, 14292786, 14634635, 14931456, 15277525]
4853A5277525L72916K76426M07934M84551N67087O70008R11359J189257J130149
4844B1287212J490276J528539J650839J913993J920712K359874K774962L445875
4836C8372282M020667N440046P865123J1880820J3967892J0529084K816391j544956
4828I3347349k762820j918775m92416j02955o4138r5151k53880l52992j47218
4819H7157004j74214P6373N7254K17404O76563J039321J345825J951934K702783
4810I5050247K972555L791792M663409N248281N478549N550402N291602N094553
4802A33141390M872355M679712M147079L112722J577714m49082k320104l598308
4794A45163478m435872m824641m545662l540159j617781J069065M015497M135692
$$ y = [15277525, 15650441, 15926867, 16334801, 16819352, 17386439, 18056447, 18967806, 20157063, 21287212, 22777488, 24306027, 25956866, 27870859, 29791571, 32151445, 34926407, 38372282, 42392949, 47832995, 55698118, 67578938, 81546830, 92075914, 94892305, 93347349, 90584529, 88665754, 88173338, 88070383, 88006245, 87911094, 87657214, 87304222, 87157004, 86982790, 87059163, 87116417, 87333821, 88010384, 89049705, 90395530, 92347464, 95050247, 98022802, 101814594, 106478003, 111726284, 117204833, 122755235, 128046837, 133141390, 138013745, 142693457, 146840536, 149953258, 151530972, 151081890, 148761786, 145163478, 140727606, 135902965, 131357303, 127817144, 126199363, 127268428, 131283925, 135419617]
4786A35419617L92743n035161p940607q467793o981038m790126l092150j989114
4778I7516371q40652J19360R58247J822760K611068L597889N206510P157450Q488179
4769A26637182P311848L902111Q10740K54071J085005k45158n244836j0678411
4761A23832552j3587697j3733926j1688282r228983p026265n397463l548140k282534
4753E7339262j092868Q4812J356931L260676O091560R994290J2111000J0390063
4745I9535726M458029j616978n094567n872784m893951l250750j533502o30246
4737H1100977L7337M86437L85081J9779n18772q51740q32669p27545m50245k59683
4727G8388957j30486J50362N59965Q19347J153838J580832K189308L131863L838604
$$ y = [135419617, 135812360, 130777199, 122836592, 114368799, 107387761, 102597635, 99505485, 97516371, 96675719, 96795079, 97753326, 99576086, 102187154, 105785043, 110991553, 118149003, 126637182, 133949030, 137851141, 138661881, 138915952, 140000957, 139755799, 134510963, 123832552, 110244855, 96510929, 84822647, 75593664, 68567399, 63169936, 59621796, 57339262, 56246394, 56331206, 57688137, 60948813, 67040373, 77034663, 89145663, 99535726, 103993755, 102376777, 97282210, 91409426, 86515475, 83264725, 81731223, 81100977, 81138314, 81624751, 82009832, 82029611, 81510839, 80659099, 79826430, 79098885, 78648640, 78388957, 78258471, 78408833, 78968798, 79788145, 80941983, 82522815, 84712123, 87843986, 91682590]
4718I1682590M605633N074786N100285N305096N153206N336971N808145N774915
4710A33841627N014833L912988K014629m9154j601303k783725l209284l214291
4702A33926320l293846l533507m162188m426368m236803m080279l423429k884962
4694A03884938k298924j810491j426432j245473q85299p12791o25839j62942o0285
4685I4656462j777k28856r02090j949495k911579l579353m289038m568512m636763
4676G1588999m498909m499529m593620m351737m373760m205100l779512l480929
4668C7805903k990694k632437k402201k126566j851575j820101j424234j083993
4660B1474102r83316j005276p98913o70455n98694o72244o44194n54177n33024
$$ y = [91682590, 96288223, 101363009, 106463294, 111768390, 116921596, 122258567, 128066712, 133841627, 138856460, 142769448, 144784077, 144734923, 143133620, 140349895, 137140611, 133926320, 130632474, 127098967, 122936779, 118510411, 114273608, 110193329, 106769900, 103884938, 101586014, 99775523, 98349091, 97103618, 96218319, 95505528, 94879689, 94716747, 94656462, 94654685, 94425829, 93523739, 91574244, 88662665, 85083312, 80794274, 76225762, 71588999, 67090090, 62590561, 57996941, 53645204, 49271444, 45066344, 41286832, 37805903, 34815209, 32182772, 29780571, 27654005, 25802430, 23982329, 22558095, 21474102, 20490786, 19485510, 18686597, 18016142, 17417448, 16745204, 16101010, 15546833, 15013809]
4651A5013809l58015k57769m09499m63743l98911k76960j94399j79337k14025
4642A2261151l98552k86904j29213m3029k16508k70843r3923p0121j68261P6498
4632A0660295J70571k599M73330P48130J611483K772351K339872L45515j345806
4623A7773142j861645j993983j444403j047290p33623n57070k53098k05410o6948
4614I609672N8945K46138O73694J079256J126577J084480O20588K47918m399K96838
4604A5039707M56711J202348J822385J968213J575347L81616n62569p92574k42326
4595B0848858O35290J653727K248889J828885M18136j090752j890788j892654
4587B2759591j341955l60930L01772N92670n0051r92371j716662j971279j617337
$$ y = [15013809, 14655794, 14398025, 13988526, 13524783, 13125872, 12848912, 12654513, 12475176, 12261151, 11862599, 11575695, 11446482, 11403453, 11186945, 10916102, 10822179, 10752058, 10583797, 10660295, 10830866, 10828267, 11301597, 12049727, 13661210, 16433561, 18773433, 19118948, 17773142, 15911497, 13917514, 12473111, 11425821, 10692198, 10135128, 9882030, 9676620, 9609672, 9668617, 9914755, 10588449, 11667705, 12794282, 13878762, 14499350, 14747268, 14742869, 15039707, 15496418, 16698766, 18521151, 20489364, 22064711, 22446327, 21883758, 21091184, 20848858, 21484148, 23137875, 25386764, 27215649, 27633785, 26543033, 24652245, 22759591, 21417636, 21056706, 21358478, 21951148, 21901097, 20908726, 19192064, 17220785, 15603448]
4578A5603448j075315m67304l71340l92151o49289r96312j188392j119972j050630
4569H292743p12776n83124m92899m04018k86279k30341l73160n5946r4713J5219
4559E074706p9857j88247J8798M0134l1787Q5579q5913J9719l69J23971J38379
4548E115113q7901R443J89964R4234m7554J09795J89282K41356K80972K36776
4538F331480J63532K02703K67410K26669L40281M90392M22238M51770O99545Q69196
4528A0465216J017476J115673J197485J799107K626796L567697N845233Q656962
4520C6291645J0569209R324375M759719j114667n303204o614736n762498l995882
4512C8153961j912585P73055L863596P062959Q310733O163509R39231m118951
$$ y = [15603448, 14528133, 14060829, 13689489, 13297338, 12648049, 11651737, 10463345, 9343373, 8292743, 7579967, 6996843, 6503944, 6099926, 5813647, 5583306, 5210146, 5154200, 5059487, 5074706, 4994849, 4806602, 4825400, 4865534, 4833747, 4919326, 4833413, 4853132, 4852763, 4976734, 5115113, 5027212, 5036655, 5226619, 5320853, 5273299, 5383094, 5572376, 5813732, 6094704, 6331480, 6495012, 6697715, 6965125, 7191794, 7532075, 8022467, 8444705, 8896475, 9596020, 10465216, 11482692, 12598365, 13795850, 15594957, 18221753, 21789450, 27634683, 36291645, 46860854, 56185229, 60944948, 59830281, 54527077, 47912341, 42149843, 38153961, 36241376, 37014431, 40878027, 47940986, 56251719, 62415228, 63354459, 59235508]
4504E9235508o814806p252683n537977l576094r19666K315684N103156O939939
4496D9493061N755931J517116l108806n726447o354298n153760l517236j544231
4488C1361330O58205L313528N932293O441143L719534j075500n177032o932019
4480C8241482o897245n877336m513325l561187k692906k145876j593556j210437
4472I749614r00797o97429n10960m83926l84332l86656l73344k74912l70394j82559
4462E184305j16001m7590j64149k66841N0768k00297j26494j57763q7601j36439
4452C931898k1102K7350j63229q1296j17422j55492m201L0151q9762o8296r5087
4441C193512p0948L1046p120p3703j79737r3069j05324j20771J06470J18132l0828
$$ y = [59235508, 52420702, 45168019, 39630042, 36053948, 35134282, 37449966, 42553122, 49493061, 55248992, 56766108, 53657302, 47930855, 41576557, 36422797, 32905561, 31361330, 32019535, 35333063, 41265356, 47706499, 51426033, 50350533, 45173501, 38241482, 31344237, 25466901, 20953576, 17392389, 14699483, 12553607, 10960051, 9749614, 8848817, 8151388, 7640428, 7156502, 6772170, 6385514, 6012170, 5737258, 5366864, 5184305, 5068304, 5020714, 4856565, 4589724, 4640492, 4440195, 4313701, 4155938, 4068337, 3931898, 3910796, 3938146, 3774917, 3693621, 3576199, 3420707, 3416506, 3446657, 3356895, 3288599, 3193512, 3122564, 3153610, 3146490, 3072787, 2893050, 2799981, 2694657, 2573886, 2680356, 2798488, 2767660]
4430B767660j11676R1902j60251O1473q8197k5614J16250k4871Q5376J11138J5637
4419B838827N7108j67858r3664j62055n5463p4795r8538k2679p0480J0883l3092
4408B128194k6411O3888K9728r259L689Q5653P6884p5365k6226N7342q815k2135
4396B277167j64399k5372j6079q6329K1912l9964J01085m8465l124k9539m9338
4385A937555P8726K7008K2225p2933j00712n9765j69998J14952n5951K7567m4475
4374A704199J24955N318J6752K63674L2874J39180K33633K98496J57296l6957
4364B939420j37255r2528j87572k61073j79201j31809o5348O650j32074j6196
4354A743014L853J73523j03376j16978M8449Q1807Q0965K3232K2242k1788L9795
$$ y = [2767660, 2655984, 2747886, 2587635, 2649108, 2560911, 2535297, 2651547, 2626676, 2712052, 2823190, 2838827, 2895935, 2728077, 2634413, 2472358, 2416895, 2342100, 2243562, 2220883, 2150403, 2161286, 2128194, 2101783, 2165671, 2195399, 2186140, 2189829, 2275482, 2352366, 2277001, 2250775, 2308117, 2299302, 2277167, 2112768, 2087396, 2071317, 1984988, 2006900, 1966936, 2068021, 2019556, 2016432, 1986893, 1937555, 2016281, 2043289, 2065514, 1992581, 1891869, 1832104, 1662106, 1777058, 1721107, 1748674, 1704199, 1829154, 1834472, 1851224, 2114898, 2147772, 2286952, 2520585, 2819081, 2976377, 2939420, 2802165, 2709637, 2522065, 2260992, 2081791, 1949982, 1884634, 1891284, 1759210, 1743014, 1746867, 1920390, 1817014, 1700036, 1748485, 1830292, 1911257, 1934489, 1956731, 1934943, 1974738]
4343A974738P2531J2787o1252j76016J05425P950j84830j43438k1878R9607M491
4332A690115J29385J3184j7031k6892j57513O6759l9634p9443J36553M7498Q3529
4321A846510R4737l4570j53981l4129Q299J97494K9319k1038K8468J07037L0564
4310B098710j35968q1649L1580j5254l800K9669q0487p641o6027J22111M3101
4299A934345k9958j33676J29286Q6712o3416j22549l5498j1922J08175J49032
4289B010531J7659J07784K9768J8584j24750N9991k4742o9080L4985n6956j3587
4278A990187J1935j43609J74785O0945p1751j65639J07677J6241M7742O0372j3928
4267B074957r6872M0882Q6811j7884L8543Q6467p8396q8604j45042J06514M9187
$$ y = [1974738, 2047269, 2060056, 1998804, 1822788, 1928213, 1936163, 1751333, 1607895, 1586017, 1685624, 1690115, 1819500, 1832684, 1815653, 1788761, 1631248, 1698007, 1658373, 1578930, 1715483, 1762981, 1846510, 1941247, 1906677, 1752696, 1718567, 1726866, 1924360, 1953679, 1932641, 1961109, 2068146, 2098710, 1962742, 1881093, 1912673, 1897419, 1893619, 1923288, 1842801, 1835160, 1769133, 1891244, 1934345, 1904387, 1770711, 1899997, 1986709, 1923293, 1800744, 1765246, 1753324, 1861499, 2010531, 2028190, 2135974, 2165742, 2184326, 2059576, 2119567, 2094825, 2025745, 2060730, 2003774, 1990187, 2002122, 1858513, 2033298, 2094243, 2022492, 1856853, 1964530, 1980771, 2028513, 2088885, 2074957, 1978085, 2018967, 2105778, 2087894, 2126437, 2212904, 2134508, 2045904, 1900862, 2007376, 2056563]
4256B056563k0945L5261j7780p2678q6476J94878k2702l2376P1335J57106m7947
4245B214239l9766p9353R4860p0234p4846j50723J17472J21850m3802J72368N6449
4234B318514N4107p6954M8994j1074J6576O5858J5588q5354J11093J64709l5455
4223B586602k4975L1479O6869o6748k8197J83474n0374k12820j29575J03169Q8325
4212B547229J24860O4024P9837j78991k970l954J08309J24071K4881K9059q6976
4201B829379Q5037R8216R7794m337Q1044n1360J0417r3286J07831L2313O3901
4190C256949N0032J8752o8443J22620m6918R5016R1705p5901j3967J64493J14470
4179C708808J0702L2471N6186J3229J70903m5490Q9485J46613Q9163M7438k9084
$$ y = [2056563, 2035618, 2070879, 2053099, 1980421, 1893945, 2088823, 2066121, 2033745, 2105080, 2262186, 2214239, 2174473, 2095120, 2189980, 2119746, 2044900, 1894177, 2011649, 2133499, 2089697, 2262065, 2318514, 2372621, 2295667, 2344661, 2333587, 2350163, 2416021, 2431609, 2346255, 2457348, 2622057, 2586602, 2561627, 2593106, 2659975, 2593227, 2565030, 2748504, 2698130, 2485310, 2355735, 2458904, 2547229, 2672089, 2736113, 2815950, 2636959, 2633989, 2630035, 2738344, 2862415, 2887296, 2916355, 2829379, 2914416, 3012632, 3110426, 3106089, 3187133, 3135773, 3146190, 3052904, 3160735, 3193048, 3256949, 3306981, 3325733, 3257290, 3379910, 3332992, 3428008, 3519713, 3443812, 3429845, 3594338, 3708808, 3719510, 3751981, 3808167, 3821396, 3992299, 3946809, 4036294, 4182907, 4272070, 4319508, 4290424]
4168D290424r0669O0759J91158J21286J09322P3384J47427J48824l5713J73540
4158E189742J80998o925J26947O6577O9970R5875K63386J32915Q8581K34475K33816
4147F676357J13531L13306K58876N0562K94024L86943L83616M52840M98746N13341
4137I942142O27123N86058N87632P18467O41539P93336P99541N69573O12646N57584
4127A6435641O70186N51029M36995L86870K10913L22123K86822K79299M41485
4118B0021363Q78884J174826J277451J323042J036135Q86262R40298P36488P80521
4109B9055270P54323R56356R44133R38731R06770R27421Q18400J081539J078268
4100C7461211R72356R99333J210828J043729R70273P78629P02461R06785J312567
$$ y = [4290424, 4199755, 4260514, 4451672, 4572958, 4682280, 4755664, 4903091, 5051915, 5016202, 5189742, 5370740, 5363815, 5490762, 5557339, 5627309, 5723184, 5986570, 6119485, 6208066, 6442541, 6676357, 6789888, 7103194, 7362070, 7412632, 7706656, 8093599, 8477215, 8930055, 9428801, 9942142, 10569265, 11155323, 11742955, 12461422, 13102961, 13896297, 14695838, 15265411, 15878057, 16435641, 17105827, 17656856, 18093851, 18480721, 18691634, 19013757, 19300579, 19579878, 20021363, 20900247, 22075073, 23352524, 24675566, 25711701, 26597963, 27538261, 28274749, 29055270, 29809593, 30765949, 31710082, 32648813, 33555583, 34483004, 35301404, 36382943, 37461211, 38433567, 39432900, 40643728, 41687457, 42657730, 43436359, 44138820, 45045605, 46358172]
4091D6358172J900245K513679K862739K774423K392106J662487P90336J64405
4083F1418592N7544J89532L50575N55984N60950O76933P79671Q67539J163597
4074F6620917J892378K256305K195432J087764j52317n46652o19563m63345q4289
4065G2186630O23210J471751K212305L254728M117334M584140M596842M061874
4057I7108814L644308L194943L142554K931574K603934K538076K261421J620072
4049A19045696J383366J116987O90074J07040p1468k8906J56025Q49059J556323
4040A24804196K491279L830835N015292O166167O340527N885895M130998J870249
4032A60535438k83460j274721j589582j229195n53690L49387J122773J458990
$$ y = [46358172, 48258417, 50772096, 53634835, 56409258, 58801364, 60463851, 61254187, 61418592, 61476136, 61665668, 62016243, 62572227, 63133177, 63810110, 64589781, 65457320, 66620917, 68513295, 70769600, 72965032, 74052796, 73900479, 73353827, 72734264, 72270919, 72186630, 72809840, 74281591, 76493896, 79748624, 83865958, 88450098, 93046940, 97108814, 100753122, 103948065, 107090619, 110022193, 112626127, 115164203, 117425624, 119045696, 120429062, 121546049, 122236123, 122343163, 122271695, 122242789, 122398814, 123247873, 124804196, 127295475, 131126310, 136141602, 142307769, 148648296, 154534191, 158665189, 160535438, 160251978, 158977257, 157387675, 156158480, 155604790, 155954177, 157076950, 158535940]
4024A58535940K026580J893859J263957O12397k6718l52736o72123p59862j242666
4015A61278628j986751k521238k956907k645744k152617j550666j385932j923480
4007A44155293k845562m157719n430864o183299o434976n643084m629611l709342
3999A05120836k828219k173741j599703j478195j335376j441828j486842j735667
3991I1041265j816641j815030j982231j757702j633409j480062j186897q04821
3983G8564472q70609j091795j621139k325304k981830l338341l224986k913545
3975F0196923k914139k027093j792855j555942j247225j352231j346565j440305
3967D6520568j506269j406476j186182j195920j107435j058956p42018n29029
$$ y = [158535940, 160562520, 162456379, 163720336, 164332733, 164306015, 163953279, 163281156, 162521294, 161278628, 159291877, 156770639, 153813732, 151167988, 149015371, 147464705, 146078773, 144155293, 141309731, 137152012, 131721148, 125537849, 119102873, 113459789, 108830178, 105120836, 102292617, 100118876, 98519173, 97040978, 95705602, 94263774, 92776932, 91041265, 89224624, 87409594, 85427363, 83669661, 82036252, 80556190, 79369293, 78564472, 77693863, 76602068, 74980929, 72655625, 69673795, 66335454, 63110468, 60196923, 57282784, 55255691, 53462836, 51906894, 50659669, 49307438, 47960873, 46520568, 45014299, 43607823, 42421641, 41225721, 40118286, 39059330, 38317312, 37788283]
3959C7788283j0407M68987Q36237P27495n50551j755031k316199k552636k306343
3950C0329835k006438j526979j429817j159685q62619q52190q26683q05806p66966
3941B0092652p80538n59253n59986o70504o22977m91014n96270p83009q28878
3932A4200223q02774p05643o09897n11992k52567K41855Q87134J043977K27673
3923A3717989p53943j130343j357349j139759q18092p64301m44351n29869l74554
3914F405428l42213k68821j66652k31698j98523j32112l709j20837k44110j38636
3904D558117j9180r1633r7790o9090k11158j46701j59682j13135l0509J03751
3894C722990j06925j37217p8541m4200l7794j24695p7847k25230R1581O7355M7272
$$ y = [37788283, 37777876, 38246863, 39083100, 39810595, 39260044, 37505013, 35188814, 32636178, 30329835, 28323397, 26796418, 25366601, 24206916, 23344297, 22492107, 21665424, 20859618, 20092652, 19312114, 18752861, 18192875, 17522371, 16899394, 16408380, 15812110, 15029101, 14200223, 13397449, 12691806, 12081909, 11569917, 11317350, 11559205, 12446339, 13490316, 13717989, 12964046, 11833703, 10476354, 9336595, 8518503, 7754202, 7309851, 6779982, 6405428, 6063215, 5794394, 5627742, 5396044, 5197521, 5065409, 5061700, 4940863, 4696753, 4558117, 4538937, 4447304, 4349514, 4280424, 4069266, 3922565, 3762883, 3649748, 3619239, 3722990, 3616065, 3478848, 3400307, 3356107, 3318313, 3193618, 3115771, 2890541, 2982122, 3049477, 3096749]
3883C096749q1228l47015o7319M2398q5123l9348M7618r5856k37734O5964m8208
3872B250898m6995q903l7330M164M5350q8472j86709o5750O0814Q5220k0142N631
3860A997776m5266j7334m1005j59234j68573n8513o257l4747L1785l6438P8815
3849A541009m6043j10782n3263O110j6046N8075j72441k6844p8300R1966K28734
3838A422175N429m8348J6958O863n2367j26291N598R7838j46958n6038M7184m9868
3826A122175Q408J45196P2257r4113j14093j6697j08733j522J32250J25419p3996
3815A196551J01784j2148N8622K083j704k05990m9529J11029L0076j5941J25172
3804A340005O4748J01386m5042j192l745l8983k5569l2343J58990r5458N1273
$$ y = [3096749, 3015521, 2668506, 2601187, 2643585, 2558462, 2519114, 2566732, 2470876, 2233142, 2299106, 2250898, 2203903, 2195000, 2157670, 2161834, 2207184, 2118712, 1932003, 1866253, 1927067, 2012287, 1992145, 1997776, 1952510, 1935176, 1894171, 1734937, 1566364, 1507851, 1501594, 1466847, 1498632, 1462194, 1541009, 1494966, 1384184, 1330921, 1337031, 1320985, 1379060, 1206619, 1179775, 1101475, 1193441, 1422175, 1427604, 1379256, 1396214, 1403077, 1350710, 1224419, 1230017, 1327855, 1180897, 1124859, 1172043, 1122175, 1130583, 1275779, 1348036, 1253923, 1139830, 1123133, 1014400, 1012878, 1145128, 1270547, 1196551, 1298335, 1286187, 1344809, 1346892, 1345188, 1139198, 1089669, 1200698, 1230774, 1214833, 1340005, 1404753, 1506139, 1461097, 1459905, 1456160, 1417177, 1391608, 1359265, 1518255, 1422797, 1474070]
3793A474070o3321o5969m2004Q3206q441j11544j7051L6418l6172J66908n54m2500
3781A373046J60396m5609k8553r735M5099l5736n1665K9696J32496j06330l6140
3770A426965k1651j9938K3419o5742k2820J25092J5830j59359r5480P8245J8126
3759A302687n2874J02292O3582L4232j27040j6561L5653m2259J0147j3456j0039
3748A286364Q6259O0612j89210j26946o9724J36877K00526O5177r1479o0594J0485
3737A308347k9581o3645P9013R3903J6697L8557n2430j4178r8191N5965J1550
3726A346007J1739L3662q4572o2245K0458M215Q6878M3413q0421p0589P671k9952
3714A226264j40882R183L5717q8559O6476J31973N7064Q7264r1600J548q4654
$$ y = [1474070, 1410749, 1344780, 1302776, 1385982, 1377541, 1265997, 1248946, 1285364, 1249192, 1416100, 1415546, 1373046, 1533442, 1487833, 1459280, 1449545, 1494644, 1458908, 1407243, 1436939, 1569435, 1463105, 1426965, 1405314, 1385376, 1408795, 1343053, 1320233, 1445325, 1461155, 1301796, 1206316, 1284561, 1302687, 1249813, 1352105, 1415687, 1449919, 1322879, 1306318, 1341971, 1299712, 1309859, 1296403, 1286364, 1372623, 1433235, 1244025, 1117079, 1047355, 1184232, 1384758, 1449935, 1358456, 1297862, 1308347, 1278766, 1215121, 1294134, 1388037, 1404734, 1443291, 1390861, 1376683, 1278492, 1334457, 1346007, 1357746, 1391408, 1306836, 1244591, 1265049, 1269264, 1356142, 1399555, 1319134, 1248545, 1256216, 1226264, 1085382, 1094565, 1130282, 1041723, 1108199, 1240172, 1297236, 1384500, 1292900, 1294448, 1209794]
3703A209794r9838P3936j04209o7710J4681J37288K8459o8259n7442n4951j25766
3692H85983O358O5350k9331J4441Q0153j47063j11485J14716m3574l3072P5165
3681H77641j60927m4075R8446p5433K7992Q9647j5598k4411J4828m3002K2465
3670G67573j44362j7403Q3014k674J38349r6453O6045o0517J20541R2675p2639
3659H74149q5061j82509O3204P6899L8698q7807M3464o7725r7634o3400j3664
3648D98614N5291O478Q928m9247L4799J13946O1209j6050j8880r5116q8369l9646
3636D71957L3122K29941K9968o9246P2293r0035j42987j7296Q5582L469J4093
3625F20861k3905m1426n2314K3710M6329j15614K7713K0471j1605N6788O8019
$$ y = [1209794, 1109956, 1183892, 1079683, 1011973, 1026654, 1163942, 1192401, 1124142, 1066700, 1011749, 885983, 892341, 957691, 928360, 942801, 1022954, 875891, 764406, 879122, 835548, 802476, 877641, 716714, 672639, 771085, 695652, 723644, 813291, 797693, 773282, 788110, 745108, 767573, 623211, 605808, 688822, 686148, 824497, 728044, 794089, 733572, 854113, 946788, 874149, 789088, 606579, 669783, 746682, 785380, 697573, 741037, 673312, 575678, 512278, 498614, 553905, 560383, 569311, 520064, 554863, 668809, 730018, 713968, 695088, 599972, 511603, 471957, 505079, 735020, 764988, 695742, 768035, 678000, 535013, 517717, 603299, 606768, 620861, 596956, 555530, 503216, 526926, 573255, 457641, 485354, 505825, 494220, 551008, 619027]
3614F19027l5210j7855o2967J99988j2108j36697N8841o371J9824N3550J2304
3603F92326q79p076J2540P273N011k0034j3227N8710J17650O6527P7870r8737
3591H97954O04k4734N6496L7207j01263j965j54408J14206J63034j26284q1966
3580G78881R2088K9197p4719J5031j21620n11L3751K5459J3819m5314J59175K1211
3568I26448r3549J5526P0901J76507N1870k2578O7913n7924k4307j3392m306L4623
3556A127732k1369J7824L5613j2409J25525l8128J935M4639M2617k8819O4334
3545A359494L2045l893K6751J07293n5395p0891L7018j6742J53053O5973r7244
3534A537462P1716K73854J5282j17536j3703j6866J21804n1594J05213J41403
$$ y = [619027, 583817, 565962, 502995, 702983, 690875, 554178, 613019, 606648, 626472, 680022, 692326, 691447, 684371, 696911, 704184, 709195, 689161, 675934, 734644, 852294, 918821, 996691, 897954, 898558, 873824, 930320, 967527, 866264, 864299, 709891, 824097, 987131, 860847, 778881, 870969, 900166, 825447, 840478, 718858, 718347, 752098, 777557, 791376, 746062, 905237, 926448, 832899, 848425, 919326, 1095833, 1147703, 1125125, 1193038, 1135114, 1110807, 1097415, 1093109, 1127732, 1106363, 1124187, 1159800, 1147391, 1272916, 1234788, 1236723, 1281362, 1323979, 1295160, 1359494, 1391539, 1387646, 1414397, 1521690, 1466295, 1395404, 1432422, 1415680, 1568733, 1634706, 1537462, 1609178, 1883032, 1898314, 1780778, 1767075, 1750209, 1872013, 1820419, 1925632, 2067035]
3524B067035j224j13684m2045J99147Q6231K7775Q445Q8187J03064p7593M4320
3513B389658K09719M873Q626J60055J23018Q9399J0042K4625J53197Q8005K13259
3502C474476J21663J31710J33833R0037K04723J60988K68365M13001L60629M13101
3492E772526N03955M01784K91877J87118K47392R6507L6078n8442j16585k20889
3482G141321j49094j74618k51478n3886L3407M5797M1803l9353r8Q5136j23582
3471F555355k00002m4725l1985k24695k94655k95996k93813l76907l89147k35368
3461D168062j90528k79224j41050j44058k17249j78359j35851n0464j47117j42593
3451B541569j6661j74904L5137o3353j06863j26383r8455j95488P2769j6230Q3805
$$ y = [2067035, 2065811, 1952127, 1910082, 2109229, 2195460, 2223235, 2231680, 2319867, 2422931, 2345338, 2389658, 2599377, 2604250, 2612876, 2772931, 2895949, 2985348, 2995390, 3020015, 3173212, 3261217, 3474476, 3596139, 3727849, 3861682, 3951719, 4156442, 4317430, 4585795, 4998796, 5359425, 5772526, 6276481, 6678265, 6970142, 7157260, 7404652, 7501159, 7537237, 7478795, 7362210, 7141321, 6992227, 6817609, 6566131, 6512245, 6545652, 6591449, 6633252, 6593899, 6593801, 6678937, 6555355, 6355353, 6310628, 6278643, 6053948, 5759293, 5463297, 5169484, 4792577, 4403430, 4168062, 3977534, 3698310, 3557260, 3413202, 3195953, 3017594, 2881743, 2831279, 2684162, 2541569, 2524908, 2350004, 2385141, 2321788, 2214925, 2088542, 1990087, 1794599, 1867368, 1851138, 1934943]
3440A934943P120j26695K4944J8911L8911q0612m9323j6032o3917k12531j57433
3429A318286M8721n8752m5418M5069Q1728L451j8137j81078K6419J09757o8411
3418A261635p8579j10422M6515K7448J1781k9933L815j31438j66628P9312R5267
3407A008773j80210K6662k8990K8552M9219J7939O5247q771n421K8449j69606
3396H31843j9274J4881o9312j9243J00668R7115k45030O7816R0586j39928n9244
3385F50878K3674n9996l7953N0640p0158P9901r5936L9015N3890J32283o7297
3374F98941n8927J00580P8132p1222L9110l7132j48849J3482J0821m9697L9590
3363F14829k9519R6502Q2602j01588n7855J13509M2936r6286J43285o8449m7766
$$ y = [1934943, 1942063, 1815368, 1840312, 1859223, 1898134, 1817522, 1768199, 1752167, 1688250, 1475719, 1318286, 1367007, 1308255, 1262837, 1307906, 1389634, 1393085, 1374948, 1193870, 1220289, 1330046, 1261635, 1183056, 1072634, 1119149, 1146597, 1158378, 1128445, 1132260, 1000822, 834194, 913506, 1008773, 828563, 855225, 826235, 854787, 904006, 921945, 987192, 978421, 973000, 1001449, 831843, 812569, 827450, 758138, 738895, 839563, 936678, 691648, 759464, 850050, 710122, 650878, 674552, 614556, 576603, 627243, 557085, 636986, 541050, 580065, 633955, 766238, 698941, 640014, 740594, 818726, 747504, 786614, 749482, 600633, 614115, 624936, 575239, 614829, 585310, 681812, 764414, 662826, 604971, 718480, 761416, 665130, 808415, 739966, 692200]
3352F92200J1413M186r6290l7470K6785l991N5894Q9075p6473M6031Q1233K62215
3340A054808J98370j29809m4200j10646k32490k4871M4348r0696n9120j08036
3330D97658n1421J05166Q690k5911o4978o2486J25426k1563M8816j02378r0987
3319C66032o2011n9367k5580J50093M5408j9323o9754J3321J46005j6626R0990
3308E59188O3714M1156n8407R7653q298P1849p3086j42585N4422J1902P5760j02975
3296E90293l8814L3557n2847k7690J8852P085R2709l0302j72203j4404J9992O9680
3284D95908j56202J32640J830L2564J3942J84371j8289o0344k8834l5847j04079
3273D57660j61634j13340J08504J10319r2974j18992m4063J5258J89798J7168
$$ y = [692200, 703613, 707799, 611509, 574039, 600824, 596833, 652727, 741802, 665329, 711360, 792593, 1054808, 1253178, 1123369, 1079169, 968523, 736033, 711162, 755510, 664814, 605694, 497658, 446237, 551403, 560093, 534182, 469204, 406718, 532144, 510581, 559397, 457019, 366032, 304021, 244654, 219074, 369167, 414575, 395252, 325498, 338819, 484824, 468198, 559188, 622902, 664058, 605651, 703304, 695006, 766855, 693769, 551184, 605606, 617508, 693268, 590293, 551479, 585036, 532189, 504499, 523351, 530436, 623145, 592843, 420640, 406236, 426228, 495908, 339706, 472346, 474176, 506740, 520682, 705053, 686764, 626420, 597586, 561739, 457660, 296026, 182686, 291190, 401509, 308535, 189543, 145480, 160738, 350536, 367704]
3263C67704m0503r916J0551J20064m4816L2301n5119n4274j6427R6235R2926q7976
3251D10750p7995j9795K3306R60j12856P2324Q9665R735j07157o850k7157l7586
3239B17344J00933J71020m8672R9783J28417O3908k5406j22385j11918Q4259n9464
3228D97819P5177N018J60571k8394j75943J36100L6659j14873m7341N7302m7169
3217E54926m5646L9188L6195m0395q8888J49022Q7371r1833j3600J07820m1235
3206F52925j5711L7340l8675j28584j0513K5968O2267J30456J3130M7007K9911
3195H05521O2146O8956J44709j49736N2676m7222L4174O426M5454J05164j23917
3184A004351J66972N3417K39368J67880j5787J31229J15091J11739K16832J41935
$$ y = [367704, 327201, 317285, 327836, 447900, 403084, 435385, 380266, 325992, 309565, 405800, 498726, 410750, 332755, 312960, 336266, 337226, 224370, 296694, 386359, 396094, 288937, 282087, 254930, 217344, 318277, 489297, 440625, 540408, 668825, 732733, 707327, 584942, 473024, 557283, 497819, 572996, 578014, 738585, 710191, 534248, 670348, 707007, 592134, 544793, 602095, 554926, 509280, 548468, 584663, 544268, 455380, 604402, 691773, 599940, 586340, 694160, 652925, 637214, 674554, 635879, 507295, 496782, 522750, 585017, 715473, 728603, 775610, 805521, 867667, 936623, 1081332, 931596, 984272, 937050, 971224, 977650, 1023104, 1128268, 1004351, 1171323, 1224740, 1464108, 1631988, 1616201, 1747430, 1862521, 1974260, 2191092, 2333027]
3174B333027J14235Q9911k5867P4493o3214O8593J4586j62186J28896R6546l5229
3163B633791M7597r7723q4955L6366J26481J31997K0305n4825P049J05160J7439
3152B888682M7253J41860L09462M75264O16472Q15930N45694M27984r7666k68636
3142E902299n23954n81895k84553n83335m02249k00401r0975k75895j92077q2866
3132B684099l0025j13815j29096j58206r7637J16978P8348O6339N9788J5832J5613
3121B508218J23393J7521J79123O4774J78668K75434P787q914k6474R736k18732
3110C110534j89855k60521j03012j4506k07328j16201j51193m6134k49644j04419
3100A667721k34950n6324J30425j10067q0316Q4553l033n9247n0182k2000j2773
$$ y = [2333027, 2447262, 2537173, 2511306, 2585799, 2522585, 2591178, 2605764, 2443578, 2572474, 2669020, 2633791, 2681388, 2583665, 2498710, 2535076, 2661557, 2793554, 2813859, 2759034, 2766083, 2871243, 2888682, 2935935, 3077795, 3387257, 3862521, 4478993, 5294923, 5840617, 6268601, 6170935, 5902299, 5378345, 4796450, 4511897, 3928562, 3526313, 3325912, 3234937, 2959042, 2766965, 2684099, 2654074, 2540259, 2411163, 2252957, 2155320, 2272298, 2350646, 2416985, 2476773, 2492605, 2508218, 2631611, 2649132, 2828255, 2893029, 3071697, 3347131, 3354918, 3346004, 3319530, 3329266, 3110534, 2920679, 2660158, 2557146, 2542640, 2335312, 2219111, 2067918, 2021784, 1772140, 1667721, 1432771, 1376447, 1506872, 1396805, 1316489, 1401042, 1398009, 1338762, 1288580, 1266580, 1253807]
3089A253807j13534m8088m7929K5578l8196J15191p6706n2512q299p327j3057
3078I88928j15409l6748j00064j35441J27184L9730j32439O3251m6998j09248
3068E42746j41988j20918n8458N6017L7686j2231R3428n8421P8640K10402j1488
3057F15415j35179j58657K5555o9898q0453l7022r660J61247P9512o0299n4110
3046B76451j24319L618Q8953l1843l143L2118j57739N2816K5964q5428k2176o532
3034D8740p9120j26541Q4306J04445m6713k2446J98213J8865J0665k0836m8781
3023A20797J4577N759k6594p9879P1068p599p8666L8039Q5765o2993l0480N5863
3011A05657j08624m0472j47l6694M8687k3491l2319J77725J09514n91j68419j0650
$$ y = [1253807, 1140273, 1092185, 1044256, 1069834, 1031638, 1146829, 1070123, 1017611, 1009312, 1001985, 988928, 873519, 836771, 736707, 601266, 728450, 768180, 635741, 698992, 651994, 542746, 400758, 279840, 221382, 277399, 315085, 302854, 396282, 337861, 416501, 626903, 615415, 480236, 321579, 347134, 277236, 196783, 159761, 150101, 311348, 390860, 330561, 276451, 152132, 155750, 244703, 212860, 209717, 241835, 84096, 136912, 162876, 77448, 55272, 48740, -30380, -156921, -72615, 31830, -14883, -37329, 160884, 179749, 190414, 169578, 120797, 135374, 141133, 114539, 34660, 105728, 98129, 19463, 57502, 143267, 80274, 49794, 105657, -2967, -43439, -43586, -80280, -31593, -55084, -87403, 90322, 199836, 199245, 30826, 20176]
2999B0176j21075P3987l5885R1057p2777N9411o0654l854p3155l8679J29513k6062
2987e7997K8969K4806M8023r3992P4519k4918k6698q1610J4958J11096L0270j21118
2975g3692j2536Q205m5137j57924M5365N4259m3326J07174K8013j85601Q1304
2964a93896K8443J30392N2017q4983j25493M7952R7359m8569L1118r1512L5903
2953a21269p5536m4786N9475P3369k9256p1509L9200q797l9976M5600m6434K1448
2941a98471M8102L182k4837L4406R6412m2522n1987L7143l1717r273R539O0283
2929f9740P6719j21329k1419l2557M7265L4816N4567J7528j07229j28224o0862
2918c10465J13736J10592o7781Q5072J4154l855j5196l4640J1589R7809j86374
$$ y = [20176, -100899, -26912, -62797, 28260, -44517, 14894, -45760, -49614, -122769, -161448, -31935, -57997, -29028, -4222, 43801, -50191, 24328, -590, -27288, -108898, -93940, 17156, 47426, -73692, -86228, -78023, -123160, -281084, -235719, -181460, -224786, -117612, -89599, -275200, -193896, -165453, -35061, 16956, -68027, -193520, -145568, -48209, -96778, -65660, -157172, -121269, -196805, -241591, -182116, -108747, -138003, -209512, -170312, -179109, -219085, -173485, -219919, -198471, -150369, -147187, -172024, -137618, -41206, -83728, -135715, -98572, -130289, -139562, -130023, -69740, 6979, -114350, -135769, -168326, -121061, -86245, -31678, -14150, -121379, -249603, -310465, -196729, -86137, -153918, -68846, -54692, -58547, -73743, -108383, -96794, 1015, -185359]
2907a85359Q3833o584k3186l493j1572j9948J5728M3413r3468J29572n4167q4517
2895b09748L7854Q01N2957N7220j18198Q5585J21830k24549j31411K06495J34727
2884A3563q4868j01353N5073N043J20874j31923N1136M4591j33151r106J64617
2873e504j05204N6249J81809n4064j20341j2782k6787j2604M8369N4531J28005
2862A31677j78575o6438O9888K0484R1167R3714n0088q8550j00458J1516L7875
2851b7788l0117J2594l2888O5906J7470o2158p4204n5698O8601L3619q9976o7078
2839b41717O0948n774J82414L5077j32646o4701r5932L5328O5510O1029j2325
2828a12789J8440n9796p1063o5142K48684K0134j7912j1004l7464m6468p060Q8192
$$ y = [-185359, -101526, -108110, -131296, -134789, -146361, -166309, -150581, -107168, -200636, -71064, -125231, -209748, -171894, -171093, -118136, -60916, -179114, -93529, 28301, -196248, -327659, -121164, 13563, -71305, -172658, -117585, -112542, 8332, -123591, -72455, -27864, -161015, -170121, -5504, -110708, -54459, 127350, 73286, -47055, -59837, -86624, -99228, -50859, 3672, 131677, -46898, -113336, -43448, -22964, 68203, 161917, 111829, 23279, -77179, -65663, -27788, -57905, -45311, -78199, -12293, 5177, -56981, -131185, -186883, -118282, -84663, -174639, -241717, -180769, -186543, -4129, 30948, -101698, -166399, -262331, -227003, -161493, -100464, -112789, -94349, -154145, -225208, -290350, -41666, -21532, -39444, -50448, -87912, -134380, -141440, -53248]
2816e3248K3544l1129J6582q5376n4159J11044J04780L0912q1221j67403n2504
2805b38178J37861m7120n4593j07832J72831O0638j16548J9509Q157m8716R0974
2794a23017j30565N3880J58681j3845M6169o0881O140p819j63743Q9545j4027
2783a59482L5277J63916l5197q0805j6927p9416k042l2065j2666J29777K539q8917
2771a76008M6577q183Q0825O4068r8375n3593m2589J03667j53050j28939P9537
2760b86063M1989j487J66262k6064j09097m0808r577K3122O3791M0615j07703
2749b45020l7277J92466L6134j9871r493q5776J01962m3833r065r174Q5142L5630
2737h175q1418q2397J3345M3234L2065L1520k5775m8974J3643R169L4669L1037
$$ y = [-53248, -29704, -60833, -44251, -129627, -183786, -72742, 32038, 62950, -18271, -185674, -238178, -100317, -147437, -202030, -309862, -137031, -76393, -192941, -173432, -165275, -213991, -123017, -253582, -199702, -41021, -54866, -8697, -69578, -63438, -71257, -235000, -145455, -159482, -124205, 39711, 4514, -76291, -93218, -172634, -174676, -206741, -219407, -89630, -87091, -176008, -129431, -137614, -56789, 7279, -91096, -144689, -187278, -83611, -236661, -365600, -286063, -244074, -245561, -79299, -105363, -214460, -255268, -264845, -241723, -177932, -137317, -245020, -282297, -89831, -53697, -73568, -83061, -168837, -66875, -110708, -119773, -128947, -43805, -8175, -89593, -171990, -158645, -115411, -83346, -51826, -77601, -126575, -112932, -103763, -69094, -38057]
2725c8057j100M78j44918q3388j1705P7382K641J03561L1713j9480R2038N1052
2713F0217j68864l449m8699n5806J1159L539J00378N2397j73399j20420K71209
2702g1738j1544j48719N0236J08006R128j20211p0540N2594N2440j12085R518
2691b52915m2722O0729Q7621m2485j5361O5965J40970m2481l6506n110K5688m4571
2679a01178M8628J2755m2030j8427J51089N709j34486k8381M094R6843J34477
2668A29093r2319o3798r0401R0509m2796n0521m4563P7737J01221k5811N6915
2657D5266r9140r6853P100P9945N2995l9174J26866n4206j39805L3157j1333L4139
2645f1043o8740m6753L6796Q6481o4347K2098q849l7270Q7861L755q9406M6940
$$ y = [-38057, -39157, -38679, -183597, -266985, -278690, -201308, -198667, -95106, -63393, -82873, 9165, 60217, -108647, -112096, -160795, -216601, -205442, -201903, -101525, -49128, -222527, -342947, -71738, -83282, -232001, -181765, -73759, -64631, -184842, -255382, -202788, -150348, -262433, -252915, -295637, -234908, -147287, -189772, -205133, -139168, 1802, -40679, -77185, -82295, -56607, -101178, -52550, -39795, -81825, -100252, 50837, 56546, -77940, -106321, -102227, -5384, 129093, 36774, -27024, -117425, -26916, -69712, -120233, -164796, -87059, 14162, -11649, 45266, -53874, -150727, -143627, -63682, -10687, -49861, 77005, 22799, -117006, -83849, -95182, -61043, -129783, -176536, -139740, -53259, -117606, -95508, -104357, -141627, -53766, -50011, -139417, -92477]
2633i2477L2342r5152K5972J53508j0955J37110o5723r379k2254l0859P6772k1865
2621G7040n5987R6901j45750M1208M1809j07795M4343K19226J37346L87818J84143
2610I20302P6387J77019L7797q9054l44712j17697n1094J9688m1614k02825k12281
2599A71916K8858p5975p2024j35697m231J30326J21597l530k8937j91269k2541
2588h1507O5691K5686j13273q2421P6580J88696M4989p8430n0132J7632N7370
2577G0881n4807p3027J3931J49094n3645j13642P3037k2467k28928k4422K68625
2566D630J32817k2137P3532j35863n5760r9570M7653K9723O5239J8090j6464M8224
2554I0114M4876r483n9633k3911n2527Q8868k9248P9544K1660Q1934k1923K5732
$$ y = [-92477, -60135, -155287, -129315, 24193, 13238, 150348, 84625, 75246, 52992, 22133, 98905, 77040, 21053, 117954, -27796, 13412, 55221, -52574, -8231, 210995, 348341, 736159, 920302, 996689, 1173708, 1211505, 1122451, 777739, 660042, 608948, 628636, 587022, 384197, 171916, 200774, 124799, 52775, -82922, -87153, 43173, 164770, 161240, 132303, -58966, -81507, -15816, 9870, -103403, -185824, -109244, 79452, 124441, 46011, -4121, 13511, 70881, 16074, -56953, -43022, 106072, 52427, -61215, 11822, -10645, -239573, -263995, 4630, 137447, 115310, 188842, 52979, -2781, -102351, -54698, -24975, 40264, 58354, 41890, 90114, 134990, 125507, 65874, 41963, -10564, 78304, 49056, 128600, 150260, 232194, 210271, 236003]
2542B36003O395N8034J02672j52586j46310Q2442R498R394l6382j0458M4326J0805
2530B13833Q1117j4901o666k2469j02094n7148j2866M7068P181N4754R3507k07805
2518G3511M0526Q1180n4834l2171K536J45807K7504Q7036J22986n9366j53845
2507B80870r687l6887P8819J25956k5833r0439q7799Q629n2744j680r4721O1317
2495A55801J31836J6275M783O7408P337j47715J8255J01735N9352Q411m8743j67161
2483B07574L8174K2731m0021n3473P8405P0686K5608O8427j64825k7063l1265
2472A94958J77027L4226L9776Q1009j17407M5072J3770Q1785L0680j60895n0312
2461C69689J37075j08094m7655J10244j1480J2612J66065R9856j9972J14302P340
$$ y = [236003, 242398, 300432, 403104, 250518, 104208, 186650, 196148, 205542, 169160, 158702, 203028, 213833, 294950, 280049, 273383, 250914, 148820, 91672, 78806, 125874, 133055, 187809, 281316, 73511, 114037, 195217, 140383, 108212, 110748, 256555, 284059, 371095, 494081, 434715, 280870, 271183, 234296, 313115, 439071, 413238, 322799, 235000, 243629, 190885, 189205, 94484, 155801, 287637, 303912, 308695, 376103, 383440, 235725, 253980, 355715, 415067, 423478, 374735, 207574, 245748, 268479, 228458, 174985, 253390, 324076, 349684, 418111, 253286, 226223, 194958, 371985, 406211, 445987, 526996, 409589, 454661, 468431, 550216, 580896, 420001, 369689, 506764, 398670, 351015, 461259, 449779, 462391, 628456, 728312, 708340, 822642, 829982]
2450H29982r5418P4571J38159p1789K1125N8990n1050k6646k41539j42305K75207
2439G69287N9739N4288J32462j75584j70982J52981L7438n4297m2504m4039Q2044
2428H00833J51447m7422M2896p9826p4617R5393J52177j109Q4246J39260j19871
2417A143407m7005K72465M6710o7261j73995L974K1165p3206N7642J10489J12305
2406A406690L2374R6610J37790J51161k8105j78957j26027j49812J52159Q0307
2396A574190J24088R4213K36888J46418j87905K14369Q0184m963N3647J33425
2386B464554K1303J41097M4696J84865K08865M8581M5267L14516J85747J12436
2376C771927k600K94078M11958L57577K26093J63842N0122K16402J50996M36402
$$ y = [829982, 734564, 809135, 947294, 875505, 896630, 955620, 904570, 877924, 636385, 494080, 769287, 829026, 883314, 1015776, 840192, 669210, 822191, 859629, 805332, 762828, 718789, 800833, 952280, 904858, 947754, 867928, 793311, 888704, 1040881, 1039772, 1124018, 1263278, 1143407, 1096402, 1368867, 1415577, 1348316, 1174321, 1178295, 1199460, 1126254, 1183896, 1294385, 1406690, 1439064, 1535674, 1673464, 1824625, 1796520, 1617563, 1491536, 1341724, 1493883, 1574190, 1698278, 1792491, 2029379, 2175797, 1987892, 2202261, 2282445, 2277482, 2331129, 2464554, 2485857, 2626954, 2671650, 2856515, 3065380, 3113961, 3159228, 3473744, 3659491, 3771927, 3769327, 4063405, 4475363, 4832940, 5059033, 5222875, 5272997, 5489399, 5640395, 6076797]
2366F076797N93143P37348Q10836P46110Q41339R69007J507981K293812K532392
2357A7108765K047985Q68934O96224N96216J248292J871436K626739L475493N382912
2348C5922996O770232J1058284K0524656M2524365O6485244O5601804K2038253
2341B70925834k8939479m8764660m9714610l6777272k5639198j8858634j4322654
2334D7909327j0929631q054991n001812l143996j563140k29934K04790o08907
2326A8581706j639218k125590k051829j676829j510378r73164o71342n45747l50065
2317G037544m49236l11413k87591n04718l64495k47632k32827j92704Q5885o7657
2307D465156j25944j44946q3943j37578k90565o2192p2074m0942j7063o5064j77131
$$ y = [6076797, 6669940, 7407288, 8218124, 8964234, 9805573, 10774580, 12282561, 14576373, 17108765, 19156750, 20025684, 20721908, 21318124, 22566416, 24437852, 27064591, 30540084, 35922996, 42693228, 53751512, 74276168, 116800533, 183285777, 248887581, 270925834, 241986355, 193221695, 143507085, 106729813, 81090615, 62231981, 47909327, 36979696, 28924705, 23922893, 20778897, 19215757, 18985823, 19190613, 18581706, 16942488, 14816898, 12765069, 11088240, 9577862, 8604698, 7933356, 7387609, 7037544, 6588308, 6276895, 5989304, 5484586, 5120091, 4872459, 4639632, 4446928, 4532813, 4465156, 4339212, 4194266, 4110323, 3972745, 3682180, 3619988, 3547914, 3506972, 3489909, 3424845, 3247714]
2296C247714j97805L3834j21168m1379k01872m9758j16886j25249N0418j7029
2286B460820k58795j58808l3790j44910j12503m8644K9617j40173j38406j6675
2276A437733l8193J02426L0030r2829k59989j02711P0037j74870j03804Q1521
2266I49351m9419K9058K6527k6641r661J95479L0058j56971r2564o6075j4574
2255H14568j05205m1282p0641k0421n4248o4895L0072k3849r3677M0852q204L9692
2243D42762K9913j01416j50451j06342O2494J6573j12572j87070J22062j4662
2233A291L1276J11896P9155k9576R9103Q8434k5346n4601J631j9109m498L4577
2221C14233j16720l9728J43380p9992q5754m4268m1554J02450Q1060l1489n6608
$$ y = [3247714, 3049909, 3083743, 2962575, 2921196, 2719324, 2669566, 2552680, 2427431, 2477849, 2460820, 2202025, 2043217, 2009427, 1864517, 1752014, 1703370, 1732987, 1592814, 1454408, 1437733, 1399540, 1501966, 1531996, 1439167, 1179178, 1076467, 1146504, 971634, 867830, 949351, 899932, 928990, 955517, 928876, 919215, 1114694, 1144752, 987781, 895217, 829142, 814568, 709363, 668081, 597440, 577019, 522771, 457876, 487948, 464099, 370422, 411274, 403070, 442762, 472675, 371259, 220808, 114466, 176960, 193533, 80961, -106109, 15953, 1291, 32567, 144463, 223618, 194042, 293145, 381579, 356233, 301632, 303263, 284154, 279656, 314233, 197513, 157785, 301165, 221173, 135419, 91151, 49597, 152047, 233107, 201618, 145010]
2210A45010J17324n1386j08188K7065Q345p7057N3477P5708q0984K2523q127r9765
2198B3945R644K1832N4044L572J9841J0984q9891j50068J9735J27019K7313K9669
2186A07639k32464J6697J02206r6694p1732j16695l4360N4707P5932R8242p224
2175a03746k5489N1509k47131q6606J99655N6577j8052J30298m9819m9949o0237
2164b02990L2221M4090p5353J15061Q2697N1120l33148r7790P9478O1948P176
2153b35490J07038l5318m7016Q1594P4545M2320q9471r907J1369k6894j26594
2142b53824k4954Q5388j05515j26311J30435J39870m985j60185N4807K14862M6267
2131d145p4608j48629K0052J0365p4881P6520M3054R0382Q579j00977l1702J18020
$$ y = [145010, 262334, 210948, 102760, 129825, 138170, 61113, 114590, 190298, 109314, 131837, 123710, 23945, 33589, 55421, 109465, 113037, 132878, 143862, 53971, -96097, -76362, 50657, 77970, 107639, -124825, -108128, -5922, -102616, -174348, -291043, -325403, -270696, -194764, -96522, -103746, -129235, -77726, -324857, -411463, -211808, -155231, -173283, -42985, -92804, -142753, -202990, -170769, -126679, -202032, -86971, -4274, 46846, -286302, -384092, -304614, -242666, -235490, -128452, -163770, -210786, -129192, -54647, -12327, -101798, -111705, -100336, -127230, -253824, -278778, -193390, -298905, -425216, -294781, -154911, -159896, -320081, -265274, -50412, -4145, -78753, -227382, -207330, -196965, -271846, -195326, -152272, -61890, -53311, -154288, -185990, -67970]
2119f7970n3204K6267o1934K2071L165M4262j68092j20820J31402J18885k5816
2108a51784q7441J12734L1825r3836L2080L755J08477j59598J22234o0921k54522
2097c96997J21704K42337p073k2293k3949J82300l2739j02128p5061L5139J22223
2086D3463p8099j45614J81894R9383j98255p7965j9011J29291L8782J88118K31228
2075C93215L35838J41390J29241o3460k14030k72223n8323k14417j31989l8551
2065F691j55024l3454N0222j18036N7058J25816J68691l4737j23364n1226L9005
2054f8358q9824k16560L3497J72181l8491j44467J21053J16916N4508K5969O6307
2043C2731j70106j61915J41636J16782j97471q8575J13782N8228l5842L1737K4427
$$ y = [-67970, -121174, -94907, -156841, -134770, -131605, -87343, -255435, -376255, -244853, -125968, -151784, -239225, -126491, -94666, -188502, -156422, -152667, -44190, -203788, -81554, -142475, -396997, -275293, -32956, -40029, -62322, -86271, 96029, 63290, -38838, -113899, -78760, 43463, -34636, -180250, 1644, 101027, -97228, -175193, -194204, -64913, -26131, 161987, 393215, 729053, 870443, 999684, 936224, 722194, 449971, 391648, 177231, 45242, 6691, -148333, -181787, -131565, -249601, -192543, -66727, 101964, 67227, -56137, -107363, -68358, -158182, -374742, -341245, -169064, -207555, -352022, -230969, -114053, -59545, -33576, 32731, -137375, -299290, -157654, -40872, -238343, -326918, -213136, -154908, -190750, -159013, -134586]
2032a34586j27928R3219P5149r1226L5505J2842j59834K1328j2490J06543r605
2021a91083L7221m5668k620O9867L5923j41632l3174P5550J8692L027K9732j26424
2009b70589q2223Q4210J42826L4356J1027n1397j10586K7288p3540r7685J08477
1998b77836J06758P7322O8778K2092K2380j05230j28191m8303J05390K9227j32813
1987b60426Q4216Q7244q4048J7483j58689N7687J13863j42155J1260N1306R3700
1976a28559m3846l2812J24887j00338J7877J2935N0670q7551m3594K1521O4057
1965a44753p7904q7814J68198k1396n1234k8679j25752l5132O2054J12257O465
1954b23690r4238O1041J07540j56168q749l1684N9108K2638p410J8787O7544P3920
$$ y = [-134586, -262514, -169295, -94146, -185372, -149867, -137025, -296859, -275531, -288021, -181478, -191083, -153862, -199530, -202150, -132283, -96360, -237992, -271166, -195616, -176924, -173897, -144165, -270589, -352812, -268602, -125776, -91420, -80393, -131790, -242376, -215088, -288628, -386313, -277836, -171078, -93756, -24978, -2886, 19494, -85736, -213927, -262230, -156840, -127613, -260426, -176210, -88966, -173014, -155531, -314220, -256533, -142670, -284825, -273565, -222259, -128559, -172405, -205217, -80330, -180668, -162791, -149856, -99186, -186737, -230331, -208810, -144753, -222657, -310471, -142273, -163669, -214903, -243582, -369334, -404466, -342412, -230155, -223690, -317928, -256887, -149347, -305515, -314264, -345948, -286840, -264202, -271612, -252825, -185281, -111361]
1942a11361j07063l6905K3957k8062k6296o9222J41948J0831p6147R7149J04011
1931g7160M1438j52235m2599K08415k2874j68273M2758N7720P473q5931j0587
1920b01855o7530j70356P9461J30094j9583k7406J22138n8926J20901k4687j18154
1909b35903J03671j497r6148j14564r976P788M2628k3480K6851J00411R1635k5647
1897a34231j4575j31890r295k6418N6470J48156o349J42544m6286r9393j23183
1886b44450m5640N3631R269r5764o0827J31534Q0200N443o299l6566N3477K2138
1874a33854M9797l7485p2904k273J15867m2344m2934m1493n7590J22884n5556
1863a97885l3804j02284J28205Q6601q6202K3547m642j2646Q2858l9067k0192
$$ y = [-111361, -218424, -255329, -231372, -259434, -285730, -354952, -213004, -202173, -278320, -181171, -77160, -35722, -187957, -230556, -22141, -45015, -213288, -170530, -112810, -105337, -191268, -201855, -269385, -439741, -360280, -230186, -249769, -277175, -155037, -213963, -93062, -117749, -235903, -132232, -133729, -229877, -344441, -354417, -346629, -304001, -327481, -300630, -200219, -108584, -134231, -148806, -280696, -289991, -316409, -259939, -111783, -118132, 24412, -21874, -121267, -244450, -290090, -236459, -227190, -322954, -383781, -252247, -172047, -166604, -172903, -209469, -155992, -133854, -84057, -121542, -194446, -196719, -80852, -123196, -166130, -207623, -265213, -142329, -197885, -231689, -333973, -205768, -119167, -205369, -181822, -186464, -199110, -116252, -155319, -175511]
1852a75511k1556M7554k8367O7287J18803K217k14463K2059Q9165q0704m9179
1841b22695K3231q2820k8984J47297J03079J14771l8735j22745P6362o6229j34551
1830b32019N7962p0872J05386L0669r0704p6541O7746M4458j97504J1936J04612
1819b44871n497o0897J23021j22141J0011K08224l6701l7890l8592k7690K9483
1808b03540r8146J41652J05581j40289M8541k8273L3318K6451P3575k6633l2625
1797a00388M9410j7752Q2083k9589k37045o24M6655J9263N3227j8153k0356M5566
1785a27703N3347l4242j04233k6895J44038n5086j67563P6867K02469m139j02935
1774a46075o5041j4551l8982j0410k2192Q665O1034n5864j5137K5854J22860j04248
$$ y = [-175511, -197067, -149513, -177880, -110593, 8210, 10427, -204036, -181977, -92812, -173516, -222695, -199464, -282284, -311268, -163971, -60892, 53879, 15144, -107601, -31239, -97468, -232019, -174057, -244929, -139543, -108874, -199578, -276119, -208373, -163915, -361419, -349483, -244871, -250368, -311265, -188244, -310385, -300374, -92150, -128851, -166741, -205333, -233023, -203540, -301686, -160034, -54453, -194742, -146201, -174474, -141156, -114705, -41130, -67763, -100388, -50978, -68730, 13353, -16236, -253281, -253905, -207250, -187987, -134760, -152913, -173269, -127703, -74356, -108598, -212831, -239726, -95688, -150774, -318337, -241470, -39001, -43140, -146075, -211116, -225667, -264649, -275059, -297251, -288586, -227552, -283416, -298553, -272699, -149839, -254087]
1762b54087n4631O7043p8931K6046J03668P6183m3136Q46N8273o4683M8198K7697
1750h7514J6704J4440m6022j2295j72496O297M9808m4654k1348K0061J07014L272
1738a66733M6070J07727j44453p4585Q86j03339J07237N7744O3185p7607q1569
1727b65437L8624o5155J02154J2821j18429j6058k5431J575K06184M6295j87533
1716b70390n3970L2197o0417L1152j3122J48305q4468n8001N2145N905J4212r9731
1704c56183K6729p2891K892Q5956l8552k2456l9606N7552J62845q7139n3242m1647
1692c75742Q0190p0727o9231N2772K7502J7186J24922P7852j0962j23526l9099
1681c08863o8216K6947M3296J54204Q1635k5815j26032n1296J3421P7572N891
$$ y = [-254087, -308718, -241675, -320606, -294560, -190892, -114709, -157845, -156999, -98726, -163409, -115211, -87514, -70810, -56370, -102392, -114687, -287183, -280886, -231078, -275732, -297080, -277019, -170005, -166733, -120663, -12936, -157389, -231974, -231088, -334427, -227190, -169446, -106261, -183868, -265437, -226813, -291968, -189814, -176993, -295422, -311480, -336911, -335336, -129152, -82857, -270390, -324360, -292163, -352580, -321428, -334550, -186245, -270713, -328714, -276569, -270664, -256452, -356183, -329454, -402345, -399453, -313497, -352049, -374505, -414111, -356559, -193714, -280853, -334095, -375742, -295552, -366279, -435510, -382738, -355236, -338050, -213128, -135276, -146238, -269764, -308863, -377079, -350132, -306836, -152632, -70997, -96812, -222844, -274140, -260719, -183147, -177256]
1670a77256P0911p8278o1645n0434K2552R7136j06172J59930r4745P8452K5616
1659a13933L5447n2065Q9717J16396j11944p0539k7279l1740M4159N8932q1712
1648a44561N0887r1296o6370J93274J32761j90858j00062L3161J5234m8390Q4817
1637a31403J59407j12086j44486R4122m610R0924Q0743j64050j7077o7385N4196
1626a61705k1072P324j08216Q6488O0971r1286O4546n7836J0204j1874j53231
1615c75687M2025J04276r8546M4561k615R6376p8681m3131J41772J04847k5915
1604i0718l2541J2666l5529j6862p8284J37529j78927J248O8430P986N6629J3389
1592a34984l7194L8983j15840N1238j5558m9436J40762q0N0272J6909p5661l219
$$ y = [-177256, -106345, -184623, -246268, -296702, -274150, -177014, -283186, -123256, -218001, -139549, -113933, -78486, -130551, -40834, 75562, -36382, -106921, -134200, -165940, -121781, -62849, -144561, -93674, -184970, -251340, -58066, 74695, -116163, -216225, -183064, -167830, -216220, -131403, 28004, -84082, -228568, -134446, -139056, -48132, 32611, -131439, -148516, -215901, -161705, -182777, -175453, -283669, -197181, -136210, -227496, -162950, -220786, -210582, -222456, -375687, -333662, -229386, -327932, -283371, -285986, -189610, -268291, -311422, -169650, -64803, -90718, -123259, -110593, -146122, -162984, -241268, -103739, -282666, -281418, -212988, -205002, -148373, -134984, -172178, -133195, -249035, -197797, -213355, -262791, -122029, -122109, -71837, -54928, -130589, -133808]
1580a33808r9341L9214m8158J20289L1193r7562J2406p701J37916K2526j40521
1569a63547j08573K73479o8484l8706l8589J41219O5475k32359M8004j39988O4329
1558a97740R8947q7469Q5869k5437j05034O214R3335J04153j41113P1460J2252
1547h4563j31087M789K5710K390J20691K0243o5226j19263L3544M7938r0359J25753
1535a09440N1940o2566j17939J15064k2150O8974L8164o4073m8466P74n1203K40
1523b00681R3549n3255q0766L5713K4655L5371p0918j24110R922k0068J28097
1512b22491O6285q7521L2337j5494K3123P3913n9989j1024j0659r959j400P4272
1500a48607J70353r4857m4270R4432L6602j43850j02406J28965m0285o0198N4186
$$ y = [-133808, -233149, -193935, -242093, -121804, -90611, -188173, -175767, -183468, -45552, -23026, -163547, -272120, 1359, -67125, -105831, -144420, -3201, 62274, -170085, -122081, -262069, -197740, -98793, -186262, -100393, -125830, -230864, -224650, -131315, -27162, -168275, -96815, -84563, -215650, -210861, -185151, -182761, -62070, -41827, -107053, -226316, -192772, -144834, -235193, -109440, -57500, -120066, -238005, -122941, -145091, -76117, -37953, -102026, -150492, -149718, -200921, -200681, -107132, -160387, -241153, -205440, -180785, -145414, -216332, -340442, -330520, -350588, -222491, -156206, -243727, -211390, -226884, -203761, -129848, -189837, -200861, -211520, -221479, -222879, -148607, 21746, -73111, -117381, -22949, 13653, -130197, -232603, -103638, -143923, -204121, -149935]
1489a49935J9830n9575p575j00399k63106L11471K1966j0419K8361O1149R7730
1478e0502j51901m946R1622m7483p6646K0631J7176o8331Q9772N1927J9919m0104
1466a48866k6156r4433l8784j3618r566L8390J22242M2453J978j4520k7981l8848
1454b07709j32341J39986J36608n7609k41141O4854M3506R0055L2991J02110K0974
1443g716L1415j73663j04871Q052k533K1439K3640O8118j801L5856k3000o0942
1431a86006j09444Q1727J17703j3924j42271K3225O3013O3749m9251j05944R4583
1420a62840O9062j00077k087O9263k3281l4772j12280L7384N7800N3880l1795
1409a79743K3150q4138J06009j7730r2790l4025Q6696q0073r5580N9588j11138
$$ y = [-149935, -130105, -189680, -197255, -297654, -560760, -249289, -227323, -237742, -209381, -148232, -50502, -202403, -207349, -115727, -163210, -239856, -219225, -202049, -270380, -180608, -128681, -108762, -148866, -175022, -269455, -308239, -321857, -331423, -293033, -170791, -128338, -126360, -140880, -168861, -207709, -340050, -200064, -63456, -121065, -362206, -297352, -253846, -163791, -130800, -28690, -7716, 23699, -149964, -254835, -246783, -249316, -227877, -204237, -136119, -137920, -102064, -125064, -186006, -295450, -213723, -96020, -109944, -252215, -228990, -165977, -102228, -151479, -257423, -162840, -93778, -193855, -195942, -126679, -149960, -184732, -297012, -259628, -201828, -147948, -179743, -156593, -240731, -134722, -152452, -245242, -279267, -192571, -272644, -368224, -308636, -419774]
1398d19774M3559R0350J02094L40N9111n544q3581P3122M8587k9614l5276j04143
1386b60769O4075L5962J0383q0719o5036M1611M1735K7016p5580R6398j13683
1375b78607k1988L7140R0403k3599r2639K3999j9763o7037R4529L2651J31702
1364i3209m926K5130j72032l8422L8486O8607K7665l9958J59374n1742l5212q0093
1352a96332m5606L2292J42691n6898J07222n2041j5968J61459J4331j24436n7766
1341i1052j21600R7829K1181K9366m1093q2168j53892O467N2045J86890R1365
1330d662j42437r7851O9403J0265o1569n4878m5602P3980P1038N2176m4893J13426
1318f1604K4533l5447n7355Q5350l8895r1810r3910J19490k2052r9635P5362l3847
$$ y = [-419774, -376215, -285865, -183771, -183431, -124320, -129864, -213445, -140323, -91736, -121350, -156626, -260769, -196694, -160732, -150349, -231068, -296104, -254493, -212758, -185742, -261322, -164924, -278607, -300595, -263455, -173052, -196651, -289290, -265291, -285054, -352091, -257562, -224911, -93209, -98135, -73005, -245037, -283459, -244973, -176366, -148701, -188659, -29285, -81027, -116239, -196332, -241938, -209646, -66955, -123853, -16631, -68672, -84640, 76819, 91150, -33286, -91052, -212652, -114823, -93642, -64276, -105369, -187537, -341429, -334962, -282917, -96027, -4662, -147099, -244950, -175547, -165282, -226851, -281729, -327331, -253351, -182313, -130137, -175030, -61604, -37071, -72518, -129873, -44523, -83418, -175228, -269138, -149648, -171700, -271335, -195973, -229820]
1306b29820j54703J31765J06459k6146Q8888p4055J818J2264R3333r3163K06367
1295F3007m9203j50045m5306q2159k3048m3813J27242O8566R4596m5167k09044
1284b94374J5536R0804P5278L7076M845n8368K2994j01765R2045J2673j06265
1273b09521J7924q8730J42830P4345l2418j49257Q617N4915M1530j3390M8012
1262a05143n9187m9118J5821j36724J23054J10869m0649R9338m925M8696j79406
1251a77374M7889O4519N759J0229j59827L8808O9807n8187P3717k5853o2518K5680
1239a47351O8360J6423j9134l3878r5419o7064k7642K4806L9650J1037Q1698J3760
1227a34754j46301K5357J43704m3615j3361L4301n9391j04186N9524Q0833L55
$$ y = [-229820, -384523, -252758, -146299, -172445, -83557, -157612, -155794, -143530, -50197, -143360, 63007, 13804, -136241, -181547, -263706, -286754, -330567, -203325, -134759, -40163, -85330, -294374, -278838, -188034, -112756, -75680, -70835, -129203, -106209, -207974, -115929, -103256, -209521, -191597, -280327, -137497, -63152, -95570, -244827, -236210, -181295, -139765, -153155, -105143, -164330, -213448, -197627, -334351, -211297, -100428, -141077, -41739, -46664, 2032, -177374, -129485, -64966, -59207, -48978, -208805, -169997, -100190, -158377, -84660, -110513, -173031, -147351, -78991, -62568, -81702, -115580, -210999, -278063, -305705, -280899, -241249, -230212, -148514, -134754, -281055, -255698, -111994, -155609, -168970, -134669, -194060, -298246, -238722, -157889, -157534]
1216a57534p1314j01689J16P2735k5194m4472Q4853L2838K47069n8876j43983
1205a65451n8251K0319j54878P5349J00966k2385K2394Q4913K1392k2226m3066
1194a40924M4742N2358j63297N2809J20700k6880j57590j7046q5314k690J31886
1183a91246L5097j6619j52500L9941J7548m3179o4136J94692L6792o7575K5237
1172a85948Q5200O8919m1234K728k1236k6987J03133L6283j56728j49456P6859
1161b08467Q7519j46845O5867K5160n6084J5460Q1801P6241O4643j92652P169
1150a80188k0382k6053J07685l959m7630l1908J6481M4120p7705k3418N0421K9584
1138a62952l075P9228r1492P1121K6097j44620N7533o6583J13785n3368p2778
$$ y = [-157534, -228848, -330537, -330421, -257686, -282880, -327352, -242499, -209661, 37408, -21468, -165451, -223702, -203383, -358261, -282912, -181946, -204331, -181937, -97024, -75632, -97858, -140924, -96182, -43824, -207121, -154312, -33612, -60492, -218082, -235128, -320442, -323132, -191246, -156149, -172768, -325268, -285327, -267779, -310958, -375094, -180402, -143610, -211185, -185948, -100748, -31829, -73063, -70335, -91571, -118558, -15425, 20858, -135870, -285326, -208467, -120948, -267793, -201926, -176766, -232850, -217390, -135589, -59348, 5295, -187357, -180188, -200570, -226623, -118938, -122897, -170527, -202435, -185954, -141834, -219539, -242957, -192536, -162952, -166027, -86799, -178291, -107170, -81073, -225693, -168160, -234743, -120958, -174326, -247104]
1127b47104Q4862K7411j203M8310n1455l9382Q9470j0279l8383m5149L3444J4985
1115a34473p9373j7302M3489J9137r183k6353P16r9945L7220K9637O7022r6280
1103b65688n0750R701J6398J05362O0534M5698m9940K5551P5333n7264P7081p9811
1091h7795j32820o019n556n5808Q4610J26496l8693n5453n8369j2383M2620J27395
1079g1775l6218r830j01664j9245J47265L0366o9088j39647k6647K9276M7552
1068b19655P1557Q039O67J4046l8581P0231Q7655j74442L4193m063l2340j0541
1056a93234k5394J15152j05710J9719P3582l8867J80351L6035q8875j73386l7785
1045b38412J10027N2957m4596q479l1413L0432j19431J0327K2987N9436O6981
$$ y = [-247104, -162242, -134831, -136034, -87724, -139179, -178561, -89091, -99370, -137753, -182902, -149458, -134473, -213846, -231148, -187659, -168522, -177705, -204058, -203342, -303287, -266067, -236430, -169408, -265688, -316438, -306737, -290339, -184977, -124443, -78745, -128685, -103134, -27801, -85065, -7984, -87795, -220615, -226634, -232190, -287998, -203388, -76892, -115585, -171038, -229407, -241790, -199170, -71775, -107993, -117823, -219487, -238732, -91467, -61101, -130189, -269836, -296483, -267207, -219655, -148098, -140059, -139392, -125346, -163927, -93696, -6041, -180483, -146290, -150353, -182693, -193234, -218628, -103476, -209186, -189467, -115885, -154752, 25599, 61634, -27241, -200627, -238412, -128385, -75428, -120024, -128503, -159916, -129484, -248915, -238588, -215601, -156165, -89184]
1034h9184N3302j46406o1338J02995q2078K16595l8435j94247R786k7252K4596
1023b31666p449Q8235R6061m2868n1344L4216l9811j8195K5356o808M0502K236
1011a11535j9172o1696j8346J46409R835k1102q9917k8337M4471m5166M028N2821
999a37707j00731J0008J97343j28597J01960p514j15229j7039o6917P16m441L3435
987b34713P8439n6088o2643k0000M5061L9782j0922M8464M190r3929l5148R5675
975b01832K1412P0375L4438q4741M1757O2343R7643j92833L1052Q079M5150l2679
963i9836l2584p2679k264J190q4670N4467l4608m1294J42041J21057p2226k1010
951a42416j38143J31681M0452n892l9951M4660R9731n9504j04060l7654J31959
$$ y = [-89184, -35882, -182288, -243626, -140631, -222709, -6114, -44549, -238796, -229010, -256262, -231666, -239115, -150880, -54819, -97687, -149031, -114815, -154626, -172821, -147465, -154273, -113771, -111535, -130707, -192403, -210749, -64340, -54505, -75607, -165524, -193861, -149390, -194556, -190528, -137707, -238438, -228430, -31087, -159684, -57724, -65238, -180467, -197506, -264423, -263707, -268148, -234713, -156274, -212362, -275005, -295005, -249944, -210162, -221084, -172620, -168430, -262359, -297507, -201832, -180420, -110045, -75607, -160348, -118591, -56248, 41395, -151438, -120386, -112307, -67157, -99836, -132420, -205099, -207363, -206173, -290843, -236376, -270984, -312278, -170237, -49180, -121406, -142416, -280559, -148878, -108426, -114318, -154269, -109609, -9878, -69382, -173442, -211096, -79137]
940g9137r3813r7372O4585k1703R0702m490N7825O3130J1955n9164L6640j1102
928d1944p5134k4814q134P8790M8871j12566K7835N3544j58097K2934K0157o1370
916b29928l9218n822J9553K6544M3581K4753m1260Q535K6209P2617o9298j19388
904b83122J18120n8653j12704O6214Q6930q353N4629J2480J17551Q940j60698
893a58666n1986J1374J2779j7985M335k4845J14687j07667J39408n0669P4461
882e4774j4895j72194K7150J7869N5597n543j31216j7041J38902J10480m5934
871i1599p7703l4897M3703j562j627O6989J9144N33P2673p4938N824p5050K7522
858a20988M0509j12714Q9757N9872p2263m4961r1339q3348K09270q2141k1505
$$ y = [-79137, -172950, -270322, -205737, -227440, -136738, -141228, -83403, -20273, -8318, -67482, -30842, -41944, -117078, -141892, -150026, -71236, -22365, -134931, -107096, -53552, -211649, -188715, -168558, -229928, -269146, -274968, -255415, -228871, -185290, -160537, -201797, -193262, -167053, -94436, -163734, -283122, -165002, -223655, -336359, -270145, -183215, -191568, -136939, -124459, -6908, 2032, -158666, -210652, -199278, -186499, -204484, -200149, -224994, -110307, -217974, -78566, -129235, -54774, -69669, -241863, -214713, -196844, -141247, -146790, -278006, -295047, -156145, -45665, -91599, -169302, -204199, -160496, -162058, -163685, -96696, -77552, -77019, -4346, -79284, -73460, -148510, -120988, -80479, -193193, -103436, -43564, -115827, -160788, -252127, -335475, -126205, -208346, -229851]
847b29851R0672J0727J33925m0373L1996L225j17698J18654j47512m7299r666
836b03200j8636Q1087Q7082j55581n0218J79789L5984k25744J26493J27499n6962
825g2407j88424p899Q7934j2798N0592l8985K1641O8319q8488O6861r5514j57310
813c66478q842L2418K14389N6970j06683m4030J8955P4842m6970m1044J06880
802a09593j88278K3106J70769p6658m9188o7836J828N3092L244k308K017n8351
790b98156J16432P8673m5182J12042r1427L843j06554j1442J50524k9957j6702
779a37906n9399l3179J85263j19841j05499J9377Q445J55534J5559J1890j31890
768a91646j20397J04164L1146q269L5403J5634K674k4386L4141r437M8668p2064
$$ y = [-229851, -139179, -128452, 5473, -34900, -2904, 321, -117377, 1277, -146235, -193534, -203200, -221836, -140749, -53667, -209248, -259466, -79677, -43693, -269437, -142944, -15445, -72407, -260831, -268730, -180796, -193594, -143002, -181987, -160346, -92027, -180515, -113654, -209168, -366478, -375320, -342902, -128513, -71543, -178226, -222256, -203301, -128459, -175429, -216473, -109593, -297871, -274765, -103996, -180654, -229842, -297678, -295850, -242758, -239514, -241822, -239805, -298156, -181724, -103051, -148233, -36191, -127618, -123775, -230329, -241771, -91247, -121204, -137906, -197305, -230484, -45221, -165062, -270561, -251184, -242739, -87205, -71646, -59756, -191646, -312043, -207879, -176733, -185002, -149599, -133965, -131291, -155677, -121536, -130973, -82305, -154369]
756a54369q2693j8225o839k1962K8352Q4119P6358o9593n6449Q7582l592j41649
744b78960Q7968J51212m7798P268J8611p8497n6512N745J7573r964M6858O4898
732g1598n5507l8685J6138j6951j14943L6333O9228O7300q8020O7588q3481j215
720b13813n5379K7462J25418n3211K3665J6486L7842L5123r3868N4212q6625r0917
708b73605k082J2268R0511J51503L4416k3208j15220j54073r121N5669p2892l3860
696c39694J11625j9930p714O2288J38010o347n5640r608J08586m9115m2388j37781
684b47708j9275Q0967j0182o9041j0665O3136p129q5568k7895J61164Q8830j2942
672i6308o0300n6478K0177j81907n7840J29455m907J40571L5247j342J0185r000
$$ y = [-154369, -237062, -255287, -262126, -284088, -255736, -171617, -95259, -164852, -221301, -133719, -137311, -278960, -190992, -39780, -87578, -80310, -61699, -140196, -196708, -190963, -173390, -183354, -136496, -71598, -127105, -165790, -149652, -166603, -281546, -245213, -175985, -108685, -196705, -129117, -212598, -213813, -269192, -241730, -116312, -169523, -145858, -129372, -91530, -56407, -150275, -96063, -182688, -273605, -275687, -263419, -172908, -21405, 13011, -10197, -125417, -279490, -288611, -232942, -305834, -339694, -228069, -247999, -255713, -193425, -55415, -61762, -117402, -127010, -18424, -67539, -109927, -247708, -266983, -186016, -196198, -265239, -275904, -212768, -219897, -305465, -333360, -172196, -83366, -96308, -156608, -213086, -192909, -374816, -432656, -303201, -308108, -167537, -132290, -133632, -123447, -132447]
660a32447K9319o937P208k2652j580N2745L0513p3695j00161j1603L2704J45407
648e1179J1218j21030l5448M8714k5222L2898L0960p2121L5697J13100m6826m1696
636a20935k6380M4357k8681m0358r557N0064N0222N948j1838J02038K5917p0325
624b9528l749k35276J4742q257P0384J13308j09196j78549J23683K0394N5632
613a66412M8004N5543L8367P4815j94773J06975q2388n3309q0017L3415K09255
602a0525l8730q0809q0813j5605n9583q6946L1039J38360Q9949O8016l7205j2775
590i5627r458M0884j89927J13522l6532m7280K05250N2932k6373q6280j35826
579b14715O202L9154j8406k3810J49840r3732l3014J40529r9756m4070m3579M7811
$$ y = [-132447, -103128, -110065, -102857, -125509, -127089, -74344, -43831, -117526, -217687, -229290, -196586, -51179, -39961, -160991, -196439, -147725, -172947, -140049, -109089, -181210, -145513, -32413, -79239, -120935, -147315, -102958, -131639, -171997, -181554, -131490, -81268, -75320, -87158, 14880, 40797, -29528, -33277, -268553, -253811, -262068, -191684, -78376, -187572, -366121, -242438, -222044, -166412, -118408, -62865, -24498, 50317, -144456, -37481, -119869, -173178, -253195, -219780, -10525, -49255, -130064, -210877, -226482, -286065, -373011, -341972, -203612, -113663, -45647, -82852, -95627, -105085, -64201, -254128, -140606, -177138, -224418, -19168, 33764, 7391, -78889, -214715, -208513, -169359, -187765, -211575, -61735, -155467, -188481, -47952, -147708, -191778, -235357, -187546]
567a87546J0923n6888R9035j5397m0449j9009R3514j4199k14R507p1315N2462
555a39576m2371l4541P6069l6690Q2375k878p7411l6684j00324o9942M9435J01876
543b30662L089P5334m2821l7908J25620J7385n1861j14505Q9499o0545Q3967m0533
531a83941j14630j3867J27559J72914k57212j5336J25614L5435m9990k4062q3304
520b80820p3883R701K0397J11504J29941J6383j0585O2922j39452l4604J38808
509d9688L8123o3241r9983j75292K1572m369J43617J13409N4499p5474k76820
498c73647J68331p9510l4840O5871P8372J82388n6840r7883k9687r2269K5767
487b43947n3797M3962O1012J5384l5430P0906p0828p6781J70072q7476m8203J02729
$$ y = [-187546, -176623, -233511, -134476, -149873, -190322, -209331, -115817, -130016, -130230, -120723, -192038, -139576, -181947, -216488, -140419, -177109, -94734, -97612, -175023, -211707, -312031, -381973, -332538, -230662, -227573, -152239, -195060, -232968, -107348, -89963, -141824, -256329, -166830, -227375, -143408, -183941, -298571, -312438, -184879, -11965, -269177, -284513, -158899, -123464, -173454, -197516, -280820, -354703, -345002, -324605, -213101, -83160, -66777, -77362, -14440, -153892, -188496, -49688, -11565, -74806, -174789, -350081, -328509, -332878, -189261, -75852, -21353, -96827, -373647, -205316, -284826, -319666, -253795, -175423, 6965, -49875, -147758, -177445, -269714, -243947, -297744, -253782, -192770, -177386, -212816, -141910, -212738, -289519, -119447, -206923, -255126, -152397]
475a52397n4994p9846L1946J761J43798Q9664p4450J48928m1484r1017J8749j2310
463g1652n2548k8659p66p144o6157J43488r850j10072N4337Q6013j57793L0897
451a89906J02956j13899n8285j9806O4492J12211j1585o8470j8711j5642o0601
440b77246K4276J38930M1120K6539l8229j6875J6402n7900j01703J69279r8734
429a74141n2332j27547R3608j6904P9841Q2638k3595m9052o4699K8249j9549J25986
417a17497J07270m1253n9859j8169m8732o6009j9977R3051j216Q5841Q221M741
405g3588j05564N0187N8536l4221N1310j22208m7353R4112P9202j07542q8166
394b45295K3534L4906J22098j6399j88548p931Q419J1043J88386O2270j85936
$$ y = [-152397, -207391, -287237, -255291, -253530, -109732, -20068, -94518, 54410, 12926, -78091, -59342, -71652, -124200, -152859, -153625, -160769, -226926, -83438, -93288, -203360, -149023, -63010, -220803, -189906, -86950, -200849, -259134, -278940, -214448, -102237, -113822, -182292, -201003, -216645, -277246, -252970, -114040, -72920, -46381, -84610, -101485, -85083, -142983, -244686, -75407, -174141, -226473, -354020, -260412, -277316, -197475, -114837, -138432, -187484, -252183, -223934, -243483, -117497, -10227, -51480, -111339, -129508, -178240, -244249, -264226, -171175, -172391, -86550, -78329, -73588, -179152, -128965, -70429, -104650, -53340, -175548, -222901, -128789, -49587, -157129, -245295, -221761, -186855, -64757, -81156, -269704, -277635, -269216, -258173, -69787, -7517, -193453]
383a93453q9224J10051o5259J1206Q2089K8862j04723j16537O7752K7335J22921
372a18980R7490j59513K3951O7377p081O4671m3860l7378l4770J3376k1034m9448
360b05199K549L1475o293o1360J35941r2006J0069R8709j54891J50912J4537J5988
348e9569p3110K1535k2229p9026j2796j8328M1056J263L92j04628R3138j5266
336b27568J5641m5081J08880L4192m2214M9461j02576K6355J42196l937N659q4153
324a23145j36200n9229J14282J25651m9500Q7289q073j7212n2476O7112j2677
313f4178j05628q045l6102J60325L7803j0521O008j53258m6588J64538J18833
302F3187k70283J142N5554l0833J8365N5354J985j763J43575r3282j85263m1282
$$ y = [-193453, -282677, -172626, -237885, -226679, -144590, -115728, -220451, -336988, -269236, -241901, -118980, -21490, -181003, -157052, -89675, -96756, -32085, -75945, -113323, -148093, -134717, -155751, -205199, -202650, -171175, -177468, -238828, -102887, -194893, -184824, -86115, -241006, -90094, -75557, -59569, -132679, -111144, -133373, -212399, -225195, -243523, -202467, -201204, -200812, -305440, -212302, -227568, -211927, -257008, -148128, -113936, -156150, -106689, -209265, -182910, -40714, -44651, -38992, -123145, -259345, -318574, -204292, -78641, -128141, -40852, -48925, -66137, -118613, -51501, -64178, -169806, -177851, -213953, -53628, -15825, -26346, -20338, -173596, -220184, -55646, 63187, -207096, -205954, -150400, -181233, -162868, -107514, -105529, -107292, 36283, -56999, -242262, -283544]
290b83544O5432k3049K3329q2882N7842J25123R4943K5579j8886O0807o3444L2147
278A3397K623k00283L4393O9680j9076m580j5132j45286l0599K08418M9841m9209
266h5813r5469M7930J33842j75068k6172j1874l4318M1000N8712O6995k5724N78
254a05381j04140M1990N8988l7937j20073K4895M3089l4728L1306k2183M5642
243a78532M0769p944n4474n2086J7246J07686j2584k08251J4198K25128l451m7919
231a60214R3604p3879l7558K5360j18607J8689N8309j1224Q1463P0069n2796K6383
219h0401R666j06354p4173J37870j0430m2342q8746j13478L7919J56819J43101
208c0549o5691o613k3565k5588r7507K1411p3374J32919N2433p8748J3051j11889
$$ y = [-283544, -218112, -241161, -217832, -300714, -242872, -117749, -22806, 2773, -16113, 44694, -18750, 13397, 16020, -184263, -149870, -80190, -99266, -103846, -118978, -264264, -294863, -86445, -36604, -85813, -181282, -133352, 490, -174578, -200750, -212624, -246942, -205942, -147230, -80235, -105959, -105381, -209521, -167531, -108543, -146480, -266553, -241658, -198569, -233297, -201991, -224174, -178532, -137763, -145707, -200181, -252267, -235021, -127335, -139919, -348170, -333972, -108844, -112295, -160214, -66610, -140489, -178047, -152687, -271294, -252605, -194296, -205520, -124057, -53988, -106784, -80401, -70735, -177089, -251262, -113392, -123822, -166164, -254910, -368388, -330469, -173650, -30549, -96240, -102853, -126418, -152006, -249513, -228102, -301476, -168557, -116124, -194872, -181821, -293710]
196b93710n4678J36731P0966k1754l0963o849J15208r9128q6020o4553M535J53659
184a76556J49705J5137o1279R0551j23929J7186k9338K3047q9724k0295m0770
173b46265J37307L2333r3608K1380j19955M7548L1393q759j05141R0904O2184
162a50679r4141l6744O1033Q479l4148R074N1198k8308m8902J03795o9271k7322
150b55936N4317o8200q889M1743R0871J37831k0359j57273m0660M517K2631o6953
138b66360l903m040J03501k7274K7485J467n7056j56316N7435l2733n0634J85378
126b23050K7495K2158p1601K2988L6969m3106o7666J52012O4412r5253k3286M652
114a93276J0894L1218O9522p910P2495p5308j39897j23827J66491l1571l8360
$$ y = [-293710, -348388, -211657, -140691, -162445, -193408, -200257, -85049, -184177, -270197, -334750, -330215, -176556, -26851, -11714, -72993, 17558, -106371, -89185, -118523, -95476, -185200, -205495, -246265, -108958, -76625, -170233, -148853, -268808, -221260, -189867, -198626, -303767, -212863, -150679, -244820, -281564, -220531, -212052, -246200, -237126, -185928, -214236, -263138, -159343, -228614, -255936, -201619, -269819, -278708, -236965, -146094, -8263, -28622, -185895, -226555, -222038, -199407, -266360, -270263, -274303, -170802, -198076, -170591, -169124, -226180, -382496, -325061, -357794, -408428, -223050, -195555, -173397, -244998, -222010, -185041, -228147, -295813, -143801, -79389, -174642, -197928, -193276, -182382, -151164, -81642, -89552, -17057, -92365, -232262, -356089, -189598, -221169, -259529]
103b59529m554K7056K856l9480J4179J3060m586k6166K22025j01032q2879L0174
91b08876q3168l0506j1816j3838J67003J2690l6434j1977k0670n5614j6217K7438
79b81985R0425m8508n5660J15109n8162n862k0761m7136N0047J1120L3900j9209
67b36682k7158p785j0493j11J0744L5119L1282p6393o309R1921j4953l8501J4230
54b35089l4180j7272m6416N5636N6862l0998k4639q6441O4685p7932n8309P7451
42c56642L9873L2064O418j31769j036R2263m3245J5245J258k7574N9232k8644
30c42557P0876N4523o7034p6275q189o349o4175q268N1652N1232J5122n1402L5069
17c45775j976J4854P3633p1329P3955k0670K556J1680l976n6190L302n6736o979
$$ y = [-259529, -264083, -237027, -234171, -273651, -259472, -246412, -250998, -277164, -55139, -156171, -239050, -208876, -292044, -322550, -334366, -348204, -181201, -168511, -204945, -216922, -237592, -293206, -309423, -281985, -191560, -240068, -295728, -180619, -238781, -244643, -265404, -312540, -262493, -251373, -217473, -236682, -263840, -271625, -282118, -282229, -271485, -236366, -205084, -281477, -287786, -195865, -210818, -249319, -235089, -269269, -286541, -332957, -277321, -220459, -251457, -276096, -362537, -297852, -375784, -434093, -356642, -316769, -284705, -278287, -410056, -411092, -318829, -362074, -346829, -345571, -373145, -313913, -342557, -271681, -217158, -284192, -360467, -368656, -375005, -439180, -447448, -395796, -344564, -329442, -380844, -345775, -347751, -332897, -259264, -330593, -256638, -277308, -274752, -263072, -267048, -323238, -319936, -376672, -383651]
4c83651m8717m8121J27437L483
0c49569
$$ y = [-383651, -432368, -480489, -353052, -349569]
$$ Imaginary data points
##PAGE= N=2
##DATA TABLE= (X++(I..I)), XYDATA
16383a081955j5732K7686R337j9306J44662L5284m4078J467o2235Q7947J09530
16372h07393l8321M0508L8488r6737P8765L4972L9937m5467L3154K5329O0442
16361f36323J1091k3222j9170Q9852N3909l637n6862k7277Q9578J01792M3071
16350c77198m3322j3988k7313L951J77631K1310r691N4734q5733o1317j8805J54163
16338b25578O9687q811l155K6491J68682N1812q3306j65468l4308J06818J21355
16327B4219l9257O0961J10430l542m340M0990J2118n290R4161k6678o0867J1359
16315B14264J006j4310P0465L567J16221m1126L3387R7431j01903K6807J28172
16304E33981J2286n1882j4124J7699m1098R2357L8788Q8911l3024J0428J57072
$$ y = [-1081955, -1097687, -1070001, -1060664, -1079970, -935308, -900024, -944102, -942635, -1004870, -916923, -807393, -845714, -805206, -766718, -863455, -784690, -749718, -709781, -755248, -722094, -696765, -636323, -625232, -648454, -667624, -577772, -523863, -527500, -584362, -611639, -522061, -420269, -377198, -420520, -434508, -461821, -457870, -280239, -258929, -268620, -213886, -299619, -360936, -379741, -225578, -155891, -164702, -167857, -141366, 27316, 79128, -4178, -169646, -203954, -97136, 24219, -15038, 45923, 156353, 152811, 148471, 189461, 201579, 196289, 290450, 263772, 202905, 214264, 215270, 200960, 271425, 274992, 391213, 350087, 383474, 480905, 379002, 405809, 533981, 546267, 494385, 480261, 497960, 456862, 549219, 588007, 676918, 643894, 654322, 811394]
16293H11394k0887o9178L6315o4422n8444M6419J66779K0666k9361k364O4197
16282I01114K1173n1314j6989L1154m8664O7999N7083L270j0971j6183o4675J3081
16270H86078P4956J24947L5935r29q0132o3411q5261O0046L1165P675J35185K7251
16258A153505n6565M802k7781O374L1055j5254M0197m894M0235m1260J53750L1608
16246A315772p0452L5875O2132o433P1907K9170j41197J0799J4776j6868L9239
16235A344720k7662Q4147l9889K31601q7152j10076r296J26416O9488P083l0702
16224A558678M8269o822j02622l1727P4813J213j6693J54637J14099k8153q7788
16213A677904M6710j67l5558o6521o4251P2239M8949R6415M0814q8201p7436L2603
$$ y = [811394, 790507, 721329, 757644, 693222, 634778, 681197, 847976, 868642, 839281, 836917, 901114, 922287, 870973, 853984, 885138, 836474, 904473, 961556, 964826, 953855, 937672, 872997, 886078, 961034, 1085981, 1121916, 1120987, 1040855, 977444, 892183, 952229, 983394, 991069, 1126254, 1153505, 1096940, 1101742, 1073961, 1080335, 1111390, 1096136, 1136333, 1131439, 1171674, 1130414, 1284164, 1315772, 1245320, 1281195, 1343327, 1336894, 1408801, 1437971, 1296774, 1307573, 1322349, 1305481, 1344720, 1317058, 1401205, 1361316, 1592917, 1505765, 1395689, 1386393, 1512809, 1582297, 1589380, 1558678, 1606947, 1600125, 1497503, 1465776, 1540589, 1541802, 1525109, 1679746, 1793845, 1765692, 1677904, 1724614, 1724447, 1688889, 1622368, 1558117, 1630356, 1679305, 1775720, 1816534, 1728333, 1650897, 1683500]
16201A683500J43963P1832n2270p9277p3829J50486L7262m0802l4357j2980J68873
16190A962401n4604j34887N8191K9411M8724J03826m520l2152R4461l4452j33183
16179A903216m699M2323m6116J2826N1421l346K4239j09289j2842j3988J31707
16168A975452J21408o2191j78374K1549k8185P1613O5419l9402M7791n3669k259
16157A939152Q490n8024Q0505P7086l7353p4953M8609L5711N2661L2153j0392
16146B093645l0691J6185o1382K682o6050N0671J41612N5030p1636j25145J81876
16135B186797P3890p7880p7862J28903m6135n245k6527j69604N0429K0409j2417
16124B044758j7092n1537J29341L7345J5636n3798N8716M4606r614N8204Q4224
$$ y = [1683500, 1827463, 1899295, 1847025, 1767748, 1693919, 1844405, 1881667, 1840865, 1806508, 1793528, 1962401, 1907797, 1772910, 1831101, 1860512, 1909236, 2013062, 2008542, 1976390, 2070851, 2036399, 1903216, 1898517, 1940840, 1894724, 1907550, 1958971, 1955625, 1979864, 1870575, 1857733, 1843745, 1975452, 2096860, 2034669, 1856295, 1877844, 1849659, 1921272, 1986691, 1947289, 1995080, 1941411, 1939152, 1947642, 1889618, 1970123, 2047209, 2009856, 1934903, 1983512, 2019223, 2071884, 2104037, 2093645, 2062954, 2079139, 2017757, 2020439, 1954389, 2005060, 2146672, 2201702, 2130066, 2004921, 2186797, 2260687, 2182807, 2104945, 2233848, 2187713, 2182468, 2155941, 1986337, 2036766, 2057175, 2044758, 2027666, 1976129, 2105470, 2142815, 2158451, 2104653, 2163369, 2207975, 2198361, 2256565, 2340789]
16113B340789j50525J6479L0971j95911L0166J49258k367M9249O155n1204J0116
16102B233176K0203m1454j09997M9311J299k4458J1867L081J9866J9974r3379
16091B089489P246P3685Q1099n7949O8365q0868J10508p0440j19472J55685L0909
16080B288257o3307L7014p1567m3033l9795P8749m9856J02439Q2484j88464M4948
16069B177869R3355j69785k4223J90408J10235q8009K5655L8196j32178j27555
16059B093968J28430P3904j21027J44534o1570j1578K6595o8252p2134Q3034o7557
16048B148347j20480K36692N2434O10q711J0681n6105j43828j7627R7745J9521
16037B219279j45204N5963R0192M9374n2782p7721l083O7790m6521p2223J16620
$$ y = [2340789, 2190264, 2206743, 2237714, 2041803, 2071969, 2221227, 2218860, 2268109, 2274264, 2223060, 2233176, 2253379, 2211925, 2101928, 2151239, 2152538, 2128080, 2139947, 2143028, 2162894, 2182868, 2089489, 2096735, 2170420, 2251519, 2193570, 2261935, 2181067, 2291575, 2221135, 2101663, 2257348, 2288257, 2224950, 2261964, 2190397, 2147364, 2107569, 2186318, 2136462, 2238901, 2321385, 2132921, 2177869, 2271224, 2101439, 2077216, 2267624, 2377859, 2289850, 2315505, 2353701, 2221523, 2093968, 2222398, 2296302, 2175275, 2319809, 2258239, 2246661, 2273256, 2205004, 2132870, 2215904, 2148347, 2027867, 2264559, 2316993, 2317603, 2308892, 2319573, 2263468, 2119640, 2102013, 2199758, 2219279, 2074075, 2130038, 2220230, 2269604, 2216822, 2139101, 2136018, 2203808, 2157287, 2085064, 2201684]
16026B201684J68960O365J7787J9283j83222j30879O8946j6993j07551J30290
16016B174670J36411k39852N6647o6209l2677O0839K7187P979Q1930J97515r0272
16005B314168j17831m1303K0665K2322m4367L2907q6036J35317m7940l7052O0887
15994B211737K5493k4319n1180Q9031K8427o6608l0774J14280K8490o7920r5776
15983B160881M6585Q1386N9718o2694j7857K2476j1569O4094l5184j6384k7153
15972B264299q2471J20657j15627K0457N0039p8792M7266q5780J5022J18208l6043
15961B237235p0116J4665J56297J20094l2968J25301j87192o8279O5246n9577
15951B300706j41797O773O2895Q5265q7616n3874l3310j03728J06783Q8311l5011
$$ y = [2201684, 2370644, 2377009, 2394796, 2414079, 2230857, 2099978, 2168924, 2151931, 2044380, 2174670, 2311081, 2071229, 2127876, 2061667, 2028990, 2089829, 2117016, 2124995, 2206925, 2404440, 2314168, 2196337, 2155034, 2175699, 2198021, 2153654, 2186561, 2100525, 2235842, 2187902, 2150850, 2211737, 2237230, 2212911, 2161731, 2250762, 2279189, 2212581, 2181807, 2296087, 2324577, 2256657, 2160881, 2207466, 2288852, 2348570, 2285876, 2268019, 2290495, 2278926, 2343020, 2307836, 2291452, 2264299, 2181828, 2302485, 2186858, 2207315, 2257354, 2178562, 2225828, 2140048, 2155070, 2273278, 2237235, 2167119, 2181784, 2338081, 2458175, 2425207, 2550508, 2363316, 2295037, 2360283, 2300706, 2158909, 2165682, 2228577, 2313842, 2226226, 2172352, 2139042, 2035314, 2142097, 2230408, 2195397]
15940B195397j13551L4246R7226J00597j43881K8263Q5434K1025l1662P51O4297
15929B338142P8170J40375j75314k15057M3448r5959j5119O0968J1711O6927J25527
15918B363819k6376J6910m4119k8355J22661n1372q6336n5765j44266J21450J44321
15907B332572M1928J19715n1969m1805m1387O023k4932K2611k5509J4702j22725
15896B229224K5836l2037m087q6758Q5032Q5700j15383J78313M9387m0198j7925
15885B357104r4664M857R9251o5982k3410L1206L9401j07042M9366J8238J02176
15874B410501j20208r9436l9184n2992o1997J54612O2356M2740P6637J43487L8445
15863B554961j38575k0795r6748j20976O0090Q1112q054O4013L2286j38684Q7290
$$ y = [2195397, 2081846, 2116092, 2213318, 2313915, 2170034, 2198297, 2283731, 2304756, 2273094, 2273845, 2338142, 2416312, 2556687, 2381373, 2166316, 2209764, 2113805, 2098686, 2159654, 2171365, 2238292, 2363819, 2337443, 2354353, 2310234, 2281879, 2404540, 2353168, 2266832, 2211067, 2066801, 2188251, 2332572, 2374500, 2494215, 2442246, 2400441, 2359054, 2365077, 2340145, 2362756, 2337247, 2351949, 2229224, 2255060, 2223023, 2218936, 2132178, 2217210, 2302910, 2187527, 2365840, 2415227, 2375029, 2357104, 2262440, 2267297, 2366548, 2300566, 2277156, 2308362, 2347763, 2240721, 2290087, 2308325, 2410501, 2290293, 2190857, 2151673, 2098681, 2036684, 2191296, 2253652, 2296392, 2373029, 2516516, 2554961, 2416386, 2395591, 2298843, 2177867, 2237957, 2319069, 2311015, 2375028, 2407314, 2268630, 2355920]
15852B355920L142J4766J10032p8179j77418P0896l7070r8056M6937J13482r5341
15841B229111R3463R9777n3703L0092j87086j23397L22M2253l6599O5768J42077
15830B302078Q8580k3512q9148M6338j32119j5782J65945j77916L0385o0710N5097
15819B189236R9363p1802J8442R5204P058K7763j68805j0510R0662N9501o4581
15808B271531q7894j3207M727N491O4143K1957r554k8681k8780J40642l428K2501
15796B359448K9164k8332J16783J1478K748j40078J1852O5278J17350j50419j39706
15785B255566l8396j63o6937P4599K01560j22824R0201J6970r2981j4921N1316
15774B353990J3295O216N4877j27729n1024r5274N4103Q1149J30J9467o1615N8497
$$ y = [2355920, 2359062, 2373828, 2483860, 2405681, 2228263, 2299159, 2262089, 2164033, 2210970, 2324452, 2229111, 2322574, 2422351, 2368648, 2398740, 2211654, 2088257, 2088579, 2130832, 2094233, 2160001, 2302078, 2390658, 2367146, 2277998, 2324336, 2192217, 2176435, 2342380, 2164464, 2194849, 2134139, 2189236, 2288599, 2216797, 2235239, 2330443, 2337501, 2365264, 2196459, 2185949, 2276611, 2336112, 2271531, 2183637, 2170430, 2175157, 2180648, 2244791, 2266748, 2257194, 2228513, 2199733, 2340375, 2336947, 2359448, 2388612, 2360280, 2477063, 2488541, 2491289, 2351211, 2363063, 2428341, 2545691, 2395272, 2255566, 2217170, 2217007, 2150070, 2224669, 2426229, 2303405, 2393606, 2410576, 2317595, 2302674, 2353990, 2367285, 2373501, 2428378, 2300649, 2249625, 2154351, 2208454, 2289603, 2289733, 2309200, 2247585, 2306082]
15762B306082O3000o9321N6416R2889L0146l5426j21094m8274Q2332l8825P6085
15751B394010o2310J9534j37410J69J78751O5550k2020j74113l347J34890Q3512
15740B477216j27920r085Q2458m0764O4663O287j24883j01114Q9888J14340m5752
15729B385334L9734N193k1931r3421J06417L9052P6759k3418k8167j21308n2223
15718B312021J13007m0482j33129N5680j021p3415n1888M5517K3260J28452j6320
15707B361682P4603J3583j01176p2607p869K2657J12507Q7237J9066j01315q2200
15696B326168j10647q2132J80789R5552o1052N1779N3448l4004N8433j07527j18413
15685B252394j1148J51359J13293o73j29997k06301P3642m4863Q0442K1323J7608
$$ y = [2306082, 2369082, 2299761, 2356177, 2449066, 2479212, 2443786, 2322692, 2274418, 2356750, 2317925, 2394010, 2331700, 2351234, 2213824, 2213993, 2392744, 2458294, 2436274, 2262161, 2258814, 2393704, 2477216, 2349296, 2340211, 2422669, 2381905, 2446568, 2452855, 2327972, 2226858, 2316746, 2431086, 2385334, 2425068, 2430261, 2408330, 2314909, 2421326, 2460378, 2537137, 2513719, 2485552, 2364244, 2312021, 2425028, 2384546, 2251417, 2307097, 2306076, 2232661, 2180773, 2226290, 2249550, 2378002, 2361682, 2436285, 2449868, 2348692, 2276085, 2268216, 2290873, 2403380, 2490617, 2509683, 2408368, 2326168, 2215521, 2133389, 2314178, 2409730, 2348678, 2400457, 2453905, 2419901, 2478334, 2370807, 2252394, 2241246, 2392605, 2505898, 2505225, 2375228, 2168927, 2242569, 2197706, 2278148, 2299471, 2317079]
15674B317079N2578K4116j31441j04978l5610J48246P7264N6457N334R9803N680
15663B514528j59538L2271l1193r1253Q0795P9340j05621J12560o1794p6141L3443
15652B327397P5873O5357N1862p9910J19440p9057j50303Q916J82067j02232p5964
15641B343446L6087P1676L0471n9846M2107j33352q4442P153P1961N9241N1451
15630B435953j2986K0080Q7197j43890J11612j4432j15172r4642L8838J14529
15620B427087M947R4944q4236p4330M7319L5601m5668K2193j36279k5173J23276
15609B389681j19341P863J10614k81K2943p3934M7292M0194n774J0850J156o2712
15597B368551j29175R6177J19541j02625L68P6004J1370n8685q7628N9736O5148
$$ y = [2317079, 2369657, 2393773, 2262332, 2157354, 2121744, 2269990, 2347254, 2403711, 2409045, 2508848, 2514528, 2354990, 2387261, 2356068, 2264815, 2345610, 2424950, 2319329, 2431889, 2370095, 2293954, 2327397, 2403270, 2468627, 2520489, 2440579, 2560019, 2480962, 2330659, 2339575, 2521642, 2419410, 2343446, 2379533, 2451209, 2481680, 2421834, 2463941, 2330589, 2246147, 2253300, 2325261, 2384502, 2435953, 2422967, 2443047, 2530244, 2386354, 2497966, 2483534, 2368362, 2273720, 2312558, 2427087, 2432034, 2526978, 2442742, 2368412, 2415731, 2451332, 2405664, 2427857, 2291578, 2266405, 2389681, 2270340, 2278203, 2388817, 2388536, 2411479, 2337545, 2384837, 2425031, 2419257, 2430107, 2431263, 2368551, 2239376, 2335553, 2455094, 2352469, 2352837, 2428841, 2440211, 2381526, 2293898, 2353634, 2418782]
15586B418782J8901o9584J39390J9705j13481r0103J18922j73775p0948R6470
15576B294279J38308n049j28323P9841O2542o9369j18205O2790P247j4676J14038
$$ y = [2418782, 2437683, 2368099, 2507489, 2527194, 2413713, 2323610, 2442532, 2268757, 2197809, 2294279, 2432587, 2427538, 2299215, 2379056, 2441598, 2372229, 2254024, 2316814, 2324061, 2309385, 2423423]
$$ [...]
##END NTUPLES=NMR SPECTRUM
##END=
