##TITLE=1H_DE-80H_X3
 200.13MHz, d2o
 8 sc
 
 19ns.26.2.2025
##JCAMPDX= 6.0         $$ Bruker NMR JCAMP-DX V2.0
##DATA TYPE= NMR SPECTRUM
##DATA CLASS= NTUPLES
##ORIGIN= UXNMR, Bruker Analytische Messtechnik GmbH
##OWNER= pz
$$ XWIN-NMR		Version 3.5
$$ Wed Apr 22 10:28:04 2026 Russian Standard Time (UT+4h)  Yarkov@DPX200
##.OBSERVE FREQUENCY= 200.1313
##.OBSERVE NUCLEUS= ^1H
##.ACQUISITION MODE= SIMULTANEOUS
##.ACQUISITION SCHEME= undefined
##.AVERAGES= 8
##.DIGITISER RES= 18
##SPECTROMETER/DATA SYSTEM= spect
##.PULSE SEQUENCE= zg30
##.SOLVENT NAME= DMSO
##.SHIFT REFERENCE= (INTERNAL, DMSO, 0, 15.4505)
##AUDIT TRAIL= $$ (NUMBER, WHEN, WHO, WHERE, WHAT)
$$ ##TITLE= Audit trail, XWIN-NMR		Version 3.5
$$ ##JCAMPDX= 5.01
$$ ##ORIGIN= Bruker BioSpin GmbH
$$ ##OWNER= Yarkov
$$ C:/Bruker/XWIN-NMR/data/yarkov2/nmr/H-C/1/pdata/1/auditp.txt
$$ ##AUDIT TRAIL=  $$ (NUMBER, WHEN, WHO, WHERE, WHAT)
(   1,<2026-04-22 10:27:27.81 +0400>,<Yarkov>,<DPX200>,
      <created by zg, POWCHK disabled, PULCHK disabled
       configuration hash MD5:
       00 E9 B6 7A A2 85 ED C7 34 08 36 98 17 FE 4E 26
       data hash MD5: 16K
       BC FF A0 FF 69 6A 33 D8 C2 12 72 42 A9 77 D9 B5>)
(   2,<2026-04-22 10:27:32.90 +0400>,<Yarkov>,<DPX200>,
      <Start of raw data processing
       efp BC_mod = 2 LB = 0.25 FT_mod = 6 PKNL = 1 PHC0 = -5302.316 PHC1 = 11.42193 SI = 16K 
       data hash MD5: 16K
       B1 09 A9 88 00 7F CC 9C 99 0D E6 AF BB E0 88 75>)
$$ ##END=
$$ 
$$ hash MD5
$$ 9E 2B EB 9C E6 6B 7E 23 22 2A 7E 69 F3 28 B1 26
##$RELAX= 
##$RELAX= 
##$RELAX= 
##$RELAX= 
##$RELAX= 
##$RELAX= 
$$ Bruker specific parameters
$$ --------------------------
##$DU= <C:/Bruker/XWIN-NMR>
##$EXPNO= 1
##$NAME= <H-C>
##$PROCNO= 1
##$TYPE= <nmr>
##$USER= <yarkov2>
##$AMP= (0..31)
100 100 100 100 100 100 100 100 100 100 100 100 100 100 100 100 100 100 
100 100 100 100 100 100 100 100 100 100 100 100 100 100 
##$AQSEQ= 0
##$AQ_mod= 1
##$AUNM= <au_zg>
##$AUTOPOS= <>
##$BF1= 200.13
##$BF2= 200.13
##$BF3= 200.13
##$BF4= 200.13
##$BF5= 200.13
##$BF6= 200.13
##$BF7= 200.13
##$BF8= 200.13
##$BYTORDA= 1
##$CFDGTYP= 0
##$CFRGTYP= 5
##$CHEMSTR= <none>
##$CNST= (0..31)
1 1 145 1 1 1 1 1 1 1 1 1 1 1 1 1 1 1 1 1 1 1 1 1 1 1 1 1 1 1 1 1 
##$CPDPRG= <>
##$CPDPRG1= <>
##$CPDPRG2= <>
##$CPDPRG3= <>
##$CPDPRG4= <mlev>
##$CPDPRG5= <mlev>
##$CPDPRG6= <mlev>
##$CPDPRG7= <mlev>
##$CPDPRG8= <mlev>
##$CPDPRGB= <>
##$CPDPRGT= <>
##$D= (0..31)
0 0.7 0 0 0 0 0 0 0 0 0 0.03 0 0 0 0 0 0 0 0 0 0 0 0 0 0 0 0 0 0 0 0 
##$DATE= 1776839247
##$DBL= (0..7)
120 120 120 120 120 120 120 120 
##$DBP= (0..7)
150 150 150 150 150 150 150 150 
##$DBP07= 0
##$DBPNAM0= <>
##$DBPNAM1= <>
##$DBPNAM2= <>
##$DBPNAM3= <>
##$DBPNAM4= <>
##$DBPNAM5= <>
##$DBPNAM6= <>
##$DBPNAM7= <>
##$DBPOAL= (0..7)
0.5 0.5 0.5 0.5 0.5 0.5 0.5 0.5 
##$DBPOFFS= (0..7)
0 0 0 0 0 0 0 0 
##$DE= 6
##$DECBNUC= <off>
##$DECIM= 32
##$DECNUC= <off>
##$DECSTAT= 4
##$DIGMOD= 1
##$DIGTYP= 9
##$DL= (0..7)
0 120 120 120 120 120 120 120 
##$DP= (0..7)
$$ [...]
##$SUBNAM2= <"">
##$SUBNAM3= <"">
##$SUBNAM4= <"">
##$SUBNAM5= <"">
##$SUBNAM6= <"">
##$SUBNAM7= <"">
##$SUBNAM8= <"">
##$SUBNAM9= <"">
##$SW= 18.0517328524113
##$SWIBOX= (0..15)
0 0 2 0 0 0 0 0 0 0 0 0 0 0 0 0 
##$SW_h= 3612.71676300578
##$TD= 16384
##$TD0= 1
##$TE= 0
##$TE2= 300
##$TE3= 300
##$TEG= 300
##$TL= (0..7)
0 120 120 120 120 120 120 120 
##$TP= (0..7)
150 150 150 150 150 150 150 150 
##$TP07= 0
##$TPNAME0= <>
##$TPNAME1= <>
##$TPNAME2= <>
##$TPNAME3= <>
##$TPNAME4= <>
##$TPNAME5= <>
##$TPNAME6= <>
##$TPNAME7= <>
##$TPOAL= (0..7)
0.5 0.5 0.5 0.5 0.5 0.5 0.5 0.5 
##$TPOFFS= (0..7)
0 0 0 0 0 0 0 0 
##$TUNHIN= 0
##$TUNHOUT= 0
##$TUNXOUT= 0
##$USERA1= <user>
##$USERA2= <user>
##$USERA3= <user>
##$USERA4= <user>
##$USERA5= <user>
##$V9= 5
##$VALIST= <valist>
##$VCLIST= <CCCCCCCCCCCCCCC>
##$VD= 0
##$VDLIST= <DDDDDDDDDDDDDDD>
##$VPLIST= <PPPPPPPPPPPPPPP>
##$VTLIST= <TTTTTTTTTTTTTTT>
##$WBST= 1024
##$WBSW= 4
##$XGAIN= (0..3)
0 0 0 0 
##$XL= 0
##$YL= 0
##$YMAX_a= 142916
##$YMIN_a= -161557
##$ZGOPTNS= <>
##$ZL1= 120
##$ZL2= 120
##$ZL3= 120
##$ZL4= 120
##$ABSF1= 0
##$ABSF2= 0
##$ABSG= 0
##$ABSL= 0
##$ALPHA= 0
##$AQORDER= 0
##$ASSFAC= 0
##$ASSFACI= 0
##$ASSFACX= 0
##$ASSWID= 0
##$AUNMP= <proc_1d>
##$AZFE= 0.1
##$AZFW= 0.1
##$BCFW= 0
##$BC_mod= 2
##$BYTORDP= 0
##$COROFFS= 0
##$CY= -3
##$DATMOD= 1
##$DC= 0
##$DFILT= <>
##$DTYPP= 0
##$F1P= 0
##$F2P= 0
##$FCOR= 1
##$FTSIZE= 16384
##$FT_mod= 6
##$GAMMA= 0
##$GB= 0
##$INTBC= 1
##$INTSCL= 3.241238e-09
##$ISEN= 128
##$LB= 0.25
##$LEV0= 0
##$LPBIN= 0
##$MAXI= 10000
##$MC2= 0
##$MEAN= 0
##$ME_mod= 0
##$MI= 1.114404
##$NCOEF= 0
##$NC_proc= -8
##$NLEV= 6
##$NOISF1= 3.799351
##$NOISF2= 2.8
##$NSP= 0
##$NTH_PI= 0
##$NZP= 0
##$OFFSET= 15.45051
##$PC= 1
##$PHC0= -5302.316
##$PHC1= 11.42193
##$PH_mod= 1
##$PKNL= yes
##$PPARMOD= 0
##$PSCAL= 0
##$PSIGN= 0
##$REVERSE= no
##$SF= 200.130014248599
##$SI= 16384
##$SIGF1= 3
##$SIGF2= 2
##$SINO= 0.751879
##$SIOLD= 32768
##$SREGLST= <19F.Aceton>
##$SSB= 0
##$STSI= 16384
##$STSR= 0
##$SW_p= 3612.71676300578
##$SYMM= 0
##$S_DEV= 0
##$TDeff= 16384
##$TDoff= 0
##$TI= <>
##$TILT= no
##$TM1= 0
##$TM2= 0
##$TOPLEV= 0
##$USERP1= <user>
##$USERP2= <user>
##$USERP3= <user>
##$USERP4= <user>
##$USERP5= <user>
##$WDW= 1
##$XDIM= 16384
##$YMAX_p= 515495825
##$YMIN_p= -3846323
$$ End of Bruker specific parameters
$$ ---------------------------------
##NTUPLES= NMR SPECTRUM
##VAR_NAME=  FREQUENCY,     SPECTRUM/REAL,   SPECTRUM/IMAG
##SYMBOL=    X,             R,               I
##VAR_TYPE=  INDEPENDENT,   DEPENDENT,       DEPENDENT
##VAR_FORM=  AFFN,          ASDF,            ASDF
##VAR_DIM=   16384,         16384,           16384
##UNITS=     HZ,            ARBITRARY UNITS, ARBITRARY UNITS
##FACTOR=    0.220516191357247, 1,           1
##FIRST=     3092.11079145626, 0,            0
##LAST=      -520.605971549523, 0,           0
##MIN=       -520.605971549523, -3846323,    0
##MAX=       3092.11079145626, 515495825,    0
$$ Real data points
##PAGE= N=1
##DATA TABLE= (X++(R..R)), XYDATA
$$ [...]
11655i27394j281919J281215m91372M04845j79838K48939M40419J314962N48735
11646A358592L78764j034545k225670L64334j097338M13951m6661J34570N65384
11637a188619J706582J439315K16202o39895K94716M37785j748306m50024M79328
11628E47084j095093l99911r83700l97049J143624K149923j163593j064386L58876
11619i04225j56753j442113J386406J068356N51175j39586J323639K86794j004510
11610I69183m71293l78399N88651Q2487l24206O813P91709k19269j098648j32400
11600a85372N31725l69242O35792q92681r22163J629283J75320q9913Q83240N03415
11590A899404Q7350q23074j629400q87798K24119m8357J051059o9582J177406
$$ plain form
11655 -927394 -2209313 -928098 -1419470 -1014625 -1194463 -945524 -505105 809857 1358592
11646 1358592 1737356 702811 -1522859 -1158525 -2255863 -1841912 -1888573 -1754003 -1188619
11637 -1188619 517963 1957278 2173480 1533585 1828301 2266086 517780 67756 547084
11628 547084 -548009 -947920 -1931620 -2328669 -1185045 964878 -198715 -1263101 -904225
11619 -904225 -1060978 -2503091 -1116685 -48329 502846 363260 1686899 1973693 969183
11610 969183 497890 119491 708142 790629 466423 473236 1264945 1045676 -52972 -185372
11600 -185372 346353 -22889 612903 -279778 -1201941 427342 602662 512749 1395989 1899404
11590 1899404 1986754 1163680 -465720 -1353518 -1129399 -1177756 -126697 -196279 981127
11581I81127o8539R11820O94008r287j266798Q5415M95063k75774k91099j430327
11571a74391l63669m19853J377981R03032j8155r39283J298642k10772j085782
11562C67750P61508M74817k4351j695806N66382k21363n92938L59869j231669
11553a235801J41619N61557O83175r48397n68680Q11411q28681o17057N15654
11544a485200J955613n44249l3077Q90769L40006j37353J21067J356090k57863
11535B205803j949272o28198l36725O55874J4066M73692k4355j388853k40537
11526a218505o23855Q37483n99571K52462k9740M69325J62997L19715M28067J39361
11516A37739N44075N44845R72179L6970p49151N90265p1665p20427j666446J226326
$$ plain form
11581 981127 912588 1824408 2518416 2509129 1242331 1327746 1822809 1547035 1255936 -174391
11571 -174391 -538060 -957913 420068 1323100 1304945 365662 1664304 1453532 367750
11562 367750 1129258 1604075 1579724 -116082 450300 228937 -364001 -4132 -1235801
11553 -1235801 -1094182 -532625 150550 -797847 -1366527 -555116 -1383797 -2000854 -1485200
11544 -1485200 470413 -73836 -106913 783856 1123862 986509 1107576 2463666 2205803
11535 2205803 256531 -371667 -708392 -52518 -38452 435240 410885 -977968 -1218505
11526 -1218505 -1842360 -1004877 -1604448 -1351986 -1381726 -912401 -749404 -429689 -1622 137739
11516 137739 681814 1226659 2198838 2235808 1486657 2076922 2005257 1284830 -381616 844710
11506H44710J040369p76929O52098r86046m96715o67161J80178J47765K07942
11497A46211K60488j105974O0148J895954Q8619o02016o37446N20720k01459k99254
11487A25991n85721K29467r15609o2071R32987Q45757J085544j328193j76478
11478A51674M70382P68035M20883j850434l09548l979j07251m36848m97416J703596
11468C09094p13738Q53500O91142Q8566j116734q27148J119439k71673q71705
11459g39257n76327J166201n80420p41195J340299J85933M09580k039381J36801
11450a437766J13457m55066J51635q65115Q56984J59537J941919R96088n0818
11441A410855m68293j443222L47591M34915R57039k61858k98553j14290l94961
$$ plain form
11506 844710 1885079 1108150 1760248 774202 277487 -389674 -209496 -61731 146211
11497 146211 406699 -699275 -639127 1256827 1345446 743430 105984 626704 425245 125991
11487 125991 -459730 -230263 -1145872 -1207943 -274956 570801 1656345 328152 151674
11478 151674 622056 1390091 1810974 -39460 -349008 -352987 -460238 -897086 -1394502 309094
11468 309094 -404644 448856 1139998 1228564 111830 -715318 404121 132448 -739257
11459 -739257 -1315584 -149383 -729803 -1470998 -130699 55234 464814 -1574567 -1437766
11450 -1437766 -1324309 -1779375 -1627740 -2492855 -1635871 -1476334 465585 1461673 1410855
11441 1410855 942562 -500660 -153069 281846 1238885 977027 678474 564184 169223
11432A69223j99587l65859J023976o14023l97094o48403L88055K33498q66892
11423a277106P54885J45335q85230J048068R48786P59925j467561J257287P32749
11414B017138j728148P92204j15096Q87342k15065r2454J41630j059781O6153
11405F93923P00008n19931m31469K60912P52304K41103q83407k15013M21801K8793
11395A049024Q50959j245452r7045j47865l41893K10665j072338J25628k74929
11386i43246q54038J233382J035363J673883k18293j162326L26145j79999l16728
11377E94143p00377R03406O23882l49915k84632J066462m22579o43594k278431
11368a491635o65655Q21320K57942O58301j10661R16728L68679j381232O71531
$$ plain form
11432 169223 -30364 -396223 627753 13730 -383364 -1031767 -643712 -410214 -1277106
11423 -1277106 -522221 -376886 -1262116 -214048 734738 1494663 27102 1284389 2017138
11414 2017138 288990 1081194 966098 1853440 1638375 1545921 1687551 627770 693923
11405 693923 1393931 874000 442531 703443 1455747 1696850 813443 598430 1020231 1049024
11395 1049024 1899983 654531 557486 409621 67728 278393 -793945 -668317 -943246
11386 -943246 -1797284 -563902 471461 2145344 1927051 764725 1090870 910871 594143
11377 594143 -106234 797172 1421054 1071139 786507 1852969 1430390 786796 -1491635
11368 -1491635 -2157290 -1335970 -1078028 -419727 -530388 386340 755019 -626213 45318
11359D5318P2781m80335l66897P00305P63803q37982j097003Q95863k9750j331919
11349a665816J547114q8990L58046J092502m64490p03410l19499J607310p79336
11340E83431r69790J245490j533794n39402J179669Q07416j739943l39911J012348
11331b94486o67133p0904J411166m44407p91880L83374k36700l45671J680685
11322F24044O20992m12553k72930m77203P794M45685K49846k072022p01790j76683
11312b164820M22159M79178O69243J420660j004487L80039M86530q78861R33524
11303G43165Q35959m18295j19340N3599K64794j296581l32816L30959J03306o39338
11293d74588m89453l01358J114546P96982r04694m30320R57365K73069q97044
$$ plain form
11359 45318 118099 -362236 -729133 -28828 734975 -103007 -1200010 -304147 -333897 -1665816
11349 -1665816 -118702 -207692 150354 1242856 778366 74956 -244543 1362767 583431
11340 583431 -386359 859131 -674663 -1214065 -34396 773020 -966923 -1306834 -294486
11331 -294486 -961619 -1032523 378643 -65764 -857644 -474270 -710970 -1056641 624044
11322 624044 1245036 832483 559553 82350 90144 535829 785675 -1286347 -1988137 -2164820
11312 -2164820 -1742661 -1263483 -594240 826420 -178067 201972 688502 -190359 743165
11303 743165 1579124 1160829 1041489 1095088 1359882 63301 -269515 61444 164750 -474588
11293 -474588 -964041 -1265399 -150853 646129 -258565 -688885 268480 541549 -355495
11284c55495K78239M04735l28351O29955j008539k62142R29617q87322N09665
11275h9638n02900M15927J334824N28291k69580j709937Q1287J927291q93530
11266H22035J37140j98563q10248n48498J76944M28093r82549k404304J841311
11257a538639N18943J751607m25526j05273O06442j067195o10176l35633J943120
11248G37670J220964q2393j654315r8349k29424J030919l54870j079202j71112
11239f80112Q33366R18121m07830O58875l46210l28650K24903r2008o83988l60728
11229b64261O48606M57841l12577o79509R68425r73870J977283m79708j73618
11220A168612p52829j82784P85446p35990P35412J063332O10601j568765j465129
$$ plain form
11284 -355495 -77256 327479 -872 629083 -379456 -641598 288019 -599303 -89638
11275 -89638 -592538 -176611 1158213 1686504 1416924 -293013 -211726 1715565 822035
11266 822035 959175 760612 -49636 -598134 -421190 6903 -975646 -3379950 -1538639
11257 -1538639 -1019696 731911 306385 201112 807554 -259641 -869817 -1205450 737670
11248 737670 1958634 1876241 221926 123577 -105847 925072 570202 -509000 -680112
11239 -680112 153254 1071375 663545 1322420 976210 647560 872463 780455 96467 -264261
11229 -264261 384345 842186 529609 -149900 818525 -155345 1821938 1342230 1168612
11220 1168612 415783 232999 1018445 282455 1017867 2081199 2691800 1123035 -342094
11211c42094p7241K67369Q01537j32062j033813L41832M2855M34204p1033N82670
11201H14224m08913q69200m52294p21032R26509P46284O28419J40196R03972j359873
11191C48292k659158K112798J357480j805125p81335K580953Q76015n23216r84857
11182E21847j232666n99680N51706j27139j180488J604753Q27602m55657P50940
11173F61218N43326j465879r72044N49692J109252p94158K90112L05484l30442
11164a03439J53682l43095J496069K02439L00648l12830j151192j272526K129322
11155A099078k47154j582290l29428J857399L1204j221544J035889P3463o44101
11146G2516p01645k18584p60477J208769M22437M77985M26617l39460m97697J06620
$$ plain form
11211 -342094 -419335 -151966 649571 517509 -516304 -174472 -131617 302587 231554 814224
11201 814224 405311 -463889 -916183 -1637215 -710706 35578 663997 804193 1708165 348292
11191 348292 -2310866 -198068 1159412 -645713 -1427048 1153905 2029920 1506704 521847
11182 521847 -710819 -1310499 -758793 -885932 -2066420 -461667 365935 -89722 661218
11173 661218 1204544 -261335 -1233379 -683687 425565 -368593 -78481 227003 -103439
11164 -103439 50243 -292852 1203217 1405656 1706304 1393474 242282 -1030244 1099078
11155 1099078 851924 -730366 -1059794 797605 828809 -392735 643154 716617 72516
11146 72516 -629129 -847713 -1608190 -399421 23016 501001 927618 588158 90461 197081
11136A97081L12914p71519P31634l11879n85395M03706k47697k21164J58060J715736
11126A381477j117753J87077k28422O1584L64447J077142j104570k236682P50100
11117h65600P78484k50846R59881J323533j090154j055679R86133j5991o56878
11108A12883M57477J491427q60967m01953P20529k4839p45345j40233n67786o75131
11098f33938Q45088J163772N35084n9559M39576j886707p67682K59394M04221
11089B99249M8468Q34079n05574k54935m67468L18139n08159j71336k61730O3083
11079f06184J624679J369222k281189q41665M35084l02148J026183j61273n65729
11070c03020k14926N32435J179038j461882K09284J95062j47619J341676j4811
$$ plain form
11136 197081 509995 -261524 470110 158231 -427164 -23458 -271155 -492319 -334259 1381477
11126 1381477 263724 450801 222379 283963 648410 1725552 620982 -1615700 -865600
11117 -865600 -87116 -337962 621919 1945452 855298 -200381 785752 769761 112883
11108 112883 570360 2061787 1200820 798867 1519396 1494557 749212 608979 41193 -633938
11098 -633938 211150 1374922 1910006 1850447 2290023 403316 -364366 -104972 299249
11089 299249 347717 1181796 676222 421287 -46181 271958 -236201 -407537 -669267 -606184
11079 -606184 1018495 2387717 106528 -735137 -300053 -602201 423982 262709 -303020
11070 -303020 -517946 14489 1193527 -268355 -59071 135991 -11628 1330048 1315237
11061A315237m77986j331386k78332n27155j2338N80153P48824p54695m96394
11052a234072M8609Q41392J151535j039549j426007J094414K295284P44009j295231
11043A180384n8473L64163L80903O03693p82005j435074k330721J997278J205330
11034A125478n78933r87891L42980K23806n19203M6052J047489P33600p11327
11025G22051M17114j769790J62938O55563M11938o62127m88337J035588J357275
11016A842213L25289L73500j483248n01076L7993P81939l94814l0181J257720
11007B209335q24534q26957j571814J5597R43036j74998p10483k38889J246301
10998F6594P78441R1757r10350P2576K90680m93520j480028L2901Q10440o81057
$$ plain form
11061 1315237 837251 -494135 -772467 -1299622 -1311960 -731807 17017 -737678 -1234072
11052 -1234072 -1185463 -344071 807464 -232085 -1658092 -563678 1731606 2475615 1180384
11043 1180384 1121911 1486074 1866977 2470670 1688665 253591 -2077130 -79852 1125478
11034 1125478 546545 -441346 -98366 125440 -393763 -347711 699778 1433378 722051
11025 722051 1139165 -630625 -467687 187876 599814 -62313 -550650 484938 1842213
11016 1842213 2167502 2541002 1057754 556678 594671 1376610 981796 951615 2209335
11007 2209335 1384801 557844 -1013970 -998373 -55337 -230335 -940818 -1179707 66594
10998 66594 845035 936792 26442 99018 389698 -103822 -1583850 -1550949 -740509 -1421566
10988a421566Q40292L60058N40145m60953M44758O38227q25457j239461J873078
10979G49121N22465j17199j832296o12528R37743j301255J522351k79917n1999
10970d63514j545247P17084K84526J12161p4264L63117k32507k48330K387797
10961A300823j310435p92001k078995J289026k88067l63944J686321O92002l11083
10952a76353l79129J906472l86194n57965j53637Q14138l65250J203261j94713
10943A710630j987943M72772J000670J40175j022512p4089L38513k92006p65529
10934d79319J145143m68396j137192o96177K183882R17337n37302J92734O2260
10925A182970m79623m98629Q31657n39706J96262J578056n50112n71662J181405
$$ plain form
10988 -1421566 -581274 -221216 318929 -142024 302734 940961 115504 -1123957 749121
10979 749121 1271586 1154387 -677909 -1290437 -352694 -1653949 -131598 -411515 -463514
10970 -463514 -2008761 -1291677 -1007151 -894990 -969254 -606137 -838644 -1086974 1300823
10961 1300823 -9612 -801613 -2880608 -1591582 -1879649 -2243593 -557272 134730 -176353
10952 -176353 -555482 1350990 964796 406831 253194 1067332 702082 1905343 1710630
10943 1710630 -277313 195459 1196129 1336304 313792 239703 578216 286210 -479319
10934 -479319 665824 197428 -939764 -1635941 547941 1465278 927976 1120710 1182970
10925 1182970 703347 204718 1036375 496669 692931 2270987 1720875 1149213 2330618
10916B330618L64528j382234j555587j263004J177077J077756L21692p41161j61043
10907A68642N84343j38847m31507o90213l43114O83918K096423r20134k14510
10898G95001l87164M90312n31607m35843l84910R12100m90509r52084q58918J199749
10888f43873Q05618R441k07820M77610R64350K81535l9216r82539K25556j599627
10878g08965Q6668R23930l1177j129928l38033J486293r4351k151601P75493L34803
10868h46868m14676M7581R09776q42470J264095J720025m60980k043577N38222
10859a28872J089742j711094r49165K175925m02464j543839L66770N73952R20530
10850C91485p70673l50042K35036o94118K5188N25750n26362k49287l23058K092092
$$ plain form
10916 2330618 2695146 1312912 -242675 -1505679 -328602 749154 1070846 329685 168642
10907 168642 752985 614138 182631 -507582 -850696 -166778 1929645 1009511 795001
10898 795001 407837 898149 366542 -69301 -454211 457889 -32620 -984704 -1843622 -643873
10888 -643873 161745 171186 -36634 440976 1405326 1686861 1647645 665106 890662 -708965
10878 -708965 -622297 301633 270456 -859472 -1197505 288788 194437 -1957164 -1181671 -846868
10868 -846868 -1261544 -1213963 -304187 -1146657 117438 1837463 1376483 -667094 -128872
10859 -128872 960870 -750224 -1699389 476536 74072 -1469767 -1102997 -529045 391485
10850 391485 -379188 -729230 -494194 -1188312 -1163124 -637374 -1163736 -1413023 -1736081 356011
10840C56011k39717m99695N09219q82759j302987P27492K48967r8198Q56921J54386
10830a70360k66299L98300K112581J048484k185627q28657j82330K45346m52152
10821b80714q41420q1256n73075Q69877R81046M06935o39036j32789J742735l51859
10811A100444M10196j249500J92403J095658o51984m37404m87378J410608N43038
10802A926081p29337m26133m576M54881j370583j581314L90237R64586j03862
10793d80020q08471J66287J27052O11034O25922J456668p44451m00311L05605
10784H59315J29981K07808j290834N2147J549227J23065K90628j173372j044714
10775b96749n5092P62841m22999j001365Q05050J57799j181151J31705J908602
$$ plain form
10840 356011 116294 -383401 125818 -756941 -2059928 -1332436 -1083469 -1181667 -324746 -170360
10830 -170360 -436659 -38359 2074222 3122706 937079 108422 -73908 171438 -280714
10821 -280714 -1122134 -1203390 -1776465 -906588 74458 481393 -157643 -290432 1452303 1100444
10811 1100444 1510640 261140 453543 1549201 897217 459813 -27565 1383043 1926081
10802 1926081 1196744 770611 766035 1220916 -149667 -1730981 -1340744 -376158 -480020
10793 -480020 -1288491 -1122204 -995152 -384118 241804 1698472 954021 553710 859315
10784 859315 989296 1197104 -93730 -41583 1507644 1630709 1921337 747965 -296749
10775 -296749 -351841 411000 -11999 -1013364 -208314 -50515 -1231666 -1099961 808641
10766H08641r78530j147719P50592p13626J561627L02306o3279r72629P65305
10757C12688J457896l82798N37672J64067p45850j090322N35430J132193R43245
10748B864221j152891k203911J242595r2053m22264p2549k2646K20551j685105
10739a324052J867533L68218q13568J12957R91689r96833N10675J227432j015092
10730I28959q01713R52591J70047p10711j238578J855960p15322o15275o8184
10721b42226j2683N35780J138841J98758k16312n99509q75343J93153M87268N3964
10711F61691k17398M80473r98967l8801J48509M14724o30297n91517n07720J207307
10701g1996N85823N08553j712107k51627o08441O7213J800953N87888j306145
$$ plain form
10766 808641 -169889 -1317608 -567016 -1280642 280985 583291 520012 -452617 312688
10757 312688 1770584 1387786 1925458 2089525 1343675 253353 788783 1920976 2864221
10748 2864221 1711330 -492581 750014 657961 235697 163148 140502 361053 -1324052
10739 -1324052 543481 911699 98131 211088 1202777 205944 716619 1944051 928959
10730 928959 127246 1079837 1249884 539173 -699405 1156555 441233 -174042 -242226
10721 -242226 -254909 280871 1419712 1618470 1402158 802649 -72694 120459 607727 661691
10711 661691 444293 924766 -74201 -113002 35507 450231 -180066 -771583 -1279303 -71996
10701 -71996 513827 1022380 -689727 -941354 -1549795 -1482582 318371 906259 -399886
10692c99886J6861K17738J359843Q50334j48537j225261j498034J086539M76561
10683G36158N1283O81008r77818l10606Q71057J32265J76625p77465k94458n97301
10673c09252K01702K10766P24358L7155j263533j410953J608764J208939m39449
10664E68497M13220K06293N17883o71220K0050J60646K21281N07892p42839p06333
10654D95370m03825m72820j066959n8263J503544Q8731j96092n81002J732586
10645A041270p1225j247448k42782K01351K21462k43199J711292N51040r10248
10636A011513l33282k14109p60083k67685J12578m66141o28219M63907J180808
10627I9287K076614r34115L0931m95803J66694J81880k40124N2537N2793r94892
$$ plain form
10692 -399886 -383025 -165287 1194556 2044890 1896353 671092 -826942 259597 736158
10683 736158 787441 1468449 490631 180025 1051082 1183347 1359972 582507 288049 -309252
10673 -309252 -107550 103216 827574 864729 -398804 -1809757 -200993 1007946 568497
10664 568497 981717 1188010 1705893 1034673 1054723 1215369 1436650 1944542 1201703 495370
10654 495370 91545 -381275 -1448234 -1506497 -2953 85778 -110314 -691316 1041270
10645 1041270 970045 -277403 -520185 -318834 -97372 -340571 1370721 1921761 1011513
10636 1011513 678231 464122 -295961 -563646 -451068 -917209 -1545428 -1081521 99287
10627 99287 2175901 1241786 1272717 776914 943608 1125488 885364 937901 990694 -4198
10617d198k6225O60773l26373N4639M05938m89730R35416K50880o66338j538078
10607g43296p50971K18944l83175J618906J996894o30546J2880R23223k57879
10598B004980j721554q02441J195920r76961J455360J061736j213881r82718R85067
10589A005508l33612j46204r01811k26890n3447k4587P62558j146367o9084J16376
10579a017560J21568J328558P09272j74079L65446n10783j467748o68522J266548
10570d7300M50211k30227K35015j61896R36495N71811j367547j517927L48434
10561g82931Q50174J80444j69623J36508Q74684j336743N19154p35408j085007
10552a548748L55936j78329R73093q12607J532190m22213M82988l93189J294551
$$ plain form
10617 -4198 -30423 630350 303977 358616 764554 274824 1210240 1461120 794782 -743296
10607 -743296 -1494267 -1275323 -1658498 -39592 1957302 1326756 1339636 2262859 2004980
10598 2004980 283426 -519015 676905 -300056 1155304 2217040 1003159 20441 1005508
10589 1005508 671896 525692 -376119 -603009 -656456 -681043 81515 -1064852 -1133936 -1017560
10579 -1017560 -895992 432566 1141838 967759 1333205 822422 -645326 -1313848 -47300
10570 -47300 402911 172684 407699 245803 1182298 1754109 386562 -1131365 -782931
10561 -782931 67243 247687 78064 214572 1089256 -247487 271667 -463741 -1548748
10552 -1548748 -1192812 -1371141 -398048 -1210655 321535 -100678 382310 -10879 1283672
10543A283672L88005J28175R72783n56478k411756j66569L56578n17795K11597
10534c11788J83561l76610l62447J138876N8605r37064j091802J500495k13079
10525d11253j63773N43434K7035J53801K47603Q10342k94024n83245J339614Q21362
10515B490896q29157j663107J7712j076631N06147M48948P73913q26397l59723
10506e17399o27603P01913N08370L2526O48483K90003J65261p24926J480997j22296
10496A835329j022336m48062l59451k94170M23687L39207o14021j579284M91884
10487a227217J361969l7377M99457P28445J757076M06951j152613j516118j380480
10478e59907j02934P92218q66705o79793K149303J844570p07048j829599O35437
$$ plain form
10543 1283672 1671677 1799852 2772635 2216157 -195599 -362168 -5590 -523385 -311788
10534 -311788 -128227 -504837 -867284 271592 330197 -606867 -1698669 -198174 -411253
10525 -411253 -575026 -31592 -4557 149244 396847 1207189 913165 329920 1669534 2490896
10515 2490896 1661739 -1368 16344 -1060287 -554140 -105192 668721 -157676 -517399
10506 -517399 -1145002 -443089 65281 97807 746290 1036293 1201554 476628 1957625 1835329
10496 1835329 812993 364931 5480 -288690 134997 474204 -139817 -1719101 -1227217
10487 -1227217 134752 97375 596832 1325277 3082353 3489304 2336691 820573 -559907
10478 -559907 -662841 129377 -737328 -1417121 732182 2576752 1869704 40105 675542
10469F75542n66866r0700l14767J63921m6568n56725P44631K92461q7042R86632
10459A200519j56933o15950O44876p2155M14923j338908O1003K10090j687370
10450a339905J77635L620748R00304l062419r39207R04241Q39707j277861N56327
10441C79570J247100l48267o99412k99357n43151q0591N06700j197437p80403
10432a815248O00533J299692J324262K38787m38561j563425m7767P84638j32092
10423B50819q05598M83213K1806J322565O67419j037236j451574J275721L82188
10414A109323j666994L02337j26171r00930K3364J241772j029129J629037M94917
10405A077526j263798m88353K916637M48035n23828O1212n08911j747079j09121
$$ plain form
10469 675542 108676 17976 -296791 -132870 -179438 -736163 8468 300929 213887 1200519
10459 1200519 1043586 427636 1072512 1000357 1415280 76372 137375 347465 -1339905
10450 -1339905 -1162270 2458478 3358782 296363 -642844 261397 1101104 -176757 379570
10441 379570 1626670 1278403 578991 279634 -263517 -344108 162592 -1034845 -1815248
10432 -1815248 -1214715 84977 1409239 1648026 1209465 -353960 -401727 382911 250819
10423 250819 -554779 -71566 -49760 1272805 1940224 902988 -548586 727135 1109323
10414 1109323 -557671 -255334 -381505 -1282435 -1259071 -17299 -1046428 582609 1077526
10405 1077526 -186272 -674625 2242012 2690047 2166219 2227431 1718520 -28559 -137680
10396a37680N59569j460128q90694R5712P63205Q01479N57413j065258N7638J022113
10386C03369j42538P11285L88146o05211L29332J123659n24141l28780J47798
10377A402919j252237m36856J94006Q89182j37080j82123l37480n50978p54625
10368a165272J557276l40185K66034j174828j517940L63492N82118K069851o15672
10359B4874K48343k20929O40345n13209M76637n28230j637321r2244k93394J726111
10349a69017P01462J607451l09473o54578j194464K73222n59318J248715j77829
10340G66171k076354m43105j05255J328382M7452J86349q16044J317892O23342
10331H28830N49586L13446r07551p84584j637815Q01090N85909J330089M19413
$$ plain form
10396 -137680 421889 -1038239 -1928933 -1833221 -1070016 -268537 288876 -776382 -718744 303369
10386 303369 160831 872116 1260262 655051 984383 2108042 1583901 1255121 1402919
10377 1402919 150682 -286174 -92168 797014 659934 477811 140331 -410647 -1165272
10368 -1165272 392004 51819 317853 -856975 -2374915 -2011423 -1429305 640546 24874
10359 24874 273217 52288 692633 179424 656061 127831 -1509490 -1601734 -1895128 -169017
10349 -169017 532445 2139896 1830423 1175845 -18619 254603 -304715 944000 766171
10340 766171 -1310183 -1753288 -1858543 -530161 -482709 -296360 -1112404 205488 828830
10331 828830 1378416 1691862 784311 -273 -1638088 -836998 -251089 1079000 1498413
10322A498413m51076Q71634J31990o7628r64268O97698k277299j984003K006182
10313e38357L200944n53206j193171N00893J20897k03352O52639Q53640l377070
10304e36143p65508J151303N57364O37778J71847Q40114R8826m8122P22491r41518
10294A888432j282938m69308n97604Q63485J74229M47262J069856m135m85980
10285A603299l5307j207403k7762P36112Q02039n74405R31034j364247q42209
10276B1151O39040J136927n31824o38116J281293j532244p90165L06325N46333
10267D38720k329825J121432J408428P0149O16372K82465m0851j021296k68605
10258B76989P54749j7921P53374j022840L13433n37471j84142j664620j036146
$$ plain form
10322 1498413 1047337 1918971 2050961 1983333 1019065 1716763 -560536 -2544539 -538357
10313 -538357 2662587 2109381 916210 1417103 1538000 1334648 1987287 2840927 -536143
10304 -536143 -1301651 -150348 407016 1044794 1216641 2056755 2155581 2107459 2829950 1888432
10294 1888432 605494 136186 -461418 402067 576296 1023558 2093414 2089279 1603299
10285 1603299 1567992 360589 332827 1068939 1870978 1296573 2227607 863360 21151
10276 21151 660191 1797118 1265294 627178 1908471 376227 -413938 -107613 438720
10267 438720 -1891105 -769673 638755 708904 1325276 1607741 1566890 545594 276989
10258 276989 1031738 1013817 1767191 744351 1057784 520313 336171 -1328449 -2364595
10249b364595n18385J513352J455110P97148J69159n71168L7361j273096p62229
10240a517343J25230J945105O5063m38243j246929J33866M24972J96640J025264
10231G13625j269683l59851J091317J84879m64142l57056r93300n85196J803908
10222b35499J253073l91461J25419L94104p61026o76842n81909J202258K4015
10213C52132n46426p4840j85793N9882N45928Q13111M36735k64200J72155Q12798
10203B121482R54972q84522N64808j158928n25938o02795Q07342m90547j125006
10194c39132L28583P62833K89014K59550L11005o23600k152581M89117J028415
10185C53204j61713J075275J16013K16307q31202J477703k26074j905590j107363
$$ plain form
10249 -2364595 -2882980 -1369628 85482 882630 1051789 480621 517982 -755114 -1517343
10240 -1517343 -1392113 552992 618055 179812 -1067117 -933251 -508279 -311639 713625
10231 713625 -556058 -915909 175408 360287 -103855 -460911 -1454211 -2039407 -235499
10222 -235499 1017574 626113 751532 1145636 384610 -292232 -874141 328117 352132
10213 352132 -194294 -269134 -454927 -395045 150883 963994 1400729 1136529 1308684 2121482
10203 2121482 3076454 2191932 2756740 1597812 1071874 469079 1276421 785874 -339132
10194 -339132 -10549 752284 1041298 1300848 1611853 988253 -1164328 -675211 353204
10185 353204 191491 1266766 1382779 1599086 767884 2245587 2019513 113923 -993440
10176i93440n52741m5208R80830Q98171q00612J01707M84683Q65957J27244o98841
10166C67750L89902j852580K73704P00183n80767j051320J180741J521770J68135
10157A117518k442113o83374N86971l26629Q00802j3543j99204O3494O84668o2507
10147d73917N28420R17157N50576j70835j124752L41407n17618j371326K72008
10138a048880M74726L57521J190639L14527J075135j115676j46744p02916n87593
10129a89261m84788m60047J410837O30175L61416j407603J81673O52006J281951
10120A976359J03470j410159k79283M00323K36172j44583j3373J227353K0716
10111B116995L2748P31572n84087n00366j708403r5181J024832M66502r22558
$$ plain form
10176 -993440 -1546181 -1591389 -610559 287612 -513000 -411293 73390 939347 1066591 367750
10166 367750 757652 -1094928 -821224 -121041 -701808 -1753128 -572387 949383 1117518
10157 1117518 -1324595 -2007969 -1420998 -1747627 -946825 -960368 -1159572 -1096078 -411410 -473917
10147 -473917 54503 971660 1522236 1351401 226649 568056 50438 -1320888 -1048880
10138 -1048880 -574154 -216633 974006 1288533 2363668 1247992 1101248 398332 -189261
10129 -189261 -674049 -1134096 276741 906916 1268332 -139271 42402 694408 1976359
10120 1976359 2079829 669670 390387 790710 1026882 882299 868926 2096279 2116995
10111 2116995 2149743 2881315 2297228 1796862 88459 -6722 1018110 1484612 562054
10102E62054q66536J502760o37812J43002q50722R91103K49937K18179O77555
10093A989520o18480J226316o23578r42290M33989O18603n95012j594444O16935
10084E11559J126993n71633m23899P63533J188216Q85664j000013o68754o22862
10075A188804p07116p0618o03765J380785J032402k41511j34853r62942O23369
10066A504555P41583j203882L37025J28659n90813o85059L36554p105m25740m33489
10056b97712k9770r50662R41104K050598R352r19598M90150m48656n64318J616228
10046A896716Q90590j362984j636554k77814J108144J035093j023860m8410j02609
10037D78312L45592M12291q33907J256377j195674m27244J187759p18226O10139
$$ plain form
10102 562054 -304482 1198278 560466 703468 -147254 843849 1093786 1311965 1989520
10093 1989520 1371040 2597356 1973778 1031488 1465477 2084080 1489068 -105376 511559
10084 511559 1638552 1066919 643020 1406553 2594769 3480433 2480420 1811666 1188804
10075 1188804 481688 411070 -192695 1188090 2220492 1978981 1844128 881186 1504555
10066 1504555 2246138 1042256 1379281 1507940 917127 232068 568622 561517 135777 -297712
10056 -297712 -327482 -1278144 -337040 1713558 1722910 803312 1293462 844806 280488 1896716
10046 1896716 2787306 1424322 -212232 -490046 618098 1653191 629331 580921 478312
10037 478312 823904 1236195 402288 1658665 462991 35747 1223506 505280 1115419
10028A115419Q2539J555475j420259j76483L80855j109622l51736Q11034M157
10019H91379r19391J892421J341649o76146m45856J332728K3268k296061m97429
10010F46562L43381q79455P28243j07556j015632K78501O34558j79856l35628
10001A13118J94284k6276O88416Q14805n90178K11383L43168K39030j61950K28657
9991B054457o18428n00815M26599l63466j110052L66071K063532m52602l55304
9982A509992O99457p15041j93111J477800j661139j415245m64313J868552M34671
9973A541623j019428P65094J84170o19061L34039P42423q6166M19497M3920p48330
9963A557781n25414N64509j745041M60401O79588J37129j071516J041496J217038
$$ plain form
10028 1115419 1197958 2753433 1333174 1156691 1537546 427924 76188 887222 891379
10019 891379 -28012 1864409 3206058 2529912 2084056 3416784 3440052 1143991 646562
10010 646562 989943 110488 838731 731175 -284457 -5956 628602 448746 113118
10001 113118 307402 281126 969542 1784347 1194169 1405552 1748720 1987750 1825800 2054457
9991 2054457 1436029 935214 1361813 998347 -111705 254366 2317898 1865296 1509992
9982 1509992 2209449 1494408 1301297 2779097 1117958 -297287 -761600 1106952 1541623
9973 1541623 522195 1287289 1471459 852398 1186437 1928860 1842694 2262191 2306111 1557781
9963 1557781 1032367 1596876 -148165 312236 991824 1128953 57437 1098933 2315971
9954B315971j124528k59019O33925P34444j682073j32807J296477K21400L83442
9945B387232q60551j25276K28490m32775l38382j003599M64992k6925M13729n19054
9935A87881q4564L2794j514696J471755M43794L27965r05227k16713M99748L83268
9925F26005O79366j535513J95549q56367J419378J010655k4263M97863j347898
9916F64775j546361N32555R29389J81018o16559J11901J288928n54925Q99946
9907A890667j041n70119m35519l14884L4658m5401R03361n36115q38520l78869
9897b91782J133159O39545J429262j33060k82402N95073J140834r24374p67342
9888B538913k88274q17447O93280M308K24081j37850q64627n99787L75482N00010
$$ plain form
9954 2315971 1191443 932424 1566349 2300793 618720 485913 1782390 2003790 2387232
9945 2387232 1526681 1401405 1629895 1197120 858738 -144861 320131 293206 706935 187881
9935 187881 103317 136111 -1378585 93170 536964 864929 -40298 -257011 242737 626005
9925 626005 1305371 -230142 -34593 -890960 528418 1539073 1514810 2012673 664775
9916 664775 -881586 -349031 580358 761376 144817 256718 1545646 990721 1890667
9907 1890667 1889626 1319507 883988 569104 603762 558361 1461722 925607 87087 -291782
9897 -291782 841377 1480922 2910184 2777124 2494722 3089795 4230629 3306255 2538913
9888 2538913 2250639 1433192 2126472 2130780 2354861 2217011 1352384 752597 1128079 1628089
9878A628089R01406j32244K71540M99615N00301O67792L17434j339296l61228
9869B953409j69587j007040k55876J15815L59105L8124l42102L47147O06563K77821
9859B923379J40579J101178j340833k62801P19331j187873l99522k88863L7618
9850A442193o49978k68988J120237J71944L78096m09069M37411O91001K40334
9841C153181J07706j065884L37964L38506L05797P77981l74814j057956j261091
9832A261390O02403N44130o47324n44240l12009Q54275Q18647K32098l65721J1435
9822B455084O27724m40851j099156J252086N3269j388567Q10318M92623n82631
9813B179899O86883N58441P01250K81744L26602l17068l42295P32863n66349q94409
$$ plain form
9878 1628089 2529495 2397251 2668791 3168406 3668707 4336499 4653933 3314637 2953409
9869 2953409 2783822 1776782 1520906 1636721 1995826 2033950 1691848 2038995 2645558 2923379
9859 2923379 3063958 4165136 2824303 2561502 3280833 2092960 1693438 1404575 1442193
9850 1442193 792215 523227 1643464 1815408 2193504 1784435 2221846 2912847 3153181
9841 3153181 3260887 2195003 2532967 2871473 3177270 3955251 3580437 2522481 1261390
9832 1261390 1863793 2407923 1760599 1216359 904350 1758625 2577272 2809370 2443649 2455084
9822 2455084 3082808 2641957 1542801 2794887 2848156 1459589 2269907 2762530 2179899
9813 2179899 2866782 3425223 4126473 4408217 4734819 4417751 4075456 4808319 4241970 3347561
9803C347561L10746l24999L26918M47468J39383j333375L01533K60338o127R50881
9793D420327j403q23323k97261J212832m294K18351p62622J171680J041017N93443
9783F768747n90454j217275J100796j257075o06861N91514J330681J637341j308177
9774F449237o87327J217642J472489j931677k81731J142621j002390j081894J11976
9765E408946J031294K57947L74022J130085p20674M09756J912823J14711M39029
9756A0357939J49754j680219o04893K704898R31907n01517o99331l96942L60765
9747A0622361m13335J505995P95083q91760O12474O53145J216377J79511P01317
9738A4981168n20062O31751Q87091N34073P90508P24813J125698J229351J817527
$$ plain form
9803 3347561 3658307 3333308 3660226 4107694 4247077 2913702 3215235 3475573 3469446 4420327
9793 4420327 4418924 3595601 3298340 4511172 4506878 4725229 3962607 5134287 6175304 6768747
9783 6768747 6178293 4961018 6061814 4804739 4197878 4789392 6120073 7757414 6449237
9774 6449237 5761910 6979552 8452041 6520364 6238633 7381254 6378864 5296970 5408946
9765 5408946 6440240 6698187 7072209 8202294 7481620 7891376 9804199 9918910 10357939
9756 10357939 10507693 8827474 8222581 10927479 11859386 11357869 10658538 10261596 10622361
9747 10622361 10209026 11715021 12510104 11618344 12230818 12883963 14100340 14279851 14981168
9738 14981168 14461106 15092857 15979948 16514021 17304529 18029342 19155040 20384391 22201918
9729B2201918Q32546J305110K765416J019824J140878M963709M109066M205262
9721D2543729O592900J1347360J4392076J3841475J7096300J7623778J7222605
9714A40660223K3364596K4402207J9315696J0487132K016214J173930J953898
9707B23373896l926779r984106j5887141j8275576j6337707j6074579j7482587
9700A25405421j9592218j6797222j2457764r657425p770143o005530l233751p28352
9692D9163016L58146l36495m45132K353151K884192L501649O518545R667415J3704201
9683H7368688J6031980J9766351J6613048J9383848K3254850K3851125K1866771
9676B28136661J1883331M748934J469138q3613o369020j3571094j8784599j9885297
$$ plain form
9729 22201918 23034464 24339574 27104990 28124814 29265692 34229401 38338467 42543729
9721 42543729 49136629 60483989 74876065 88717540 105813840 123437618 140660223
9714 140660223 164024819 188427026 207742722 218229854 220246068 221419998 223373896
9707 223373896 219447117 209463011 193575870 175300294 158962587 142888008 125405421
9700 125405421 105813203 89015981 76558217 66900792 59130649 53125119 49891368 49163016
9692 49163016 49521162 49184667 48739535 51092686 53976878 57478527 63997072 73664487 87368688
9683 87368688 103400668 123167019 139780067 159163915 182418765 206269890 228136661
9676 228136661 240019992 244768926 246238064 246154451 239785431 226214337 207429738 187544441
9668A87544441j8754055j8688642k0633549k2191258j9936775j5643430j2338277
9661E9358455r780130n779734n130249m133110j696899k932628j956774j153539
9653B6795392j614094j801863j268232j617080r88834j155176n2049l000519N7035
9644A5354580K96246q03077j634743j348761K13174q14175R40460o21006m16851
9635A1165847J364034J84964j329529o03668J51574K59626j179943J30488j686833
9626H456560j435348L60398k51213l53604j96558o61544m87240J899664K048457
9617I379572j80914k386648n15328J045765m02647j694326j947976J404653j91976
9608D510175m933M86852N62708K01409j105784n79654K51899o66539Q04940q67213
$$ plain form
9668 187544441 168790386 150101744 129468195 107276937 87340162 71696732 59358455
9661 59358455 49578325 43798591 38668342 34535232 32838333 29905705 27948931 26795392
9653 26795392 25181298 23379435 22111203 20494123 19505289 18350113 18298064 15297545 15354580
9644 15354580 15650826 14847749 13213006 11864245 12077419 11263244 12203704 11582698 11165847
9635 11165847 12529881 12714845 11385316 10781648 10933222 11192848 10012905 10143393 8456560
9626 8456560 7021212 7381610 7130397 6776793 6580235 5918691 5431451 7331115 9379572
9617 9379572 9198658 6812010 6296682 7342447 6939800 5245474 3297498 4702151 4510175
9608 4510175 4505242 4992094 5554802 5756211 4650427 4070773 4322672 3656133 4461073 3593860
9598C593860n17431N73417n19964Q60661k64035M79381m98559r3892M81569n97928
9588C497079p86547j056262M43241L27929j62858Q19550l78383l60474P23586
9579C066861p3944K0817j038751P40320j46365J22159o06286k75191J139788k34747
9569B714661r41255q77251O12176R6508J740086m87864O57972r86193K47679Q12579
9559C589098k144679P50634o27279m8696l64440J370935k1147j922900J677518
9550B259044O04796j051411p38034K072758O8847j158263J35560M12066o45549
9541A959814o45490m36672r62512O39681J737820L05504j69097O2808j68352j960675
9531C62829N58301J206259N34710q97567j475367N40870Q4070j63651k71189O19767
$$ plain form
9598 3593860 3076429 3649846 3129882 3990543 3726508 4205889 3707330 3613438 4095007 3497079
9588 3497079 2710532 1654270 2097511 2425440 2262582 3082132 2703749 2343275 3066861
9579 3066861 2992917 3013734 1974983 2715303 2568938 2691097 2084811 1809620 2949408 2714661
9569 2714661 1773406 896155 1508331 1604839 3344925 2857061 3515033 2528840 2776519 3589098
9559 3589098 1444419 2195053 1567774 1519078 1154638 2525573 2504426 581526 2259044
9550 2259044 2863840 1812429 1074395 3147153 3216000 2057737 2193297 2605363 1959814
9541 1959814 1314324 877652 -84860 554821 2292641 2598145 2429048 2491856 2323504 362829
9531 362829 921130 2127389 2662099 1764532 289165 830035 914105 750454 479265 1099032
9521A099032J33556o76637L26472K160750N91268m90610j284673p99719L85515
9512A444954N80363Q20294l88028N86143M88469j406074L84770J90704o54085
9503B047510p89837j450785J160535O34830j52234k17215P47069J158269j151781
9494A986361N06681J126225J468816o85938j617690L08514j19267j25839l71456
9485B476407P29010n61039O6414J82194J36310J692545r72234O5038j219542K59243
9475B854346K90847j324654N0660J13955R9082k36180O5903N94720O26023m46354
9465B688348j059284J311197L87142r50564r72751k67076J51768l28904J098886
9456B058762Q14315j390136l36207n32169O6812j73335K83263J236799n89002
$$ plain form
9521 1099032 1232588 555951 882423 3043173 3634441 3143831 1859158 1059439 1444954
9512 1444954 2025317 2845611 2457583 3043726 3532195 2126121 2510891 2701595 2047510
9503 2047510 1257673 -193112 967423 1602253 1450019 1232804 1979873 3138142 1986361
9494 1986361 2493042 3619267 5088083 4402145 2784455 3092969 2973702 2847863 2476407
9485 2476407 3205417 2644378 2710792 2892986 3029296 4721841 3749607 3814645 2595103 2854346
9475 2854346 3145193 1820539 1871199 1985154 2084236 1848056 1913959 2508679 3134702 2688348
9465 2688348 1629064 2940261 3327403 2376839 1404088 1137012 1288780 959876 2058762
9456 2058762 2873077 1482941 1146734 614565 681377 508042 791305 2028104 1439102
9447A439102J480181n70933m88607L60967O41130k000932j050480j33267J127405
9438H04566O01534j69083p5668K36871O59379M60985l35984L84358j441910r71328
9428A53720J104503J032889k67277j692672J566753j49518J30723k14587k340146
9419f75612R33173R8966K35652q34240J386828K287841r53810q15497r24395K146678
9409B885584K90287n94000j496940L79747j065963j57044J017801n83547m30672
9400B45253R63545K836679K05579m32687O42845q39833M76588O01834j514284
9391C185519j022738J71830l87024k108473p94133R32686O07346J139075q83745
9382H40343k28724N93555N29139M11837O89549q06374q05656O99002J837785j574176
$$ plain form
9447 1439102 2919283 2348350 1859743 2220710 2861840 860908 -189572 -322839 804566
9438 804566 1406100 1237017 1161349 1398220 2057599 2518584 2182600 2566958 1125048 153720
9428 153720 1258223 2291112 2023835 331163 1897916 1748398 1879121 1664534 -675612
9419 -675612 257561 356527 592179 -242061 1144767 3432608 2478798 1663301 738906 2885584
9409 2885584 3175871 2581871 1084931 1464678 398715 241671 1259472 675925 245253
9400 245253 1208798 4045477 4251056 3818369 4461214 3621381 4097969 4699803 3185519
9391 3185519 2162781 2334611 1947587 -160886 -955019 -22333 585013 1724088 840343
9382 840343 611619 1205174 1734313 2146150 2835699 2029325 1223669 1922671 3760456 2186280
9372B186280k50550J067197k55864j61570p29627o45082J92753J271568r20299
9363A754806p20715k84187J747076k28358o47776L76402l37488Q41096j54235
9354B346621r9665m31677K13646P29128J084180N80798k62427P08990j024751
9345C844843m07874j229794P27637j012049M20315J083934Q20847r91999j829642
9336A426218R6082n67372p21942J201286K000565m08963j91738O01557m69089
9327B966604q27364l1101R47011j067759r70059K001183J146712L12102p21843
9318C755486q11692J122968J061737r9236p81084J69802J6680n58564J027648
9309D903745O71562j45051p71851j34733O71907j71376o28578l37913j211188
$$ plain form
9372 2186280 1935730 3002927 2747063 2585493 1855866 1210784 1403537 2675105 1754806
9363 1754806 1034091 749904 2496980 2268622 1620846 1997248 1659760 2500856 2346621
9354 2346621 2246956 1815279 2028925 2758053 3842233 4423031 4160604 4869594 3844843
9345 3844843 3436969 2207175 2934812 1922763 2343078 3427012 4247859 3255860 1426218
9336 1426218 1522300 954928 232986 1434272 3434837 3025874 2834136 3435693 2966604
9327 2966604 2139240 2108139 3055150 1987391 1017332 3018515 4165227 4477329 3755486
9318 3755486 2943794 4066762 5128499 5029263 4248179 4417981 4434661 3876097 4903745
9309 4903745 5575307 5430256 4658405 4523672 5195579 5024203 4395625 4057712 2846524
9300B846524M55943j033813K52907J032201P53641N24084J12373L73276q19548
9291D497588q48124n7890n65178l55027Q81119Q30037j94792R61134l94640k67417
9281D486810o34500K90076Q12624k549N69819q79564j57905p30350J023635R22630
9271E700726J52962j063636n62650j39558j490240j15466J669596k12051p88284
9262C151399J66849J162788j20439O41063k83008J35019j17511J255082k95257
9253E695985j206901R88245K02471L01022j716070J053364J126461j387900q32704
9244D223973j70665m40989j33360K190437O09443o55168M88046Q49731q94561
9235F066887j025042J304528l98241l16888J270040K74305j737098K30884K085085
$$ plain form
9300 2846524 3302467 2268654 2521561 3553762 4307403 4831487 4943860 5317136 4497588
9291 4497588 3649464 3591574 3026396 2671369 3552488 4382525 4187733 5148867 4754227 4486810
9281 4486810 3852310 4142386 4955010 4952461 5522280 4642716 4484811 3754461 4778096 5700726
9271 5700726 5853688 4790052 4227402 4087844 2597604 2482138 4151734 3939683 3151399
9262 3151399 3318248 4481036 4360597 5001660 4718652 4853671 4736160 5991242 5695985
9253 5695985 4489084 5477329 5679800 5980822 4264752 5318116 6444577 5056677 4223973
9244 4223973 4053308 3612319 3478959 5669396 6278839 5623671 6111717 6961448 6066887
9235 6066887 5041845 6346373 5948132 5631244 6901284 7175589 5438491 5669375 7754460
9226G754460o02451j642844Q67714J150201m23979p6121P30449m97657j263649
9217E996123M47346J913610j96611j116040K82452P79107M88371Q5727J340259
9208A0020344K02751q33291n03351O91751J15233Q36834J467893r34821K90638
9199A1353981j49914K71037q80096n86780J586474J554q1912J221558o49219l93371
9189A1693312j69161J307996J206890k15631J494484o73088K46246J118281r70898
9180A5038431R822K173136K047360m07187M20091K85087N34802P59108J969150
9171B2829800L459986J039704P31342L611329K223221m6980K64149R66678J59668
9162C5238897p77747M22041J146404J32766J23905J296299P39078L231241L848959
$$ plain form
9226 7754460 7152009 5509165 6376879 7527080 7103101 7026980 7757429 7259772 5996123
9217 5996123 6443469 8357079 8160468 7044428 7326880 8105987 8594358 8680085 10020344
9208 10020344 10223095 9389804 8886453 9578204 9693437 10530271 11998164 11063343 11353981
9199 11353981 11204067 11475104 10595008 10008228 11594702 11596256 11514344 12735902 12086683 11693312
9189 11693312 11524151 12832147 14039037 13823406 15317890 14644802 14891048 16009329 15038431
9180 15038431 15048253 17221389 19268749 18861562 19281653 19566740 20101542 20860650 22829800
9171 22829800 26289786 27329490 28060832 31672161 33895382 33848402 34112551 35079229 35238897
9162 35238897 34461150 34883191 36029595 36162361 36286266 37582565 38321643 41552884 45401843
9153D5401843N190116N925490N363075R813416J6006879K2880194L0431893L8942437
9145A79955343L9282101K5347667J5660216J2977807Q885499K025277j4398283
9138B69735627k9059287l4395035k5112604j5544275q014822J516442O474821
9131A65600867R918793J0656065R638715L463160j603776j714939r14729J281038
9123A96325194N916882N811538r25861p919819q039982k356418L11945l591281
9115A85532198j1005168j5252491j5604372j1889784q840224r101064p572749
9108A06266346l493193j126750l923801o228353q674135q025224r857095p055161
9100E7882634m480144l048908k830372j964145j435701r05777j111308j7195N55743
$$ plain form
9153 45401843 50591959 56517449 61880524 71693940 87700819 110581013 141012906 179955343
9145 179955343 219237444 244585111 260245327 273223134 282108633 284133910 269735627
9138 269735627 240676340 206281305 181168701 165624426 157609604 159126046 165600867
9131 165600867 175519660 186175725 195814440 199277600 197673824 195958885 195044156 196325194
9123 196325194 202242076 208053614 207127753 199207934 191167952 188811534 189123479 185532198
9115 185532198 174527030 159274539 143670167 131780383 122940159 113839095 106266346
9108 106266346 102773153 101646403 97722602 91494249 82820114 74794890 64937795 57882634
9100 57882634 53402490 50353582 47523210 45559065 44123364 43217587 42106279 42089084 42644827
9091D2644827r24735p28028J130860K284206J828199N663798O264379O032335
9083F4195841O598303R733800R787695O074439L454993K408453J685470P727408
9075A11666402R932058M710663k621960o500803o742459k192757r6354n286278
9067A02868512j1673615j0496700r807098r615621n392886k884318l134715k418845
9059D7444714j879181j363677j519014J49351N34224r50450J752n70943J90900
9050D2037676K030262K524532K980831Q406837R476956J3782333J7739703J3027653
9042A12006783N536122k207483k110944J582013L712238J619359q208118j3810993
9034I8118977j4531160j2115246r271786q655789n549944l277196k327940k264149
$$ plain form
9091 42644827 41720092 40992064 42122924 44407130 46235329 51899127 58163506 64195841
9083 64195841 70794144 80527944 90315639 96390078 99845071 102253524 103938994 111666402
9075 111666402 121598460 126309123 123687163 117186360 110443901 108251144 108154790 102868512
9067 102868512 91194897 80698197 70891099 61275478 55882592 52998274 49863559 47444714
9059 47444714 45565533 44201856 42682842 42832193 43366417 42415967 42417719 41846776 42037676
9050 42037676 44067938 46592470 49573301 57980138 67457094 81239427 98979130 112006783
9042 112006783 117542905 115335422 113224478 114806491 118518729 120138088 111929970 98118977
9034 98118977 83587817 71472571 62200785 53544996 47995052 44717856 42389916 40125767
9026D0125767j991760j735391j911906J46349j844932j973651j169560o73682
9018B8971234j306519j045971R12887j876514n26733l61606j270396j18681J612225
9009B4989926K386715k440112J887858Q63369n64116N73804R30923K151389J79148
9000C0958904K670192K148571n3689J347189P95440M497331K457400K995042N633654
8991E3450034Q635457J1166974J2767304J5553659J4628257J6298798J7365275
8984A49865758J6736892J3565803P878013L254585n355090q300507j2328537j7927808
8976A47389109j9677590k0411356j5797270j2655221p745277m754984l520102
8969F2827309l338670k288009o0745L14389p02199R36731J218220L404169K460906
$$ plain form
9026 40125767 38134007 36398616 34486710 34633059 32788127 30814476 29644916 28971234
9018 28971234 27664715 26618744 27531631 25655117 25128384 24766778 23496382 23377701 24989926
9009 24989926 27376641 24936529 26824387 27687756 27123640 27697444 28628367 30779756 30958904
9000 30958904 33629096 35777667 35723978 37071167 37866607 42363938 44821338 47816380 53450034
8991 53450034 62085491 73252465 86019769 101573428 116201685 132500483 149865758
8984 149865758 166602650 180168453 188046466 191301051 185945961 177645454 165316917 147389109
8976 147389109 127711519 107300163 91502893 78847672 71102395 66347411 62827309
8969 62827309 59488639 57200630 57139885 57454274 56752075 57688806 58907026 62311195 64772101
8960F4772101L987922O451417J0847461J4113144J6921818J5946075J2818656
8953A45858594J3141240J4182573J6566343J7154109R866560L350760J696103
8946B21816282N132038O462535K383876l147738o465712j1444144j6285713j7857012
8938A80594412j7643393j4927151q282523k533748M840299N810886P651591Q198810
8930A63709183J1769096K3968768N5466590Q8376416J08038416O4167356j7393760
8923D98102065o6571849p3012374m2646602k2105368j1195211r580455j2581417
8916B60408789j3296927r486809r511641j1760699j2886285p730971n946233q937717
8908A80851507j0644409j0656709j2367648j4338080j5029888j3032209j0895873
$$ plain form
8960 64772101 68760023 75211440 86058901 100172045 117093863 133039938 145858594
8953 145858594 158999834 173182407 189748750 206902859 216769419 220120179 221816282
8946 221816282 226948320 233410855 235794731 232646993 226181281 214737137 198451424 180594412
8938 180594412 162951019 148023868 139741345 137207597 142047896 147858782 155510373 163709183
8930 163709183 175478279 199447047 254913637 343290053 451328469 515495825 498102065
8923 498102065 431530216 358517842 315871240 293765872 282570661 272990206 260408789
8916 260408789 247111862 237625053 228113412 216352713 203466428 195735457 189789224 180851507
8908 180851507 170207098 159550389 147182741 132844661 117814773 104782564 93886691
8901I3886691p896277l248557n4993J828426M564109O16323k265374m167837o216955
8892G7045556p837751o315917l270601j608943J111007M625318Q627421J2854103
8884H5230193J4377015J0963540K212489n890401p097364n177197l940803o861818
8876H3815654j1609443r972820r588838p183860n394612m476779m168804k851708
8868B8568790k459963j304422j371924j386399m50693j009584j76694q70274l15367
8859A9223470k6389o16936P7823k167376j802866j358080J95348j66223j444026
8850A1914745p9133r61373l18435m83301L84906j088821o19312k97262R44433
8841I396447k25822p30007K91213q52097K26803l15524Q65773R93489r07086p31810
$$ plain form
8901 93886691 85990414 82741857 82686864 84515290 89079399 89695722 87430348 83262511 77045556
8892 77045556 69207805 62891888 59621287 58012344 59123351 63748669 72376090 85230193
8884 85230193 99607208 110570748 112783237 106892836 99795472 94618275 90677472 83815654
8876 83815654 72206211 62233391 52644553 45460693 40066081 35589302 31420498 28568790
8868 28568790 26108827 24804405 23432481 22046082 21595389 20585805 20409111 19538837 19223470
8859 19223470 19197081 18580145 18657968 16490592 14687726 13329646 13524994 13358771 11914745
8850 11914745 11835612 10874239 10555804 10072503 10457409 9368588 8749276 8452014 9396447
8841 9396447 9170625 8440618 8731831 7879734 8106537 7791013 8656786 9650275 8743189 8011379
8831H011379q81181r5368r93011L92800j81289J78238J49580Q88945j826590j373313
8821D270190J769426m15253K26470j444396J238048L288R03196J518518o71024
8812G398463o87896j292475J473965j07332M13082k332789j099568N51115J556678
8803E873243J082496o57341m87240R6563K40546j518563j092020R3697j353482
8794B277899O29076J172497J628991n80660j178399J505151p57648p48517l40222
8785C608168o05167J03539m17691m6047N47215k15695n19408K8375O70021j14701
8775C038609m15551j218102O63474M01992R86184m51482l93647K32720O83960
8766C528157j060969J144595R38475j613525k321776K038106R16221k115720N53470
$$ plain form
8831 8011379 7130198 7034830 6041819 6434619 6253330 6431568 6581148 7470093 5643503 4270190
8821 4270190 6039616 5624363 5850833 4406437 5644485 5647773 6550969 8069487 7398463
8812 7398463 6710567 5418092 6892057 6784725 7197807 4865018 3765450 4316565 5873243
8803 5873243 6955739 6298398 5811158 5907721 6148267 4629704 3537684 3631381 2277899
8794 2277899 2906975 4079472 5708463 5127803 3949404 5454555 4696907 3948390 3608168
8785 3608168 3003001 3106540 2688849 2642802 3190017 2974322 2454914 2483289 3153310 3038609
8775 3038609 2623058 1404956 2068430 2470422 3456606 3005124 2611477 2844197 3528157
8766 3528157 2467188 3611783 4550258 2936733 614957 2653063 3569284 1453564 2007034
8757B007034N80595Q63635j725925J097032q28891j93332O8535n01031K51230
8748A618882l36495R69012n08178K04397L54643R3543r33137k44137Q71073Q01186
8738B890789j317531j560659J190037J457K52548J061929P42625j605511l5283
8729A620401o08894l38495r25785J46030O31347m85430J337424j073249Q01151
8720A104500Q05297j012248k81136j377669L69446L11765R18722N7478q66455
8711B9700m75038J203748r05337Q05858Q79455K21412K81308m65029R40517N23917
8701C040511j97487j452097j219369j649892J564920l75868Q38679j866216K36971
8692a079848P80335L29397J399843j532502P15281L39897L2869j361241m46367
$$ plain form
8757 2007034 2587629 3451264 1725339 2822371 1993480 1800148 1868683 1367652 1618882
8748 1618882 1282387 2251399 1743221 1947618 2302261 2395804 1462667 1218530 2089603 2890789
8738 2890789 1573258 12599 1202636 1204093 1456641 2518570 3261195 1655684 1620401
8729 1620401 1011507 673012 -252773 -106743 524604 39174 1376598 303349 1104500
8720 1104500 1909797 897549 616413 -761256 -391810 -80045 838677 896155 29700
8711 29700 -445338 758410 -146927 658931 1538386 1759798 2041106 1576077 2516594 3040511
8701 3040511 2843024 1390927 171558 -1478334 86586 -289282 549397 -1316819 -1079848
8692 -1079848 -299513 29884 1429727 -102775 612506 952403 985272 -375969 -822336
8683h22336N03337j148244j90387J36988J149307J193014k11684O23096Q01629
8674B034720L65328n58906p49387K74819n3815n25099k10O0164J146171J97361
8664B191146j908779r71290K15245j198035j160615P85185J238427j40321n00696
8655a449733J899625N09749p00386j347093L84463L04159P05050M49000o87304
8646F7530n72673J416096n49964l40562k98602J415904p71180l99335J596147
8637A563361r97729M22311j001390J173512n64147J78077j726839K49465K44307
8628d59072q37890l39866L52767J020135m86611J441792L96954K27627M46480
8619A762316K20699q52934k11776N16854k91074j459113j05339J059726J48443
$$ plain form
8683 -822336 -318999 -1467243 -1657630 -1520642 -371335 821679 609995 1233091 2034720
8674 2034720 2400048 1841142 1091755 1366574 1312759 787660 787450 847614 1993785 2191146
8664 2191146 282367 -688923 -473678 -1671713 -2832328 -2047143 -808716 -949037 -1449733
8655 -1449733 449892 959641 259255 -1087838 -703375 -399216 305834 754834 67530
8646 67530 -505143 910953 360989 20427 -278175 1137729 366549 -32786 1563361
8637 1563361 565632 987943 -13447 1160065 595918 773995 -952844 -703379 -459072
8628 -459072 -1296962 -1636828 -1284061 -263926 -750537 691255 1088209 1315836 1762316
8619 1762316 1983015 1130081 918305 1435159 1144085 -315028 -420367 639359 787802
8610G87802o73908J172092R10482j107008m66730N39645P50526j325626j477486
8601h90211O54382o97028J39615m75643N40561L53578M0603O88017n38141O40854
8591D56587J96715l37059m83818K97786J245162J855462o35588l95136m71840
8582A728271q34875o67281L21322o65919o09311p35598J374195L32994q57785
8573f13987R03302L98292K49463l62623N7419j814249k47406O44215J98182r71064
8563a558456o6813J478946m62341l8272K37199m64713r30050J125878J515043
8554H36421O31194n93395J460547k60033o74397L84514L59616j524904j078439
8545d58876M89955j74873j008889n63862K436700j337960m19066N60617M43753
$$ plain form
8610 787802 113894 1285986 2196468 1089460 622730 1162375 1912901 587275 -890211
8601 -890211 -235829 -932857 -793242 -1268885 -728324 -374746 -334143 353874 -184267 456587
8591 456587 653302 316243 -167575 130211 1375373 3230835 2595247 2200111 1728271
8582 1728271 893396 226115 547437 -118482 -727793 -1463391 -89196 243798 -613987
8573 -613987 289315 687607 937070 574447 631866 -1182383 -1429789 -785574 -587392 -1558456
8563 -1558456 -1625269 -146323 -608664 -646936 -409737 -874450 -1804500 -678622 836421
8554 836421 1467615 874220 2334767 2074734 1400337 1784851 2144467 619563 -458876
8545 -458876 31079 -143794 -1152683 -1716545 720155 -617805 -1036871 -476254 -32501
8536c2501k3344p24363R63097n94946L13264J418760N84050j132517J96280Q86871
8526A854651j168752j64418q0879K54153j714062Q20503N0765q8116J177884K96588
8516A238317M60085q71338n87893K8725J40354p93079q2940O30730o30004p04010
8506a171053K136929J53358p62326J94797J2915n21992l91495J553498J6931j254445
8496c2883J127153p9762j44693J096634Q31144j530503j326563M542j708231R02985
8486h60177K33482l17174K50520K21408P82931L69469l20334n12710K23002K89722
8476C60139J089980P0299o83475p64252j079048J659573N65560r59016n80541
8467c20781l028K6121O53276K31340j132964L71837P50626o91136n50877P57542
$$ plain form
8536 -32501 -55845 -780208 182889 -412057 -98793 1319967 1904017 771500 967780 1854651
8526 1854651 685899 521481 440602 694755 -1019307 -198804 -148039 -236155 941729 1238317
8516 1238317 1698402 827064 239171 267896 408250 -384829 -467769 162961 -467043 -1171053
8506 -1171053 965876 1119234 356908 551705 564620 42628 -348867 1204631 1221562 -32883
8496 -32883 1094270 1014508 869815 1966449 2797593 1267090 -59473 -54931 -1763162 -860177
8486 -860177 -626695 -943869 -693349 -471941 310990 680459 360125 -152585 70417 360139
8476 360139 1450119 1520418 836943 72691 -1006357 653216 1218776 259760 -320781
8467 -320781 -323809 -297688 355588 586928 -546036 -174199 576427 -114709 -665586 91956
8457I1956O90677j038948j046071j06956k1318Q05988J092537R51797J95092M0520
8447A655274J316713r247p86959j022375m73092Q01115j203330J5490K05137p1634
8437D27092r29827k04599j35000p01396P89501J115807k46645m37639j193201
8428a515907L04332O70042m68856L93244r74009M68928J328877n45418o83029
8419a021796N29655L46519J693014j483127J097095J089735p47155l05869j496553
8410b98482k00010o83156j85823J562009j214584m00342R80257M48644L59330
8401C67843j496275n29363O38747Q94067R90985k96663l8354K15315q73228Q4646
8391d2280j076479k32624l6611J71600J79177J40515R58309J027205J52913L67012
$$ plain form
8457 91956 782633 -256315 -1302386 -1409342 -1430660 -624672 467865 1419662 1614754 1655274
8447 1655274 2971987 2962740 2175781 1153406 680314 1481429 278099 293589 498726 427092
8437 427092 -502735 -707334 -842334 -1543730 -754229 361578 114933 -322706 -1515907
8428 -1515907 -1211575 -541533 -1010389 -617145 -1591154 -1122226 206651 -338767 -1021796
8419 -1021796 -492141 -145622 1547392 64265 1161360 2251095 1503940 1198071 -298482
8410 -298482 -498492 -1181648 -1367471 194538 -1020046 -1420388 -440131 8513 367843
8401 367843 -1128432 -1657795 -1019048 -124981 866004 569341 530987 746302 -126926 -42280
8391 -42280 -1118759 -1351383 -1387994 -1216394 -1037217 -896702 61607 1088812 1241725 1608737
8381A608737q94243L97126R73830j54946j078230j608999L21521m15447J56562
8372f94089K68134l43437q65193J317584K00209r75445N2976J129978K92934N60076
8362I43727M28201q18137p17891K39610n42705k030423R0065K9891N45091J093572
8352g38999L36173Q03950O59104m83402N74029R07844J86832p17945m79138m91931
8342E56517N73321p7619n2974j693842k57253l89856j047998P37369P06928p19898
8332a665305k57197K270739K59354j348588M91640q78654l9981J956926J27721
8323I16655j431113j11059J229570J02490m14321O4656n52647o40582J8806J354243
8313E36698j06435j201382j39098J82134K483753J69138j245962q18427j55392
$$ plain form
8381 1608737 714494 1111620 2085450 1930504 852274 -756725 -435204 -850651 -694089
8372 -694089 -425955 -769392 -1634585 -317001 -116792 -1092237 -1039261 90717 383651 943727
8362 943727 1371928 553791 -164100 75510 -467195 -2497618 -2407553 -2377662 -1832571 -738999
8352 -738999 -402826 401124 1060228 576826 1150855 2058699 2245531 1527586 1048448 556517
8342 556517 1129838 1052219 999245 -694597 -951850 -1341706 -2389704 -1652335 -945407 -1665305
8332 -1665305 -1922502 348237 607591 -740997 -249357 -1128011 -1167992 788934 916655
8323 916655 -514458 -625517 604053 706543 292222 356878 -195769 -836351 -817545 536698
8313 536698 430263 -771119 -910217 -728083 1755670 1924808 678846 -139581 -294973
8304b94973N09984L9574m50595j87237k3103j075813J173206N40775o87263j26172
8294e81617j142513O83298o53546P79955n0725N06533N49451j546122Q29820J710539
8284A085073M65025j339772j167165m12268O55512J079426J151210K30670Q34971
8275B582682P72623k254470j215066K23403J811089j837069j420593l49027q13073
8266b499501M53560J024232M36573r97412N43953J578083J130752n90255r30869
8257A49116l61018N14641N12964j131420L40928J613576N56802j164910j030288
8248C91P3355K31491J342335J224034m4393k004253n19519N27976J18470M80360
8238A430247k2554n62245L88558k097858J425291l8328j31478j250872j223752
$$ plain form
8304 -294973 215011 254585 -196010 -383247 -406350 -1482163 -308957 231818 -455445 -581617
8294 -581617 -1724130 -1040832 -1694378 -914423 -965148 -458615 90836 -1455286 -625466 1085073
8284 1085073 1550098 210326 -956839 -1369107 -713595 365831 1517041 1747711 2582682
8275 2582682 3355305 1100835 -114231 109172 1920261 83192 -1337401 -1686428 -2499501
8266 -2499501 -2045941 -1021709 -585136 -1582548 -1038595 539488 1670240 1079985 149116
8257 149116 -211902 302739 815703 -315717 25211 1638787 2195589 1030679 391
8248 391 73746 305237 1647572 2871606 2827213 822960 303441 831417 949887 1430247
8238 1430247 1407693 845448 1234006 -863852 561439 523111 391633 -859239 -2082991
8229b082991L6603O60867J182399K437103j060430m58817J548057j249726K99032
8220A312097r7940k09241j941285n74299J826361J018377J261932l05145r50495
8211A340362l43233j049352j09087L75078Q32274k653823l81133J285581K329775
8202A626442J75941M51375j951475k844855P21553L36649m58159J73976k077770
8193c846323J231519J767564K836393K65295k060752N19749k159j008747n78395
8184h75856K349299l75176M88878j158221j490390r6069M24117J250734k928232
8175b410916l93857N99689J98613K395457r85971M63747j268151r59855J338566
8166a022678r4948R34818J36114J24797j062608m19139J461530J432525J20975
$$ plain form
8229 -2082991 -2046388 -1385521 -203122 2233981 1173551 714734 2262791 1013065 1312097
8220 1312097 1214157 1004916 -936369 -1510668 315693 1334070 2596002 2290857 1340362
8211 1340362 997129 -52223 -161310 213768 1046042 -1607781 -1988914 -703333 1626442
8202 1626442 1802383 2253758 302283 -2542572 -1821019 -1484370 -1942529 -1768553 -3846323
8193 -3846323 -2614804 -847240 1989153 2254448 193696 713445 711286 -297461 -875856
8184 -875856 1473443 1098267 1587145 428924 -1061466 -1157535 -733418 517316 -2410916
8175 -2410916 -2804773 -2205084 -2006471 388986 -596985 -133238 -1401389 -2361244 -1022678
8166 -1022678 -1117626 -182808 -46694 78103 -984505 -1403644 57886 1490411 1611386
8157A611386j431955M95826o27194P11514J459117k315455j941000p11081J414948
8148a333894r78910J358893J110851j203485J872325o87012R84376j007287P12917
8139H28774Q03783j623957J406111j433147J216927J07336r10583p29233j476750
8130a810739J529548q96905O78386o0697R53916k57207q426J94606M63311o5851
8120G19942l97205O07284n42822j109227j54752q49165p84294n3255J494842O72577
8110c96075J834469P55662l2343P20809k136589o98822N22282K09494R6037k20277
8100F54647j614427k47854k39346P04173r06569n7125P09184k96733l90676K389223
8090G04497R19902L81927q67936j71097J716753O10500j475200k012242o62059
$$ plain form
8157 1611386 179431 675257 48063 759577 2218694 -96761 -2037761 -2748842 -1333894
8148 -1333894 -2312804 -953911 156940 -1046545 825780 138768 1123144 115857 828774
8139 828774 1632557 8600 1414711 -18436 1198491 1305827 395244 -333989 -1810739
8130 -1810739 -281191 -1178096 -499710 -560407 393509 136302 127876 322482 785793 719942
8120 719942 322737 930021 387199 -722028 -876780 -1725945 -2510239 -2563494 -1068652 -396075
8110 -396075 1438394 2194056 2161713 2882522 745933 47111 569393 778887 874924 654647
8100 654647 -959780 -1207634 -1446980 -742807 -1649376 -1706501 -997317 -1294050 -1684726 704497
8090 704497 1624399 2006326 1138390 967293 2684046 3294546 1819346 -192896 -854955
8081h54955j539346m85166Q97981J2154J049350K142470j55420n9113J039746
8072B047701j400279k320080J468778J045849j316491q29282J783554J94006o89750
8063a5994K17089P47177j699154k124018J520053N80427m85524J442501J84848
8054C67405p40965j83315n71658J604368q57401j10498N43073l08197J036533
8045G79345O39661j254814k87435J48621q66138P74811O3358K03713o80297r11927
8035a391102m01235k73460Q83921J260935P91249n63613m95718K3184o8355j11375
8025c45569k08918J93645j355533J172957J079145m46478p14971m36336J232300
8016A70242P31823l80892o48869R64928j1392j349221n7244k69915P755J67448
$$ plain form
8081 -854955 -2394301 -2879467 -1981486 -1969332 -919982 1222488 1067068 1007955 2047701
8072 2047701 647422 -1672658 -203880 841969 -474522 -1303804 479750 673756 -15994
8063 -15994 201095 948272 -750882 -2874900 -1354847 -774420 -1259944 182557 367405
8054 367405 -373560 -556875 -1128533 475835 -381566 -492064 51009 -257188 779345
8045 779345 1419006 164192 -123243 25378 -840760 -65949 -2591 201122 -479175 -1391102
8035 -1391102 -1792337 -2065797 -1181876 79059 870308 306695 -189023 -165839 -234194 -345569
8025 -345569 -554487 -360842 -1716375 -543418 535727 89249 -625722 -1062058 170242
8016 170242 902065 521173 -127696 837232 825840 -523381 -580625 -850540 -842785 -675337
8006f75337J165782J70549j825848J143691Q97299q51610j443098r30161l5415
7997b384148K93497R65484K91105R65393L74739K44947l7626p82519N11187j84658
7987B57401k64654j069411P22861J385676m10286q8407q1310O542J006000L39550
7977A803962j238937j761738J201709J82986l46172o04836J13635J534258p02990
7968A81877K234905j11759k185981L65530j678568K96684M76460l30845j76749
7959i28446N14863Q20786N87416L95270m48954J1039k221292R27039k6260P93604
7949D25065J365806n38325O2179q01501N52670j567816n54402O37190m83677Q91100
7939a1711n378j020019Q14890K66127j513446o22294K310692J122221j638548
$$ plain form
8006 -675337 490445 660994 -1164854 -21163 876136 24526 -1418572 -2348733 -2384148
7997 -2384148 -2090651 -1125167 -834062 131331 506070 751017 713391 -69128 442059 257401
7987 257401 -7253 -1076664 -353803 1031873 621587 533180 451870 458412 1464412 1803962
7977 1803962 565025 -1196713 4996 187982 -158190 -763026 -649391 884867 181877
7968 181877 2416782 2305023 119042 484572 -1193996 -897312 -420852 -751697 -928446
7959 -928446 -413583 407203 994619 1389889 940935 951974 -1269318 -342279 -368539 425065
7949 425065 1790871 1252546 1314725 513224 1065894 -501922 -1056324 -419134 -902811 -11711
7939 -11711 -17089 -1037108 -222218 43909 -1469537 -2091831 218861 1341082 -297466
7930b97466Q1082q99990m04811R72046N16310p73441j525438L74338J254119m02005
7920a105256J99428M49831j653141J278116O38300q39148J30771L20271J245823
7911F64995j397742m26299J933926J28864j412598j10217J094520L08548k39241
7902E44756N42805o05995J73596k88945p96461o82686n61595J55727m12052L92444
7892a538406P78305K37094j298710R17906J326055m26133p17202J33801J518746
7883I31456r16463q53475J24704K43690J626327k24122m01466r16187J170145
7874G84609J871075j028704o51783l41121J59244L59173M65516o92428j600205
7865f74624k10472K92964N7597n16789J355336L82827r51398n14373L70136L47136
$$ plain form
7930 -297466 -216384 -1116374 -1521185 -549139 -32829 -806270 -2331708 -1957370 -703251 -1105256
7920 -1105256 -905828 -455997 -2109138 -831022 -192722 -1031870 -901099 -580828 664995
7911 664995 -732747 -1159046 774880 903744 -508854 -619071 475449 783997 544756
7902 544756 1087561 481566 655162 366217 -430244 -1112930 -1674525 -1518798 -1930850 -1538406
7892 -1538406 -760101 -523007 -1821717 -903811 422244 -3889 -721091 -587290 931456
7883 931456 14993 -838482 -713778 -470088 1156239 932117 530651 -385536 784609
7874 784609 2655684 1626980 975197 634076 793320 1152493 1618009 925581 -674624
7865 -674624 -885096 -592132 -534535 -1051324 304012 686839 -264559 -778932 -408796 -61660
7855f1660k54994J28355p87170q42638J085665J028847M68186J50386n1352Q12510
7845A676135l4870k77057j176452j257427J180293M72483Q29463J74278o30555
7836I56291M05649j344279k29025r07755N4J379641k59303r87070q41401J502368
7826c24830N17299j32339j365554m32832m19853P25883K256525j327788n32787
7817a036276n94804K721164n54367j045663n0211L31174O38314j604053Q05572
7808c89150Q75291J259368J70747j384719j16862J54616P8503j516186j014573
7799a882965N00795J154574j174496N81918P79810j69971k76396N06381m70893
7790d51243q7173J80088J5883k11489l18373J208245j120852J220389N06412j70484
$$ plain form
7855 -61660 -316654 -188299 -975469 -1818107 -732442 296405 764591 914977 863625 1676135
7845 1676135 1641265 1364208 187756 -1069671 110622 583105 1412568 1586846 956291
7836 956291 1361940 17661 -211364 -1119119 -1119065 260576 1273 -985797 -1827198 -324830
7826 -324830 192469 60130 -1305424 -1738256 -2158109 -1432226 824299 -503489 -1036276
7817 -1036276 -1631080 1090084 535717 -509946 -560157 -228983 409331 -1194722 -389150
7808 -389150 486141 1745509 1916256 531537 414675 569291 647794 -868392 -1882965
7799 -1882965 -1382170 -227596 -1402092 -820174 -40364 -210335 -486731 19650 -451243
7790 -451243 -538416 -358328 -342445 -553934 -872307 335938 -784914 435475 941887 771403
7780G71403m0203L88874M58634j213728N13941j38169p28159J005992K41396p85007
7770D74974j981867m9422R1758M00852K29682K022998j388932k60703J002093
7761E41433L85219O88095j889043p7736j22869K70696J463028o05557j180905
7752e27639M0229J993431k30070j384699J017694J268780k50828L19367k462048
7743b15783o73172J003810M40520l15533j44229L42767L74638m63869j49145N5875
7733B55879j374586J500406N38014m82195k41996K79457L33329p91300n63999
7724e46991N82468P14066N56693n34337j202856M3389K128244J7599j059062n03625
7714A95588J227394J80830O3271j464813n44710n98143M43953n4081O21094K69994
$$ plain form
7780 771403 731200 1120074 1578708 364980 878921 740752 12593 1018585 1259981 474974
7770 474974 -1506893 -1556315 -1464557 -1063705 -834023 1188975 -199957 -460660 541433
7761 541433 926652 1614747 -274296 -352032 -474901 -204205 1258823 653266 -527639
7752 -527639 -487410 1506021 1275951 -108748 908946 2177726 1926898 2246265 -215783
7743 -215783 -888955 114855 555375 239842 95613 438380 813018 349149 200004 255879
7733 255879 -1118707 381699 919713 437518 195522 474979 808308 17008 -546991
7724 -546991 35477 749543 1306236 771899 -430957 -387568 1740676 1758275 699213 195588
7714 195588 1422982 1603812 1667083 202270 -342440 -940583 -496630 -550711 70383 340377
7704C40377p49204P72680N77458r07617l81929J67910q6556J179016j93314j683952
7694i65131N87126J862177N7755k622117p21792J438554j098747J095126O23633
7685B56584j24152N03421j291834M28698J003178j62682Q09745j723049J235382
7676I35291R92188j029699l77235j014774K8693l78306p26794J319739N55417
7667C04520r04512j89417J44743M37642R85416l66775j274524m20398J832750
7658E49445o63991j232431R49891k45983L73029O98735Q48169L03987k262295
7649f81444N41751q72321N63311O72474j012164J399611r0409k66939k36527Q01798
7639H19141P99059k78554j357483j04262L02468K5073j056337m98658l29454P67668
$$ plain form
7704 340377 -408827 363853 941311 33694 -348235 -180325 -266881 912135 718821 -965131
7694 -965131 -378005 1484172 1541927 -1080190 -1801982 -363428 -1462175 -367049 256584
7685 256584 132432 635853 -655981 -227283 775895 613213 1422958 -300091 935291
7676 935291 1927479 897780 520545 -494229 -465536 -843842 -1570636 -250897 304520
7667 304520 -599992 -789409 -644666 -207024 778392 411617 -862907 -1283305 549445
7658 549445 -114546 -1346977 -397086 -643069 -270040 428695 1276864 1580851 -681444
7649 -681444 -139693 -1012014 -448703 223771 -788393 611218 520809 253870 17343 819141
7639 819141 1618200 1339646 -17837 -122099 180369 205442 -850895 -1349553 -1679007 -911339
7629i11339O77433N63510j197127M49326N15807j461702P93968R11314L68084
7620G09274J68944j16801J227642m49896p18659j394840Q57247k43192j74307
7611a34588M85404J307364j98847j001945J608840j254211o27581N2880q54398
7602f17082k24853n17305J321176k51802J104512J535662o98309J88869k245440
7593d04572M98387M10985m27442j127577m30568O05132K84596P41860J535983
7584A686784K78351j166706r51114O91194M74106J598702j549685k065091N72069
7575d31390Q34467j43988o73707N72598K78874o46713J158416P61707j7766k470585
7565g78087k03544q92252Q03036P08831L745J711515m68408j57912j46202K48701
$$ plain form
7629 -911339 -233906 329604 -867523 -418197 97610 -1364092 -570124 341190 709274
7620 709274 878218 761417 1989059 1539163 820504 -574336 282911 39719 -134588
7611 -134588 350816 1658180 1459333 457388 2066228 812017 184436 237316 -617082
7602 -617082 -841935 -1359240 -38064 -289866 814646 2350308 1651999 1840868 -404572
7593 -404572 93815 504800 77358 -1050219 -1480787 -875655 -591059 150801 1686784
7584 1686784 1965135 798429 -152685 538509 1012615 2611317 1061632 -1003459 -431390
7575 -431390 403077 259089 -414618 157980 436854 -209859 948557 1710264 1692498 -778087
7565 -778087 -981631 -1873883 -1070847 -362016 -358271 1353244 884836 726924 580722 829423
7555H29423n0706j134552m85567k97499J85464O99354p74191j24408J100066P13787
7545F61171K58675k40044r80013M07611o4815p43391Q36306J414140Q42382q66392
7535A525630j794607J193852j549768J243299n64801j850119p2293J536855O53882
7526C21930M53j27216q45875N54333o55594j15111R0699j30389L76232r3351K97193
7515c26696l26618Q41246J32774j87030m03475m97120J00998P60729J155377j230381
7505A9804q79315J569126N80996j358899J3959m07472J88715O2684P8724r68232
7495a099910O16790Q73747j800071p93130J304870J461376R08949j714664J27862
7486a14181L46005n66244J196339L15245n04616o51735j11010J127699l66798
$$ plain form
7555 829423 778717 -355835 -841402 -1138901 -953437 -254083 -1028274 -1152682 -52616 661171
7545 661171 919846 679802 -300211 107400 42585 -700806 135500 1549640 2392022 1525630
7535 1525630 -268977 924875 -624893 618406 53605 -1796514 -1868807 -331952 321930
7526 321930 322383 195167 -650708 -96375 -751969 -867080 -776381 -906770 -530538 -623889 -326696
7515 -326696 -653314 187932 320706 133676 -269799 -766919 -665921 94808 1250185 19804
7505 19804 -859511 709615 1290611 -68288 -54329 -461801 -273086 -210402 -131678 -1099910
7495 -1099910 -483120 390627 -1409444 -2202574 -897704 563672 1472621 -242043 -114181
7486 -114181 231824 -334420 861919 1177164 672548 20813 -90197 1037502 670704
7477F70704l39707m79519o21011P09524J47453j131621L86577P19078L24934M0171
7467D26583m10540L33946k07425j66532o59303o81918M72896J22391R74746L60900
7457E65744K13781J33018o02026m03932m70392L61020k63534K27737J41794n3776
7447a50566q65928R90872N97094M91268j386245j142248J00850N78033K68907
7438e17963k6732Q47597K66197K45728Q80812k73920k89136m8152j219316m94297
7428f29182k30853O36257K98405k54212k95038n71838L52135K39239j54896o66991
7418a276974P19675N32689M31792K12490o74011O69558j069825P07669N06629
7409G59692J40889j309229M90414K26296n81856N7782K15274R53945n00554L87564
$$ plain form
7477 670704 330997 -148522 -769533 -60009 87444 -1044177 -657600 61478 386412 426583
7467 426583 16043 349989 142564 -23968 -683271 -1365189 -892293 -769902 204844 565744
7457 565744 779525 912543 310517 -93415 -563807 -202787 -466321 -238584 -96790 -150566
7447 -150566 -1016494 -25622 571472 1062740 -323505 -1465753 -1364903 -786870 -517963
7438 -517963 -544695 302902 569099 814827 1695639 1421719 1132583 1084431 -134885 -629182
7428 -629182 -860035 -223778 74627 -179585 -474623 -1046461 -694326 -455087 -609983 -1276974
7418 -1276974 -557299 -24610 407182 619672 -54339 615219 -454606 253063 759692
7409 759692 900581 -408648 81766 308062 -273794 -216012 -738 953207 452653 840217
7399H40217n82331K02276l28776r34396n11964M84482K94115m2013K42490k62452
7389e98352p01247M90550R29261j71372J275825P51983p12879p94243O76425l84738
7379G61213j507440O94323O23817p02082M47889Q54177j294179l84865N08167
7370A020l89979m67858R14927P65398j301172P81980J573815l8950k91549m10949
7360A136683L83683j383466n90590J214517m78579j27489j204638l44977J205744
7351a89112J030443N6182p94694l96505R58429N38270l00272J088131k35255q08242
7341I47375j125811l59239J327130K84113j12438K25674K53120l50221j047800
7332D1903P00169L45566k016870o1701j61440P30035J553899Q16039n19620j597145
$$ plain form
7399 840217 257886 460162 131386 -803010 -1314974 -830492 -536377 -578390 -335900 -598352
7389 -598352 -1299599 -809049 120212 -51160 1224665 1976648 1263769 469526 1145951 761213
7379 761213 -746227 -51904 571913 -130169 317720 1171897 -122282 -507147 1020
7370 1020 -388959 -856817 58110 823508 -477664 304316 1878131 1839181 1547632 1136683
7360 1136683 1520366 136900 -453690 760827 282248 154759 -1049879 -1394856 -189112
7351 -189112 841331 897513 102819 -293686 664743 1203013 902741 1990872 1755617 947375
7341 947375 -178436 -537675 789455 1073568 961130 1186804 1439924 1089703 41903
7332 41903 742072 1087638 -929232 -990933 -1152373 -422338 1131561 1947600 1427980 -169165
7322a69165R56242J8977l14302o55576M73599l64004k78726J328703K11272J41355
7312A348375j547064J39515J507646o9188j66939L6084j020624q33644J603857
7303I98018J096406j705936q00747M82389L4500k11631P37685k50942j626114
7294a246372M93140J448162Q31216p05903p73382o14226O4409P21798N8459n7882
7284B19419r7552K8275J036144n69259j186010J257757N07859q21471j124269
7275g49107N69606N5511m44017Q25068J109760j50689j362276k66066M22319P67999
7265G78108l96820q28898M46356K39019l28271p13553L55553k34029o95113j00082
7255a477730J355375R36568J74368j322903o6764M75212J102882o75422r43651
$$ plain form
7322 -169165 787077 806054 491752 -163824 309775 -54229 -332955 995748 1207020 1348375
7312 1348375 -198689 -59174 1448472 1379284 1212345 1248429 227805 -605839 998018
7303 998018 2094424 388488 -412259 70130 104630 -107001 630684 379742 -1246372
7294 -1246372 -753232 694930 1526146 820243 46861 -567365 -502956 218842 277301 219419
7284 219419 121867 150142 1186286 617027 -568983 688774 1196633 375162 -749107
7275 -749107 -179501 -123990 -568007 257061 1366821 1216132 -146144 -412210 10109 778108
7265 778108 381288 -447610 -1254 237765 -90506 -804059 -448506 -682535 -1377648 -1477730
7255 -1477730 -122355 814213 988581 -334322 -401086 74126 1177008 501586 -442065
7246d42065N93327k74060q05527j2494J930537l46805J49392N93200p8342k00562
7236A106601o47152j200415o32983L89940N31722m92598L92174J519555j49706
7227H17138j865364J112867J359934j86288j502466m91317Q05733R1471o3033
7218G8675Q98700L3384R78133O55207j357310k376130N06691k16178r83946J200224
7208e82550J587834k61112j332007J715832Q41676o17735L54476j674345j19553
7199h7484J009005L56862r45760o97778p4975j290459L47494J708490J123843
7190A449238j620229j048061m21207L14608R45317j02247l50719M97507O14086
7181B78293l48313P5655J248235j307533p79743K32893Q29731q19832M70862K079999
$$ plain form
7246 -442065 151262 -122798 -928325 -940819 989718 642913 792305 1385505 1307163 1106601
7236 1106601 459449 -740966 -1373949 -984009 -452287 -944885 -552711 966844 817138
7227 817138 -1048226 64641 1424575 1238287 -264179 -755496 50237 141708 78675
7218 78675 977375 1010759 1988892 2644099 1286789 -1089341 -582650 -798828 -1782774 -582550
7208 -582550 1005284 744172 -587835 1127997 1969673 1351938 1706414 32069 -87484
7199 -87484 921521 1278383 332623 -365155 -440130 -1730589 -1383095 325395 1449238
7190 1449238 -170991 -1219052 -1640259 -1325651 -380334 -482581 -833300 -335793 278293
7181 278293 -70020 5635 1253870 -53663 -833406 -600513 229218 -590614 -119752 1960247
7171A960247j758167p65667M32497n92088o0513Q51455O31998l049467N85813
7162a763892J909872j087729O31560K158845j367501j057189O89949J416722r87968
7153E42669j429006O34155o01473J228165J321182n23906m36128N66407o85509
7144F16556k093P00669Q47656j394363p58819J063760n53028J111749j056141
7135E75946L70717n83896o6271P41895J1240K63293q65416m52504l85372J282048
7125H91680j045429J927168k57969j867056l99721J015068N61030L6090Q03618
7116A664479j011584q16262M63935J135856l61579j512516K51283P89418O41766
7107A244796K07968j202710Q00782Q91469q89487N08846L34219l13313k000488
$$ plain form
7171 1960247 202080 -563587 -131090 -723178 -783691 67764 699762 -2349705 -1763892
7162 -1763892 145980 -941749 -310189 1848656 481155 -576034 113915 1530637 542669
7153 542669 -886337 -252182 -853655 374510 1695692 1171786 735658 1302065 616556
7144 616556 614463 1315132 2162788 768425 9606 1073366 520338 1632087 575946
7135 575946 946663 362767 296496 1038391 1049631 1312924 447508 -4996 -390368 891680
7125 891680 -153749 1773419 1515450 -351606 -751327 263741 824771 860861 1664479
7116 1664479 652895 -163367 300568 1436424 1074845 -437671 -186388 603030 1244796
7107 1244796 1452764 250054 1050836 1942305 1052818 1561664 1895883 1582570 -417918
7098d17918K86821N7380K11190R0152j043781R40121J38447M74963m51581M61762
7088G47556L4544p81959J94643n80987K99105j49148p37691J960767O59878O61721
7078B308429j500537j26297J299450j212405k124555k00598J556731L49615J693300
7069B043133p00383n23551L89328m9021l11249j849506J235387p06911j185763
7060a658536P39581J703657n0726o02212J438577K5191j660355l95396M73233
7051A3014M46050n26689l61272J100392P1059J005676j777416J074359Q15355
7042A860528j167383n64348P8888M44952p03422K64333M68807p22964J060349
7033A019740J586538j419968j424546J608845o77527j004159M40396N49960o42397
$$ plain form
7098 -417918 -131097 -73717 137473 227625 -816156 123965 262412 737375 285794 747556
7088 747556 782100 141 194784 -386203 -87098 -236246 -973937 986830 1646708 2308429
7078 2308429 807892 681595 1981045 768640 -1355915 -1556513 218 349833 2043133
7069 2043133 1342750 819199 1208527 1159506 848257 -1001249 234138 -472773 -1658536
7060 -1658536 -918955 784702 733976 131764 1570341 1595532 -64823 -460219 13014
7051 13014 459064 -67625 -428897 671495 742554 1748230 -29186 1045173 1860528
7042 1860528 693145 128797 207685 652637 -50785 213548 682355 -40609 1019740
7033 1019740 2606278 1186310 -238236 1370609 693082 -311077 129319 679279 36882
7024C6882n84997K281369M79087N6229q86124j025869P76L45621j078279m91342
7014h66647J551325J361032j582392o68898J162599J25192j601958p68445M5268
7005a242924K11211N64601l45872J463573P59548l55942o86638J59209J458690
6996A985456Q73455j305526j520149j231527Q4038j81704L25744J884059N6870
6987I70716r33283k03277P70044n7534j167012q68494j97778J131479Q43419q14176
6977e25896J288634N64343j93614k033566J230900R36474M21434o04870q10844
6968B72995K01534M0845k6132R97102J496958j187802m60604j07265m29090O12837
6958A411378p79245L20006j320333j29288O77905k337009J822407k45743j84424
$$ plain form
7024 36882 -548115 1733254 2212341 2268570 1382446 356577 357353 702974 -375305 -866647
7014 -866647 684678 2045710 463318 -205580 957019 1082211 -519747 -1288192 -1242924
7005 -1242924 -1031713 -467112 -812984 650589 1410137 1054195 367557 526766 1985456
6996 1985456 2858911 1553385 33236 -1198291 -1114253 -1295957 -970213 913846 970716
6987 970716 37433 -165844 604200 546666 -620346 -1488840 -1686618 -555139 288280 -525896
6977 -525896 762738 1327081 1133467 -900099 330801 1267275 1688709 1083839 272995
6968 272995 474529 515374 489242 1486344 2983302 1795500 1334896 1227631 798541 1411378
6958 1411378 632133 952139 -368194 -497482 180423 -2156586 -334179 -579922 -764346
6949g64346j4694J538192J018865K33379k1038l66782J79305J093666o10236j421953
6939H64358M94119K16338j318581l12037k8206P32459L4073O44915j104570j314074
6929a091206R96672N99031K39627p31714p6621l99204J77208J669309P48460j877350
6919B54212o75503Q42114R23549j113221j060557J122190o63715J537359O20568
6910A786996K76501k54459m64504O20796j638535O17985p92169m24260R23710
6901F52061Q57006k51146l78209Q59057j468105k83202J051673Q93039j429441
6892E02733k548780J847542K07348J570200p05543k7758j12879l23692N88047
6883I97218n27631R46688k98525k81138o32348J187060P04472n98933j024164
$$ plain form
6949 -764346 -779040 759152 1778017 2011396 1990358 1623576 1802881 2896547 2286311 864358
6939 864358 1358477 1574815 256234 -55803 -84009 648450 682523 1327438 222868 -1091206
6929 -1091206 -94534 504497 744124 12410 -64211 -463415 -286207 1383102 2131562 254212
6919 254212 -421291 420823 1344372 231151 -829406 292784 -370931 1166428 1786996
6910 1786996 2063497 1809038 1344534 1965330 326795 944780 152611 -271649 652061
6901 652061 1509067 1257921 879712 1738769 270664 -12538 1039135 1932174 502733
6892 502733 -2046047 -198505 8843 1579043 873500 845742 732863 409171 997218
6883 997218 469587 1416275 1117750 836612 204264 1391324 2095796 1496863 472699
6874D72699q45182L8245L54219J14410P51905r51638k41996L88693k13476Q77304
6864G45183o97306R3315o91489K41483M16656m40458J694140R87415q14353j547296
6854a2710Q62734O05059j197176m57564p00933J453685K33750Q33885j479358
6845A41372k96288O64974M75023l40152o65513m0967M52815M03737r29562p3827
6835b08388L29619L12680M83J146903k119779J118399O7219K00747M41613o36340
6825F53156n82781M34310P34791p84029o57270M23232J193310j176642j95038
6816D3039J581718j218185j319149j328080L92343j35965O56987J092536j73053
6807d07809p78837P03582K302900q1973m59031j10160L31124j373258M44450p56560
$$ plain form
6874 472699 -372483 -334238 19981 134391 886296 -65342 -307338 81355 -132121 745183
6864 745183 47877 141192 -550297 -308814 107842 -332616 1361524 2348939 1534586 -12710
6854 -12710 850024 1455083 257907 -199657 -900590 553095 786845 1620730 141372
6845 141372 -154916 510058 985081 644929 -20584 -61551 391264 795001 -134561 -208388
6835 -208388 121231 433911 434394 1581297 -538482 579917 647136 847883 1289496 653156
6825 653156 70375 504685 1239476 455447 -201823 221409 1414719 238077 43039
6816 43039 1624757 406572 -912577 -2240657 -1848314 -1984279 -1327292 -234756 -407809
6807 -407809 -1186646 -483064 1819836 1737863 1278832 1168672 1499796 126538 570988 -185572
6797a85572j15591M25195K08675n48596J07106R26023j357822k57233l0219K72246
6787e55788j59104K633658L36017j892178O79053R5477j473350l50398J573694
6778H87081n84875j015246J59316K36929L97490K96779L46677L9546R24907L9293
6768A727897j129502m86782Q67748L61147r41088O33077M52403l79310R43061
6759B048651n25271j179508n23567P46745O38020l7556J021058L159j076639j545943
6749d30851J327823O1792l75250p26634Q77672J88262O81007m53926O29479O89866
6739B469240q17244J462621K75714J20730j019548k843294M38953P72438P79567
6730A639177p0754l18419p92451j27151O87884j68332j072983P0658J710891o32964
$$ plain form
6797 -185572 -301163 124032 332707 -215889 -108783 817240 -540582 -797815 -828034 -555788
6787 -555788 -714892 1918766 2254783 362605 1041658 1137135 -336215 -686613 887081
6778 887081 302206 -713040 -553724 -316795 80695 377474 724151 763697 1688604 1727897
6768 1727897 598395 111613 979361 1340508 399420 1032497 1484900 1105590 2048651
6759 2048651 1523380 343872 -179695 567050 1205070 1167514 2188572 2191731 1115092 -430851
6749 -430851 896972 958764 583514 -143120 734552 922814 1603821 1149895 1779374 2469240
6739 2469240 1651996 3114617 3390331 3511061 2491513 -351781 87172 859610 1639177
6730 1639177 1568423 1250004 457553 330402 1018286 849954 -223029 -152371 1558520 925556
6720I25556L23487J675049j01869j650970k11650p97309o46768j19937Q16420
6711B12009j214293O36176J029757J988604K70992M02861p04061q01137J139800
6702B960708k79720o17984J56087o98693o09068j180955J152367R61460n7678
6693A786524R40093m04950R87439M61310j104328L21976J712995L49220k20150
6684D830129J424517J17786j526256r11428o4298J84465n36399L40212l58152
6675C500576l77084J139499N10748j841859l51846K785202K332472J666889m8661
6666I315936K09603O00894j3980n89070r91648j70050k0036R06009L9334Q83621
6656A0170613j350429n88997J208022P57669r21526N31083L28890M9108j620567
$$ plain form
6720 925556 1249043 2924092 2822223 1171253 959603 162294 -484474 -604411 212009
6711 212009 -1002284 -366108 663649 2652253 2923245 3326106 2622045 1820908 2960708
6702 2960708 2680988 2063004 2219091 1520398 911330 -269625 882742 1844202 1786524
6693 1786524 2726617 2321667 3309106 3770416 2666088 2988064 4701059 5050279 4830129
6684 4830129 6254646 6372432 4846176 3934748 3870450 4054915 3518516 3858728 3500576
6675 3500576 3123492 4262991 4773739 2931880 2580034 5365236 7697708 9364597 9315936
6666 9315936 9525539 10126433 10112453 9523383 8531735 8361685 8341649 9247658 9286992 10170613
6656 10170613 8820184 8231187 9439209 10196878 9275352 9806435 10135325 10184433 8563866
6647H563866N5113N02804l38334K1025J147766L47006L33319J19967J65965Q7261
6637A1005758L87979J495601k25284J059418K323594J335731J275135J231295
6629A9889227j655199k210275j022343J306359j262849j404925J4343k60391o92495
6620A2701452K38420j530784j301390N51907R40635J94691j19041J31513j0532
6611A1796871M22238K89433J18947J321548J614574q68728m02352J043498l66384
6602A4969645r54790J15225P2044j376280R81525p013o38059N9846j222100k788200
6592I211843j251341J912750J86750j704868r49675j084103l83340P76327J092887
6583G807230O6761J72772l35005q22853J467807O53764l6527j023569j19010J925341
$$ plain form
6647 8563866 8618979 9121783 8783449 8804474 9952240 10299246 10632565 10752532 10918497 11005758
6637 11005758 11393737 12889338 12664054 13723472 16047066 17382797 18657932 19889227
6629 19889227 18234028 16023753 15001410 16307769 15044920 13639995 13654338 13393947 12701452
6620 12701452 12939872 11409088 10107698 10659605 11600240 11794931 11675890 11807403 11796871
6611 11796871 12219109 12508542 12627489 13949037 15563611 14694883 14292531 15336029 14969645
6602 14969645 14014855 14130080 14202124 12825844 13807369 13800356 13162297 13222143 12000043 9211843
6592 9211843 7960502 9873252 10060002 8355134 7405459 6321356 5938016 6714343 7807230
6583 7807230 7873991 8046763 7711758 6888905 8356712 9010476 8973949 7950380 7831370 9756711
6573I756711J073168m75700n81783k24023J85584j787106m93568J23640k209864
6564E367059j933752Q84896R51644j605103J5878J578790J028563M85198j95024
6555F578149j27332j234678k3687p0272m63590k91588P67066Q89419j113775Q13384
6545E723096p88902J54274j373121O06335K29314r4989Q1392j007286P98109o79071
6535C649151R75002j322299j08696j012758L96352J204402O1656n1880j84370
6526C606560O82770J994899N85796r48767j065698L69891Q55466q33682l16548
6517D930687L01008o87584j43129l39982m77350K75376M87654l26763P71771k07117
6507D584571j230750O49957N38007J386810M17486K808796K21652r85958j308844
$$ plain form
6573 9756711 10829879 10354179 9772396 9548373 9733957 7946851 7453283 7576923 5367059
6564 5367059 3433307 4318203 5269847 3664744 3680622 5259412 6287975 6773173 6578149
6555 6578149 6450817 5216139 5192452 5122180 4658590 4367002 5134068 6023487 4909712 5723096
6545 5723096 4934194 5088468 3715347 4321682 4550996 4456007 4537399 3530113 4328222 3649151
6535 3649151 4624153 3301854 3193158 2180400 2576752 3781154 3842810 3790930 3606560
6526 3606560 4289330 6284229 6870025 5921258 4855560 5225451 6080917 5247235 4930687
6517 4930687 5231695 4544111 4400982 4061000 3583650 3859026 4346680 4019917 4791688 4584571
6507 4584571 3353821 4003778 4541785 5928595 6346081 9154877 9376529 8390571 7081727
6498G081727Q46665q31294q77085O28705K56898J69963q69170R74146N43475q7103
6488G836927q6173J148091Q48328J529922J08460j178127k024195j306125P90012
6479G667120p20493Q88427l83996o95797J008533J259165J194609M86412J369666
6470A2073646J152169K397391M222946M567253L006712J068947J086031r67590
6462B8607505j585838j747329k256005l792787l911778r98266j2243j759600k688979
6453I854680r06731J151712k91900Q78118o1306r1669m64858M4045N30013j899726
6443H742378J043281J142705N72713p02933O28794K74708l90801L56133J647013
6434A3313991L48069K273680K800309J461954Q73996J16588m12490k718319k349915
$$ plain form
6498 7081727 7928392 7097098 6220013 6848718 7105616 7275579 6406409 7380555 7924030 7836927
6488 7836927 7750754 8898845 9747173 11277095 11385555 10207428 8183233 6877108 7667120
6479 7667120 6946627 7835054 7451058 6755261 7763794 9022959 10217568 10703980 12073646
6470 12073646 13225815 15623206 19846152 24413405 27420117 28489064 29575095 28607505
6462 28607505 27021667 25274338 23018333 19225546 15313768 14315502 14303259 12543659 9854680
6453 9854680 8947949 10099661 9807761 10685879 10624573 10532904 10068046 10112091 10642104 8742378
6443 8742378 9785659 10928364 11501077 10798144 11426938 11701646 11310845 11666978 13313991
6434 13313991 13662060 15935740 18736049 20198003 21071999 21188587 20776097 18057778 15707863
6425A5707863o55291k79258o00378j18111q64527r29690l75910l34272J301909
6416A2852335j858355J72420Q15234k83517p12497n168J401932M38397Q62383
6407A3683164K108690J367442K126067M038688K192004J707260N784734Q129229
6399D1137278P732259P758364N840142J799448l079069o648252p023128o252261
6391D1264781n317195m388132n115411j964843k505077j141576j279742j94663
6383A9358142q1114k98682j469173J905565Q87740j511484j115969L40667O62785
6374A8678477N8074K017668L318857k52914J241796K817577L059595N208759N449764
6365D1597653N178394K590509M152798K512471l84042m196711l674151m319278
$$ plain form
6425 15707863 15052572 14773314 14172936 14054825 13190298 12260608 11884698 11550426 12852335
6416 12852335 10993980 11166400 11981634 11698117 10985620 10980452 12382384 12820781 13683164
6407 13683164 15791854 17159296 19285363 23324051 25516055 27223315 33008049 41137278
6399 41137278 48869537 56627901 62468043 64267491 61188422 54540170 47517042 41264781
6391 41264781 35947586 31559454 26444043 24479200 21974123 20832547 19552805 19358142
6383 19358142 19277028 18978346 17509173 19414738 20302478 18790994 17675025 18015692 18678477
6374 18678477 18736551 20754219 24073076 23820162 25061958 27879535 30939130 36147889 41597653
6365 41597653 46776047 49366556 53519354 56031825 55647783 51451072 47776921 43457643
6357D3457643l577428l132946l103051m216738m075531j481954l30330R2028m54191
6348B3177502j473399q08396o44663M67825m7706L08645j172541N77584M57094
6339B0841945J212914K41683O27755N26755m00054J087424J408176J796723K15807
6330B7559128K264801K216237M668184N556839P552008P295035Q230217P502420
6322G2844869K639304j657761l335523m075469n951074l393596j304914p37471
6314E5028365m90456N936381P674340O100336N864925K795485L037836M62156
6306H6409368J177623J310253M803068O038246M582309L281544L503236K574698
6298A13680345j644658k215163k000985k387589k795245l650626k353137j663076
$$ plain form
6357 43457643 39880215 36747269 33644218 29427480 25351949 23869995 23539665 23631693 23177502
6348 23177502 21704103 20895707 20251044 20718869 20671163 20979808 19807267 20384851 20841945
6339 20841945 22054859 22296542 22924297 23451052 23050998 24138422 25546598 27343321 27559128
6330 27559128 29823929 32040166 36708350 42265189 49817197 57112232 65342449 72844869
6322 72844869 75484173 73826412 70490889 66415420 60464346 57070750 55765836 55028365
6314 55028365 54537909 60474290 68148630 74248966 80113891 82909376 85947212 86409368
6306 86409368 87586991 88897244 93700312 99738558 104320867 107602411 111105647 113680345
6298 113680345 112035687 109820524 107819539 105431950 102636705 98986079 96632942 94969866
6290I4969866k940615j735437J466269M328990M155995L585351M6075l427457
6282A00449037n100827p651024n079995r97355L591094K736088K288166J666703
6274I1901887m72239k971375m013891j949114j551167L90910j66688r56715k125831
6265G8085777n777788o786460o385485n517845n089619m680907j887228n0889
6257D1909556J174712J099018j58000j646156k134837n031154m528634k423231
6249B8261274k568397l296761k192173j411214m92989j331763J549210j070650
6241A7446537n55294K64614n8653L14833R61585J575714J847385K531452K487868
6232B6816041P41994j631526r15756j945026k145629k189391k389781k260054
$$ plain form
6290 94969866 92029251 90293814 91760083 96089073 100245068 103830419 103876494 100449037
6282 100449037 95348210 87697186 82617191 81619836 85210930 87947018 90235184 91901887
6274 91901887 91429648 88458273 84444382 82495268 80944101 81335011 81168323 80211608 78085777
6265 78085777 72307989 65521529 59136044 53618199 48528580 43847673 41960445 41909556
6257 41909556 43084268 44183286 44025286 42379130 40244293 35213139 30684505 28261274
6249 28261274 25692877 22396116 20203943 18792729 18299740 16967977 18517187 17446537
6241 17446537 16891243 17155857 17097204 17412037 18373622 19949336 21796721 24328173 26816041
6232 26816041 27558035 25926509 25010753 23065727 20920098 18730707 16340926 14080872
6224A4080872j595130j875555l67484o26708m62451j87136p72870j87353J162916
6215I169101n58632p78132o18034O46271q08847O83494J27839L03724q28894K82803
6205G620693L00841l11616J643109r71700m13925J63202L64149p46883N399r78816
6195F674453k1379J612175J99956k551349j89357J753371o4540j546502L28305
6186F195133n93785j703848P11796J205008j65845J74420Q69618j231445m69317
6177D991735J342876k15577j344050K02225J451948l00354n12172P01718j191913
6168E126436j530406n8302J770384L4886o2734p86845M85151n85306J58629N79562
6158E131455q47217l24668o71648j038969L07442q8521m52613o55863j050543
$$ plain form
6224 14080872 12485742 10610187 10242703 9615995 9153544 8966408 8193538 8006185 9169101
6215 9169101 8610469 7832337 7214303 7860574 7051727 7735221 7863060 8166784 7337890 7620693
6205 7620693 7921534 7609918 9253027 8281327 7867402 8030604 8394753 7647870 7653269 6674453
6195 6674453 6653074 8265249 8465205 5913856 5724499 7477870 7413330 5866828 6195133
6186 6195133 5601348 3897500 4609296 5814304 5648459 5822879 6692497 5461052 4991735
6177 4991735 6334611 6119034 4774984 4977209 6429157 6128803 5616631 6318349 5126436
6168 5126436 3596030 3537728 5308112 5342998 5280264 4493419 4978570 4393264 4551893 5131455
6158 5131455 4284238 3959570 3287922 2248953 2556395 2467874 2015261 1359398 308855
6149C08855K416835J735154j72244o97699p77850q07850q85315J21770J744452
6140B986108K7710o91754Q60514k45890q40870l95299P84210N49818j339654m30331
6130A264562k04597O72940K49415j8608o10621r3967O61958O6210L98158P3652
6120B459102r05177j6483n36154J411273L20153L07823j5840j059692J021773
$$ plain form
6149 308855 2725690 4460844 4288600 3590901 2813051 2005201 1119886 1241656 2986108
6140 2986108 3013818 2322064 3182578 2936688 2095818 1700519 2484729 3034547 1694893 1264562
6130 1264562 1059965 1732905 1982320 1963712 1353091 1259124 1921082 1987292 2385450 2459102
6120 2459102 1553925 1537442 1001288 2412561 2732714 3040537 3024697 1965005 2986778
$$ [...]
##END NTUPLES=NMR SPECTRUM
##END=
