##TITLE=1H_DE-80H_X3
 200.13MHz, d2o
 8 sc
 
 19ns.26.2.2025
##JCAMPDX= 6.0         $$ Bruker NMR JCAMP-DX V2.0
##DATA TYPE= NMR SPECTRUM
##DATA CLASS= NTUPLES
##ORIGIN= UXNMR, Bruker Analytische Messtechnik GmbH
##OWNER= pz
$$ XWIN-NMR		Version 3.5
$$ Thu Apr  2 10:35:18 2026 Russian Standard Time (UT+4h)  Yarkov@DPX200
##.OBSERVE FREQUENCY= 200.1313
##.OBSERVE NUCLEUS= ^1H
##.ACQUISITION MODE= SIMULTANEOUS
##.ACQUISITION SCHEME= undefined
##.AVERAGES= 8
##.DIGITISER RES= 18
##SPECTROMETER/DATA SYSTEM= spect
##.PULSE SEQUENCE= zg30
##.SOLVENT NAME= CDCl3
##.SHIFT REFERENCE= (INTERNAL, CDCl3, 0, 15.4946)
##AUDIT TRAIL= $$ (NUMBER, WHEN, WHO, WHERE, WHAT)
$$ ##TITLE= Audit trail, XWIN-NMR		Version 3.5
$$ ##JCAMPDX= 5.01
$$ ##ORIGIN= Bruker BioSpin GmbH
$$ ##OWNER= Yarkov
$$ C:/Bruker/XWIN-NMR/data/yarkov2/nmr/H-C/1/pdata/1/auditp.txt
$$ ##AUDIT TRAIL=  $$ (NUMBER, WHEN, WHO, WHERE, WHAT)
(   1,<2026-04-02 10:34:27.23 +0400>,<Yarkov>,<DPX200>,
      <created by zg, POWCHK disabled, PULCHK disabled
       configuration hash MD5:
       00 E9 B6 7A A2 85 ED C7 34 08 36 98 17 FE 4E 26
       data hash MD5: 16K
       D8 33 5C 7C 47 B6 5C A7 7B A8 5B B9 16 12 61 F6>)
(   2,<2026-04-02 10:34:32.84 +0400>,<Yarkov>,<DPX200>,
      <Start of raw data processing
       efp BC_mod = 2 LB = 0.25 FT_mod = 6 PKNL = 1 PHC0 = -5301.748 PHC1 = 6.821927 SI = 16K 
       data hash MD5: 16K
       56 3F 27 09 1F 99 96 DE 23 60 AF FB 3E 26 3A 65>)
$$ ##END=
$$ 
$$ hash MD5
$$ 0D EF 81 DD AB 07 6E DB 88 7E 49 F1 2B D6 F1 4C
##$RELAX= 
##$RELAX= 
##$RELAX= 
##$RELAX= 
##$RELAX= 
##$RELAX= 
$$ Bruker specific parameters
$$ --------------------------
##$DU= <C:/Bruker/XWIN-NMR>
##$EXPNO= 1
##$NAME= <H-C>
##$PROCNO= 1
##$TYPE= <nmr>
##$USER= <yarkov2>
##$AMP= (0..31)
100 100 100 100 100 100 100 100 100 100 100 100 100 100 100 100 100 100 
100 100 100 100 100 100 100 100 100 100 100 100 100 100 
##$AQSEQ= 0
##$AQ_mod= 1
##$AUNM= <au_zg>
##$AUTOPOS= <>
##$BF1= 200.13
##$BF2= 200.13
##$BF3= 200.13
##$BF4= 200.13
##$BF5= 200.13
##$BF6= 200.13
##$BF7= 200.13
##$BF8= 200.13
##$BYTORDA= 1
##$CFDGTYP= 0
##$CFRGTYP= 5
##$CHEMSTR= <none>
##$CNST= (0..31)
1 1 145 1 1 1 1 1 1 1 1 1 1 1 1 1 1 1 1 1 1 1 1 1 1 1 1 1 1 1 1 1 
##$CPDPRG= <>
##$CPDPRG1= <>
##$CPDPRG2= <>
##$CPDPRG3= <>
##$CPDPRG4= <mlev>
##$CPDPRG5= <mlev>
##$CPDPRG6= <mlev>
##$CPDPRG7= <mlev>
##$CPDPRG8= <mlev>
##$CPDPRGB= <>
##$CPDPRGT= <>
##$D= (0..31)
0 0.7 0 0 0 0 0 0 0 0 0 0.03 0 0 0 0 0 0 0 0 0 0 0 0 0 0 0 0 0 0 0 0 
##$DATE= 1775111666
##$DBL= (0..7)
120 120 120 120 120 120 120 120 
##$DBP= (0..7)
150 150 150 150 150 150 150 150 
##$DBP07= 0
##$DBPNAM0= <>
##$DBPNAM1= <>
##$DBPNAM2= <>
##$DBPNAM3= <>
##$DBPNAM4= <>
##$DBPNAM5= <>
##$DBPNAM6= <>
##$DBPNAM7= <>
##$DBPOAL= (0..7)
0.5 0.5 0.5 0.5 0.5 0.5 0.5 0.5 
##$DBPOFFS= (0..7)
0 0 0 0 0 0 0 0 
##$DE= 6
##$DECBNUC= <off>
##$DECIM= 32
##$DECNUC= <off>
##$DECSTAT= 4
##$DIGMOD= 1
##$DIGTYP= 9
##$DL= (0..7)
0 120 120 120 120 120 120 120 
##$DP= (0..7)
$$ [...]
##$SUBNAM2= <"">
##$SUBNAM3= <"">
##$SUBNAM4= <"">
##$SUBNAM5= <"">
##$SUBNAM6= <"">
##$SUBNAM7= <"">
##$SUBNAM8= <"">
##$SUBNAM9= <"">
##$SW= 18.0517328524113
##$SWIBOX= (0..15)
0 0 2 0 0 0 0 0 0 0 0 0 0 0 0 0 
##$SW_h= 3612.71676300578
##$TD= 16384
##$TD0= 1
##$TE= 0
##$TE2= 300
##$TE3= 300
##$TEG= 300
##$TL= (0..7)
0 120 120 120 120 120 120 120 
##$TP= (0..7)
150 150 150 150 150 150 150 150 
##$TP07= 0
##$TPNAME0= <>
##$TPNAME1= <>
##$TPNAME2= <>
##$TPNAME3= <>
##$TPNAME4= <>
##$TPNAME5= <>
##$TPNAME6= <>
##$TPNAME7= <>
##$TPOAL= (0..7)
0.5 0.5 0.5 0.5 0.5 0.5 0.5 0.5 
##$TPOFFS= (0..7)
0 0 0 0 0 0 0 0 
##$TUNHIN= 0
##$TUNHOUT= 0
##$TUNXOUT= 0
##$USERA1= <user>
##$USERA2= <user>
##$USERA3= <user>
##$USERA4= <user>
##$USERA5= <user>
##$V9= 5
##$VALIST= <valist>
##$VCLIST= <CCCCCCCCCCCCCCC>
##$VD= 0
##$VDLIST= <DDDDDDDDDDDDDDD>
##$VPLIST= <PPPPPPPPPPPPPPP>
##$VTLIST= <TTTTTTTTTTTTTTT>
##$WBST= 1024
##$WBSW= 4
##$XGAIN= (0..3)
0 0 0 0 
##$XL= 0
##$YL= 0
##$YMAX_a= 291526
##$YMIN_a= -182685
##$ZGOPTNS= <>
##$ZL1= 120
##$ZL2= 120
##$ZL3= 120
##$ZL4= 120
##$ABSF1= 0
##$ABSF2= 0
##$ABSG= 0
##$ABSL= 0
##$ALPHA= 0
##$AQORDER= 0
##$ASSFAC= 0
##$ASSFACI= 0
##$ASSFACX= 0
##$ASSWID= 0
##$AUNMP= <proc_1d>
##$AZFE= 0.1
##$AZFW= 0.1
##$BCFW= 0
##$BC_mod= 2
##$BYTORDP= 0
##$COROFFS= 0
##$CY= -3
##$DATMOD= 1
##$DC= 0
##$DFILT= <>
##$DTYPP= 0
##$F1P= 0
##$F2P= 0
##$FCOR= 1
##$FTSIZE= 16384
##$FT_mod= 6
##$GAMMA= 0
##$GB= 0
##$INTBC= 1
##$INTSCL= 3.241238e-09
##$ISEN= 128
##$LB= 0.25
##$LEV0= 0
##$LPBIN= 0
##$MAXI= 10000
##$MC2= 0
##$MEAN= 0
##$ME_mod= 0
##$MI= 1.114404
##$NCOEF= 0
##$NC_proc= -7
##$NLEV= 6
##$NOISF1= 3.799351
##$NOISF2= 2.8
##$NSP= 0
##$NTH_PI= 0
##$NZP= 0
##$OFFSET= 15.49458
##$PC= 1
##$PHC0= -5301.748
##$PHC1= 6.821927
##$PH_mod= 1
##$PKNL= yes
##$PPARMOD= 0
##$PSCAL= 0
##$PSIGN= 0
##$REVERSE= no
##$SF= 200.130005429146
##$SI= 16384
##$SIGF1= 3
##$SIGF2= 2
##$SINO= 0.751879
##$SIOLD= 32768
##$SREGLST= <19F.Aceton>
##$SSB= 0
##$STSI= 16384
##$STSR= 0
##$SW_p= 3612.71676300578
##$SYMM= 0
##$S_DEV= 0
##$TDeff= 16384
##$TDoff= 0
##$TI= <>
##$TILT= no
##$TM1= 0
##$TM2= 0
##$TOPLEV= 0
##$USERP1= <user>
##$USERP2= <user>
##$USERP3= <user>
##$USERP4= <user>
##$USERP5= <user>
##$WDW= 1
##$XDIM= 16384
##$YMAX_p= 496319731
##$YMIN_p= -1198853
$$ End of Bruker specific parameters
$$ ---------------------------------
##NTUPLES= NMR SPECTRUM
##VAR_NAME=  FREQUENCY,     SPECTRUM/REAL,   SPECTRUM/IMAG
##SYMBOL=    X,             R,               I
##VAR_TYPE=  INDEPENDENT,   DEPENDENT,       DEPENDENT
##VAR_FORM=  AFFN,          ASDF,            ASDF
##VAR_DIM=   16384,         16384,           16384
##UNITS=     HZ,            ARBITRARY UNITS, ARBITRARY UNITS
##FACTOR=    0.220516191357247, 1,           1
##FIRST=     3100.93043332926, 0,            0
##LAST=      -511.786329676517, 0,           0
##MIN=       -511.786329676517, -1198853,    0
##MAX=       3100.93043332926, 496319731,    0
$$ Real data points
##PAGE= N=1
##DATA TABLE= (X++(R..R)), XYDATA
$$ [...]
9690 -148694 -144385 -117084 -359282 -599846 -474733 -244480 -77006 -131603 -294123 -313791 -312069
9679 -312069 -290468 -21078 -1870 -141139 -260523 -275158 -48522 22033 -16200 -172180 -166087
9668 -166087 -162436 -3328 65047 -79422 -142050 -143018 -173408 -167928 -85440 -94206 -253034 -426239
9656 -426239 -316819 -207993 -21223 -110619 -111789 -209389 -296760 -182441 -6823 -84452 -197945
9645 -197945 -372688 -231013 66965 78491 -216 -48785 -80842 30250 -2704 163587 198950
9634 198950 90437 79867 94265 282979 342178 212009 46837 194632 175823 354179
9624 354179 430203 446281 453582 360460 485092 584151 790659 922875 829739 785705 1007227
9613 1007227 1344574 1527596 1282925 1195102 954837 807059 776730 886183 634951 331296
9603 331296 101165 102357 397196 400350 270256 190422 100427 205502 327978 463566 517407
9592 517407 222622 143045 314953 606273 577565 533634 362405 325945 481175 796011
9582 796011 902971 937417 684130 561117 669759 802683 813896 703818 411918 252509
9572 252509 323778 313947 370135 118760 -56595 -93669 -158270 51714 128496 29782 -90636
9561 -90636 -259218 -331885 -75273 94612 104878 -129775 -78228 16694 -50915 181556 27529
9550 27529 9542 -17548 -145151 33648 259576 253430 210607 145790 389916 844876 1015356
9539 1015356 1024959 964730 872080 943084 959451 1046796 930608 729209 591669 419163 389992
9528 389992 466088 336732 194508 155209 985 32703 -27741 -144103 -163210 -178188 -152316
9517 -152316 -60610 -176362 -180217 -221631 -257219 -179779 -93134 -28390 -127396 -324013 -308556
9506 -308556 -209069 -154205 -78593 -209121 -314871 -297458 -173846 -93383 -164897 -217875 -231998
9495 -231998 -235098 -140187 -66431 -79229 -238193 -358694 -251654 -189332 27036 161693 -185585
9484 -185585 -378789 -329191 -296630 -199453 -98824 9166 -119844 -271234 -185098 -44863
9474 -44863 53512 87172 -187701 -341764 -253943 -86542 77843 7953 -203294 -328749 -494281
9463 -494281 -444496 -277401 -220443 -355568 -484741 -356558 -367084 -316146 -232940 -358153 -476067
9452 -476067 -429883 -258755 -342775 -372945 -386147 -325236 -331952 -348401 -303846 -262552 -245866 -484984
9440 -484984 -460987 -292364 -121261 -164844 -359014 -288075 -92414 -214464 -230940 -146662 -129385
9429 -129385 -152223 -351251 -279979 -211499 -259197 -218136 -290872 -271607 -389567 -324892 -258447
9418 -258447 -131404 -294884 -362133 -237006 -231221 -252630 -332519 -256030 -325496 -337108 -143591
9407 -143591 -121205 -72185 146205 127030 1140 182917 146888 472070 628431 647152 719208
9396 719208 498593 267287 -28176 -121529 -241465 -119831 115571 -69592 -189467 -368863
9386 -368863 -477458 -422330 -260942 -314031 -526702 -452963 -405551 -272652 -347205 -373116 -487726
9375 -487726 -494395 -500369 -452887 -343908 -99212 -274818 -389404 -374244 -442474 -339588 -323398
9364 -323398 -346486 -421706 -500294 -477614 -465126 -345210 -251232 -471439 -612750 -462783 -253952
9353 -253952 -256670 -376162 -466087 -505902 -406495 -304049 -300813 -298472 -335594 -347114 -420521 -353445
9341 -353445 -358915 -288260 -328889 -337127 -314437 -380711 -340185 -352094 -360662 -377110 -296354 -244135
9329 -244135 -265221 -283697 -343029 -453690 -458253 -335873 -429427 -364715 -254021 -321857 -300503
9318 -300503 -317357 -343153 -291812 -312050 -305904 -245247 -375945 -282689 -260509 -324704 -322751 -336241
9306 -336241 -255967 -155556 -156957 -276635 -308821 -271106 -324319 -433102 -370357 -258327 -121832
9295 -121832 -200527 -139886 -176476 -342109 -278080 -267929 -341816 -376782 -443003 -489286 -497815 -578659
9283 -578659 -458166 -368841 -375719 -301395 -392926 -458486 -357515 -277347 -260249 -343376 -258887
9272 -258887 -103825 -117025 -211662 -190563 -394089 -400569 -412583 -446442 -287498 -378069 -306950
9261 -306950 -332366 -288382 -138402 -329919 -220306 -246674 -536652 -444294 -413680 -452410 -438615
9250 -438615 -373670 -222481 -328432 -254697 -261411 -386618 -329117 -313272 -431392 -228907 -185995
9239 -185995 -137714 -125845 -316486 -406551 -392273 -494029 -371901 -399991 -544277 -433433 -509388
9228 -509388 -354653 -317099 -316580 -312120 -293675 -453865 -528219 -580495 -365845 -466950 -689094
9217 -689094 -396571 -440314 -361946 -219689 -162573 -265289 -390341 -350054 -347483 -443228 -163972
9206 -163972 -328496 -542037 -377358 -280885 -251178 -233526 -190093 -432029 -437632 -419095 -186537
9195 -186537 -139721 -155637 -162385 -314910 -291478 -288664 -272412 -164391 -354484 -315594 -282000
9184 -282000 -460311 -340449 -386585 -378429 -336184 -427218 -287777 -325619 -179715 -77693 -343116
9173 -343116 -280870 -280708 -343756 -192012 -285569 -346901 -338278 -388822 -358348 -250188 -322630 -365430
9161 -365430 -241674 -212638 -348014 -370625 -301681 -427134 -341720 -218006 -339533 -361348 -370727
9150 -370727 -360467 -399198 -240066 -208294 -76303 -295822 -416334 -243141 -239162 -240326 -255554
9139 -255554 -276040 -301949 -268899 -73319 -267181 -485000 -347909 -245963 -171013 -116795 -164635
9128 -164635 -205511 -327746 -331806 -146914 -134606 -32298 -202663 -253064 -194935 -125712 -179652
9117 -179652 -187861 -247678 -354241 -349280 -311602 -277673 -408156 -488283 -564180 -495032 -391001
9106 -391001 -372415 -232044 -316162 -456277 -320796 -245126 -198819 -60594 -149559 -134389 -92860
9095 -92860 -109309 -168454 -146975 -160206 -114000 -194988 -38423 -36909 -1430 11620 -222612 -237139
9083 -237139 -197294 -245806 -128970 54081 70543 -136726 -143947 16727 11470 -36413 -60030
9072 -60030 -147635 -28564 105616 35780 49993 -48830 -43091 -47395 -32701 -56134 -66157 29418
9060 29418 -78566 -88566 -407 78252 20389 86894 -119674 -119052 -38804 -151221 -17416
9049 -17416 27954 -49819 -10816 7472 35075 72938 -110701 7849 77774 92814 151766
9038 151766 -7115 71061 51468 -16448 272439 142598 49032 47114 159842 160715 138414
9027 138414 213986 64735 480 5353 86224 93096 197703 151945 56888 305489 357236
9016 357236 478177 413583 348927 454884 531559 542031 391403 283981 256494 46181 -61017
9005 -61017 139294 287065 192916 69423 104283 289926 263976 391478 556671 524199 521335
8994 521335 315680 461711 685804 758043 729237 595631 649301 866553 858214 897266 1000490
8983 1000490 728763 836040 975706 1007159 1095625 1063767 959063 1056899 1256427 1269051
8973 1269051 1169555 1183616 1333686 1226066 1382027 1549544 1534133 1675482 1718004 1818415
8963 1818415 1899098 2067891 2267630 2285329 2412222 2631639 2872845 3149103 3341048 3560514
8953 3560514 4009325 4135097 4476923 5101352 5322387 5760241 6390971 6851801 7343424 7874805
8943 7874805 8439368 9072790 10123467 11351974 12760186 14523283 16466855 18400748 21043087
8934 21043087 24702668 29544736 37331516 48599884 65537736 91527759 125169120 159324527
8926 159324527 186469352 190543452 168747410 136572936 106076249 81863456 63823115
8919 63823115 50815034 40792209 32895211 26445780 21702377 18555647 16432649 14433258
8911 14433258 12937754 11833381 10968390 10000144 9136611 8441371 7918380 7578714 7392383
8902 7392383 6947934 6681623 6451527 6050777 5988163 5961952 5839984 5667866 5415361 5215540
8892 5215540 5120974 5057082 4985657 4670836 4550557 4365720 4117133 4232340 4218657 3995048
8882 3995048 3954760 3691004 3604811 3742513 3594777 3650867 3337015 3146150 3162140 3005316
8872 3005316 3036492 3006720 2759786 2807430 2668558 2525006 2338034 2250275 2238988 2122130
8862 2122130 2071160 2139378 2231800 2145073 2178120 2162354 2160080 2185095 2215353 2233318 2108552
8851 2108552 2230351 2219631 2136091 2421448 2335640 2146935 2187693 2130272 2172020 2227635 2204030
8840 2204030 1967935 1954622 1954131 1873470 1846717 1939521 1766932 1734160 1804011 1623251 1734223
8829 1734223 1815064 1774267 1851229 1783249 1608071 1578453 1454426 1446347 1414073 1564012 1612639
8818 1612639 1555539 1652861 1624070 1445176 1644810 1682147 1615375 1710785 1633872 1586610 1738605
8807 1738605 1648482 1719898 1648144 1474081 1415775 1410161 1527733 1612628 1657644 1746599 1644061
8796 1644061 1716137 1897782 1747379 1740653 1784004 1844236 1910039 1910100 2120985 2178923 2180735 2132100
8784 2132100 2090652 2324908 2506844 2659004 2863248 2931591 3040303 3284092 3393427 3402134
8774 3402134 3492287 3260723 3085515 3390397 3591269 3617670 3646932 3591474 3374014 3194124
8764 3194124 3088547 2971635 2793774 2616062 2438739 2525096 2619240 2529145 2739297 2865737
8754 2865737 2761927 2959004 2968059 3039585 3048991 3111640 3303252 3213316 3273035 3064483 2935751
8743 2935751 2999406 2928390 2969343 3180791 3166816 3292821 3404800 3494090 3390490 3178512
8733 3178512 3114102 3056906 3022409 3144619 2962653 2814692 2903064 2844958 2960248 2977234 3007140
8722 3007140 3168761 3195525 2980968 3171254 3264740 3240538 3066171 2976685 2898047 2808741 2883211
8711 2883211 2718091 2701758 2944508 2974619 3147441 3143519 3160962 3050616 2940163 2917066 2825799
8700 2825799 2874948 2990307 2819213 2738270 3016333 2957216 3030613 3065512 3369349 3617355
8690 3617355 3654523 3803284 3847498 3941564 4083961 4154549 3925278 3986964 3989283 3974166 4085235
8679 4085235 3863255 3844746 3840876 3717002 3664807 3619468 3585639 3511238 3381472 3080751 2847923
8668 2847923 2808853 2880521 2821300 2805809 2687114 2601561 2660609 2524616 2545847 2595703 2568118
8657 2568118 2675642 2836020 3021173 3084837 3201605 3220938 3329929 3447304 3780676 3773813
8647 3773813 3858261 4093402 3880072 4032305 4001180 4008201 3947123 3706068 3789519 3984057 3979336
8636 3979336 4067306 4123880 4131747 3979498 3835045 4070342 4168996 3899808 3880951 3466186 3324304
8625 3324304 3515254 3633309 3734522 3789112 3608000 3637242 3800277 3845700 3700610 3612883
8615 3612883 3519483 3294259 3353406 3490626 3451998 3349594 3064946 2839459 3036540 3061378
8605 3061378 3219085 3189238 3145063 3114119 2869843 2983436 3190625 3014098 3075746 3278851
8595 3278851 3293288 3681080 3765021 3952193 3997988 3862941 3971102 3926699 4166266 4344713
8585 4344713 4452875 4600368 4729727 4712089 5025726 5031576 4936958 5010110 4818498 5175203
8575 5175203 5048283 4680344 4860502 4814808 4882364 4729915 4638385 4699327 4672675 4631302 4622690
8564 4622690 4595058 4834095 4970388 4854802 5261860 5327021 5224808 5577186 5636817 5970682
8554 5970682 6357245 6624030 7071890 7374048 7559307 7743732 7991690 8492109 8835266 9000565
8544 9000565 9397463 9729217 10407506 10944623 11239460 11777208 11995115 12492469 13149593 14002916
8534 14002916 15213914 16626772 18518763 21162139 24641582 29036125 34206416 38970682
8526 38970682 42720379 44553264 44085117 42764571 40919386 40148536 40910333 43006181 46989310
8517 46989310 51477616 55148117 56199121 54301859 50165944 44977877 39926891 36046045
8509 36046045 32899628 30794445 29600628 28467583 27688614 26628901 25553577 24477741
8501 24477741 23210886 22442991 22015229 21757137 21649292 21610578 21916824 22595458 23421868
8492 23421868 24901776 26990165 29817235 33808666 38457571 43468404 47892831 50329445
8484 50329445 50688191 49213256 47083933 45533660 45237673 46797819 49908858 53553041
8476 53553041 57144359 58802591 57780323 54378809 48985170 43422879 38563291 34537643
8468 34537643 31888882 29933932 28453448 27202529 25760478 24529199 23008834 21494965
8460 21494965 20189254 19072483 18147423 17342507 16564891 16093160 15614731 15177083 15046331
8451 15046331 14728696 14680635 14643546 14497904 14327994 14136130 14010015 13913592 13841304 13726123
8441 13726123 13571994 13218156 12880804 12613941 12304205 12148890 11994079 11992720 11843517 11898248
8431 11898248 11696985 11318907 11033462 10542938 10310129 10145715 9748493 9594389 9657090 9463759
8421 9463759 9605588 9448359 9319096 9373178 9412056 9341835 9296057 9207371 9124336 8956370 8906914
8410 8906914 9039756 9079155 9206397 9441480 9465640 9600710 9639340 9882587 10144745 10237063
8400 10237063 10524729 10672164 10858674 11022220 11255131 11531762 11817817 12160555 12549800
8391 12549800 13129379 13926767 15092701 16413082 18237628 20580459 23294985 26158276
8383 26158276 28237969 28964610 28336806 26789889 25197199 24198960 23974552 24247489 25266712
8374 25266712 26545044 27418297 27502889 26402479 24514925 22471173 20531505 18901690 17557848
8365 17557848 16527885 15714674 15009763 14622873 14556564 14783248 15226304 15693081 16310190
8356 16310190 16949455 17491126 17829910 17809870 17743835 17730162 17774810 18031320 18765800 19473199
8346 19473199 20820064 22496428 24526130 26903323 29488859 32072566 34049191 34475583
8338 34475583 33770517 32238622 30694649 29713776 29598145 30629320 32529718 34895239 37654082
8329 37654082 39966798 41444306 42215589 41824914 40379345 37768962 34855047 32314648
8321 32314648 30309574 29361563 29463085 30230830 31413558 32409031 32596570 31671469 30108214
8312 30108214 28235150 26172801 24048089 22377173 20874464 19850934 19274486 18846009
8304 18846009 18758897 19012489 19410277 19945966 20275382 20274848 20192726 19928069 19503450 19121011
8294 19121011 18734087 18513905 18441191 18680080 19407562 20397958 21923731 23586959 25553723
8285 25553723 27765557 29853799 31122455 31202310 30000121 28074844 26163766 24860395
8277 24860395 24331328 24782568 25733660 26618661 27375020 27183353 25800075 23711846 21471588
8268 21471588 19035285 17317009 15821067 14547215 13416330 12566721 11978052 11445433 11326029
8259 11326029 11412236 11579307 11829963 12036543 11966852 11958375 11563469 11175770 10709753 10266065
8249 10266065 10241511 10145090 10054130 10295534 10316887 10406658 10221766 9613488 9280188 8848655
8239 8848655 8448203 8082530 7637051 7284606 7021613 6773669 6694594 6487484 6512203 6364057
8229 6364057 5923966 5879037 5667402 5351932 5397430 5332211 5197977 4943811 4698227 4709116
8219 4709116 4547965 4399796 4373915 4021872 3894363 3745300 3597105 3551577 3290924 3281192
8209 3281192 3272744 2933788 2915057 2953814 2921293 3034060 2912515 2809833 2948078 2724359
8199 2724359 2721609 2857584 2651318 2725273 2532441 2647095 2141110 2413742 2891137 2535358
8189 2535358 2472108 2585510 2714571 2729864 2648332 2435090 2370563 2139329 2158935 2092291 1862437
8178 1862437 1978520 1932152 1820701 1827693 1706070 1740314 1742965 1651720 1676581 1601271 1542478
8167 1542478 1634705 1382957 1305456 1257478 1231308 1546066 1485595 1209183 1278791 1305878 1539321
8156 1539321 1534718 1468915 1675892 1576775 1578053 1585978 1478811 1597653 1470625 1327354 1393666
8145 1393666 1177680 1243259 1319701 1188347 1197684 1112749 1058735 821885 823722 943662 945462
8134 945462 768379 872681 894757 854620 948237 750210 746242 603454 660133 809784 799097
8123 799097 727872 703073 635986 694455 778642 865623 896451 679037 613156 732973 583751
8112 583751 865677 860778 809851 847451 673473 516750 568410 826628 810716 709191 583885
8101 583885 601647 467466 664262 681209 472051 438093 311106 407221 402938 422375 497547
8090 497547 572619 429608 430399 406735 493678 571438 421179 338130 284758 313376 271553 174849
8078 174849 338121 527389 325575 268215 343619 393578 420704 431251 303981 326669 249250
8067 249250 262832 384387 340061 219720 88912 179737 183391 238758 288315 153867 69133
8056 69133 -13218 99286 308643 482686 217313 143525 84423 88525 141950 212822 348107
8045 348107 202704 64220 220246 268473 308962 290288 212614 255086 250483 310675 381600
8034 381600 449552 371566 283342 208561 305391 239906 241568 249911 220513 311562 222203 241194
8022 241194 376735 513076 525916 514977 505028 610742 735645 664269 918432 1061924 1053896
8011 1053896 1119518 1322241 1432282 1431224 1349677 1277282 1257232 1291042 1448423 1335723 1386343
8000 1386343 1468109 1406538 1272170 1167239 1244228 1262554 1008876 712338 605524 568931
7990 568931 664627 599047 491251 478012 377883 544430 692220 694703 772033 772364 681223
7979 681223 576038 653355 763272 731322 838181 856067 787055 1091183 1205193 1211724 1399274
7968 1399274 1307086 1379080 1520139 1475590 1479931 1286830 1331620 1188724 1139149 1205771 1312748
7957 1312748 1346995 1372103 1095029 1091227 1100947 938940 852503 589736 467500 511294 525400
7946 525400 590793 682567 483769 426381 245313 371252 509908 382539 439315 448278 455029
7935 455029 449515 260633 250276 276796 135913 178541 163257 271432 407546 267617 287428
7924 287428 185566 10499 88132 176261 147591 241079 134169 173732 53446 -58643 9660
7913 9660 32677 116718 87146 -11045 90417 30897 35591 195115 203203 12206 -59323 14742
7901 14742 175887 -27043 24807 177514 36881 -5730 -60729 82889 164971 77105 -11779
7890 -11779 -50590 -914 130223 112663 105482 120393 49564 53557 128484 85949 -28590 -100368
7878 -100368 -24826 -18006 127490 150930 -53933 107627 121739 -70507 -35253 -19582 -132863
7867 -132863 -240443 -271353 -193303 -160983 -127786 -33984 -103382 -85932 -67297 -122790 22849
7856 22849 24462 -143907 4581 -45416 -31365 149293 49987 -49044 -155244 -345252 -208083
7845 -208083 -167910 -156962 -185084 -7494 38849 -112419 740 67235 -14371 -37295 -209130
7834 -209130 -192582 -137338 -245087 -145305 -19761 93739 130632 76144 79373 -9387 8195
7823 8195 169548 -71791 -72479 -52441 -88009 -126139 -152979 -250370 -139062 -113171 -145885 -18702
7811 -18702 56070 51489 100449 77082 -562454 -595071 -266721 -251339 -182765 -178067 -119665 -188251
7799 -188251 -216775 -170636 -64726 -33511 -172964 -122625 -121814 -183952 -169231 -230103 -120082
7788 -120082 -131303 -290909 -190418 -320426 -151754 -39081 -156744 -134354 -76444 -53633
7778 -53633 -223482 -241099 -125770 -170911 -126746 74357 -35590 -138946 -166286 -181487 -193852
7767 -193852 -215193 -191525 -115519 -141845 -252650 -206726 -82145 11118 -131734 -74982 -90709
7756 -90709 -128195 27592 -36749 -198583 -169733 -183664 -147474 22665 22535 -92893 -211972
7745 -211972 -147554 2883 -150837 -197381 -260454 -412743 -298633 -193624 -55910 -188688
7735 -188688 -254535 -201215 -214398 -364272 -138342 -107912 -276600 -225263 -220207 -202023 -136748
7724 -136748 -78609 -64646 -159450 -164473 -201864 -217823 -233087 -243796 -146245 -134986 -89623 -25226
7712 -25226 54128 -65249 -171060 -108047 -52934 -132606 -73133 -57974 -266265 -273420 -81999
7701 -81999 -19777 -65437 -4626 -29420 -113173 -95373 -106677 -82079 -48886 -16791 -41815 -89863
7689 -89863 -171478 -207758 13567 33056 -97332 -95437 -187395 -226941 -39057 -28259 -110557
7678 -110557 64256 82716 65733 89519 142638 32107 -42782 18584 61977 -27954 -24352
7667 -24352 8165 87131 98072 81025 3073 -107725 -127355 -46016 -51859 -153394 -125685 -82855
7655 -82855 -101771 90688 101102 -71956 -57088 -20200 228243 243609 198365 -18866 -139033
7644 -139033 -153095 24527 -17777 28359 195982 23521 -16221 96762 55411 73833 37391
7633 37391 -102334 -188183 -9710 147780 170027 108428 -67422 -157879 -134112 -34175 -178586
7622 -178586 -36951 -44213 -71865 -17184 -165289 -27030 84795 34603 2524 -173321 -184928
7611 -184928 -97674 -87041 -61890 -159221 -144866 48222 -116967 -57049 39554 -137198 -86739
7600 -86739 -68895 -46409 78428 127346 152237 145653 96306 150381 134584 154190 188990 44888
7588 44888 210052 120654 64780 272657 146388 295098 405827 326078 363411 414058 525635
7577 525635 777529 1009326 1402506 1648653 1719058 2085261 2154031 2031804 1867340 1575739
7567 1575739 1478271 1231990 880866 875534 664345 564855 512387 381605 360524 292915 354136
7556 354136 445297 438289 489014 610359 566971 618428 537722 528667 433559 290827 425233
7545 425233 375069 206239 266640 268732 343731 212054 175413 318910 56328 -31531 220632
7534 220632 166259 170346 267382 243366 260611 134223 247319 397859 270769 298028 156600
7523 156600 115852 409747 362715 388709 436234 309172 269080 266202 299161 365521 356723 308288
7511 308288 233947 283918 331865 193876 298388 280177 208558 402763 364947 502136 558794
7500 558794 393984 325527 317262 204517 452290 522762 356725 516195 441585 454807 490550
7489 490550 543796 632897 511407 582903 489046 394755 607871 578646 572788 637586 599977
7478 599977 606581 726107 832513 1036192 1254169 1255172 1304977 1492930 1640933 1382726 1277681
7467 1277681 1533447 1499116 1502693 1493910 1390406 1235574 1090966 1083930 877233 829457 825659
7456 825659 666644 563847 566606 404321 389090 422194 359241 363359 500535 660940 560067
7445 560067 555130 441341 384867 412166 541536 579741 499463 486618 394626 429996 498374
7434 498374 352113 474293 472181 481429 553367 565986 527611 442199 643345 647981 584256 745982
7422 745982 948589 1079085 1213803 1270925 1364160 1437210 1419715 1479738 1372706 1389088 1618768
7411 1618768 1604279 1435401 1226142 1229728 1111316 982370 861692 817532 921575 878482
7401 878482 918079 930665 859439 868162 894463 714721 860252 863423 783982 835067 672486
7390 672486 646013 903090 1029162 1130852 1068259 852482 945858 1000594 961954 1037577 1009606
7379 1009606 936728 967422 933795 1249064 1229628 1427614 1530480 1360334 1610031 1795877
7369 1795877 1982094 2201512 2354727 2592296 2944813 3343559 3874195 4087762 4285598 4453019
7359 4453019 4471698 4557760 4289157 4147514 3908877 3521964 3302638 3240751 3226924 3077839
7349 3077839 2987414 2941977 3148642 3419102 3781460 4056411 4229901 4718177 4996006 5271445
7339 5271445 5487269 5572519 5707948 5400094 5067690 4576636 4194834 3870933 3714926 3332315
7329 3332315 3140162 2993345 2770556 2664164 2282241 2248800 2221293 2247677 2300569 1990296
7319 1990296 2021583 2074964 2123026 2201327 2135611 2200372 2122178 1943590 1845565 1920606 1997308
7308 1997308 1949476 1770774 1882511 1893204 1818179 1971831 1886913 1840020 1909440 1900585 1875038
7297 1875038 1747772 1720342 1786177 1838335 1998166 2355767 2373192 2483901 2437621 2444428 2504181
7286 2504181 2321627 2379509 2297959 2201969 2249402 2121494 1991070 1827318 1684824 1588948
7276 1588948 1581094 1549442 1699215 1517795 1307943 1331541 1244363 1422857 1505221 1441519 1307475
7265 1307475 1207304 1222657 1141870 1146496 1217752 1205268 1107760 1163787 1238126 1205848 1156827
7254 1156827 995327 932156 986780 1230912 1494982 1487876 1466056 1480474 1524365 1761955 1830978
7243 1830978 1684701 1585388 1393757 1396202 1315724 1259662 1376268 1133719 968817 933362 893676
7232 893676 854195 887390 919767 718441 627791 803419 839963 776772 748822 730590 726707
7221 726707 737585 704912 833769 980533 845537 796113 957013 972229 1081749 1142653 1352527
7210 1352527 1410667 1361408 1315717 1246602 1166855 1308228 1360408 1358177 1138201 995082 981041
7199 981041 976874 805179 741367 778595 657788 601400 510654 548159 673127 672686 526151
7188 526151 451733 396496 399502 433237 469301 343918 461094 481685 427837 384502 440798
7177 440798 418999 297698 274325 325228 376042 358308 385796 388176 265810 225701 192723
7166 192723 303368 362534 406230 267978 205250 363106 227651 162241 243997 170903 137646
7155 137646 42339 73688 154579 23225 -85976 -56919 -69043 44283 203191 137920 103
7144 103 -152406 -67662 38719 3395 -18432 -136313 -205872 -120469 -100799 33094 7576
7133 7576 -67898 -201208 -201541 -79680 -40945 -99406 -213116 -263662 -187388 -123252 69902 102334
7121 102334 14154 -27966 -44839 -45024 -32359 -4084 -110448 -309570 -341514 -276673 -255898 -159512
7109 -159512 -156661 -321756 -291919 -296629 -212822 -19500 -52734 -127263 -90954 -74532 -180219
7098 -180219 -227693 -176243 -278280 -409782 -419428 -284611 -195823 -130357 -51882 -158895 -226072
7087 -226072 -385198 -243813 -68170 51143 -95918 -246693 -277244 -221546 -119952 -168419
7077 -168419 -183642 -163428 -237753 -326920 -258534 -160624 -119804 -63808 -172888 -185611 -235815
7066 -235815 -194916 -186457 -301705 -209430 -102502 -159084 -84021 -72603 -29447 -75974 -153239
7055 -153239 -293184 -309609 -252290 -81784 31804 84321 7768 -2458 151613 40782 77799
7044 77799 288366 145304 98073 138273 128336 136818 88401 221134 293955 422640 575043
7033 575043 809889 766039 699710 455023 501366 643326 681798 715646 643847 570714 666798
7022 666798 799942 712856 825136 602575 428475 492532 502334 512309 408783 378785 376676
7011 376676 311313 361638 321803 150615 278207 107206 -33287 25650 144091 208826 155104
7000 155104 114419 174260 68949 146834 287724 331641 275994 111632 73176 172079 166076
6989 166076 167423 96115 -33889 54110 172696 310151 242248 210536 244660 103775 225611
6978 225611 439672 490734 521804 550282 486293 449162 497107 490593 716572 793425 773975
6967 773975 879040 809027 935752 1015136 940338 1007839 1078713 1060023 1044503 1043123 1097459
6956 1097459 1087032 990894 990266 800438 823563 848300 611798 673011 591325 625137 529742
6945 529742 437288 405712 444336 452745 322433 190572 161373 331533 180970 265895 155554
6934 155554 44808 132424 13409 132084 223828 222606 200135 19813 57171 136760 169961
6923 169961 41753 91829 142799 199609 118247 93102 112605 -85210 -63901 -20247 172748
6912 172748 186921 63212 -59951 33280 46972 63792 128594 177307 83351 -109399 -93444
6901 -93444 60434 28681 -82928 -171433 -131337 -23011 121097 272050 147868 124744 27433
6890 27433 54144 120932 202767 147378 173071 176531 120629 344143 274527 338983 351057 176204
6878 176204 153787 192138 249248 231080 246848 36020 17481 -43219 82365 45926 34414
6867 34414 -32034 -94293 52600 133081 20164 56524 81262 -139945 -64298 13508 18832
6856 18832 29837 -27739 -38689 -50480 54496 1765 26652 179206 133195 93339 184705
6845 184705 146489 158088 63456 61764 21284 97283 64274 75176 104010 3115 -46305 -94696
6833 -94696 47551 -36743 -12357 64719 168739 91312 39134 31738 -60184 13533 74845 9250
6821 9250 45212 132950 178352 232396 270402 166497 220866 120471 92099 186900 197092 221303
6809 221303 152856 219271 70512 265891 428417 200688 201890 167603 286743 250067 559625
6798 559625 534704 512664 442376 352490 586055 588809 784896 836417 841317 841456 1030684 1417596
6786 1417596 1496868 1599183 1551190 1708811 1724545 1743547 1593010 1445350 1483635 1268213
6776 1268213 1200317 1351321 1372961 1228868 1193564 963757 614382 567975 641463 676008 523986
6765 523986 500030 541124 617636 573920 570896 516815 379386 454340 447055 407496 307229 184958
6753 184958 122892 201244 297003 198618 207929 195209 305315 444523 319836 354026 304583
6742 304583 265464 253528 231817 102115 112974 176880 175741 350402 420517 523215 373108
6731 373108 398258 554051 516492 579714 617242 589774 508868 476792 429626 530948 303251
6720 303251 228974 296106 149400 139645 200502 184701 198877 142011 208786 207557 221341 261922
6708 261922 226065 215141 111669 -43734 126857 237460 -31357 96094 55951 61582 311662
6697 311662 268900 279073 223072 223894 238568 215299 319903 391471 194955 11437 10958 107837
6685 107837 208629 267984 184824 284540 327591 388371 365355 413259 387286 250745 335983
6674 335983 373808 470114 566012 401511 300423 312902 331610 422731 529459 522628 325890
6663 325890 386740 559927 591453 596844 564571 388253 524947 527293 382338 441906 381142
6652 381142 231828 238757 410088 576515 522627 431014 438328 452313 512426 422497 417122 555135
6640 555135 531796 471161 623190 599960 678685 760593 703367 732670 735508 784668 732303 720497
6628 720497 905697 854938 864938 893195 793128 910877 854280 791174 958555 825286 867470
6617 867470 967850 956779 828139 1077480 1148976 936353 887554 1015180 1079942 1120263 1381399
6606 1381399 1193073 1101117 1170586 1198200 1280901 1273642 1182471 1239614 1138531 1118569 1136489
6595 1136489 1198118 1123030 1076729 1209293 1292807 1375209 1668357 1500631 1271634 1232812 1290383
6584 1290383 1483175 1654285 1626135 1559541 1492866 1650274 1833566 1852351 1896747 1866216 1710080
6573 1710080 1861550 2086230 2195540 2292651 2108464 2065288 2170435 2313111 2454393 2443036
6563 2443036 2214754 2217360 2341622 2473740 2490073 2543653 2685762 2334063 2441453 2726681
6553 2726681 2829153 2958989 2797552 2706812 2684548 2834349 2865373 2850665 2877741 2752983
6543 2752983 2647112 2880448 2999318 3031971 3165009 3017065 3006971 3171124 3064978 2850112
6533 2850112 2646654 2716873 2830181 2837202 2916693 2919483 2886343 2955097 2963441 2835481 2965378
6522 2965378 2742921 2817116 2899522 2931093 3248647 3161147 3089710 3251753 3327672 3438999 3458081
6511 3458081 3573360 3489880 3410326 3642962 3677215 3601402 3697604 3648493 3606260 3826322 3832031
6500 3832031 3971209 4073435 3943520 4010714 4057052 4213778 4310852 4434230 4419030 4283318
6490 4283318 4387895 4444584 4512513 4364678 4416724 4189428 4177037 4151689 4151182 4089290 3800980
6479 3800980 3729766 3680552 3836940 3918674 3983630 4042998 3934809 3867669 4046544 4391202 4429749
6468 4429749 4317816 4356301 4384013 4517756 4666199 4735191 4554090 4258882 4137683 4277000
6458 4277000 4324361 4240867 4303943 4086598 4013909 4085231 4300358 4342929 4410639 4405842 4364840
6447 4364840 4582850 4866376 5143046 5285319 5428227 5610376 5729623 6031146 5963594 6059968
6437 6059968 6133787 6057284 6048347 6118623 6109160 5908831 5733142 5601170 5455579 5470099 5418080
6426 5418080 5095221 4946323 4873366 4650142 4712424 4657243 4350161 4297426 4315906 4392055 4418715
6415 4418715 4523681 4288221 4147379 3987787 3916013 3771829 3614279 3437812 3328230 3378729
6405 3378729 3419393 3511102 3365719 3154995 3142398 3151185 3195520 3357033 3417145 3375071 3384263
6394 3384263 3332378 3601320 3620462 3392507 3384195 3258953 3444201 3762393 3925350 3959091
6384 3959091 3798370 3811097 3991948 4144294 4427275 4497606 4403342 4618933 4726138 4903059
6374 4903059 5289205 5340717 5351999 5422233 5566150 5842541 6010403 6180871 6019058 5787967
6364 5787967 5756494 5910038 5933042 5928172 5629418 5364234 5344108 5284314 5486483 5234903 5046310
6353 5046310 4923306 4533814 4595621 4774943 4820049 4704536 4663745 4551594 4710860 4871754
6343 4871754 4873559 4826349 4643484 4740545 4844310 5172463 5281759 5249488 5318802 5361459 5579401
6332 5579401 5722752 5716924 5730909 5824455 5815714 6057475 6149797 6268044 6377105 6354098 6488949
6321 6488949 6654254 6766395 6917062 6920288 6863808 6918491 7017778 7175165 7401501 7534716
6311 7534716 7686283 7793032 7953132 8184968 8225057 8483151 8704358 8894140 9184895 9248313
6301 9248313 9419656 9551623 9642513 9936341 10235813 10271042 10471429 10600047 10728777 11017134
6291 11017134 11199215 11348527 11405778 11552430 11736047 11799239 12170799 12528481 12696113 13111072
6281 13111072 13413446 13748725 14304651 14579668 14807079 15252719 15586390 16219102 16678487
6272 16678487 17273654 17732564 18210618 18868963 19623905 20486940 21520815 22476485 23461657
6263 23461657 24748342 26218155 28080369 30521451 32912907 36080376 39631876 43854357
6255 43854357 48486741 52727581 56365121 59112330 60926815 61902866 62004714 61321945 59617336
6246 59617336 56869397 54260965 51657156 49591221 48370767 47229831 46929237 47287577
6238 47287577 48188732 49971012 52818086 56649171 61455093 67692787 75372012 83934971
6230 83934971 92447051 100413769 106193891 110194383 112391114 112435909 110594775 106505132
6222 106505132 100243732 92561972 84498333 76899665 70482659 65088461 60992701 57797643
6214 57797643 55467585 54396604 53817272 54200856 55676251 57757764 60882783 64806196
6206 64806196 69064911 73125620 76445851 79082143 80926026 82005859 82157868 81468964
6198 81468964 79749777 77511489 75713254 74929534 75733475 78687905 83697364 89582660
6190 89582660 94785493 97197358 95261511 89647017 82491014 75707939 70422077 66830290
6182 66830290 65132790 65554893 67871816 71822171 76225919 80103568 82284374 82619015
6174 82619015 83231051 85363954 89194775 94130457 97985564 99257988 97043953 92025200
6166 92025200 86364739 81897829 79421639 79186664 79965355 80719836 79727321 76273983 71634310
6157 71634310 67157774 64044233 63022430 64528799 68615724 74641404 81943115 88538858
6149 88538858 92350563 91214111 85454754 76884115 67948247 59923570 52981652 47946973
6141 47946973 43887219 40648177 38255576 36417550 35241021 34396199 33795370 33485423 32840175
6132 32840175 31969965 31093599 30166711 29332769 28507444 27458617 26791771 26231908 25667587
6123 25667587 25406850 25240180 25255640 25340213 25510259 26088459 26528231 27453286 28577900 29831792
6113 29831792 31034906 32461609 33805453 34983042 35530096 35494001 35169064 34292649 33514274
6104 33514274 32166893 30196169 28328669 26473447 24874536 23582383 22539010 21730816
6096 21730816 20997071 20199457 19903238 19754036 19706186 19771578 19822078 20257527 20683422 21370684
6086 21370684 22135551 22593383 22908400 23136442 22907551 22535643 22025759 21182141 20204126
6077 20204126 19067220 17920078 16884721 15821533 15191699 14429578 13684321 13163465 12578376
6068 12578376 12264953 11920234 11432031 11432143 11125200 10934304 10747364 10419555 10295198 9978186
6058 9978186 9762310 9814986 9411973 9270077 9370984 9067366 8974409 8811227 8702270 8646402
6048 8646402 8349779 8190945 8138661 7805838 7807287 7643340 7457566 7428828 7153367 7262801
6038 7262801 7092449 6765396 6775790 6364332 6333541 6519779 6377625 6421626 6125769 5832175
6028 5832175 6047082 5835626 5740018 5852358 5599969 5540852 5507683 5451030 5469941 5184396
6018 5184396 5316765 5407783 5178380 5249477 5341127 5302781 5271616 5013235 5230304 5225645 5006242
6007 5006242 5110525 4772821 4816765 5017610 4806358 5059591 5048430 4770597 5013693 4981013
5997 4981013 5042223 4884258 4766054 4871626 4810607 4913940 4990404 4627049 4798915 4820318
5987 4820318 4626098 4922758 4788130 5003773 5040990 4768363 4798177 4789590 4836133 4940099
5977 4940099 4722364 4673763 4635937 4553245 4718672 4556267 4527279 4732049 4614750 4762796
5967 4762796 4841071 4658545 4705891 4793352 4878172 4847629 4598069 4709778 4719808 4585652 4703139
5956 4703139 4645244 4689060 4667961 4472597 4706175 4587548 4616895 4802020 4631920 4737662
5946 4737662 4700810 4621119 4761510 4907816 4885864 4996080 4869947 4973181 5101579 5270184
5936 5270184 5396938 5169841 5232186 5342871 5371026 5614127 5637289 5792664 5813503 5777047
5926 5777047 5765621 5781275 5954497 6026938 5954457 6026271 6219655 6300220 6560410 6696879 6717850
5915 6717850 6888880 7032448 7085123 7250557 7282801 7252149 7255262 7269171 7194823 7329675 7545964
5904 7545964 7536623 7415653 7409997 7425590 7483437 7624726 7711874 7891734 8033634 8175998 8143502
5893 8143502 8234541 8243182 8310294 8455557 8573566 8678870 8830688 8813931 8771053 8622898 8670019
5882 8670019 8947278 9109800 9282238 9415859 9439849 9525986 9540246 9643832 9877093 9961458
5872 9961458 10074296 10170740 10317409 10490785 10796103 10931051 11074953 11254632 11440706 11505460
5862 11505460 11525752 11714793 11769129 11877001 12008927 12056151 12188701 12279557 12372457 12447298
5852 12447298 12576303 12583064 12695887 12682002 12814975 12826410 12933132 13117931 13076107 13179152
5842 13179152 13226649 13301495 13505694 13414129 13499062 13811524 14051293 14040637 14064715 14285446
5832 14285446 14378845 14327237 14403935 14611510 14738698 14934819 14780698 14943110 14956806 14590216
5822 14590216 14706278 14830251 14820523 14918575 15064739 15201242 15320404 15342302 15218265 15286252
5812 15286252 15466916 15758175 15862176 16087026 16254563 16359266 16719495 16829101 17003581
5803 17003581 17063747 16991745 17234586 17521847 17639126 17874288 18012217 18130776 18313938 18343629
5793 18343629 18458944 18448353 18698100 19039367 19130272 19568744 19873894 20284130 20861819 21223647
5783 21223647 21616699 22265517 22813582 23461297 24226436 25005450 25992601 26905028 28228030
5774 28228030 29650503 31097067 32865237 34846806 37185925 39883602 43317205 47354734
5766 47354734 52274240 57359503 62269947 66553326 69721929 72232218 73881777 74785821
5758 74785821 74790756 73458178 71080529 67555604 64036496 60993761 58305970 56631251 55603049
5749 55603049 55285707 55631461 56958768 59085364 62578180 67419235 73764766 81575443
5741 81575443 90339028 99009070 106417697 111970213 115480303 117503129 118046383 116951261
5733 116951261 113735518 108356897 100918986 92579652 84422285 76877366 70592486 65641568
5725 65641568 61692087 59012822 57173152 55896191 55583933 55984801 57430590 59689465
5717 59689465 62395807 65439279 68141134 70011848 71312783 71323429 70695048 69588853 67555823
5708 67555823 64955087 61411025 57019877 52726472 48571947 44912119 41693134 39113045
5700 39113045 37251984 35550828 34237968 33081542 31837539 30872617 30243194 29721380 29291065
5691 29291065 28723324 28133635 27850377 27422406 26953974 26577900 26161792 25974827 25640436
5682 25640436 25462691 25326660 25082087 25198178 25181108 25240009 25682394 25736938 25695766 25236359
5672 25236359 24634962 24220984 23611428 23261440 22934042 22440193 22165140 22059545 21924564
5663 21924564 22120967 22064943 21900626 21883092 21651888 21752112 21675420 21523402 21806570 22002926
5653 22002926 22255653 22423074 22510007 22978428 23296203 23987511 25147098 26516966 28249652
5644 28249652 29736986 30603282 30765408 29697184 28666883 27796772 26917105 26394706 25934672
5635 25934672 25852925 25764359 25603145 25664228 25753231 25939285 26274607 26334764 26639966 27039708
5625 27039708 27166718 27599276 28149680 28715986 29538197 30279652 31084847 32108617 33241904
5616 33241904 34816911 36615815 38691050 41090092 43337891 45410659 46588286 47215791
5608 47215791 48060066 48987679 50604982 52762934 55526800 59154623 63478349 68993759
5600 68993759 76255884 85112006 94947498 103638410 109287779 110514644 106845664 100863503
5592 100863503 94664168 89382460 86281639 85432135 86563488 89904924 94909830 100113119
5584 100113119 104306389 106420940 107604298 108834428 111365783 115626169 120931868 126664639
5576 126664639 130949870 132053436 129693537 125041389 119905652 116142394 114160240 113488180
5568 113488180 112711684 110637538 107110875 103214571 100433151 99434349 100387155 103816595
5560 103816595 109373180 117159530 126629569 136277050 144703000 150223752 152144303 152258877
5552 152258877 152465244 153997096 157411206 162400303 168768837 175881479 183606029 191937018
5544 191937018 200206159 207485312 212438000 214100158 212184653 207030929 199884096 191876050
5536 191876050 183510470 174973569 166157012 157250920 148433864 139929369 132131538 125003411
5528 125003411 118410606 112370144 106560678 100884405 95395589 90203370 85507012 81151546
5520 81151546 77047389 73103512 69540628 66266684 63288174 60779840 58355556 55903878
5512 55903878 53715944 51712412 49755934 48203839 46851946 45555432 44347453 43128673
5504 43128673 42049986 41295193 40461583 39549305 38731383 37888026 37007040 36208700 35509119
5495 35509119 34573313 33407068 32520285 31606284 30847232 30258116 29542358 28873135 28380948
5486 28380948 27871889 27508149 27266613 26960542 26440783 25881814 25232033 24636312 24223309
5477 24223309 23653604 22861618 22364432 22162242 21584199 21143696 20668629 20389399 20118114
5468 20118114 19637707 19091651 18751108 18223442 17956735 17580441 17378919 16954374 16391710
5459 16391710 16350013 16083200 15819791 15818116 15691145 15496728 15389558 15013176 14894944 14850294
5449 14850294 14588105 14607265 14502911 14449008 14277994 14094603 14214995 14034841 13751022 13611649
5439 13611649 13517473 13565939 13676188 13637212 13668467 13645578 13601824 13785756 13954995 14053833 13832321
5428 13832321 13732240 13751569 13483449 13455181 13143543 12830394 13022073 12926389 12859479 13002369
5418 13002369 12921588 12808419 12760452 12678530 12833020 12738431 12715861 12611608 12224635 12304784
5408 12304784 12058995 11973881 11974496 11688252 11636134 11695292 11594090 11602468 11441563 11066132 10852419
5397 10852419 10721628 10736256 10788469 10825629 10955347 10689011 10665100 10778766 10747369 10848591
5387 10848591 10706826 10596898 10739191 10569850 10409145 10383065 10275017 10142641 10007259 9805567
5377 9805567 9828722 9616540 9637795 9501088 9334461 9559595 9345328 9307597 9229410 9132244
5367 9132244 9186122 9047858 8857539 8791813 8666937 8537363 8473686 8414393 8471221 8464826 8510941
5356 8510941 8570541 8504243 8595685 8543475 8475316 8611915 8438491 8221311 8155050 7952873 7834701
5345 7834701 7680029 7731809 7699291 7563288 7641460 7536225 7457108 7564599 7562548 7589656 7637095
5334 7637095 7571212 7581876 7751147 7888800 7938097 7941652 8048881 8096374 7989274 8081388 8190449
5323 8190449 8283773 8212526 8011695 7917869 7967216 7948680 7920613 7859387 7675806 7794243 7839361
5312 7839361 8005430 8116276 8188622 8176774 8205230 8262525 8337986 8568197 8592307 8657326 8702709
5301 8702709 8757122 8877478 8850800 8886553 8702474 8646914 8775188 8941314 9024907 8944621 8832606
5290 8832606 8908644 9074013 9134289 9388318 9511678 9503910 9603340 9762455 9865555 10114894
5280 10114894 10387089 10459357 10649948 10946062 11232232 11510300 11899114 12192148 12336694 12630409
5270 12630409 12940711 13321217 13483250 13543098 13765947 13933160 14060782 14142797 14009952 13986094
5260 13986094 13990802 13858467 13879386 13854997 13803232 13743279 13897745 14173213 14374539 14279040 13987672
5249 13987672 13408974 13042716 12554405 12048896 11907189 11867525 11783277 11593941 11444606 11405690
5239 11405690 11302113 11164844 11273440 11273198 11319781 11446013 11351204 11274110 11240441 11364687 11547138
5228 11547138 11217171 11172528 11101806 11187743 11222650 11120706 11035833 11018909 10960282 10968986 11080131
5217 11080131 11056388 11084507 11013646 11032604 11160686 11183697 11583073 11745343 11750303 11725453 11600261
5206 11600261 11758230 12172735 12409895 12509913 12533460 12800315 13150180 13387715 13762796 13937088
5196 13937088 14248974 14663289 14921731 15356878 15878268 16102883 16450283 16734891 16887579
5187 16887579 17003132 16983204 16899952 16499130 15968469 15758489 15409184 15168987 14885950 14359631
5177 14359631 14175689 14029954 13917207 13778822 13625292 13547708 13487100 13481929 13580248 13431552
5167 13431552 13255609 13280347 13209282 13082858 12896090 12728163 12721215 12540543 12387077 12323803
5157 12323803 12213666 12027638 11749945 11649501 11667836 11598711 11475035 11422861 11286082 11195403
5147 11195403 11140048 11209915 11231301 10986478 10756148 10661682 10642053 10771051 10668604 10503722
5137 10503722 10377430 10241059 10337383 10499153 10380130 10329383 10098874 10155134 10184871 10327082
5127 10327082 10510067 10448068 10303327 10439853 10440674 10556818 10833962 10897521 10976767 11129725
5117 11129725 11520892 12101062 12619597 12951262 13044070 12783945 12562475 12368652 12266668 12109086
5107 12109086 11876218 11934937 12089814 12431931 12770950 13003194 13073019 13025290 13158391 13382826
5097 13382826 13673019 13888284 14122173 14270321 14426530 14547644 14710642 14552324 14160143
5088 14160143 13986329 13989224 13867739 13732102 13423627 13241558 13008647 12760330 12672377 12642229
5078 12642229 12649010 12317432 11828607 11696987 11530671 11486993 11318564 11322817 11401425 11542530
5068 11542530 11660715 11749894 11691691 11810909 11777723 11814935 12227130 12472631 12950098 13272916
5058 13272916 13715852 14370460 14668971 14454489 14093248 13367858 12769255 12409134 12046016
5049 12046016 11906202 11623700 11213165 11044874 11037233 11029932 10875444 10676284 10719695 10681289
5039 10681289 10704736 10935662 10954127 11042333 10994661 11124490 11311778 11575207 11865456 11998193
5029 11998193 12086986 12381155 12764865 13005618 13094923 13014871 13172296 13278812 13416584 13868832
5019 13868832 13666528 13525412 13418716 13325443 13486523 13537598 13438600 13500863 13401449 13656793
5009 13656793 13953211 14062394 14383074 14436210 14530015 14901754 15323920 15858228 16402348 16776484
4999 16776484 17223658 17441643 17815119 18116939 18280397 18249129 17872457 17875044 18334842 18548795
4989 18548795 18752334 18972445 19064578 19371582 19879907 20271953 20859842 21241816 21813099 22546274
4979 22546274 23413727 24547238 25517972 26711084 28139021 29686993 31663764 33742612
4971 33742612 35818348 37542639 38466362 39114025 39582991 40165257 41258310 42446269 43800208
4962 43800208 45734856 48114449 50876778 53944149 57068293 60575962 64088250 68054549
4954 68054549 72206517 76606686 81053778 85337870 89455083 94330131 99988495 107576240
4946 107576240 118425254 134339379 157814224 192127864 242001550 309577888 385708044
4939 385708044 455344506 496319731 485813342 434531757 370040138 311004139 263964253
4932 263964253 228971153 203055161 182794969 165675466 151752304 141384102 134103055
4925 134103055 129143172 125643650 123628242 122529483 121982692 122099889 122677368 124025764
4917 124025764 125996207 128289570 130700466 133012506 134938637 136049030 136552198 136436367
4909 136436367 135737770 134983910 134552069 134197032 134542967 135809012 138286551 142138973 146543220
4900 146543220 151234441 155248859 157735130 158233999 156493270 152691423 146705919 139151625
4892 139151625 130798799 122587144 115200715 109011777 104175037 101173437 99929223 100486918
4884 100486918 103279944 107899075 113491580 118800060 122116208 122054609 118578826 112329357
4876 112329357 104793717 96807732 89268216 82942047 77505815 73103247 69595947 66704256
4868 66704256 64494718 62776528 61785741 61206393 61188236 61471841 61980328 62771310 63870944
4859 63870944 65080198 65776833 65821631 65073531 63892427 62000356 59774151 57539705 55140040
4850 55140040 53085659 51347773 49851845 48680962 47748694 47108605 46440367 45875451 45213078
4841 45213078 44500992 43819161 42832085 41440597 40300704 39129795 37975289 36998634 35756646
4832 35756646 34790172 34079233 33425588 32900802 32501448 32073219 31532837 31162115 30853794
4823 30853794 30641818 30551651 30665713 30868287 31210289 31651445 32170994 32803547 33415553 34252547
4813 34252547 35227976 36499505 38202272 40311247 42763116 46086849 50121450 55072098
4805 55072098 61111747 67661037 74446851 80918634 86389102 90244342 92133191 91938750
4797 91938750 89657993 85536751 80534675 74719630 68627263 62756861 57259637 52137155
4789 52137155 47709870 44020058 41097754 38540455 36315436 34582029 32860711 31428607
4781 31428607 30199890 28891736 27674164 26431568 25291796 24323659 23572763 23059204 22532119
4772 22532119 21909453 21584629 21299756 20913713 20673739 20380902 20231713 20054824 19885321
4763 19885321 19838645 19751663 19609280 19514348 19264445 19169722 19096877 18932500 18792712 18710528
4753 18710528 18634195 18471300 18212401 18116074 17861061 17716297 17557030 17413943 17378747 17275385
4743 17275385 17198871 17098314 17139231 17059949 17152178 17116178 17322226 17412275 17433560 17696016 17824922
4732 17824922 18014524 18010530 18001954 17967081 17759606 17705131 17645052 17642615 17702219 17541162 17618628
4721 17618628 17875917 17958474 18114247 18422467 18651893 19014375 19596245 20106179 20795577 21464354
4711 21464354 22217853 23303404 24331008 25620427 27111766 28915334 31266942 34007665
4703 34007665 37620818 42533916 48739023 56501605 65399122 74851741 83038291 87691443
4695 87691443 87389870 82455335 74541405 66014468 58174106 51413716 45988558 41807256
4687 41807256 38550665 35825549 33340071 30916878 28751466 27109408 25485902 23988683
4679 23988683 23049901 22302359 21626940 21055173 20520966 20108767 20088650 19892049 19836581 19844892
4669 19844892 19809170 20055823 20205844 20485772 20801293 21174075 21520827 21741641 22100379 22503925
4659 22503925 22869678 23314850 23638118 24092127 24684048 25309910 25883329 26683988 27524612
4650 27524612 28584994 29794711 31138906 32698716 34384323 36095433 38345791 41007010
4642 41007010 43978017 47530774 51253120 55771441 60485828 65605986 71040853 76756301
4634 76756301 82833913 89959775 98309664 109119784 122520808 139369205 160638763 187025763
4626 187025763 220514989 261419155 307643063 353209251 388032584 402238659 391104427
4619 391104427 360932508 323044903 286171436 255585808 232720560 215798804 202484509
4612 202484509 190579251 177931619 164505282 150539972 137245151 125285691 114710490
4605 114710490 106205949 99007649 92863315 88070005 83998968 80918649 78385371 75738603
4597 75738603 73056953 70447053 68076454 66147766 64202678 62606560 61122490 59194076
4589 59194076 57209555 54896591 52417266 50122323 47815512 45865065 43994432 42174972
4581 42174972 40849191 39610593 38527478 37811819 37057319 36642699 36244947 35710392 35312116
4572 35312116 34682265 33948378 33383527 32807956 32578293 32311163 31986426 32012095 32047386 32225865
4562 32225865 32494169 32476139 32397027 31859692 31030751 29997082 28629536 27482988 26376792
4553 26376792 25265638 24580974 23746975 22775627 22134081 21374593 20796050 20112246 19490210
4544 19490210 19157369 18763583 18173663 17906780 17547608 17317971 16926563 16604062 16456992
4535 16456992 16016603 15772560 15779979 15537120 15324086 15077130 14677186 14877621 14835439 14692492
4525 14692492 14300707 13999644 13951963 13680728 13610317 13601440 13321739 13231981 13080001 13059840
4515 13059840 13306432 13162850 12898786 12895308 12702398 12822117 12980129 12955474 12889621 12659490
4505 12659490 12813487 13146821 13191967 13292497 13072069 12718270 12440171 12053224 11842520 11798633
4495 11798633 11574569 11370734 11291732 11221570 11408420 11383791 11388438 11440890 11310648 11272150 11231108
4484 11231108 11120531 10975172 10790289 10734342 10581232 10453320 10579876 10557012 10595310 10612227
4474 10612227 10445207 10563844 10520151 10572380 10831785 11081731 11408964 11744252 11691689 11588985
4464 11588985 11106871 10632053 10202737 9775566 9498726 9129240 8791563 8713572 8637501 8470315
4454 8470315 8311825 8140270 8106717 8033514 8007452 8218113 8128280 8117141 8174495 8129025 8546602
4443 8546602 8562408 8650673 8879299 8812811 8957562 8968767 8741240 8428869 8111698 7951972
4433 7951972 7729506 7468871 7314835 7056154 6731699 6633968 6567814 6641152 6577007 6353313
4423 6353313 6134111 6142928 6313856 6446317 6499775 6769307 6700245 6566646 6655195 6728087 7013403
4412 7013403 7063407 6927144 7069401 7274147 7584100 7947786 7872904 7739849 8001116 8469451
4402 8469451 9007969 9646224 10385324 11253067 11808395 12174891 12086707 11752418 11516095 11643420
4392 11643420 11791817 12274696 13166232 14261315 14982188 15313092 15380706 14693051 13844306
4383 13844306 12904807 11876558 10999794 10365700 9967254 9767675 9658855 9633702 9620398 10088588
4373 10088588 10955717 12017876 12964157 13568445 13285892 12304101 11068492 9885946 8850174
4364 8850174 7917176 7309880 6886273 6503018 6225695 5975519 5854680 5753481 5481096 5397949
4354 5397949 5336961 5406011 5372145 5178379 5246214 5209966 5317590 5293463 5107205 5070118 5044067
4343 5044067 5052571 5038266 5082154 5093822 5105480 4955917 4986785 5064036 5120833 5078318 5039844
4332 5039844 5196153 5248164 5245543 5274285 5193508 5143656 5182099 5300905 5524118 5656685 5815207
4321 5815207 6063999 6183706 6676074 6920069 6885230 6832384 6640451 6407584 6140931 5931795
4311 5931795 5852315 5627726 5363795 5390980 5296732 5384383 5315394 5068072 4878164 4695870
4301 4695870 4666103 4739809 4683529 4621869 4333739 4412275 4509425 4517798 4721454 4706776 4591678
4290 4591678 4741958 4920763 5141647 5396023 5281202 5410234 5378246 5291978 5447148 5364077
4280 5364077 5328240 5199270 5030726 5116122 5056487 4820399 4677177 4425583 4569635 4619820
4270 4619820 4394915 4397303 4327704 4341931 4334023 4279796 4373735 4229628 4130793 4147586 3899390
4259 3899390 3952718 4235987 4033357 4053027 4134543 4089401 4263244 4146017 4213838 4166740 4073286
4248 4073286 4233176 4230288 4271364 4297499 3893163 3838324 3733882 3637941 3915490 3688041 3621373
4237 3621373 3647539 3473417 3734481 3672535 3533494 3571632 3459583 3510902 3616052 3626295
4227 3626295 3796653 3714564 3633483 3854088 3836702 4199593 4150980 3932782 4097955 4000876
4217 4000876 4018069 4187988 4230886 4295762 4010289 3972154 4196681 4049850 4090963 4077768 3878119
4206 3878119 3975530 4028312 3974673 3940544 3774137 3860142 3855657 3940083 4098233 3968303 4059124
4195 4059124 4260326 4248511 4504454 4622791 4650380 4700321 4594236 4590805 4692309 4580978
4185 4580978 4516615 4360150 4400879 4416777 4299907 4316447 4206973 3987049 3884734 3742826
4175 3742826 3723576 3873549 3809629 4084746 4163711 3951153 4136643 4065345 4077105 4083782 3900317
4164 3900317 3969623 3865952 3855870 3986072 3826843 4045122 4167587 3894529 4165342 4079352
4154 4079352 4084394 4347845 4191690 4225186 4045811 4000227 4030589 3907359 3951883 3802020 3613611
4143 3613611 3619182 3535294 3351526 3311956 3137271 3200708 3138444 2955728 3078604 2913706 2782691
4132 2782691 3074632 2868287 2887778 2949767 3051441 3099568 2880460 2927790 2942092 2811340
4122 2811340 2875093 2905448 2724839 2811107 2639559 2679842 2831420 2738800 2763698 2781981 2725984
4111 2725984 2810170 2825127 2815075 2885911 2739610 2951883 2901880 2885999 3008228 2847685 2956580
4100 2956580 3091760 2943881 2984113 2905257 2811526 2588185 2585724 2694360 2781877 2705822 2806534
4089 2806534 2646844 2563877 2602280 2442317 2669462 2734436 2723368 2738931 2612591 2677954 2710368
4078 2710368 2614221 2605196 2610140 2822581 2845604 2676779 2668338 2588823 2579546 2791798 2566861
4067 2566861 2551863 2641545 2489894 2476914 2592141 2478456 2502869 2356924 2306624 2290905 2303074
4056 2303074 2407821 2305531 2335817 2422951 2264637 2347042 2371232 2297187 2226588 2289755 2356341
4045 2356341 2373966 2278149 2215435 2260090 2190473 2236647 2278427 2260170 2291713 2121776 2206092
4034 2206092 2376653 2419499 2312402 2146353 2220851 2300399 2263171 2364192 2424353 2211099
4024 2211099 2285874 2352899 2423079 2461370 2316352 2355473 2240167 2284173 2383283 2321727 2357017
4013 2357017 2386670 2166831 2191427 2458314 2518300 2496321 2321753 2195280 2238368 2471249
4003 2471249 2550071 2390838 2249478 2239004 2130550 2294632 2382865 2244947 2234547 2191626
3993 2191626 2041168 2213482 2444041 2563413 2565809 2330060 2420520 2332642 2444711 2556940
3983 2556940 2384543 2445453 2313729 2416854 2463930 2348740 2462694 2417155 2302208 2286433
3973 2286433 2343482 2312364 2314555 2288909 2243642 2266456 2445239 2435442 2344445 2320891 2352546 2456404
3961 2456404 2495168 2416089 2311553 2503096 2468966 2459388 2424020 2471834 2373117 2364578 2544211
3950 2544211 2621142 2493608 2528734 2392852 2327404 2456624 2490601 2619262 2668350 2566827
3940 2566827 2519659 2604663 2597710 2600434 2603534 2669590 2528086 2753633 3122717 2896622 2850193
3929 2850193 2815566 2655651 2725544 2970838 2912557 2831284 2832844 2812426 2886801 3193545 3203413
3918 3203413 3202776 3212300 3091235 3186250 3255965 3341888 3269432 3281274 3176974 3307262 3535581
3907 3535581 3583620 3627574 3546562 3496738 3513736 3686260 3786606 3621189 3485548 3521363 3680072
3896 3680072 3836789 3948364 3748662 3721519 3707390 3756743 3946614 4200491 4122266 3968733
3886 3968733 3878942 3819327 3951565 4095905 4044069 4013437 4067355 4094075 4305213 4468094 4456226
3875 4456226 4222916 4237261 4340845 4439722 4476088 4425153 4237572 4250116 4309442 4356971 4465399
3864 4465399 4498811 4333666 4231280 4299943 4293776 4449692 4520658 4320423 4242116 4517597 4571490
3853 4571490 4631868 4526479 4363666 4348557 4343182 4402972 4455281 4628187 4634375 4519749 4635412
3842 4635412 4905888 4871031 4742351 4673913 4569532 4733581 4949475 4950481 4786152 4689092
3832 4689092 4632328 4586117 4773962 4878527 4903892 4941307 4880979 4861575 4963726 5042286 4839780
3821 4839780 4856868 4867977 4845273 4918579 4827569 4653740 4693328 4551163 4667795 4847893 4806333
3810 4806333 4726311 4643682 4572216 4652360 4808744 4792161 4593374 4567305 4636124 4498424 4834308
3799 4834308 4975321 4673149 4528969 4477111 4561908 4762223 4711783 4635588 4638343 4691271 4820899
3788 4820899 4904482 5059242 5084907 4704419 4733446 4855871 5054155 5141324 5069526 4938763
3778 4938763 4782060 4974088 5127780 5101296 5162073 5153699 5026227 5051525 4982154 5095129 5152064
3767 5152064 4906395 4947323 5099538 5085322 5205210 5146916 4969430 4968101 5174975 5337309
3757 5337309 5391303 5416663 5357642 5222047 5214602 5340294 5434907 5618581 5591532 5445688 5591584
3746 5591584 5685380 5588758 5623139 5548802 5578757 5592771 5731417 5673078 5623259 5804701 5747653
3735 5747653 5705012 5878214 5916621 5826708 5871772 5788672 5864418 5988387 6041698 6113690 6025997
3724 6025997 5949861 5869640 5911689 6129433 5949948 5949439 6057392 5924032 6084907 6097282 5988696
3713 5988696 6181012 6149335 6051956 6175292 6095808 6095776 5971356 6040934 6115250 6111258 6219099
3702 6219099 6140762 5936731 5980091 5992658 5975988 6105722 5969202 5971253 6010102 5850761 5896347
3691 5896347 5919784 5840298 5748208 5678521 5789788 5753602 5724066 5944824 5960289 5876287 5993148
3680 5993148 6060834 6245702 6244402 5927899 5841571 5947463 6126861 6294977 6225809 6112769
3670 6112769 5961969 5984370 6065983 6078769 6171730 6070968 5803363 6051438 6069611 5933376
3660 5933376 6035486 5974730 5865364 5926158 6037251 6056773 6134312 6060165 6044927 6086211 6205445
3649 6205445 6294654 6215668 6308627 6242629 6138076 6202570 6264972 6293257 6388250 6262451 6255434
3638 6255434 6452391 6612410 6718342 6465746 6304712 6345579 6476693 6630484 6524017 6565379
3628 6565379 6596024 6594414 6834384 6798290 6810235 6829199 6853045 6933036 7153468 7187875 7175364
3617 7175364 7313408 7391109 7712828 7903209 7905724 7781513 7845552 7959457 7995025 7922308 7941667
3606 7941667 8048659 8100017 8234662 8285468 8407711 8518189 8474778 8483012 8477430 8677996 8819488
3595 8819488 8789570 8878878 8847559 9030045 9235884 9382317 9579249 9703043 9810015 10008086
3585 10008086 10194559 10358939 10563866 10532275 10533866 10804844 11120893 11295646 11421582 11551331
3575 11551331 11578802 11841721 12205903 12460840 12649079 12892286 12865655 12952509 13272442 13427705
3565 13427705 13681551 13967480 14218754 14340717 14622998 15071193 15177110 15255335 15475911 15744491
3555 15744491 16382573 17049571 17441463 17836926 18282319 18562177 19313028 19972338 20657804
3546 20657804 21500364 22122790 22652158 23106379 23708219 23966287 24205994 24397426 24340738 24395413
3536 24395413 24642694 24898137 25284970 25522261 25852185 26235990 26784048 27291613 27855796
3527 27855796 28421955 29215319 30045428 31065801 32329384 33363138 34515184 35935701 37257645
3518 37257645 38489020 39811297 41018017 42423025 43663061 45121119 46523955 47684884
3510 47684884 48768826 49872728 50732569 51427053 52081067 52717725 53493855 54186181 55015387
3501 55015387 55972891 57137292 58796410 60406174 62076445 64148575 66390577 68927587
3493 68927587 71679292 74465165 77040698 79626547 82175942 84528528 87005494 89789409
3485 89789409 92807661 96254714 100412963 105093630 110751298 117360222 124876085 133598682
3477 133598682 143480031 154040928 165263080 176996037 188726568 200068565 210846768
3470 210846768 220273853 227688326 232866109 236114336 237691938 237666458 236454363 234124376
3462 234124376 230668315 226096332 220411223 213431710 205523205 196740042 187322736 177708429
3454 177708429 168446484 159695877 151473837 143867597 136381498 129577966 123642147 118075246
3446 118075246 112938917 108249012 103969441 99852095 96204630 92723144 89591257 86686695
3438 86686695 83840788 81186836 78826032 76899076 75266772 74076510 73151230 72552858
3430 72552858 71978750 70870747 68975430 66244319 63105787 59854402 57102500 54599853
3422 54599853 52343614 50694686 49044298 47629106 46254780 44934185 43962697 42961184
3414 42961184 41890102 40719242 39806923 38889967 38039330 37473462 36969141 36335631 35887784
3405 35887784 35552161 35520753 36011379 36820545 38284703 40433532 42936384 45024056 46071897
3396 46071897 44884255 41809640 38455627 35604792 33207699 31282988 29829517 28620210
3388 28620210 27539745 26853821 26165104 25652545 25260547 24852816 24355092 23972753 23746581
3379 23746581 23298852 22871042 22538889 22352447 22193832 22168425 22098382 22058235 22270553 22712569
3369 22712569 23642157 24816230 26105429 27137228 27315563 26627889 25236249 23609588 22208158
3360 22208158 21073561 20076157 19431423 19031836 18647498 18065549 17520635 17275883 17081516
3351 17081516 16925427 16702898 16601012 16376818 15923080 15909580 15754112 15420724 15348559 15030617
3341 15030617 14842310 14715683 14548848 14527270 14454706 14224446 13991009 13897866 13878140 13776004
3331 13776004 13747022 13422869 13141689 13090418 13194028 13311270 13132303 12875179 12665855 12537790
3321 12537790 12553807 12501128 12559632 12688500 12242849 12125840 12197323 12210375 12216708 12153137 11851443
3310 11851443 11736812 11610419 11611329 11685211 11766174 11634256 11498540 11536709 11476386 11522706 11518829
3299 11518829 11483214 11459626 11446224 11413945 11388289 11306075 11167367 11057099 10992211 10888983 10828521
3288 10828521 10799906 10622845 10460837 10448721 10497888 10377739 10363734 10245708 10072504 10123630
3278 10123630 10117553 10041018 9977376 9893883 9796513 9888734 9986071 9907763 9705942 9679734 9693700
3267 9693700 9731158 9740936 9652805 9538635 9409347 9367571 9418810 9342923 9197053 9018453 9027535
3256 9027535 9011716 9061938 9014247 8804417 8631434 8618523 8607138 8502286 8592010 8488834 8365491
3245 8365491 8335767 8542354 8587255 8563711 8743911 8568902 8417841 8459222 8528072 8452133 8652725
3234 8652725 8641499 8555225 8665312 8851912 8902400 8845369 8869397 8850771 8803996 8843343 8932076
3223 8932076 8934397 8958487 8862349 9014066 9258044 9214381 9382686 9457395 9416572 9610685 9873522
3212 9873522 9954103 10320678 10391928 10344089 10336212 10460134 10669949 10756024 10867269 10811434 10940104
3201 10940104 11131710 11468428 11713826 11881943 12041287 12088591 12309208 12738114 12983266 13134498
3191 13134498 13145442 13123907 13261907 13525317 13664163 13978723 14168801 14288840 14557127 14994453
3181 14994453 15201082 15474912 15823886 16070991 16336642 16952603 17347881 17750728 18242056
3172 18242056 18831758 19410385 20263316 21159486 21994088 23104002 24220926 25203347 26660878
3163 26660878 27966788 29450513 31325185 33085122 35208861 37644331 40524241 43616248
3155 43616248 46994021 50584674 54164873 57748950 61290324 64128903 66229084 67242854
3147 67242854 67610899 67554428 67326131 67393089 67479669 67477432 67700147 67786652 67792484 68017990 68262181
3136 68262181 68919909 69895227 70969056 72665869 74479564 76555066 79090730 81872272
3128 81872272 85720104 91039240 98103147 108037933 120668723 134879273 148356044 157450542
3120 157450542 158860965 152661398 142023348 130014944 118003480 107506195 98352158
3113 98352158 90546301 84506578 79912850 76201022 73500239 71360501 69705889 68717104
3105 68717104 68241352 68523599 68942090 69731803 70897388 71921527 73252482 75020366 76853247
3096 76853247 79220830 81338889 83608087 86079394 87731262 88563102 87861693 85782070
3088 85782070 82538652 78184388 73405290 68423108 63806237 59817914 55953455 52653177
3080 52653177 50184194 48024012 46349222 45111924 44032534 43109909 42461238 41829360 41231118
3071 41231118 40257146 39413676 38548728 37774567 36919520 35677584 34448247 33011612 31325191
3062 31325191 29958783 28551477 27225654 26116361 24650919 23538473 22589394 21820153
3054 21820153 21119876 20222386 19500377 18985553 18351177 18086544 17573950 17091460 16881062
3045 16881062 16312079 15923732 15916037 15410334 15070113 14796152 14264090 13945306 13464328 13164780
3035 13164780 12840716 12608037 12271764 11532048 11151256 11069322 10781447 10625903 10390340 10059962
3025 10059962 9694514 9458915 9424007 9273801 9056116 8829810 8455167 8261855 8202345 8042890
3015 8042890 7948377 7945438 7706335 7663218 7624210 7475419 7536207 7338171 7268475 7143248 6758868
3004 6758868 6830056 6827985 6761856 6545810 6362095 6350347 6155706 6146829 6174267 5960995 5652425
2993 5652425 5650800 5548849 5398954 5343275 5183472 5145811 4957500 4847513 4758278 4772724 4861249
2982 4861249 4733978 4600370 4709621 4527072 4432010 4522158 4407290 4397025 4287895 4162647
2972 4162647 4295987 4307637 4256844 4073599 3957659 3878601 3797007 3905713 3757284 3593747
2962 3593747 3568575 3584051 3406097 3386898 3397378 3391631 3392034 3078945 3216411 3275267 3217176
2951 3217176 3252040 3047544 2932213 2858371 2819173 2961631 3091573 3042721 2977896 2700718
2941 2700718 2701343 2851032 2739263 2699928 2618107 2560927 2659888 2700580 2751815 2588496 2605055
2930 2605055 2457843 2408087 2471340 2352582 2131709 2153335 2181691 2266660 2309996 2246228 2202154
2919 2202154 2317296 2331993 2303328 2406054 2327087 2253678 2277193 2199269 2138204 2260280 2339749
2908 2339749 2228580 2006842 2182156 2189433 2113668 2156311 2091440 2203828 2142314 2014968 1855121
2897 1855121 1879986 1927831 1997588 2021896 2020248 1994393 1799552 2016461 1973917 1890763 1914531
2886 1914531 1880052 1948875 1857547 1862405 2028403 1982619 1898591 1792776 1777672 1966196 2055066
2875 2055066 1929206 1951975 1828447 1827818 2040746 1897573 2083539 2070641 2070637 2085940 1942030
2864 1942030 2045094 2076994 2078469 2183978 1909060 1640093 1741268 1663688 1802946 1730327
2854 1730327 1727326 1800689 1726891 1798948 1749477 1724259 1753084 1679425 1753552 1918718 1838358
2843 1838358 1905356 1888375 1830297 2082165 2216013 2297570 2252198 2027019 2147249 2075021 1999627
2832 1999627 2085166 1728630 1748683 1803880 1668548 1658768 1728253 1762392 1895744 1547053 1516467
2821 1516467 1611353 1594284 1714965 1428433 1548135 1567997 1654683 1751546 1683419 1603821 1625855
2810 1625855 1626358 1650950 1771291 1680953 1677041 1596073 1599518 1676583 1490160 1503228 1363080 1418886
2798 1418886 1489138 1229778 1305493 1119710 1053320 1196669 1287991 1266214 1375902 1288808 1397302
2787 1397302 1479131 1298193 1173787 1159961 1112067 1158750 1110053 1284163 1333105 1219652 1111572
2776 1111572 1045946 1173620 1168204 1083339 1090589 999739 933109 1151048 1027368 1133823 1149295
2765 1149295 969006 1175894 1174062 1129220 1233532 1076299 951246 888901 958403 1128429
2755 1128429 1192351 1150674 1067231 868444 1090411 1150533 1063234 995475 992929 955187 1010085
2744 1010085 1029837 1018224 934480 931090 928733 911694 995169 962684 900247 939006 841898 783946
2732 783946 987731 919918 1020580 964832 765525 852825 950134 1081728 1132992 785720 800958
2721 800958 797865 824142 858984 903316 909723 619495 590481 769339 938402 996499 984523
2710 984523 788352 753203 732665 833317 768960 813150 855754 750235 695626 779224 884574
2699 884574 879678 701559 642245 801415 682022 717276 774914 743280 793504 845268 902573
2688 902573 899626 887676 865031 788527 720620 677021 572547 695581 793834 709971 616368
2677 616368 579332 703110 736833 695928 788475 793042 761880 725959 591966 715733 621636
2666 621636 555304 661957 541578 559884 657364 716046 733720 675612 686823 577214 496360
2655 496360 693220 740758 666467 512431 532138 603818 701588 574779 582154 564960 460124
2644 460124 661578 638441 600327 635429 535987 528885 437388 478148 713622 691810 769257
2633 769257 691569 716094 930717 838698 786334 678141 405296 433529 509516 482689 600543
2622 600543 613421 529112 518149 373313 523656 575083 559056 463100 361643 357456 503873
2611 503873 522104 589417 610901 368571 487867 583857 765759 804414 518209 585619 653000
2600 653000 420193 401877 553470 724728 692481 433799 523804 578000 788321 1100529
2590 1100529 1135345 1150104 1003633 911037 970355 973117 1007385 815123 591500 654496 577955
2579 577955 616193 615810 556882 587421 442038 432371 481529 415089 509762 506817 240149 501707
2567 501707 476168 501543 630126 505183 438526 545830 483706 493136 395006 373596 317140
2556 317140 199122 437670 641337 645948 693680 616328 355203 225541 277553 339741 429384
2545 429384 515358 422092 424119 458276 486397 414861 463874 331417 267896 501875 502292 550170
2533 550170 597621 378459 520794 439670 442551 447768 421305 367031 385681 381671 340329 415395
2521 415395 536072 474830 318182 432552 609056 534417 548448 508258 427671 374230 382263
2510 382263 488307 493847 518321 468139 411198 485742 547772 549027 499808 431618 477951 472949
2498 472949 429006 498911 467395 494532 441584 413033 398329 484723 478197 472196 426544 369886
2486 369886 297735 391761 478940 452768 336125 396924 408298 355698 566937 663311 572359
2475 572359 506678 441302 538655 662288 514659 524596 407265 516782 596783 515080 512744
2464 512744 602361 443216 417326 455573 491780 594214 466616 504153 380950 370574 597556
2453 597556 616355 606200 645438 567776 434584 407857 425108 666759 691217 646114 526662
2442 526662 429025 671778 737860 700596 577694 454001 583368 655033 658440 727934 601501
2431 601501 620940 661745 548995 696026 646766 666510 563103 421418 558133 717151
2421 717151 834399 939500 749494 623887 685531 735280 702781 722547 774734 828847 878850
2410 878850 796401 970646 1019022 942814 872227 865379 927236 864949 925229 1017897 879805
2399 879805 853548 761848 829964 918280 800045 935893 1056886 1078426 1140424 1209787 1114029
2388 1114029 1355209 1458146 1517515 1548150 1520320 1493498 1494694 1478772 1428905 1297549 1425025
2377 1425025 1510013 1411064 1469280 1385498 1495183 1677362 1714340 1759063 1617617 1640604 1799920
2366 1799920 1859991 2106446 2119159 2072030 2093397 2192986 2220578 2254481 2372889 2767272 2754217
2355 2754217 2622425 2859968 3093049 3307283 3430274 3672460 4103961 4222851 4585288 5028585
2345 5028585 5522389 5947419 6264792 6956137 7745203 8705081 9862656 11117961 12291381
2336 12291381 13390818 14166436 14943801 15787942 16837256 18671538 21283807 25050067 30611220
2327 30611220 38633205 50818704 69021508 94038484 120345559 143100307 150709875
2320 150709875 136792892 112202057 87904230 68271489 53451980 42723272 34550389
2313 34550389 28113462 22759395 19040817 16769674 15276455 14494470 13967815 13041914 12067183
2304 12067183 10575259 9132761 8236038 7353953 6793088 6592594 5932742 5477648 5224887
2295 5224887 5077924 5003485 4724548 4602060 4371505 4123958 4267588 3997396 3860932 3813807
2285 3813807 3602580 3486142 3450733 3260735 3271055 2987098 2817433 2905171 2810078 2928972
2275 2928972 2666103 2527115 2482010 2270486 2384088 2497379 2391078 2434836 2306571 2186519
2265 2186519 2122474 1940963 2057667 1956548 1816043 1736804 1459854 1542370 1683663 1584446
2255 1584446 1646001 1476441 1354520 1450221 1502699 1547093 1507292 1296815 1417628 1378217 1291881
2244 1291881 1327579 1239970 1398177 1264880 1147599 1473322 1268150 1253016 1269628 938847
2234 938847 1070833 957434 993235 1145217 1033836 1045634 984850 900087 1178530 963311
2224 963311 945186 1034180 813561 769681 780326 838814 969091 742877 778273 739481 641023
2213 641023 823196 823345 788764 893304 639853 820427 885512 651629 842841 772229 757428
2202 757428 844687 651442 735719 696072 453741 613393 486045 511674 613944 662982 739041
2191 739041 589530 600214 714268 647033 679165 785267 616974 771711 528825 411017
2181 411017 586083 519278 625557 561483 375959 596338 420783 506106 607270 387912
2171 387912 508947 363845 367295 582607 285855 276873 304356 89697 260630 441117 518378
2160 518378 590878 430272 462342 373582 399920 657513 440367 545978 495851 295266 490616
2149 490616 589578 578227 817353 505678 290273 490873 433883 542315 465691 293136
2139 293136 242601 295487 642127 648183 455336 339089 321772 338145 428109 398280 467550
2128 467550 378720 318531 289406 304407 466709 425998 343067 398114 271165 268938 508464
2117 508464 326679 434612 310283 226430 471607 485700 432068 370173 257539 335032 410669
2106 410669 507611 540572 227839 428326 483400 334384 421640 351854 234200 387577 222617
2095 222617 287289 323912 160121 159768 166562 266457 385914 299599 417239 220791 372947
2084 372947 551875 355077 446420 474724 338796 515475 396053 336373 454820 355267
2074 355267 342408 343536 379716 500306 407356 477927 567822 449791 681003 574349 401234
2063 401234 408076 360964 593050 570363 495967 532725 394527 527162 701746 855150 995154
2052 995154 934040 865222 841651 708534 690219 764051 587236 425974 488787 378062 393346
2041 393346 273030 312182 170551 144139 294206 228846 359083 527679 355503 462944
2031 462944 395213 341185 486981 385809 202627 341438 299513 396569 319213 374413 393365
2020 393365 122397 267930 186477 6525 205407 140705 42254 274229 213481 234300 234157
2009 234157 174372 191191 138365 230739 327430 278814 302482 260273 427003 466778 130980
1998 130980 238496 237343 22928 124586 55661 -34634 -19476 -5345 219726 312011 126697
1987 126697 212528 166078 257260 298453 184775 534409 428641 196646 291608 153358 232350
1976 232350 296748 58990 56224 19468 153393 327367 303654 338010 195094 147136 303974
1965 303974 236326 385036 404950 108817 224441 325267 294044 406568 337805 228219
1955 228219 136314 88815 199468 172336 178927 228090 105012 237684 132814 150602 295466
1944 295466 235300 144177 303606 340325 343374 283425 194585 196185 -61762 63400 139343
1933 139343 93841 103517 169368 142551 214525 84424 202645 298708 74509 153067 365763
1922 365763 247857 148634 83391 65694 175827 244198 298676 198971 323785 407531 138212
1911 138212 261394 137856 70204 98101 39547 107644 239283 241743 302296 184082 203096
1900 203096 142882 56356 248041 201787 297136 480792 218645 175147 281139 183351 137314
1889 137314 157994 -3220 33336 181646 96017 24676 170231 306304 237426 252766 211221
1878 211221 201446 300225 167690 72353 302376 185324 -29562 71616 107102 74913 7573
1867 7573 37765 157038 115115 200749 263818 117345 178823 208987 2738 52740 156771
1856 156771 191093 167269 161271 81202 276198 149808 116054 213399 229975 51836 192869
1845 192869 275510 120860 159113 259723 292753 224252 149395 81938 141899 75110 68452
1834 68452 102656 205799 134155 52772 181710 43361 238157 297467 261903 211804 205178
1823 205178 183842 100308 216378 264339 76786 303350 347693 186911 337827 203096
1813 203096 194439 261589 86514 137749 156920 258759 290535 166151 317431 114271 -67871
1802 -67871 -57942 -37546 7762 202112 61250 131775 242173 274358 345795 328115 288300
1791 288300 273522 237566 217152 170253 -23640 51561 -7442 128342 173705 118441 208864
1780 208864 44295 43043 147494 103955 -93824 34722 -10268 111352 105847 163171 286373
1769 286373 71877 157752 54070 -9714 280290 151024 113377 188656 6045 71997 298468
1758 298468 257536 190004 251606 372821 305218 135707 257453 109887 228277 287368 119048
1747 119048 173700 238987 233015 214370 201285 225569 200543 264364 275761 233477 237039 393594
1735 393594 148194 240060 348723 198646 398616 269146 206803 259499 122217 95365
1725 95365 225709 106704 61904 -20838 122326 122965 125653 150420 65508 57769 293715 126796
1713 126796 164326 291992 133779 127766 6641 84347 106775 84714 86208 -61888 79657
1702 79657 268613 185189 374315 286002 55776 209172 97243 81236 277897 163737
1692 163737 188489 203971 129089 225193 218490 170297 65767 48229 168752 90368 67645
1681 67645 311892 131398 179119 387516 331958 361381 280924 277649 177934 167069 253379
1670 253379 370856 321881 288435 50857 160445 227488 9631 52078 88452 128872 131591
1659 131591 145645 224342 57241 106848 6018 99871 184506 234402 221237 231474 293738
1648 293738 145293 180668 -19548 12135 59569 8890 205094 410308 243818 273333 284490
1637 284490 199547 208081 293357 30227 -102446 5099 -110049 -57311 147281 81180 129690
1626 129690 153791 -7996 22452 29184 78195 152350 176804 155551 248598 290462 337989 286289
1614 286289 316034 259834 221870 273187 298970 118584 65573 163248 336255 327622 289024
1603 289024 174741 54382 163159 146255 114840 127506 148599 143009 267640 167285 127932
1592 127932 116702 133148 45402 -31920 37755 83970 138305 172671 68797 28090 120229
1581 120229 123940 166050 256999 122389 -17420 131852 248590 335909 201691 -2742 -65825
1570 -65825 128390 169060 178009 218717 47272 -22602 -40508 -25328 118532 125152 26581 49992
1558 49992 167475 246228 92640 99505 174762 4243 -37999 56282 75801 75386 39473 119002
1546 119002 161393 301887 187988 278165 191606 266433 219531 174647 320373 223353 127623
1535 127623 143309 -45366 13036 193551 72346 189718 193364 101446 94956 111410 106389
1524 106389 144675 181306 104518 -37442 99808 2302 56274 140608 21517 136316 101495
1513 101495 -73331 -75295 61624 169587 153788 81646 67229 18899 78303 286584 117783
1502 117783 207966 239421 72204 201179 212038 211553 266094 21767 31898 61327 64273 121382
1490 121382 -13323 67460 22560 -15427 169237 127410 64354 116070 -45034 112026 150824
1479 150824 92811 230385 83246 78 36577 118050 251604 233041 114281 -24522 -177453
1468 -177453 -41265 58323 169562 347754 155491 138521 132304 207462 315296 213851 173165
1457 173165 -76740 41301 190115 211275 198996 291482 235200 104159 314851 188097
1447 188097 110052 240667 22117 20720 151968 212653 95873 -35026 -49105 -114320 -99230
1436 -99230 45105 -10075 193268 241884 83670 78205 110618 177802 184716 20860 125100
1425 125100 185652 108622 236206 142868 196129 52547 -6163 213453 360302 270930 309237
1414 309237 -16776 35208 76149 15427 118966 130963 150692 155801 273932 208719 190842
1403 190842 285240 207482 59916 131352 25200 47235 89197 9250 76982 241348 120177
1392 120177 1887 79270 194346 285880 203709 303771 241751 172082 209302 47285 -34434
1381 -34434 83548 149590 182162 274877 264830 187675 192112 89206 80584 72343 215183 140971
1369 140971 102556 29316 -15913 160025 256470 189659 153167 100774 7472 70483 117585
1358 117585 121934 46812 57427 55527 20043 184018 203872 131785 93290 27246 1708 143378
1346 143378 161551 74507 -73878 -6004 104083 156180 251521 232079 20201 28652 -29988
1335 -29988 17934 147330 -36223 -6215 -48703 77782 133816 206832 161309 141514 -13400
1324 -13400 32185 -49255 76351 138745 -85012 51513 148212 -77748 -22161 82126 146789
1313 146789 128822 26790 -41939 116196 175396 154721 54025 95093 47678 -10231 12310
1302 12310 -4231 69522 152400 7199 56339 147619 83425 115764 117314 116584 220562 203677
1290 203677 118115 169852 11509 53518 50227 -13310 58830 106172 174944 196278 143145 175684
1278 175684 40177 159136 329755 87641 -64913 9072 -69571 33014 40843 242649
1268 242649 241112 73196 146878 40589 -60489 154037 152101 95660 81669 24814 22509
1257 22509 76936 38012 53019 31258 87093 107359 128091 168845 17528 56073 123613 100185
1245 100185 245362 125492 42880 108542 90291 96932 113677 109022 142277 37034 -16589
1234 -16589 62893 29372 201690 143105 61470 147424 16668 -18130 134700 62394 103510
1223 103510 42077 -168368 -134212 21628 146340 108445 152242 142862 25141 72751 166088
1212 166088 20459 37509 -38691 -124797 76196 104501 135589 82984 -39759 64638 52593
1201 52593 51719 104493 -139372 4376 -58459 -120280 97883 11304 103492 89963 -99827
1190 -99827 -62457 24166 14457 -15942 -37675 -143732 -25166 -940 125301 -47061 -44853
1179 -44853 76354 17742 94656 61517 60050 52001 -28925 30434 151112 208170 196359 177827
1167 177827 177836 187194 111911 103706 -12105 -145479 61008 83530 -24358 173919 58879 116120
1155 116120 377077 352406 369424 285333 243610 211349 148702 59043 58317 44919 -25570 -40157
1143 -40157 176791 249879 30499 13120 -347 -184703 -22401 153284 189060 128250 114895
1132 114895 31614 92965 227639 226990 36837 68360 17298 85385 279575 146740 130147
1121 130147 98116 -93229 12701 184886 229064 183001 23788 27096 32727 35122 203317
1110 203317 170180 165931 116298 66043 226097 61841 110203 32898 74750 84035 237499
1099 237499 267984 246253 187607 -82122 -183026 -109762 86539 14847 -117762 -6560 53497
1088 53497 -39922 68690 285397 89377 50268 138004 25195 43486 16285 2462 -44006
1077 -44006 70010 37302 58140 83577 -32608 -52760 34980 107765 119652 142711 145096 7010
1065 7010 153763 165469 110632 182025 47505 34407 208200 116021 83675 86994 32932 28328
1053 28328 83034 198628 158265 145935 106950 24166 65134 37775 -78689 8375 152356
1042 152356 68910 14022 95500 -23805 -10672 102532 79573 98126 141702 156070 98619
1031 98619 217541 237221 191768 208395 302919 -10382 61634 87918 89465 137679 159090 150328
1019 150328 -67122 -2345 -85539 62698 128078 216401 108089 177627 154345 95213 65296
1008 65296 85782 -68681 -75853 -105635 27590 164466 148739 125889 68410 41717 -42378
997 -42378 88220 90699 -107939 32452 21851 -67665 200239 143663 -253724 -183329 -71797
986 -71797 -32588 89914 251526 135607 38158 57238 -38675 69331 130032 -43221 -36930
975 -36930 58515 11309 -14811 80767 23025 -42789 75232 77299 167881 200214 70681 -103591
963 -103591 -97730 -131638 -7953 19510 83889 9757 -5333 210158 243141 135479 -16291
952 -16291 59611 -33647 -49708 66201 -29843 29861 -97703 51318 103917 103289 2321 -26535
940 -26535 -83001 -19144 190403 191550 47441 3196 17947 14101 142526 236411 146045 142790
928 142790 72255 -117407 -40673 55146 -71952 -29721 54577 -1837 11783 93853 -13605
917 -13605 -156425 -96510 -29814 10258 186093 151434 3203 48578 -25333 95808 74184
906 74184 71048 22878 5337 53355 7723 127629 121667 13601 -47166 -90515 -144091 -5514
894 -5514 63599 -18906 101797 104388 76053 56501 65861 -171507 -136978 71292 193324 83559
882 83559 51498 -19672 -39202 89139 148386 148655 84021 -95876 -45578 88149 103672 93229
870 93229 62876 78096 -164947 22679 166264 70161 -12223 -74005 -179403 -13013 56755
859 56755 27085 49739 -122516 -184220 -103133 29508 142565 62734 8954 14776 -75658 -96839
847 -96839 -67097 15568 -2623 -1723 59833 151883 81314 -59863 -63573 79604 80251 100666 73917
834 73917 -139821 659 137835 99807 138920 165392 74891 -8888 14080 128322 261861
823 261861 115627 70601 26113 116478 255170 196369 251140 146154 -521 953 25859
812 25859 34292 132501 164937 103186 182540 48383 -89547 -71262 28969 244 -35154 4824
800 4824 -50787 35476 -153914 -253811 -54890 89992 101491 136412 132883 7670 -29700 93336
788 93336 146223 78509 142430 145937 406 -40302 38328 45363 56469 -135548 -98660 102224
776 102224 66134 190218 3589 -95828 -92653 -117366 -17868 5534 81659 104923 -146695
765 -146695 -64321 139496 103205 65306 -7727 -64088 -81282 -21424 -36963 -158840 -98980
754 -98980 139002 136107 225972 198613 -52610 -59505 117841 150309 254224 166899 15854
743 15854 49145 -24795 48455 86500 138483 172545 61937 90781 15824 -62 73399 -76660
731 -76660 19641 176533 77266 120286 171298 -39288 1030 -57115 -36141 5310 -112249
720 -112249 -70867 -46248 41607 136352 -26719 148993 183744 -125930 21434 78149 102273
709 102273 162730 107206 143979 23388 28763 77853 -19432 -96327 -64783 -85075 -35914 -53319
697 -53319 -5962 2919 -159954 -57190 -36577 -11124 -38936 -26405 8887 50785 62982 182137
685 182137 82273 -15112 80696 -23955 133814 121817 -17298 71289 146954 87416 28782
674 28782 -73817 -45245 112263 14704 130196 135589 131025 -29132 -111331 -122445 -11071
663 -11071 -44512 58986 -56940 -173971 6532 -81605 4193 61592 -29612 -65490 -94491
652 -94491 40897 47313 -28823 106828 -8744 -34161 155728 -11693 -2714 -37114 -147750
641 -147750 -53022 -73257 122726 93515 -23368 -27527 -1681 113187 179369 151050 329846
630 329846 152412 59578 83725 124307 22004 49829 -54826 -141711 -52746 -156525 -26302
619 -26302 -9079 -145370 -38829 -1924 -1609 85652 -81047 -67858 -81917 59077 218923
608 218923 115883 87867 -140476 -224218 6771 29291 -7384 -66512 -215463 -149082 -16908
597 -16908 -66246 -132043 -219638 -89783 13963 -117013 21523 61919 -62551 81096 75476
586 75476 80643 230071 143225 -59561 -82335 -19434 -4801 -26263 147430 184377 54309
575 54309 209796 194586 41310 179848 2033 67683 297270 203544 156247 70942 63846
564 63846 27943 8724 47458 66942 -51321 61331 -153533 -195079 -68939 -133749 57513
553 57513 7708 7427 168204 32559 74498 194245 -89895 -172142 -58919 -85431 179231
542 179231 106383 74620 61287 -125682 166139 208341 86330 114794 -133146 -107783 82869
531 82869 11678 152341 92342 -66645 38556 -33098 122108 11542 -108435 1358 -70471
520 -70471 10286 64428 -107308 13977 -62779 -253771 18571 5962 48214 -46166 -67741
509 -67741 13820 -116143 -107962 17846 -142718 -1279 -88555 -126815 135953 13986 35658
498 35658 -11801 -69251 55075 -2391 -68047 79181 14769 16856 99625 3389 85605 -97714
486 -97714 -83864 223034 -45067 20360 128711 -184752 11162 -44277 13316 107368 -77731
475 -77731 124603 92821 -91830 90493 -106206 -96535 27858 -18610 187233 167248 112946
464 112946 247335 -144770 -129320 20709 -99781 61490 -80292 -162579 -66700 -127181 235114
453 235114 171915 -16564 58410 -111896 -48948 16658 -57841 169889 -26191 -178747 53426
442 53426 -55348 82752 117440 -64609 -10331 -86957 -46489 160614 -45736 94578 167721
431 167721 63531 183257 21724 1507 56037 -129710 71055 70557 26879 18172 -117163
420 -117163 -78374 -51187 -149432 81838 -116470 -176900 -11401 -160099 -25892 86745 -61554
409 -61554 33292 -181481 -184570 -66173 -14097 143201 -20534 -102254 -54771 -247355 -9332
398 -9332 -13428 -95490 30953 -91419 -5376 108726 -169360 -129342 -45678 -18607 58424 -1201
386 -1201 81539 129319 -53303 -72433 101472 39528 181925 -110088 -72464 177128 68233
375 68233 83368 58842 -49174 -57417 -147930 24868 81432 -139082 -66183 -202883 -95839
364 -95839 -111746 -204437 -10296 -196861 -116752 -49586 -79389 -59689 -165206 -122307 20424
353 20424 -26621 13125 150217 70103 77080 47562 -108924 158174 50229 -86837 -120125
342 -120125 -108001 -140638 -80871 -12460 7356 18394 20631 -131335 -139970 80834 76249 142971
330 142971 115856 131527 204587 144676 98415 25537 -127436 44392 72999 59492 228989
319 228989 131372 -8575 -37168 -112558 7728 138195 121200 80977 -16050 56799 215733
308 215733 183582 138245 34293 109548 28553 162280 350930 48874 -83852 -12917 -55851
297 -55851 17828 11664 -69219 4166 -123926 -98119 -138334 -44966 -20470 -43013 62995 104863
285 104863 -58472 -48709 92237 -75610 6194 18461 -75778 -45292 -17544 38479 -11890
274 -11890 -86897 -13036 46352 78284 80993 -32234 -7814 -179201 -74542 42205 -25479
263 -25479 -86144 -58358 -18938 27260 -63032 -27890 -9547 -132924 5365 -12434 35838 -23928
251 -23928 -230228 -65439 10326 18784 26717 -173621 -42211 63416 25960 33823 -63105 -8742
239 -8742 -5194 -125822 -118633 -52413 -59661 -57156 -153401 -270816 -148719 -182575 -171078 -101624
227 -101624 -157278 -45662 -23832 -17383 80281 -92247 -28232 -241499 -282111 -64449 -85766
216 -85766 -127672 -95137 -96346 64338 30418 -19195 -145534 -218961 -64767 -20832 -69072 37662
204 37662 -148846 -202483 -211062 -103986 32888 26409 -109122 -233095 -139057 -31013 -51061
193 -51061 -162043 -116761 -122989 -122919 -43812 -54525 23899 84545 -160537 -244267 -166297 -49479
181 -49479 -79680 -160286 -217200 -194055 -112349 6137 -77005 -44823 -54502 -126926 -48356 -20349
169 -20349 -189425 -178972 -225182 -197300 -89114 -103624 -19802 -42136 -141462 -86493 -41728 40873
157 40873 38074 -128069 -88097 -149599 -164792 -204711 -300219 -193925 -215111 -156019 -100227 -128533
145 -128533 -67250 -76560 -266904 -185809 -146522 -213762 -131734 -113157 -78968 -162646 -296409 -138455
133 -138455 -83126 -157732 -214155 -323105 -163928 -179760 -224533 -142705 -242871 -221411 -23900
122 -23900 -99917 -180174 -206340 -258738 -123476 -83803 -123995 -186901 -277196 -336353 -278447 -169629
110 -169629 -76366 -180840 -305274 -310920 -291785 -220179 -161948 -245478 -216043 -318097 -335477
99 -335477 -233044 -248811 -108059 -256818 -393159 -391521 -348082 -274491 -310898 -354119 -426291
88 -426291 -415811 -383368 -295543 -231965 -230023 -382899 -283596 -117890 -328173 -323178 -377813 -561497
76 -561497 -477317 -377682 -248682 -181643 -359461 -400821 -336458 -315981 -296316 -349451 -452556
65 -452556 -460771 -389010 -341332 -256725 -313580 -387034 -481409 -365384 -291146 -252810 -242255 -257721
53 -257721 -423049 -517037 -464134 -443974 -377076 -479330 -453187 -408921 -467803 -414988 -365398 -471037
41 -471037 -588268 -491120 -347466 -331884 -347107 -441909 -537822 -481655 -375408 -296406 -298655 -465109
29 -465109 -544456 -487731 -504383 -524525 -488998 -601984 -603747 -510338 -434652 -379541 -454055 -597231
17 -597231 -547365 -534859 -418874 -447569 -525672 -647587 -716330 -677321 -629666 -570501 -487666 -569994
5 -569994 -617147 -560617 -464206 -508994 -567130
0 -567130
$$ Imaginary data points
##PAGE= N=2
##DATA TABLE= (X++(I..I)), XYDATA
16383 -2270377 -2175425 -2153064 -2058080 -2111972 -1980995 -1911458 -1835694 -1822094 -1804879 -1818910 -1846457
16372 -1846457 -1779050 -1680092 -1571705 -1628648 -1640370 -1708845 -1571591 -1523672 -1453629 -1351582 -1497576
16361 -1497576 -1410130 -1311290 -1303786 -1183998 -1131234 -1108461 -1147675 -1151867 -1141642 -1075238 -1015262
16350 -1015262 -985301 -885031 -906570 -801301 -787223 -680523 -683644 -693946 -688922 -664839 -578285
16339 -578285 -594984 -628919 -623796 -498963 -255430 -324095 -321518 -268814 -324448 -288554 -177144
16328 -177144 -221425 -231531 -192950 -181492 -92937 22595 28226 -15230 -28857 -39092 34204
16317 34204 136191 184899 255426 189564 205200 330064 422732 402600 328468 368925 328429
16306 328429 446622 585987 682550 664597 638407 670306 715466 810355 750921 766073 821518
16295 821518 885523 976498 913635 997088 938765 872215 790032 851839 1067305 1108468 976522
16284 976522 964591 1159959 1077503 1246589 1321310 1200976 1142640 1183015 1400161 1440234 1407803
16273 1407803 1333358 1396717 1401789 1539220 1462290 1511376 1614176 1565314 1708180 1753854 1728444
16262 1728444 1715483 1760746 1720218 1678992 1775401 1827572 1852485 1879313 1824239 1795957 2019778
16251 2019778 2082273 1822520 1900430 1846790 1940488 1993278 2052077 2091105 1945121 2038508 2096849
16240 2096849 2124891 2224580 2323752 2233795 2155254 2101971 2221907 2252810 2180237 2220190 2414455
16229 2414455 2370281 2363490 2470375 2396429 2321225 2381824 2345313 2526500 2723257 2696374 2447533
16218 2447533 2343469 2489638 2480948 2513990 2699589 2574746 2641014 2553456 2677647 2813357
16208 2813357 2783252 2805636 2706359 2752543 2799954 2864716 2695061 2734184 2743771 2853536 2816580
16197 2816580 2735358 2881338 2780443 2772735 2993054 3045609 3140159 3214505 3063821 2874435
16187 2874435 2981180 3080972 3061098 3139471 3019145 2911823 3015900 3262627 3152012 3161651
16177 3161651 3143911 3117019 3172632 3204373 3223560 3221441 3177204 3076204 3215416 3191500 3358359
16166 3358359 3264656 3120057 3006726 3139594 3192088 3111665 3081613 3103363 3031853 3030141 3268398
16155 3268398 3381586 3145310 3268972 3295924 3119728 3199155 3322599 3296688 3323027 3254279
16145 3254279 3142378 3312792 3271122 3213203 3181249 3356614 3398854 3332915 3367085 3356486 3226021
16134 3226021 3170624 3194508 3210422 3448038 3392995 3348113 3383591 3355159 3313506 3402198 3546903
16123 3546903 3512306 3547286 3538079 3380625 3528272 3499785 3455849 3526348 3386998 3257144 3431920
16112 3431920 3579729 3461904 3541671 3590771 3485936 3533531 3572818 3488929 3460028 3487749 3557350
16101 3557350 3640786 3515514 3405612 3340042 3472267 3639792 3648588 3816902 3657012 3640862
16091 3640862 3624584 3777860 3718161 3655577 3622345 3548008 3624138 3665703 3558167 3499656 3408957
16080 3408957 3470190 3602264 3709395 3587228 3544732 3566700 3434811 3532882 3616905 3661843
16070 3661843 3598566 3498124 3566756 3453162 3635676 3710629 3715567 3705314 3541266 3547588 3698440
16059 3698440 3734876 3664863 3739382 3581268 3471210 3488524 3644699 3677126 3655895 3642816 3580119
16048 3580119 3729481 3795199 3704964 3583148 3625414 3481997 3521862 3562062 3547676 3625631 3533967
16037 3533967 3590060 3625569 3648580 3570851 3680902 3702678 3618497 3548461 3777848 3665614 3618644
16026 3618644 3578117 3522547 3705458 3756822 3593663 3591233 3568163 3538193 3343023 3447891 3614466
16015 3614466 3595990 3619005 3625317 3618098 3576005 3552486 3625684 3735240 3638786 3674772 3697961
16004 3697961 3637010 3679398 3587888 3576685 3619578 3591074 3643535 3483086 3345493 3555674 3740289
15993 3740289 3722615 3692701 3551699 3624728 3746623 3792259 3801117 3694476 3664393 3595342 3634963
15982 3634963 3820086 3627578 3588304 3534189 3496643 3672032 3838115 3765651 3676437 3616374
15972 3616374 3609380 3719788 3759668 3718272 3551769 3518777 3562612 3483933 3662385 3760064 3800762
15961 3800762 3836054 3728562 3866409 3871503 3788140 3831782 3602390 3539844 3532879 3592577 3677017
15950 3677017 3674351 3544434 3746349 3663479 3738658 3817913 3595872 3703692 3699358 3626737 3639979
15939 3639979 3712879 3756097 3762337 3708723 3742638 3678133 3769460 3711579 3566963 3684828 3812008
15928 3812008 3620044 3648327 3608910 3599456 3678950 3504483 3545581 3619560 3676101 3715735 3656779
15917 3656779 3634696 3645648 3634379 3597977 3579669 3538121 3603510 3568250 3569306 3607750 3599818 3807416
15905 3807416 3848385 3638892 3714729 3652923 3714081 3629916 3572367 3637647 3533205 3603272 3694252
15894 3694252 3596907 3580330 3534942 3673860 3583432 3520431 3682981 3588409 3628126 3573658 3478859
15883 3478859 3620627 3680839 3695375 3754528 3641991 3625767 3719897 3616249 3782825 3894416
15873 3894416 3606823 3698377 3640191 3577862 3634760 3709461 3630595 3553810 3643881 3630037 3480945
15862 3480945 3604701 3753097 3686999 3700117 3752770 3599259 3688776 3693163 3761633 3723458 3563537
15851 3563537 3571997 3597068 3757793 3709963 3641797 3741825 3645666 3620824 3895180 3741176 3647043
15840 3647043 3581667 3665872 3843786 3705167 3765854 3847930 3793321 3741700 3518172 3687797
15830 3687797 3732160 3647851 3702703 3706377 3545576 3607209 3682332 3695788 3910256 3675719 3625539
15819 3625539 3695058 3705925 3772452 3727474 3775610 3730720 3605358 3677290 3688196 3769924 3832853
15808 3832853 3662059 3524923 3657174 3713490 3823358 3663254 3647190 3680889 3725159 3729438
15798 3729438 3565098 3662175 3768488 3596102 3589992 3813785 3677290 3710855 3719531 3610118
15788 3610118 3738490 3737362 3688869 3634111 3592339 3741003 3747620 3826548 3679403 3759165 3823584
15777 3823584 3672829 3667600 3744729 3718856 3746285 3791251 3791006 3810303 3832447 3765457 3668617 3675140
15765 3675140 3743622 3629423 3644229 3752053 3729216 3701846 3607685 3634043 3609592 3657063 3631219
15754 3631219 3738789 3710275 3683975 3788293 3636710 3518111 3468143 3696659 3771563 3693384
15744 3693384 3805452 3687120 3731409 3768234 3774889 3736131 3771099 3767615 3803639 3878792 3958973
15733 3958973 3982693 3838969 3845775 3649501 3659973 3720779 3790935 3773010 3702970 3723102 3783092
15722 3783092 4015924 3888337 3790876 3730247 3762161 3816416 3919078 3929587 3861712 3802934 3704596
15711 3704596 3804607 3929799 3911566 3882976 3869437 3769571 3619058 3784399 3624905 3493327
$$ [...]
##END NTUPLES=NMR SPECTRUM
##END=
