##TITLE=1H_DE-80H_X3
 200.13MHz, d2o
 8 sc
 
 19ns.26.2.2025
##JCAMPDX= 6.0         $$ Bruker NMR JCAMP-DX V2.0
##DATA TYPE= NMR SPECTRUM
##DATA CLASS= NTUPLES
##ORIGIN= UXNMR, Bruker Analytische Messtechnik GmbH
##OWNER= pz
$$ XWIN-NMR		Version 3.5
$$ Wed Oct 15 15:00:19 2025 Russian Standard Time (UT+4h)  Yarkov@DPX200
##.OBSERVE FREQUENCY= 200.1313
##.OBSERVE NUCLEUS= ^1H
##.ACQUISITION MODE= SIMULTANEOUS
##.ACQUISITION SCHEME= undefined
##.AVERAGES= 8
##.DIGITISER RES= 18
##SPECTROMETER/DATA SYSTEM= spect
##.PULSE SEQUENCE= zg30
##.SOLVENT NAME= CDCl3
##.SHIFT REFERENCE= (INTERNAL, CDCl3, 0, 15.4891)
##AUDIT TRAIL= $$ (NUMBER, WHEN, WHO, WHERE, WHAT)
$$ ##TITLE= Audit trail, XWIN-NMR		Version 3.5
$$ ##JCAMPDX= 5.01
$$ ##ORIGIN= Bruker BioSpin GmbH
$$ ##OWNER= Yarkov
$$ C:/Bruker/XWIN-NMR/data/yarkov2/nmr/H-C/1/pdata/1/auditp.txt
$$ ##AUDIT TRAIL=  $$ (NUMBER, WHEN, WHO, WHERE, WHAT)
(   1,<2025-10-15 14:59:40.48 +0400>,<Yarkov>,<DPX200>,
      <created by zg, POWCHK disabled, PULCHK disabled
       configuration hash MD5:
       00 E9 B6 7A A2 85 ED C7 34 08 36 98 17 FE 4E 26
       data hash MD5: 16K
       96 09 73 31 CE 5D E7 1E 25 DB 1C 90 39 1B C8 D3>)
(   2,<2025-10-15 14:59:44.45 +0400>,<Yarkov>,<DPX200>,
      <Start of raw data processing
       efp BC_mod = 2 LB = 0.25 FT_mod = 6 PKNL = 1 PHC0 = -3350.054 PHC1 = 8.932312 SI = 16K 
       data hash MD5: 16K
       4C 38 41 69 49 1C 69 46 25 F7 F0 B6 7D F6 BB 98>)
(   3,<2025-10-15 14:59:48.92 +0400>,<Yarkov>,<DPX200>,
      <abs ABSG = 5 
       data hash MD5: 16K
       9E 07 1E D0 95 CD 96 B1 11 74 0C EB 2C 9A 09 A3>)
$$ ##END=
$$ 
$$ hash MD5
$$ D8 F5 FA 36 3C 62 29 00 0F 0F B4 EE 24 A8 09 5F
##$RELAX= 
##$RELAX= 
##$RELAX= 
##$RELAX= 
##$RELAX= 
##$RELAX= 
$$ Bruker specific parameters
$$ --------------------------
##$DU= <C:/Bruker/XWIN-NMR>
##$EXPNO= 1
##$NAME= <H-C>
##$PROCNO= 1
##$TYPE= <nmr>
##$USER= <yarkov2>
##$AMP= (0..31)
100 100 100 100 100 100 100 100 100 100 100 100 100 100 100 100 100 100 
100 100 100 100 100 100 100 100 100 100 100 100 100 100 
##$AQSEQ= 0
##$AQ_mod= 1
##$AUNM= <au_zg>
##$AUTOPOS= <>
##$BF1= 200.13
##$BF2= 200.13
##$BF3= 200.13
##$BF4= 200.13
##$BF5= 200.13
##$BF6= 200.13
##$BF7= 200.13
##$BF8= 200.13
##$BYTORDA= 1
##$CFDGTYP= 0
##$CFRGTYP= 5
##$CHEMSTR= <none>
##$CNST= (0..31)
1 1 145 1 1 1 1 1 1 1 1 1 1 1 1 1 1 1 1 1 1 1 1 1 1 1 1 1 1 1 1 1 
##$CPDPRG= <>
##$CPDPRG1= <>
##$CPDPRG2= <>
##$CPDPRG3= <>
##$CPDPRG4= <mlev>
##$CPDPRG5= <mlev>
##$CPDPRG6= <mlev>
##$CPDPRG7= <mlev>
##$CPDPRG8= <mlev>
##$CPDPRGB= <>
##$CPDPRGT= <>
##$D= (0..31)
0 0.7 0 0 0 0 0 0 0 0 0 0.03 0 0 0 0 0 0 0 0 0 0 0 0 0 0 0 0 0 0 0 0 
##$DATE= 1760525979
##$DBL= (0..7)
120 120 120 120 120 120 120 120 
##$DBP= (0..7)
150 150 150 150 150 150 150 150 
##$DBP07= 0
##$DBPNAM0= <>
##$DBPNAM1= <>
##$DBPNAM2= <>
##$DBPNAM3= <>
##$DBPNAM4= <>
##$DBPNAM5= <>
##$DBPNAM6= <>
##$DBPNAM7= <>
##$DBPOAL= (0..7)
0.5 0.5 0.5 0.5 0.5 0.5 0.5 0.5 
##$DBPOFFS= (0..7)
0 0 0 0 0 0 0 0 
##$DE= 6
$$ [...]
##$SUBNAM3= <"">
##$SUBNAM4= <"">
##$SUBNAM5= <"">
##$SUBNAM6= <"">
##$SUBNAM7= <"">
##$SUBNAM8= <"">
##$SUBNAM9= <"">
##$SW= 18.0517328524113
##$SWIBOX= (0..15)
0 0 2 0 0 0 0 0 0 0 0 0 0 0 0 0 
##$SW_h= 3612.71676300578
##$TD= 16384
##$TD0= 1
##$TE= 0
##$TE2= 300
##$TE3= 300
##$TEG= 300
##$TL= (0..7)
0 120 120 120 120 120 120 120 
##$TP= (0..7)
150 150 150 150 150 150 150 150 
##$TP07= 0
##$TPNAME0= <>
##$TPNAME1= <>
##$TPNAME2= <>
##$TPNAME3= <>
##$TPNAME4= <>
##$TPNAME5= <>
##$TPNAME6= <>
##$TPNAME7= <>
##$TPOAL= (0..7)
0.5 0.5 0.5 0.5 0.5 0.5 0.5 0.5 
##$TPOFFS= (0..7)
0 0 0 0 0 0 0 0 
##$TUNHIN= 0
##$TUNHOUT= 0
##$TUNXOUT= 0
##$USERA1= <user>
##$USERA2= <user>
##$USERA3= <user>
##$USERA4= <user>
##$USERA5= <user>
##$V9= 5
##$VALIST= <valist>
##$VCLIST= <CCCCCCCCCCCCCCC>
##$VD= 0
##$VDLIST= <DDDDDDDDDDDDDDD>
##$VPLIST= <PPPPPPPPPPPPPPP>
##$VTLIST= <TTTTTTTTTTTTTTT>
##$WBST= 1024
##$WBSW= 4
##$XGAIN= (0..3)
0 0 0 0 
##$XL= 0
##$YL= 0
##$YMAX_a= 257815
##$YMIN_a= -433883
##$ZGOPTNS= <>
##$ZL1= 120
##$ZL2= 120
##$ZL3= 120
##$ZL4= 120
##$ABSF1= 15.48907
##$ABSF2= -2.562779
##$ABSG= 5
##$ABSL= 3
##$ALPHA= 0
##$AQORDER= 0
##$ASSFAC= 0
##$ASSFACI= 0
##$ASSFACX= 0
##$ASSWID= 0
##$AUNMP= <proc_1d>
##$AZFE= 0.1
##$AZFW= 0.1
##$BCFW= 0
##$BC_mod= 2
##$BYTORDP= 0
##$COROFFS= 0
##$CY= -3
##$DATMOD= 1
##$DC= 0
##$DFILT= <>
##$DTYPP= 0
##$F1P= 0
##$F2P= 0
##$FCOR= 1
##$FTSIZE= 16384
##$FT_mod= 6
##$GAMMA= 0
##$GB= 0
##$INTBC= 1
##$INTSCL= 3.241238e-09
##$ISEN= 128
##$LB= 0.25
##$LEV0= 0
##$LPBIN= 0
##$MAXI= 10000
##$MC2= 0
##$MEAN= 0
##$ME_mod= 0
##$MI= 1.114404
##$NCOEF= 0
##$NC_proc= -7
##$NLEV= 6
##$NOISF1= 3.799351
##$NOISF2= 2.8
##$NSP= 0
##$NTH_PI= 0
##$NZP= 0
##$OFFSET= 15.48907
##$PC= 1
##$PHC0= -3350.054
##$PHC1= 8.932312
##$PH_mod= 1
##$PKNL= yes
##$PPARMOD= 0
##$PSCAL= 0
##$PSIGN= 0
##$REVERSE= no
##$SF= 200.130006531046
##$SI= 16384
##$SIGF1= 3
##$SIGF2= 2
##$SINO= 0.751879
##$SIOLD= 32768
##$SREGLST= <19F.Aceton>
##$SSB= 0
##$STSI= 16384
##$STSR= 0
##$SW_p= 3612.71676300578
##$SYMM= 0
##$S_DEV= 0
##$TDeff= 16384
##$TDoff= 0
##$TI= <>
##$TILT= no
##$TM1= 0
##$TM2= 0
##$TOPLEV= 0
##$USERP1= <user>
##$USERP2= <user>
##$USERP3= <user>
##$USERP4= <user>
##$USERP5= <user>
##$WDW= 1
##$XDIM= 16384
##$YMAX_p= 405068181
##$YMIN_p= -889217
$$ End of Bruker specific parameters
$$ ---------------------------------
##NTUPLES= NMR SPECTRUM
##VAR_NAME=  FREQUENCY,     SPECTRUM/REAL,   SPECTRUM/IMAG
##SYMBOL=    X,             R,               I
##VAR_TYPE=  INDEPENDENT,   DEPENDENT,       DEPENDENT
##VAR_FORM=  AFFN,          ASDF,            ASDF
##VAR_DIM=   16384,         16384,           16384
##UNITS=     HZ,            ARBITRARY UNITS, ARBITRARY UNITS
##FACTOR=    0.220516191357247, 1,           1
##FIRST=     3099.82766798379, 0,            0
##LAST=      -512.889095021992, 0,           0
##MIN=       -512.889095021992, -889217,     0
##MAX=       3099.82766798379, 405068181,    0
$$ Real data points
##PAGE= N=1
##DATA TABLE= (X++(R..R)), XYDATA
$$ [...]
7720D31713P6237K52175k08043k74678n9212K03269J30878m8440M2148j52436
7710C93611P9483J5958p8932j21384M06914k5607J6449l19395j43201Q6778L78614
7699F89288J21050j73761N8991k58527J21632N7697j41661Q5902j66680J24820
7689E18751j43204J62436L1078l8175J04524M5323j51413k43201J92824q5421
7679C93522l33497K04773K42526J51724l3502o6035l65610k0582J02197k9970
7669B45546J88459m8209j09650j4742P5417k8281k5896N4045J25969l8242K03546
7658F27962Q272L2366k57292j75776K33763j02744j78688L0628K13625J70802
7648F02918j56078M4462j42150K44730l5934l8094j59024j87268L18496K16257
$$ y = [431713, 507950, 760125, 552082, 277404, 218192, 421461, 552339, 503899, 546047, 393611, 473094, 489052, 410120, 288736, 695650, 670043, 686492, 367097, 223896, 310674, 689288, 810338, 636577, 695568, 437041, 558673, 616370, 474709, 560611, 393931, 518751, 375547, 537983, 569061, 530886, 635410, 680733, 529320, 286119, 478943, 393522, 60025, 264798, 507324, 659048, 625546, 559511, 193901, 173319, 275516, 245546, 434005, 385796, 276146, 261404, 336821, 308540, 282644, 336689, 462658, 424416, 627962, 636234, 668600, 411308, 235532, 469295, 366551, 187863, 218491, 432116, 602918, 446840, 491302, 349152, 593882, 557948, 519854, 360830, 173562, 492058, 708315]
7638G08315j95648j64915J17756K6676p5088k06490L46507L6856j20006J24105
7628E98068m6273n4284m0718K73197o3120K8666J65524l08117k17129M0499J02007
7617D78320o7184n3731J02499r1465O9170J28517n1185p1179J37488j68163j00937
7606C12150J98626L11684k2734k33780l3782P8690k20657j40274P2941n896j091
7595C15877P4262J91133j07852o5862K09525Q4456l3421J4790Q6309L5360j87333
7584F17244n8440N6888P2948Q1692k08648j78823J59885r0659o683R2520O9106
7573F07030P709q8778J6094k47615K36997R6653l07115O8956J41875j3783L9895
7562E57918L99674k35862l74818l56828O6932L59704K8792l9502r1628q607j15001
$$ y = [708315, 512667, 347752, 465508, 492184, 417096, 210606, 557113, 593969, 473963, 598068, 551795, 497511, 456793, 729990, 666870, 695536, 861060, 552943, 335814, 376313, 478320, 411136, 357405, 459904, 368439, 437609, 566126, 514941, 443762, 581250, 413087, 312150, 510776, 822460, 799726, 565946, 532164, 610854, 390197, 249923, 322864, 316968, 315877, 390139, 581272, 473420, 407558, 617083, 701539, 668118, 682908, 769217, 804577, 617244, 558804, 615692, 688640, 770332, 561684, 382861, 542746, 452087, 445404, 537924, 607030, 614739, 525961, 542055, 294440, 531437, 628090, 320975, 389931, 531806, 518023, 557918, 957592, 721730, 346912, -9916, 57016, 416720, 445512, 406010, 314382, 305775, 190774]
7551A90774L0505K12588p5911J51476Q0452p5051P2942j15565k2863j13635o761
7540C28951o8018l06864K97717K84639p1982j59450K05602P3253p0244j89261
7530C24343Q2777O7324O6113m9573L30341L04536l7723r8994q528N1088L9658
7519A071362L5234J49778L18409r9537L22911J64608L17424l6637j73637r869
7509B060046P1184J75101M5573p8031l56915k00594j71836l10951o3696O9907
7499A239788p0559O7771K65359l09290m13780N8723J31524j2656M9765k6197l6602
7488I43846k18944P5921j68963l4483l2000o6318O5611L7254M1514q0790L40461
7477I03109K48240j74568j46837K6785O7965K7444O0995j27572J27970J67770
$$ y = [190774, 221279, 433867, 357956, 509432, 589884, 514833, 587775, 472210, 449347, 335712, 328951, 260933, -45931, 251786, 536425, 464443, 304993, 510595, 583848, 513604, 324343, 407120, 474444, 540557, 490984, 821325, 1125861, 1088138, 989144, 980616, 1031704, 1071362, 1106596, 1256374, 1574783, 1475246, 1798157, 1962765, 2280189, 2243552, 2069915, 2060046, 2131230, 2306331, 2351904, 2273873, 1916958, 1716364, 1544528, 1233577, 1169881, 1239788, 1169229, 1237000, 1502359, 1193069, 779289, 838012, 969536, 956880, 1006645, 980448, 943846, 724902, 800823, 631860, 597377, 565377, 499059, 564670, 601924, 643438, 562648, 903109, 1151349, 976781, 829944, 856729, 924694, 952138, 1013133, 885561, 1013531, 1181301]
7467A181301J89662J61862m2582M5069J13965K94150J69150K18149j88050N4426
7457B197102J10189l47650k1323J92342p5456k17494l18706J69727k57856k63296
7447A167579k78549j74325J08359j27521J17152K5962k56676m7649O6205K50244
7437H50781r139N0842J35903j0400k3559p4830l46017n5085J37336j57653K6480
7426E24659N5585K23290j6212k69821Q8629P1361J638l076k94740K46547K63206
7415H91066j8707r2715j63471l20864O1468K28752j0601O9131R3928J38708q1761
7404G94934J42561m0253k08786K35810k77693J75973M0180l2116P6320M0684Q9145
7393A036759P4498K19450j48877r8296r040j96392n983Q3972k35431O0545q7799
$$ y = [1181301, 1370963, 1532825, 1490243, 1535312, 1649277, 1943427, 2112577, 2330726, 2142676, 2197102, 2307291, 1959641, 1938318, 2130660, 2055204, 1837710, 1519004, 1688731, 1430875, 1167579, 889030, 714705, 823064, 695543, 812695, 838657, 581981, 534332, 600537, 850781, 841642, 892484, 1028387, 1017987, 994428, 919598, 573581, 518496, 655832, 498179, 524659, 580244, 803534, 787322, 517501, 606130, 677491, 679129, 676053, 381313, 627860, 891066, 872359, 779644, 616173, 295309, 356777, 585529, 574928, 644059, 737987, 876695, 794934, 937495, 897242, 688456, 924266, 646573, 822546, 862726, 830610, 906930, 947614, 1036759, 1111257, 1330707, 1181830, 1083534, 1074494, 878102, 872119, 956091, 720660, 781205, 693406]
7382F93406M1762J58873m4916o7852p0902j96163l2404J99072P9256M49260K18995
7371A428387k66839K13003M10105J45917O3835j72604L04237P5435j25817J13731
7361B189390m5715K4744l49759k8844l79161l2925J38951j21374K9147j78455
7351A245999k93133o5891P9684k3494N9554j05715O2440j5852l8980O4258J49750
7340A118620r3846k14296j56228K9027J53512j72283j03148k40101M2243J97555
7330E61055J21705L7370j4125j16917J9229j08808o232K26824K69679K1855j31539
7319H80096k76136j72537O6999o7905J68691j15253j15982j20889K27680L28111
7309H02875j75667l01968k5159J95432J68567j26588j3620j50348k13199L90372
$$ y = [693406, 735168, 894041, 849125, 781273, 710371, 514208, 481804, 680876, 760132, 1209392, 1428387, 1161548, 1374551, 1784656, 1930573, 1994408, 1821804, 2126041, 2201476, 2075659, 2189390, 2143675, 2168419, 1818660, 1789816, 1410655, 1377730, 1516681, 1395307, 1424454, 1245999, 952866, 886975, 966659, 943165, 1002719, 897004, 959444, 943592, 904612, 968870, 1118620, 1024774, 810478, 654250, 683277, 836789, 664506, 561358, 321257, 363500, 561055, 682760, 720130, 706005, 589088, 608317, 499509, 493277, 720101, 989780, 1011635, 880096, 603960, 431423, 498422, 430517, 599208, 483955, 367973, 247084, 474764, 802875, 627208, 325240, 300081, 495513, 664080, 537492, 523872, 373524, 160325, 550697]
7299E50697J27676j35928K63955J46284p354J21705j69806j46718L73636J45232
7289A269379m5315j11398K60111K65883Q7797J03639J00510l05248L6861J76148
7279A838367j19131P1136O2538K21210j00103m24902k23127M8921k3650q849r2641
7268A249769J02113k33473l21777J16961R8416K10687q3434j63839m30819k28342
7258C16262m1992L21961N3130j69758L2578J94204K4833k04970o2449M12753l5869
7247H40683j24856J48177M0632j62280O4020Q3937J05443J00220k96564J31826
7237I31238J08426K49651K47890J05124K46200Q7478j25356j04669n24728r9314
7227A121940K53812J09328j78793Q1003k77891L5281K13446l5768M00974J94771
$$ y = [550697, 678373, 542445, 806400, 952684, 945330, 1067035, 897229, 750511, 1124147, 1269379, 1224064, 1112666, 1372777, 1638660, 1726457, 1830096, 1930606, 1625358, 1662219, 1838367, 1719236, 1790372, 1852910, 2074120, 1974017, 1549115, 1325988, 1374909, 1351259, 1342410, 1249769, 1351882, 1118409, 796632, 913593, 1012009, 1222696, 1139262, 975423, 544604, 316262, 274270, 596231, 649361, 479603, 512181, 706385, 731218, 526248, 463799, 876552, 840683, 715827, 864004, 904636, 742356, 806376, 890313, 995756, 1095976, 799412, 931238, 1039664, 1289315, 1537205, 1642329, 1888529, 1976007, 1850651, 1745982, 1221254, 1121940, 1375752, 1485080, 1306287, 1387290, 1109399, 1144680, 1358126, 1322358, 1723332, 1918103]
7217A918103p2330O564J72830j79647j28322L69105K6515J44642R7503l6825J52875
7206B471013L85599m0267J90882L63025K20866L75680K38890J28050M45158N23134
7196E302030Q60666N81825O71360Q29377Q31394O62284O71225Q79430O65279M42954
7186A2397824L37712r0919j59255k91J40766r3922l31374M1194O5382J99609K38443
7175A2745169L9100K02222K35921j07391n7066N1058J07080n2546R9901m3921
7165A3219527j61572l49056m41965m78098l42579k44588k43494j56938k97565
7156A0503672n35485l34031l91678l86503m76125n10810k35919j78606m27899
7147G026616j77007j30215n44049k08543k78344k10341k33694j8692l36287j46037
$$ y = [1918103, 1845773, 1852337, 2025167, 1845520, 1717198, 2086303, 2112818, 2257460, 2354963, 2318138, 2471013, 2856612, 2816345, 3007227, 3370252, 3591118, 3966798, 4205688, 4333738, 4778896, 5302030, 6162696, 6744521, 7415881, 8245258, 9076652, 9738936, 10410161, 11289591, 11954870, 12397824, 12735536, 12644617, 12485362, 12485071, 12625837, 12531915, 12200541, 12241735, 12307117, 12506726, 12745169, 12784269, 12986491, 13222412, 13115021, 13057955, 13109013, 13216093, 13163547, 13263448, 13219527, 13057955, 12708899, 12266934, 11788836, 11446257, 11201669, 10958175, 10801237, 10503672, 9968187, 9634156, 9242478, 8855975, 8379850, 7869040, 7633121, 7454515, 7026616, 6849609, 6719394, 6175345, 5966802, 5688458, 5478117, 5244423, 5225731, 4889444, 4743407]
7137D743407j67551o15043J23869K6948n8006j57070J60113l43121j91230p8o4200
7126C458038j52053K14798n0560m10254K75616K9174J0491N9255q2424p7057j7646
7115C257378Q0696J58929Q8947M3481J50353R7061J08309K72389K07874k50488
7105D214929J23839L01282J5005L3039l2610j4409l47844j35773k92493k20860
7095C644105k24416j62751R6201k32089k41160q069k88070j91227o3628k77781
7085B051115J40534L070l96251j32886k554Q1892J91840j41592j61408k90642
7075A343118N9651J38676J0922j86210r3707l95349K7082K8659K71032j36352
7065A067522j06272M608k03631l2549N1215K16661N4171j59031J0945q2099M8748
$$ y = [4743407, 4575856, 3960813, 4084682, 4111630, 4053624, 3896554, 4056667, 3713546, 3522316, 3522238, 3458038, 3305985, 3520783, 3470223, 3059969, 3335585, 3364759, 3375250, 3434505, 3352081, 3275024, 3257378, 3338074, 3497003, 3585950, 3629431, 3779784, 3876845, 3985154, 4257543, 4465417, 4214929, 4338768, 4640050, 4655055, 4688094, 4655484, 4641075, 4293231, 4157458, 3864965, 3644105, 3419689, 3256938, 3353139, 3121050, 2879890, 2871821, 2583751, 2392524, 2328896, 2051115, 2191649, 2194719, 1798468, 1665582, 1663028, 1744920, 1936760, 1795168, 1633760, 1343118, 1402769, 1541445, 1552367, 1366157, 1272450, 877101, 904183, 932842, 1203874, 1067522, 961250, 965858, 762227, 729678, 780893, 997554, 1051725, 892694, 903639, 821540, 870288]
7054H70288P7188m5796j88339p5681K7820j57055j7542k34772K29362L27207q8996
7043G23684O320J81533q2648J2814r8348m0894J62476N0394K9046L93822o5810
7032A272389p8814K26344J95009K79650q1950k73441K21827L13244j8857l06133
7022A749268j49546k80796q3109k73979P993j41100k21082R7453L91426j02447
7012I94081l9789L9005j65606N1418J37570j43124n6188J19884j41067m8905o8444
7001F78835n9229K3414L3115J5986k45309m3521k36120L26838K12911j30666o3824
6990E12430o9069J10037n5542r2448j431k70093J641R4592K14468J51540k07902
6979C88223k7643Q6388j57590j50880Q3930n3255M0070J87119q4207j05745J03061
$$ y = [870288, 947476, 901680, 713341, 637660, 665480, 508425, 490883, 256111, 485473, 812680, 723684, 730004, 911537, 828889, 841703, 743355, 702461, 864937, 915331, 944377, 1338199, 1272389, 1193575, 1419919, 1614928, 1894578, 1812628, 1539187, 1761014, 2074258, 2055401, 1749268, 1599722, 1318926, 1235817, 961838, 969831, 828731, 607649, 705102, 1096528, 994081, 954292, 993297, 827691, 879109, 1016679, 873555, 817367, 937251, 796184, 747279, 678835, 619606, 643020, 676135, 692121, 446812, 403291, 167171, 494009, 706920, 576254, 512430, 443361, 553398, 497856, 405408, 403977, 133884, 135525, 230117, 444585, 596125, 388223, 360580, 446968, 289378, 138498, 222428, 169173, 209243, 396362, 312155, 206410, 309471]
6968C09471K8001K9962M2786j35521K4976J52467k20247p0167j87046J83800K38646
6957C97128m3468j31104j46450j26877n5793K50871J48165K03238p3595k80223
6947A41892j8880j6827Q9283J41544J77276l48732M7357o018L08708l4427r0147
6936C91029j80805l65766P6961K88310n2190k68990j3842L7089J67780J57231
6926B36807k17514l41355K95926O9923O1885J71833j92658j92769R7150O4842
6916E4070l5253J59239N9357k5233o7838p7670l00235J19124O8596p4484J57131
6905C6804K14750k31958P3338M5262N3865j0822K31830N370j287J27177J1359
6894E55688L2337j9398J46157J6717n1584J02645j06833k73719l4273r3939O9556
$$ y = [309471, 337472, 367434, 410220, 274699, 299675, 452142, 231895, 161728, -25318, 158482, 397128, 353660, 222556, 76106, -50771, -106564, 144307, 292472, 495710, 422115, 141892, 123012, 106185, 195468, 337012, 514288, 165556, 212913, 206895, 515603, 481176, 391029, 210224, -155542, -78581, 209729, 157539, -111451, -125293, -88204, 79576, 236807, 19293, -322062, -26136, 43787, 105672, 277505, 84847, -107922, -10772, 54070, 18817, 178056, 237413, 212180, 144342, 66672, -233563, -114439, -45843, -120327, 36804, 251554, 19596, 92934, 138196, 192061, 181239, 413069, 418439, 417152, 544329, 555688, 588025, 568627, 714784, 731501, 679917, 782562, 675729, 402010, 367737, 273798, 343354]
6883C43354J5280P6731k28286L10942r7556k65624J27764K4950j56444j09854
6873D1257r3494J34025J33721j35002l14859L1350O238J5804J6382K2521J71223
6862B9166K1152k97277L146J35845j0707K07157l1829j71596l1103L6497l01950
6851d11499J66420k1789J19222k5817j36611K04468j22499J94643J18499J123
6841H6160J95665j22967L51678l6372j46187l3885J58999J54286m5108l11627
6831B50642j3731J28959j82719k1498q9979J53032J25474l29945j29334J96552
6821H7453J50492j41072K11475J59323r5696K7399M1177r5677J08054M02973Q3006
6810I38907J22134j30151J8143K7308M44458J77474O11920M84502M75559M51702
$$ y = [343354, 358634, 435365, 207079, 518021, 420465, 154841, 282605, 307555, 151111, 41257, -52237, 81788, 215509, 80507, -234352, -203002, -196764, -180960, -164578, -142057, 29166, 50318, -246959, -243813, -107968, -118675, 88482, 56653, -114943, -146046, -109549, -411499, -245079, -266868, -147646, -173463, -310074, -105606, -228105, -33462, 85037, 86160, 281825, 158858, 510536, 474164, 327977, 294092, 453091, 607377, 562269, 250642, 236911, 365870, 183151, 161653, 71674, 224706, 350180, 20235, -109099, 87453, 237945, 96873, 308348, 467671, 371975, 399374, 440551, 344874, 452928, 855901, 938907, 1061041, 930890, 949033, 976341, 1420799, 1598273, 2210193, 2694695, 3170254, 3621956]
6800C621956O96612M56625N42179Q79754R5826j30457m52509p9857M07712P4534
6790F112375M94874K85103N48033L38786K22807l36569o96836q45638q25853q07098
6780D489984m02659k39007m08901l56742j24165n9276m17129q6245k99357k89583
6770A806920j56776p4638L8396n19r4191q5001k28057J34611k5046j46627J62790
6759A331862J58162o3701l6751j2637K48995o9973j6218j9678L08523M29970L99965
6748B658519q3078J76832L18066n6203K37359L45106L83178O9646K87571M31931
6738D768927M42619M42964M70145k12507l81195q465m22285k43073L73624J98099
6728E428853L35217M65725K86375K74436l57870n87898n94831n86654n23333l74324
$$ y = [3621956, 4318568, 4775193, 5317372, 6197126, 6292952, 6162495, 5709986, 5630129, 6037841, 6112375, 6607249, 6892352, 7440385, 7779171, 8001978, 7665409, 6968573, 6122935, 5297082, 4489984, 4087325, 3848318, 3439417, 3082675, 2958510, 2899234, 2482105, 2395860, 2096503, 1806920, 1650144, 1575506, 1613902, 1613383, 1519192, 1434191, 1206134, 1340745, 1315699, 1169072, 1331862, 1490024, 1426323, 1389572, 1376935, 1625930, 1555957, 1539739, 1520061, 1828584, 2258554, 2658519, 2575441, 2752273, 3070339, 3014136, 3251495, 3596601, 3979779, 4049425, 4336996, 4768927, 5211546, 5654510, 6124655, 5912148, 5530953, 5522488, 5100203, 4857130, 5230754, 5428853, 5764070, 6229795, 6516170, 6790606, 6432736, 5844838, 5250007, 4663353, 4140020, 3765696]
6718C765696n33807k48913k47360l2935n4900m14922j46194j10424j42599l63298
6708A470344j12943J18481M3748l4596k72036k0360j05710p6430m7443l22006
6698F41049P6146J61053j80794q1302L98K62525q0266k15855j7416o6692l0912
6687D67934N0195J70934j6872j55874p9897K9179k25357n6166L3755j675K08094
6676D24250j6839R901L5703j9786P9012l13984j99099Q3254M02059M1067o9899
6665D55639p6902p6821J96573j60797l7555K68433l67649J6397l4774l47916J38924
6654b6448j60701J59605J79210J09516R249m1542K1549j10516l33021J78242J77694
6643A62837j35017Q7924J10951q888j67138o1841J32855L0233Q5163l58398J69876
$$ y = [3765696, 3231889, 2982976, 2735616, 2702681, 2647781, 2232859, 2086665, 1976241, 1833642, 1470344, 1357401, 1475882, 1519630, 1485034, 1212998, 1192638, 1086928, 1010498, 963055, 641049, 717195, 878248, 697454, 616152, 616550, 879075, 798809, 582954, 565538, 498846, 467934, 518129, 689063, 672191, 516317, 436420, 465599, 240242, 184076, 217831, 216156, 424250, 407411, 417312, 453015, 433229, 512241, 198257, -842, 82412, 484471, 525538, 455639, 378737, 301916, 498489, 337692, 300137, 568570, 200921, 217318, 182544, -165372, -26448, -187149, -27544, 151666, 261182, 270431, 228889, 250438, 139922, -193099, -14857, 162837, 27820, 115744, 226695, 217807, 50669, -11172, 121683, 151916, 237079, -121319, 48557]
6632D8557J37205j08628J21500j52616J97137K21540O6418O0015J18839L6266
6622G46233k70155L83910J21745J2724J9794o1822o2159q824o5132L4104J34038
6611I84456J02956J46160L1806J74812K19475J88380J16362J57439L17175O15938
6601C054959N71174P11098M24167P50058N79365M67025l4322l91552k80690L1728
6591E883010J06469Q1199K29216M58781M23420M29967L14930k05982m54426l64251
6581F902333l40596m72979o0082J69229o3809K92226L54658K67292O33647M74257
6571H156176P79123P40412O5381L70308j37947j28011l9248L38877P59393P90958
6561A1695422Q64957J296257J469704J308220J201108R73126Q96882J112229Q09472
$$ y = [48557, 185762, 77134, 198634, 46018, 243155, 464695, 531113, 591128, 709967, 746233, 476078, 859988, 981733, 994457, 1014251, 952429, 890270, 881446, 816314, 850418, 984456, 1087412, 1233572, 1265378, 1440190, 1659665, 1848045, 1964407, 2121846, 2439021, 3054959, 3626133, 4337231, 4761398, 5511456, 6090821, 6557846, 6523524, 6131972, 5851282, 5883010, 5989479, 6070678, 6299894, 6758675, 7182095, 7612062, 7926992, 7721010, 7266584, 6902333, 6561737, 6088758, 6028676, 6197905, 6134096, 6426322, 6780980, 7048272, 7681919, 8156176, 8935299, 9675711, 9741092, 10111400, 9973453, 9845442, 9806194, 10145071, 10904464, 11695422, 12560379, 13856636, 15326340, 16634560, 17835668, 18808794, 19705676, 20817905, 21627377]
6552B1627377K10217k5804n82794j388753j180423j471039j376282j406319p67373
6543A3638807j139779j229267r37334o99666q00435o55152l02197o25662l67194
6534F882121o12332m33729l42882n79036l50367k96906j64107n4841j65115k47850
6524C634956l67026N3146k33710l2151k97506Q4959p6560K7603m32606m0176n9395
6513B261534l5546l23757m38980L01080J83793j81528k24307M1829K27092j9547
6503A791663J77538j09376j73862k15634J23411j22843J36205J30532j33437l9330
6493A564867k03068J77624R2904k96593j15617Q2321j26715n2625J07449J75249
6483A405796j73308n3202j39730k42232J85783K15083o1124j86572K26172L00999
$$ y = [21627377, 21837594, 21811790, 21228996, 19840243, 18659820, 17188781, 15812499, 14406180, 13638807, 12499028, 11269761, 10332427, 9632761, 8832326, 8177174, 7874977, 7249315, 6882121, 6269789, 5836060, 5493178, 4914142, 4563775, 4266869, 4102762, 4047921, 3882806, 3634956, 3267930, 3321076, 3087366, 3055215, 2757709, 2842668, 2766108, 2793711, 2361105, 2320929, 2261534, 2225988, 1902231, 1463251, 1764331, 1948124, 1766596, 1542289, 1584118, 1811210, 1791663, 1969201, 1859825, 1685963, 1470329, 1593740, 1470897, 1607102, 1737634, 1604197, 1564867, 1361799, 1539423, 1632327, 1335734, 1220117, 1302438, 1175723, 1123098, 1230547, 1405796, 1232488, 1179286, 1039556, 797324, 983107, 1198190, 1137066, 950494, 1176666, 1477665]
6473A477665j99394n4818j3465j92376j7345m3402j20544M9197j37419O0103J71811
6462I80013J1042m0689r3750l97112l5520L1880n9017K6465O4038M4858L7867
6451E70075K3273r6807j07107K64317J76984j79131k56329k46204k00814K26913
6441A75170J71178J20091j96172n3245q5481k00558L8556J2130M1832l1868m946
6430a3313K70508k92384k21777J73918Q9203M1530j05364l20855p9416J35765
6420c22185k06654J0345J28725j3042K22609J42603J471j19108J84024j30825
6410a02037k52020J15670k07474J53769o2590m2597o8529m8236j62465K26244
6400d50265R8151q0356l7603p1653o6826J95116k6020J19761L6929P8597j23790
$$ y = [1477665, 1278271, 1223453, 1209988, 1017612, 1000267, 956865, 836321, 885518, 748099, 808202, 980013, 991055, 950366, 856616, 459504, 423984, 455864, 396847, 423312, 487350, 532208, 570075, 593348, 496541, 389434, 653751, 830735, 651604, 395275, 149071, -51743, 175170, 346348, 466439, 270267, 217022, 131541, -69017, -30461, -18331, 23501, -8367, -13313, 257195, -35189, -256966, -83048, 6155, 47685, -57679, -378534, -457950, -322185, -528839, -518494, -389769, -402811, -180202, -37599, -36128, -155236, 28788, -102037, -354057, -238387, -445861, -292092, -354682, -397279, -465808, -514044, -676509, -450265, -352114, -432470, -470073, -541726, -608552, -413436, -439456, -319695, -282766, -204169, -327959]
6389c27959l124j52122j90588J83486j02872m4648j2434M1545j63066j01493M3839
6378h29436K8893K5841J13532j13999N7028K1336J25451K8812R4176K7154J29322
6367b91890J68049j74128k29766J90537n5162K37391J53356k07079l9328K0069
6357b27951K74737K27457k93083k25782p507N4523L0989j53235p6506J27747J51889
6346a16722N65J482r5357N5103l9189l32046J96954J03303o2164n1973O3427K9448
6334b47169l03242O3494J18467K34370j3323J29511J46688O7687j31559R7038
6324A61962J2925J99027J20043p5960k2419L1791L04454k1285l7773N4208M2712
6313G69685j19945k81036P9825J59585L6395m0564R8814N5544L4760L4817M1343
$$ y = [-327959, -331083, -483205, -673793, -490307, -593179, -637827, -650261, -608716, -771782, -873275, -829436, -800543, -774702, -661170, -775169, -718141, -696805, -571354, -542542, -448366, -421212, -291890, -123841, -297969, -527735, -337198, -392360, -154969, -1613, -208692, -248020, -227951, 46786, 274243, -18840, -244622, -252129, -197606, -166617, -319852, -396358, -268611, -116722, -116157, -114675, -210032, -154929, -194118, -526164, -329210, -225907, -288071, -340044, -276617, -247169, -550411, -486917, -368450, -134080, -147403, -17892, 128796, 196483, 64924, 161962, 174887, 373914, 493957, 417997, 395578, 427369, 731823, 710538, 672765, 726973, 769685, 649740, 368704, 448529, 608114, 644509, 603945, 702759, 758303, 793063, 827880, 869223]
6302H69223j467O5737l2711n3199Q3108P3092L7428J47911j41412o0904J22805
6291A109611q4881K16499j3350k77341J74570K97114j86512K55879j88384N6075
6281A359280M10806Q9868k5957n6040l15771P762K59249J71820k23187k65557
6271A412273N898M6109P6294j15586l87456J11761L216J51056J92552R0285l236
6260A583166l9776M13056J33327K28201K65765k3634l01429l2946o5407O4315
6250B224638R5007Q2568m6313k99836L7200K78425O5378j26320j69144j50377
6240A991226J45309n5123J84088J24901r0258K84314K37214K40880o4689K2364
6230C020226J05818j48388R1548K96064L19737O6082o3112K07923K71336L7322
$$ y = [869223, 867756, 933493, 900782, 847583, 930691, 1003783, 1041211, 1189122, 1047710, 986806, 1109611, 1024730, 1241229, 1227879, 950538, 1125108, 1422222, 1235710, 1491589, 1303205, 1359280, 1770086, 1859954, 1833997, 1777957, 1462186, 1469948, 1729197, 1901017, 1677830, 1412273, 1418171, 1464280, 1540574, 1424988, 1037532, 1149293, 1152509, 1303565, 1496117, 1586402, 1583166, 1543390, 1956446, 2089773, 2317974, 2583739, 2560105, 2258676, 2225730, 2160323, 2224638, 2319645, 2402213, 2355900, 2056064, 2093264, 2371689, 2437067, 2310747, 2141603, 1991226, 2136535, 2081412, 2265500, 2390401, 2300143, 2584457, 2821671, 3062551, 2997862, 3020226, 3126044, 2977656, 3069204, 3365268, 3685005, 3751087, 3687975, 3895898, 4167234, 4204556]
6220D204556L47796K07948K26143J71602Q7772K86066L68753K55539J64543K12641
6210F533359J91322O31075K05920L65412Q23743O19567N19932N67487O39749R41876
6200A2039442P21856R58341Q97673R62608R40301J012042P38274P09184P56042
6191A9735763M36575Q02262P96805P75955Q13673P43856R40404J312945J227688
6182B7585926J393486J628019J484709J480997J518307J961524J810042K074488
6174D0937498J953908K169699K541096K970693L185994L494643M154254M928123
6166F6335908N597203O262471P110361Q482773R840600J1090045J3146764J4899012
6158A42765137J6725345J8628994K1096937K3024680K3992223K4169040K4114001
$$ y = [4204556, 4552352, 4760300, 4986443, 5158045, 5245817, 5531883, 5900636, 6156175, 6320718, 6533359, 6724681, 7355756, 7561676, 7927088, 8750831, 9370398, 9890330, 10457817, 11097566, 12039442, 12761298, 13719639, 14617312, 15579920, 16520221, 17532263, 18270537, 18979721, 19735763, 20172338, 20974600, 21771405, 22547360, 23361033, 24104889, 25045293, 26358238, 27585926, 28979412, 30607431, 32092140, 33573137, 35091444, 37052968, 38863010, 40937498, 42891406, 45061105, 47602201, 50572894, 53758888, 57253531, 61407785, 66335908, 71933111, 78195582, 85305943, 93788716, 103629316, 114719361, 127866125, 142765137, 159490482, 178119476, 199216413, 222241093, 246233316, 270402356, 294516357]
6151B94516357K3858815K2793181K0955735J5705730O669097l767048j2855840
6144C67876027j7859457j9283605j8367164j7880357j8495672j9062754j9367146
6137B37559872j8666846j6925498j4940071j3403517j1971613j0537140r096860
6130A42018327q732543p312578o406297n960094m887324m034342l393562k538208
6122I8753379j711500r97625J91461P80161K453386K897855K689827K870388K585066
6113A10512398Q43920k580340o723961p647641p085638o393147n429964m494105
6105G1001522l921084l416935l388982l155164k382295k585083k353971k151467
6097D7646541k162950j744026k050505j991703j733251j500027j490720j045362
$$ y = [294516357, 318375172, 341168353, 362124088, 377829818, 384498915, 380731867, 367876027, 350016570, 330732965, 312365801, 294485444, 275989772, 256927018, 237559872, 218893026, 201967528, 187027457, 173623940, 161652327, 151115187, 142018327, 133285784, 125973206, 119566909, 113606815, 108719491, 104685149, 101291587, 98753379, 97041879, 96044254, 96235715, 97015876, 99469262, 102367117, 105056944, 107927332, 110512398, 111356318, 108775978, 102052017, 94404376, 87318738, 80925591, 75495627, 71001522, 67080438, 63663503, 60274521, 57119357, 54737062, 52151979, 49798008, 47646541, 45483591, 43739565, 41689060, 39697357, 37964106, 36464079, 34973359, 33927997]
6089C3927997j404468j253114j170397j239851o91126q86487j014349q77319p90631
6080B4600255n66400n37645o95635l36831p05654m53352m04034n56772n75811
6071A9768121o04456l23355l70826k92180k87166m09280l73418m04706k97189
6062A6405545l68409k49186l9657j12394k46564o8689k43695k79212j49179l98838
6052A4249722j95913m56791j22436J16112j71136l68266k51926k03864j56347
6043A2439155l58671l54422n4159p0902j09797j49765K4918k31676k99358M3787
6033A0879110J8817m9621M8667k06426j88260R064j94100j16093r6969m60274
6023I643915L58451K36652Q3926K16184N8731L0573L24113J17243m81664j33344
$$ y = [33927997, 32523529, 31270415, 30100018, 28860167, 28169041, 27282554, 26268205, 25390886, 24600255, 24033855, 23496210, 22800575, 22463744, 21758090, 21304738, 20900704, 20343932, 19768121, 19163665, 18840310, 18469484, 18177304, 17890138, 17480858, 17107440, 16702734, 16405545, 16037136, 15787950, 15748293, 15635899, 15389335, 15320646, 15076951, 14797739, 14648560, 14249722, 14053809, 13597018, 13474582, 13590694, 13419558, 13051292, 12799366, 12595502, 12439155, 12080484, 11726062, 11671903, 11601001, 11491204, 11341439, 11366357, 11134681, 10835323, 10879110, 10897927, 10848306, 10896973, 10690547, 10502287, 10511351, 10317251, 10201158, 10104189, 9643915, 10002366, 10239018, 10322944, 10539128, 10597859, 10628432, 10952545, 11069788, 10588124, 10454780]
6013A0454780l4377k52167l16361j12581m7855j73693k54266k41092j84639J32573
6003H970322R615l80861J765j29182j83O4720k53497L9119q877L1810L5622K34246
5991H614619K54739N740L27861L60380N35475L38624L63627M01023O62803K78569
5981A2143460N84463L07888O06378Q20657R97150Q59685J003456J705668J129713
5972B0158518R74653R84148P49447K67534l19517m52741j110560j094334j225975
5963A8931173j282136r62020r42695q98581p54851p19997q37495l15944l87173
5954A1830281p02959l10522k86035m52458l80577o43027l22662k68815l35577
5945H127649k34961k59872k79821k14809k78930l9801J0720k0838j87580j39554
$$ y = [10454780, 10420403, 10168236, 9851875, 9739294, 9691439, 9517746, 9263480, 9022388, 8837749, 8970322, 8979937, 8599076, 8600841, 8471659, 8471476, 8536196, 8282699, 8321818, 8312941, 8344751, 8380373, 8614619, 8869358, 8875098, 9202959, 9563339, 10098814, 10437438, 10801065, 11202088, 11864891, 12143460, 12727923, 13035811, 13642189, 14462846, 15459996, 16319681, 17323137, 19028805, 20158518, 21133171, 22117319, 22866766, 23134300, 22814783, 22362042, 21251482, 20157148, 18931173, 17649037, 16687017, 15744322, 14845741, 14090890, 13370893, 12533398, 12217454, 11830281, 11127322, 10816800, 10530765, 10078307, 9697730, 9054703, 8732041, 8463226, 8127649, 7892688, 7632816, 7352995, 7138186, 6859256, 6819455, 6830175, 6809337, 6621757, 6482203]
5935F482203m39428l57738k70198K14149L32979M5429k40895k75252j83081r8355
5925E209813p1413m533n4268r4034Q4747Q5344k54471k54355j82029j15197J96689
5914D546293K8396o1035j18090J68062j0420l59583l95845J72933j2935M6294
5904D004070L80099k48339j00664q3591m3599j64852K1414J35370q198l2820j28400
5893C730490K35119Q0683k73634m7414k99444j52621N3104J15226n145R1362p6673
5882C451053o2731r1898J36300R3204k85783J86825J16963l8499k3207k70824
5872C211403M9541K98718Q7950k44460J21057J66006J4120p5488N6969R3720j94724
5861C584812k13486K58851J38794r9799j1647K94859J36473r9363N7050K25963
$$ y = [6482203, 6042775, 5685037, 5414839, 5628988, 5961967, 6007396, 5766501, 5491249, 5308168, 5209813, 5138400, 5133867, 5079599, 4985565, 5070312, 5155656, 4901185, 4646830, 4464801, 4349604, 4546293, 4574689, 4513654, 4395564, 4563626, 4553206, 4193623, 3797778, 3970711, 3957776, 4004070, 4384169, 4135830, 4035166, 3951575, 3907976, 3743124, 3764538, 3899908, 3891710, 3858890, 3730490, 3965609, 4046292, 3772658, 3725244, 3425800, 3273179, 3326283, 3441509, 3436364, 3527726, 3451053, 3388322, 3296424, 3432724, 3525928, 3240145, 3426970, 3543933, 3505434, 3482227, 3211403, 3260944, 3559662, 3647612, 3403152, 3524209, 3690215, 3704335, 3628847, 3685816, 3779536, 3584812, 3371326, 3630177, 3768971, 3669172, 3657525, 3952384, 4088857, 3989494, 4046544, 4272507]
5851D272507J43206M1067J0395j4618j46622j50112L36820L0918k5627n4387p404
5840D436143q7148R0014N7011J17585o3433p3856k73929j21659K16727k09988
5830D087467j42129k854K5968R1736j74624j65867j25083j37230J82193K82415
5820C921992k14925l44735J96428J76088k12154j82964J67844j64362l06539K60321
5810C296994k20328r5649M92560J2221k59226O5605K803J28627p3461j27810m9798
5799C172538L0669k2069k54876J27032K25952J85048p3047j51250K18533K6926
5789C485456P096J14535j9224o1863m9048M3736J50339n3463J81820j60256j06502
5778C532626J4139P0813J1321J49868Q7551k0581q8777r4777J7623J03728M4655
$$ y = [4272507, 4415713, 4456780, 4467175, 4452557, 4305935, 4155823, 4492643, 4523561, 4497934, 4443547, 4436143, 4348995, 4439009, 4496020, 4613605, 4550172, 4476316, 4202387, 4080728, 4297455, 4087467, 3945338, 3942484, 3968452, 4060188, 3885564, 3719697, 3594614, 3457384, 3639577, 3921992, 3707067, 3362332, 3558760, 3734848, 3522694, 3339730, 3507574, 3343212, 3036673, 3296994, 3076666, 2981017, 3473577, 3485798, 3226572, 3292177, 3294980, 3423607, 3350146, 3222336, 3172538, 3203207, 3181138, 2926262, 3053294, 3279246, 3464294, 3391247, 3239997, 3458530, 3485456, 3492552, 3607087, 3587863, 3526000, 3476952, 3520688, 3671027, 3617564, 3799384, 3639128, 3532626, 3546765, 3617578, 3628899, 3778767, 3866318, 3845737, 3756960, 3662183, 3679806, 3783534, 3828189]
5767C828189M70845J94566j36628j3613J60216n6955j27543K12001J06083L22890
5757D960051o6471k55587J20242K39536J41334r4989l52250J27441J04130j15159
5747D808278j47716J19866l748J2183K21538k568L1918J8013k52212O6730P6581
5736D948863L28418K04290R6719J31945K06265K34045N5202J32739K60487N8239
5726F657212l6364l44631j83471j69601J62p5511j6660J0221k08264K09855K56889
5715F099837j5200J3472L30249m7105k69755p5197O2635r4157k16288M9603O464
5704E844558J85228o619j15282k50954J5885J66434J92986l7590j64689k05244
5694E624713m233J31908J6353K43089J6216J2333K28164K98760J42323L13594
$$ y = [3828189, 4299034, 4493600, 4356972, 4343359, 4503575, 4446620, 4319077, 4531078, 4637161, 4960051, 4893580, 4637993, 4758235, 4997771, 5139105, 5044116, 4691866, 4819307, 4923437, 4808278, 4660562, 4780428, 4776680, 4788863, 5010401, 5007833, 5039751, 5057764, 4805552, 4872282, 4948863, 5277281, 5481571, 5578290, 5710235, 5916500, 6150545, 6205747, 6338486, 6598973, 6657212, 6620848, 6276217, 6092746, 5923145, 5923307, 5847796, 5831136, 5841357, 5633093, 5842948, 6099837, 6084637, 6098109, 6428358, 6381253, 6111498, 6036301, 6098936, 6004779, 5788491, 5838094, 5844558, 6029786, 6023167, 5907885, 5656931, 5672816, 5839250, 6032236, 5994646, 5829957, 5624713, 5620480, 5752388, 5768741, 6011830, 6028046, 6040379, 6268543, 6567303, 6709626, 7023220]
5684G023220O46643P21709M47770M34462K62302J76504o75500m91944q22594n40435
5674G182137k94592j25318k38011k39055K9619m52Q4500j41709k3607J56240N3397
5663F443149j22764l78279o5693j1032K61721N64501J56767J65067K15061L35561
5653G564059N41924N10955O54170O79940M97167L87643K51250k99371q15568m02254
5643I569915m5969k2662j1130j18984J14193R5826k6670M34729J793K93266L50485
5632A0634792M52169M81069M39682N84836N84062N34297R72899O63888R61119
5623A6308813J044644R98511J024551J260627J150659J161928J280524J465938
5615B5696195J078614J040679Q12636Q20938J051891Q27654R16583P69365P35478
$$ y = [7023220, 7669863, 8391572, 8839342, 9273804, 9536106, 9712610, 9037110, 8545166, 7722572, 7182137, 6887545, 6762227, 6524216, 6285161, 6314780, 6314328, 6398828, 6257119, 6233512, 6389752, 6443149, 6320385, 5942106, 5876413, 5865381, 6127102, 6691603, 6848370, 7013437, 7228498, 7564059, 8105983, 8616938, 9271108, 9951048, 10448215, 10835858, 11087108, 10787737, 9972169, 9569915, 9523946, 9501284, 9490154, 9371170, 9485363, 9581189, 9554519, 9989248, 9991041, 10284307, 10634792, 11086961, 11568030, 12007712, 12592548, 13176610, 13710907, 14683806, 15347694, 16308813, 17353457, 18351968, 19376519, 20637146, 21787805, 22949733, 24230257, 25696195, 26774809, 27815488, 28628124, 29449062, 30500953, 31328607, 32245190, 33014555, 33750033]
5606C3750033M08808M90403L69560K43874L23717J125301J049026J272268J638257
5597D0671247J691761J660202J366449J130560P1879r47560j932626k539809k191532
5588C8980571k395688k004352j539983j333963j086032j236457j032316p09365
5580B7642415p60515m39916l21889n57832k47381j34786O4905K94266J22179K57921
5570B5919367P46754M36337O65678J056598Q87838J179304J205263J410625K035322
5561C5543086K236153K758913L071852L570466M036378M803339N584907O692688
5553F8297782P202096P615620Q776047R505812J0317224J0886016J0962579J0876207
5545A44439383J0507812R602844Q769156O323921L823914K28789k899201n330453
$$ y = [33750033, 34158841, 34649244, 35018804, 35262678, 35586395, 36711696, 37760722, 39032990, 40671247, 42363008, 44023210, 45389659, 46520219, 46592098, 45644538, 43711912, 41172103, 38980571, 36584883, 34580531, 33040548, 31706585, 30620553, 29384096, 28351780, 27642415, 26881900, 26441984, 26120095, 25562263, 25314882, 25180096, 25245001, 25539267, 25661446, 25919367, 26666121, 27102458, 27768136, 28824734, 29712572, 30891876, 32097139, 33507764, 35543086, 37779239, 40538152, 43610004, 47180470, 51216848, 56020187, 61605094, 68297782, 75499878, 83115498, 91891545, 101397357, 111714581, 122600597, 133563176, 144439383, 154947195, 164550039, 173319195, 179643116, 183467030, 183695819, 180796618, 175466165]
5537A75466165p212392p985269q563283q674091q645345q951749q657590q192042
5529A08584404p899874p223133o543855o342319n441736m933397m452582l962774
5521F1784734l777650l405585l113279k937307k593267k174623k002037k082083
5513C9698903j591668j445285j941085j497807j268975j151011j001781j153651
5505B8647640p57624r65483j148620q49916o77628q70995n24442k82495o43918
5496B1926519m23254n62998o68454n89410l33014k67267m07312o50658l64259
5487A7659893j42447k13205m9953k74375k97730k74591k68945k9399j03420j78653
5477A5827175k67195l92626l31455p0659l76299m78137j17112p5249l88609k90709
$$ y = [175466165, 168253773, 160268504, 151705221, 143031130, 134385785, 125434036, 116776446, 108584404, 100684530, 93461397, 86917542, 80575223, 75133487, 70200090, 65747508, 61784734, 58007084, 54601499, 51488220, 48550913, 45957646, 43783023, 41780986, 39698903, 38107235, 36661950, 34720865, 33223058, 31954083, 30803072, 29801291, 28647640, 27890016, 26924533, 25775913, 24925997, 24248369, 23377374, 22852932, 22570437, 21926519, 21503265, 20940267, 20271813, 19682403, 19349389, 19082122, 18674810, 18024152, 17659893, 17517446, 17304241, 17254288, 16979913, 16682183, 16407592, 16138647, 16109248, 16005828, 15827175, 15559980, 15167354, 14835899, 14765240, 14388941, 13910804, 13793692, 13718443, 13329834, 13039125]
5467A3039125j85595m89586j33434l17825m60018k54596l66654l68763p8859l05219
5457A0078576k54988j57140j44649O3947k45356k35039p6843l4552r0851K23893
5447I126998o0258K3369j3842J9296r1726J24026K97157J75424L86461O36809
5437A0623714O35626N51177M44691J19667j94357m30141o84127k96440p95536
5428I974274n69611j48031J973k31444j87591K8575J17143n5199l02843P4672
5418H701918n9600j60309L0884k34859k70898k46010l16829p0379p1880q8190
5408G213848l98097k40878k63582K42334k19079J02642J27158j32876j39390k18884
5398F073196k5477m70570n8751j12061m0330k5890R3259J9223j59556l44060j75890
$$ y = [13039125, 12853530, 12363944, 12230510, 11912685, 11452667, 11198071, 10831417, 10462654, 10383795, 10078576, 9823588, 9666448, 9521799, 9585746, 9340390, 9105351, 9028508, 8993956, 8903105, 9126998, 9066740, 9090109, 9076267, 9095563, 9003837, 9127863, 9425020, 9600444, 9986905, 10623714, 11259340, 11810517, 12255208, 12374875, 12180518, 11750377, 11066250, 10769810, 9974274, 9404663, 9256632, 9258605, 9027161, 8839570, 8868145, 8985288, 8930089, 8627246, 8701918, 8642318, 8482009, 8512893, 8278034, 8007136, 7761126, 7444297, 7373918, 7302038, 7213848, 6815751, 6574873, 6311291, 6553625, 6334546, 6437188, 6564346, 6431470, 6292080, 6073196, 6047719, 5577149, 5518398, 5406337, 5366007, 5340117, 5433376, 5452599, 5293043, 4948983, 4773093]
5387D773093K68462l07321j83758J5910p2673J18436J38426j27615l08795j32890
5377D181275J24699r5417M2535p882l32519j35028l6772k01774j10408Q2428n5296
5366C455841K32903k41612j65977K83779K08142j54265j08766j82269l2213O1181
5356C356744J18794l5107l1759k12615J36041J07310k71460P5433j20867m3885
5346C078629j10876l3972J85533j96006J54673k4688j98941p3165l38417J17635
5336B560405N7874K17144j13809l1344j45294j57395J50670J00202J19100k5246
5326B732307j45136l4930P4726j93468j57552J85969l10618j9254J27366J22507
5316B381917J225j26165j68615J24692K2720M7027j73297q788m096J3663K04225
$$ y = [4773093, 5041555, 4734234, 4550476, 4566386, 4493713, 4612149, 4750575, 4622960, 4314165, 4181275, 4305974, 4210557, 4253092, 4245210, 3912691, 3777663, 3740891, 3539117, 3428709, 3511137, 3455841, 3688744, 3447132, 3281155, 3564934, 3773076, 3618811, 3510045, 3327776, 3295563, 3356744, 3475538, 3440431, 3408672, 3196057, 3332098, 3439408, 3167948, 3243381, 3122514, 3078629, 2967753, 2933781, 3119314, 2923308, 3077981, 3053293, 2854352, 2781187, 2442770, 2560405, 2618279, 2835423, 2721614, 2690270, 2544976, 2387581, 2538251, 2638453, 2757553, 2732307, 2587171, 2552241, 2626967, 2433499, 2275947, 2461916, 2151298, 2132044, 2259410, 2381917, 2383142, 2256977, 2088362, 2213054, 2235774, 2282801, 2109504, 2100716, 2096620, 2110283, 2314508]
5305B314508j94821j28943N6852j66372K2201K07346J16552l95778K8213L15463
5295B175221l00855k49631J51712r1627M9221J46612K1461k73250j22159J33650
5285A640355L36886J17028l25635R2708J09144J19073j42339k1775j33059J97751
5275A990137K58763j70788L6204r7873o4679l2003j28964J98201P3662m1253k27846
5264A793561m5057L78333K00223m2854l29192J3658K45340K54243j12961j25049
5254B230245K30039J93675J77698o4302M1605J27240L9296o6764J54166N2145
5244C115043Q3614q9640k28917J94834j70724j48274M98471J76335K0380R7253
5234C548375j61303k50471r6064L0141J14862J12524L8298o4602L42047J45071
$$ y = [2314508, 2119687, 1990744, 2047596, 1881224, 1903425, 2110771, 2227323, 1831545, 1859758, 2175221, 1874366, 1624735, 1776447, 1684820, 1734041, 1880653, 1902114, 1628864, 1506705, 1640355, 1977241, 2094269, 1768634, 1861342, 1970486, 2089559, 1947220, 1925445, 1792386, 1990137, 2248900, 2078112, 2114316, 2016443, 1951764, 1919761, 1790797, 1988998, 2062660, 2021407, 1793561, 1748504, 2126837, 2327060, 2284206, 1955014, 1968672, 2214012, 2468255, 2355294, 2230245, 2460284, 2653959, 2831657, 2767355, 2808960, 2936200, 2975496, 2908732, 3062898, 3115043, 3198657, 3109017, 2880100, 3074934, 2904210, 2755936, 3254407, 3430742, 3451122, 3548375, 3387072, 3136601, 3040537, 3070678, 3185540, 3298064, 3336362, 3271760, 3613807, 3758878]
5224C758878j389O6162K98133Q6352j94447k21108L59776L60069L16630L57894
5214E186950J29567P8586K38293K42320J95328k8740K21552m6394K46906K63658
5204F728026q8514J16307K19861K85972L22477L01168P4583J86873J6078K769
5194H165600M9797R5775j28130m02088l77843n7820L4423r2318k15858j6203k0829
5183G034506n1903J44071P6190N9573q9844K2231J23201M28144M82305M84860
5173H713334K53342L18074L77629L88573K07529L11347L86536M17851K79855K44938
5163A1899008L21290L74392M63869J88664M90674J50187p0297n930l24521n35258
5153A2952078m08356j083263l13129l63924k90128l37115l17891p2322j89501
$$ y = [3758878, 3757489, 3823651, 4121784, 4208136, 4013689, 3792581, 4152357, 4512426, 4829056, 5186950, 5316517, 5395103, 5633396, 5875716, 6071044, 6042304, 6263856, 6217462, 6464368, 6728026, 6639512, 6755819, 6975680, 7261652, 7584129, 7885297, 7959880, 8146753, 8162831, 8165600, 8215397, 8311172, 8183042, 7780954, 7403111, 7345291, 7379714, 7287396, 7071538, 7055335, 7034506, 6982603, 7126674, 7202864, 7262437, 7172593, 7194824, 7318025, 7746169, 8228474, 8713334, 8966676, 9284750, 9662379, 10050952, 10258481, 10569828, 10956364, 11374215, 11654070, 11899008, 12220298, 12594690, 13058559, 13247223, 13737897, 13888084, 13817787, 13811857, 13487336, 12952078, 12543722, 11460459, 11147330, 10783406, 10493278, 10156163, 9838272, 9765950, 9576449]
5144I576449J54441Q1231L1603n738j1655K45009M74595L03912N28866J75939
5134A1554652L18734K05819K48811K71231N7498K7625k67056j17892q2044j19890
5124A2097488q5017K86115J759o4057k77665k21476k45296k18786l27179k19016
5114A0726870l6094j78017P9121j23142j06167k23408N8197R4448O3713j87002
5104A0168519j42071K05462J47072L64723K6963p1406J46329J36307N8296m1422
5094A0998772P6911j17475k85044N44278r2672j73546j96510r0022o8931j50133
5084A0445628J0520j18824J20723k01731n1711J28227M1257K09919K8741K02156
5074A0814905J3170j23415j47040k26947j98492p2672k81770l09691j52941n79562
$$ y = [9576449, 9730890, 9812121, 9843724, 9837986, 9826331, 10071340, 10545935, 10849847, 11378713, 11554652, 11873386, 12079205, 12328016, 12599247, 12656745, 12684370, 12417314, 12299422, 12217378, 12097488, 12012471, 12298586, 12300345, 12236288, 11958623, 11737147, 11491851, 11273065, 10945886, 10726870, 10690776, 10512759, 10591880, 10468738, 10362571, 10139163, 10197360, 10291808, 10355521, 10168519, 10026448, 10231910, 10378982, 10743705, 10770668, 10699262, 10845591, 10981898, 11040194, 10998772, 11075683, 10958208, 10673164, 11217442, 11124770, 10951224, 10754714, 10664692, 10595761, 10445628, 10456148, 10337324, 10458047, 10256316, 10204605, 10332832, 10374089, 10584008, 10612749, 10814905, 10828075, 10704660, 10557620, 10330673, 10132181, 10059509, 9777739, 9468048, 9315107, 8735545]
5064H735545l69923k71597j07054j86635Q8788L75j45582J10666M7360J79947
5054H081890o960n3619Q9891j1402k31073l99645l35372l70684j01411l4848l66496
5043F260271q7561K7694j31112j48093J24048j97108q7174K28008J37939q113
5033F118799Q3248K81737j49286J48524K51085j61883O8263K12239j19653Q6534
5023F819607K87057r5166j30980J57218j32753J24802P0100K99481K99181P7670
5013G776217J46578J61012J44857k3711K42035J70283J4009J64873O65597L2072
5003I493822r7825K74812J57234n504J83425P1808r4644L9050j9950L59957N920
4992A0368105J99814M60534o2347J85777K76245J86819J98533n3020K64239r5546
$$ y = [8735545, 8365622, 8094025, 7986971, 7800336, 7889124, 7889499, 7743917, 7854583, 7901943, 8081890, 8074930, 8021311, 8111202, 8099800, 7868727, 7469082, 7133710, 6763026, 6661615, 6626767, 6260271, 6172710, 6200404, 6069292, 5921199, 6045247, 5848139, 5760965, 5988973, 6126912, 6118799, 6202047, 6483784, 6334498, 6483022, 6734107, 6572224, 6640487, 6852726, 6733073, 6819607, 7106664, 7011498, 6880518, 7037736, 6904983, 7029785, 7099885, 7399366, 7698547, 7776217, 7922795, 8083807, 8228664, 8204953, 8446988, 8617271, 8631280, 8796153, 9461750, 9493822, 9395997, 9670809, 9828043, 9822539, 10005964, 10077772, 9983128, 10022178, 10002228, 10362185, 10368105, 10567919, 11028453, 10966106, 11151883, 11428128, 11614947, 11813480, 11760460, 12024699, 11929153]
4982A1929153J18709Q8021O9438J34314O8240q3484J69354J32308J76579L73362
4972A3175994L49100J86324N02563M35172O47156L72548M69581M06367N36789
4963A7081594N88988J76610L7916o2346J95100j12031m25590k2825j12458k9092
4953A7315866j11134R9309L22486L80871O64078O24226N78019Q47079P66785L63138
4943B1850723P06699K60816J59357L12652j11214J76976K11136p2468J28688L77528
4933B4000893N10013K43722N60080N43236P20339Q34334R62677Q68143J095523
4924C0338960J008304J051055Q62950J468809J345353J070592J060223J651425
4916C9857671J650078J783286J968969J693952J838143K022058J867952J400991
$$ y = [11929153, 12047862, 12135883, 12205321, 12339635, 12407875, 12324391, 12493745, 12626053, 12802632, 13175994, 13525094, 13711418, 14213981, 14649153, 15296309, 15668857, 16138438, 16544805, 17081594, 17670582, 17847192, 17885108, 17822762, 18017862, 17905831, 17480241, 17457416, 17344958, 17315866, 17204732, 17304041, 17626527, 18007398, 18671476, 19295702, 19873721, 20720800, 21487585, 21850723, 22557422, 22818238, 22977595, 23290247, 23179033, 23356009, 23567145, 23494677, 23623365, 24000893, 24510906, 24754628, 25314708, 25857944, 26578283, 27412617, 28375294, 29243437, 30338960, 31347264, 32398319, 33261269, 34730078, 36075431, 37146023, 38206246, 39857671, 41507749, 43291035, 45260004, 46953956, 48792099, 50814157, 52682109, 54083100]
4908E4083100J069425J122228O91494K03246k70116o41846m84016q64908j116024
4899E3792583r19225q08782q93138n56148o25470j97198n61120m42480O8705Q658
4889D8866385l981j81263K23889L15016O05746N47610P74140J036498J545654
4880E3729694J453366J798667J822138K264027K528830K679510L471716L778092
4872G3526040M392928N105398O008979O323383P370476Q745016R764366J1142960
4864A32379546J2999073J5474522J7818859K0874763K3945728K6403435K8646755
4857B78542681K9162084K8691921K6058617K1109554J4589513O870065j174514
4850D03849921q520338j4295683j7899070k0212380k1162549k0969821k0237485
$$ y = [54083100, 55152525, 56274753, 56966247, 57169493, 56899377, 56257531, 55773515, 54908607, 53792583, 52873358, 52064576, 51171438, 50615290, 49989820, 49792622, 49231502, 48789022, 48857727, 48866385, 48862404, 48681141, 48905030, 49220046, 49825792, 50373402, 51147542, 52184040, 53729694, 55183060, 56981727, 58803865, 61067892, 63596722, 66276232, 69747948, 73526040, 77918968, 83024366, 89033345, 95356728, 102727204, 111472220, 121236586, 132379546, 145378619, 160853141, 178672000, 199546763, 223492491, 249895926, 278542681, 307704765, 336396686, 362455303, 383564857, 398154370, 405024435, 403849921, 395329583, 381033900, 363134830, 342922450, 321759901, 300790080, 280552595]
4843B80552595j9241461j7827748j6525724j5482419j4610174j3351877j2036473
4836A71476719j0784995j0036992r066470q202705p764048o802773o130640n655968
4828A07032128n119798m662318m131255l775600l738169l709154k989375k999426
4820G5907033k671402k444806k184531k063452j717976j624860k059019j275768
4812E9865219j397513j186118j145725j433688j421742j214289j282086j106879
4804D9677179j255267j157267j051528j014806m63152q83629r36938o04432p08602
4795D1601558m57612n03097m61028l39323j62345l5681p655j04594m23774l67952
4785C8738497q6854m5640p5344o04541n33145j57327m67929o15778l00932l10263
$$ y = [280552595, 261311134, 243483386, 226957662, 211475243, 196865069, 183513192, 171476719, 160691724, 150654732, 141588262, 133385557, 125621509, 118818736, 112688096, 107032128, 101912330, 97250012, 93118757, 89343157, 85604988, 81895834, 78906459, 75907033, 73235631, 70790825, 68606294, 66542842, 64824866, 63200006, 61140987, 59865219, 58467706, 57281588, 56135863, 54702175, 53280433, 52066144, 50784058, 49677179, 48421912, 47264645, 46213117, 45198311, 44735159, 43851530, 42914592, 42310160, 41601558, 41143946, 40640849, 40179821, 39840498, 39678153, 39642472, 39634817, 39530223, 39106449, 38738497, 38651643, 38606003, 38530659, 37926118, 37392973, 37235646, 36767717, 36151939, 35851007, 35540744]
4775C5540744m51917n94851m12152j29488p3225k37561n14466k10733l92390m25880
4765C2098081l34229J9100n1322l69204k50431j95227k17873o1041m44716p0454
4755C0122684j21910m90026K8258n5795l48751J49319j35085k78136k13464n51641
4745B8105453k32311j08552k6166M9764n83534P145l3859n33388j90317q6663
4735B6367572o2450m64699l50651M3898k53590m79536k05173m66319l03939l5581
4725B3789532l3104k76070p9898J32591M709K7252K17600L82055M1155K0490r8949
4714B4127363K09678R7470K47487L04623K17833J98718K95372J24982M30616L05160
4704B6559302L61867J95936L69779O08151L21299L42891P64995O82810M35367
$$ y = [35540744, 35088827, 34493976, 34081824, 33952336, 33879111, 33641550, 33127084, 32916351, 32523961, 32098081, 31763852, 31782952, 31731630, 31362426, 31111995, 30916768, 30698895, 30637854, 30193138, 30122684, 30000774, 29510748, 29539006, 29483211, 29134460, 29283779, 29148694, 28870558, 28657094, 28105453, 27873142, 27764590, 27738424, 27788188, 27204654, 27211799, 27177940, 26644552, 26454235, 26367572, 26305122, 25840423, 25489772, 25533670, 25280080, 24800544, 24595371, 24129052, 23825113, 23789532, 23756428, 23480358, 23400460, 23533051, 23537760, 23565012, 23782612, 24164667, 24205822, 24226312, 24127363, 24337041, 24434511, 24681998, 24986621, 25204454, 25403172, 25698544, 25823526, 26254142, 26559302, 26921169, 27117105, 27486884, 28095035, 28416334, 28759225, 29524220, 30207030, 30642397]
4695C0642397M64876M12301N02834O8056N4269K67952M96274O0252J05377k5255
4685C3049333J98005K34803O22815O65435O05647J015652J121114J093757J471605
4676D0078166J228434J616738J815002K014637K351859K542924K266790K247610
4668E6162160K738683K306532J729277R59926R45000J071647Q27996J055690J565700
4659F9362611K390927K739243L573321M018026M750277N473219O311501P094460
4651A05713585P617617Q054953Q369019Q363808Q360064Q425310R179525R786645
4643A73870526J0875678J3437444J7197323K1523367K5618532K8260610K9655473
4636C20438953K9919752K7343550J9876713P489213p453492j8780191k3668162
$$ y = [30642397, 31107273, 31519574, 32022408, 32090464, 32144733, 32412685, 32908959, 32969211, 33074588, 33049333, 33247338, 33482141, 34104956, 34770391, 35376038, 36391690, 37512804, 38606561, 40078166, 41306600, 42923338, 44738340, 46752977, 49104836, 51647760, 53914550, 56162160, 58900843, 61207375, 62936652, 63896578, 64841578, 65913225, 66741221, 67796911, 69362611, 71753538, 74492781, 78066102, 82084128, 86834405, 92307624, 98619125, 105713585, 113331202, 121386155, 129755174, 138118982, 146479046, 154904356, 164083881, 173870526, 184746204, 198183648, 215380971, 236904338, 262522870, 290783480, 320438953, 350358705, 377702255, 397578968, 405068181, 397614689, 378834498, 355166336]
4629C55166336k4243993k2592636k0240196j8556382j7030199j5311886j4188599
4622B23002445j3194706j2505966j1217023j0338663r339588q175314p400107
4615A50831078o677871n604795n134454m691709m330344m165633m383765m113271
4607A11729236m335732m025962l452853l555030l536130l266572l567206l180128
4599H2809623k988867k586273k439703k254094k191103j902312j536455j505325
4591F5405491j408896j467232j257749q47533p42125q77824n01527l46925m59546
4582E7496134m4210j23978k59119M123J54393j5006L56349j11278L10859R83096
4572E8751363O08843P40897O27558J312493J096649J204395J410748J595924K126014
$$ y = [355166336, 330922343, 308329707, 288089511, 269533129, 252502930, 237191044, 223002445, 209807739, 197301773, 186084750, 175746087, 166406499, 158231185, 150831078, 144153207, 138548412, 133413958, 128722249, 124391905, 120226272, 115842507, 111729236, 107393504, 103367542, 99914689, 96359659, 92823529, 89556957, 85989751, 82809623, 79820756, 77234483, 74794780, 72540686, 70349583, 68447271, 66910816, 65405491, 63996595, 62529363, 61271614, 60424081, 59681956, 58804132, 58302605, 57955680, 57496134, 57451924, 57327946, 57068827, 57072950, 57227343, 57212337, 57568686, 57457408, 57768267, 58751363, 59360206, 60101103, 60728661, 62041154, 63137803, 64342198, 65752946, 67348870, 69474884]
4563F9474884K464331L365709M332656N084207O655579P934032Q902819R914123
4555A18128340J0398758J0032644Q983287O732149M007266N21274k493405n178299
4547A51132014p120746p804085p864475p539694o503861n400780m413243l387206
4539A01097924l306563k704040k454913k170069j923309j637732j665599j353083
4531H3882616r80413j61375J93661N08722J061646J144915J498668J325449J078487
4522H9552376N40798k89011m94236o88878n79498l04399L83038J329075K109896
4513I1559161L195600M129871M934207N753304O894134P271800O606199O157449
4505A36501725M765036J284289l212051p345983r299636r067212p652615o585821
$$ y = [69474884, 71939215, 75304924, 79637580, 84721787, 91377366, 99311398, 108214217, 118128340, 128527098, 138559742, 147543029, 154275178, 158282444, 158803718, 156310313, 151132014, 144011268, 136207183, 128342708, 120803014, 114299153, 108898373, 104485130, 101097924, 97791361, 95087321, 92632408, 90462339, 88539030, 86901298, 85235699, 83882616, 82902203, 82740828, 82934489, 83443211, 84504857, 85649772, 87148440, 88473889, 89552376, 90093174, 89804163, 89309927, 88621049, 88041551, 87737152, 88120190, 89449265, 91559161, 94754761, 98884632, 103818839, 109572143, 116466277, 123738077, 130344276, 136501725, 141266761, 142551050, 139338999, 131993016, 122693380, 113626168, 105973553, 99387732]
4497I9387732n967099m923885m165293l946879m017193l217463l125345k939581
4489F7084994k515896k472412k009087j605069j302900j213383j071899o65131
4481E4229217m05292j59351p8244J17812K72078L00122M09896O44141J203979
4472E6534358J340898J804213J864009K442059K630838L314593L444731L742505
4464G7118204M500332N132369N629923O095581O940386Q372338J0002696J1956228
4456A35748057J4260450J7835600K0849471K4617346K7937839K9631726K9214571
4449C00095060K6296173K1001054J2572949L218542o931088j4630781k0224517
4442C21397392k3285014k3927427k2292138j9605579j6920580j4638575j3065092
$$ y = [99387732, 93420633, 88496748, 84331455, 80384576, 76367383, 73149920, 70024575, 67084994, 64569098, 62096686, 60087599, 58482530, 57179630, 55966247, 54894348, 54229217, 53823925, 53664574, 53586330, 53704142, 53976220, 54276342, 54686238, 55330379, 56534358, 57875256, 59679469, 61543478, 63985537, 66616375, 69930968, 73375699, 77118204, 81618536, 86750905, 92380828, 98476409, 105416795, 113789133, 123791829, 135748057, 150008507, 167844107, 188693578, 213310924, 241248763, 270880489, 300095060, 326391233, 347392287, 359965236, 363183778, 356252690, 341621909, 321397392, 298112378, 274184951, 251892813, 232287234, 215366654, 200728079, 187662987]
4435A87662987j1560048j0330604r496787r068071q198834p438670o634874n782305
4427A19152794n152377m227299l647161l046728k738123k529446k267416j861934
4419I3682310k135323k048889k416285l254764l140572l520623l504838l113404
4411G0547612k458796k020950k162373k215137j983713k166105k092511k030892
4403E3417135j825613j477069k030780j535670j402454j395781j242382j478261
4395D1029125r83019j170843j088407q06395r05880r12397p47642n92871q56441
4386C2965230n21425n94739n70513l97026n04557l13768m92561n69286n86341
4377B8415014p54778p71278n49542n16187o01393m99160l16706l60751n40590
$$ y = [187662987, 176102939, 165772335, 156275548, 147207477, 139008643, 131569973, 124935099, 119152794, 114000417, 109773118, 106125957, 103079229, 100341106, 97811660, 95544244, 93682310, 91546987, 89498098, 87081813, 83827049, 80686477, 77165854, 73661016, 70547612, 68088816, 66067866, 63905493, 61690356, 59706643, 57540538, 55448027, 53417135, 51591522, 50114453, 48083673, 46548003, 45145549, 43749768, 42507386, 41029125, 40046106, 38875263, 37786856, 36980461, 36074581, 35162184, 34414542, 33821671, 32965230, 32443805, 31849066, 31278553, 30881527, 30376970, 30063202, 29570641, 29001355, 28415014, 27660236, 26888958, 26339416, 25823229, 25221836, 24722676, 24405970, 24045219, 23504629]
4368B3504629k83475l03575l97340q9710k01431k53951L8428l42983l15862l27733
4358B1026997N9245m99219k68241k26480l81435j28749r9875j11162m33400k66450
4348A8671231n53485k63775J24476J15026j82110m76566p2676J5942j39529l5608
4338A7202926P3425K00262j79873j61307r2882K22780q992Q6776k66103L1803
4328A7108815k7262m49246k26967p4126k40097k26278j23772l08199l48647k35893
4318A4848328j05482r6180L4756n22321k59118J86074j82050K35311M4823j69300
4308A4014841j36097O2151j71861J88440L47469K75944J36217L20242L02325P6853
4298A5416524J29754l11518l59506o20009m70191n96496l8415J1433j14964l12024
$$ y = [23504629, 23221154, 22917579, 22520239, 22430529, 22229098, 21975147, 22013575, 21670592, 21354730, 21026997, 21086242, 20587023, 20318782, 20092302, 19710867, 19582118, 19482243, 19371081, 18937681, 18671231, 18117746, 17853971, 17978447, 18093473, 17911363, 17434797, 17362121, 17378063, 17238534, 17202926, 17276351, 17476613, 17296740, 17135433, 17042551, 17265331, 17256339, 17343115, 17077012, 17108815, 17081553, 16632307, 16405340, 16331214, 16091117, 15864839, 15741067, 15432868, 15084221, 14848328, 14742846, 14646666, 14681422, 14159101, 13899983, 14086057, 13904007, 14139318, 14184141, 14014841, 13878744, 13940895, 13769034, 13957474, 14304943, 14580887, 14717104, 15037346, 15339671, 15416524, 15546278, 15234760, 14875254, 14255245, 13785054, 13188558, 13150143, 13161576, 13046612, 12734588]
4288A2734588l9607m47581k21230P6066L1842m52630l86258j11379k36180o8055
4278A0879576j66202j92546L05123M4134l46116l12673J53846O2702j54601j97582
4268A0075661J0069K33795N4021K38212j41108l1339j26243M5929K29661n7686
4258A0530972j74201q6874q366J45634j99246l30280l58324j04128j07580P1516
4248I379123K6987l9272j31823j00054P0825o956q7030j1902m7668n8431J72153
4237I165952q4836j74917N1181j18628m12474K63007J15564P3311L1167K87978
4227I197305L03753j5896L88246q9514p1415L4641j72568r3655k02428J25850
4217I404319J25255q5728k07907p3693j20377j63941L80739j97642j26411K43704
$$ y = [12734588, 12694981, 12247400, 12026170, 12102236, 12134078, 11681448, 11295190, 11183811, 10947631, 10879576, 10713374, 10520828, 10825951, 10870085, 10523969, 10211296, 10365142, 10427844, 10273243, 10075661, 10085730, 10319525, 10373546, 10611758, 10470650, 10439311, 10313068, 10358997, 10588658, 10530972, 10356771, 10269897, 10261531, 10407165, 10207919, 9877639, 9519315, 9415187, 9307607, 9379123, 9406110, 9366838, 9235015, 9134961, 9205786, 9198830, 9111800, 9099898, 9052230, 8993799, 9165952, 9081116, 8906199, 8957380, 8838752, 8426278, 8689285, 8804849, 8878160, 8909327, 9197305, 9501058, 9485162, 9873408, 9783894, 9712479, 9747120, 9574552, 9480897, 9278469, 9404319, 9529574, 9443846, 9235939, 9162246, 9041869, 8877928, 9258667, 9061025, 8934614, 9178318]
4207I178318l42242n1622J42232k88948K84489l1721l6748J2148q8141k52513
4197H525252J20139J68674K09838K09973J03225k19578M828K80289J80191R7325
4187I680156K56683K97404j9598j22831J747K47366q0530l07412q428n3444k32968
4176I658145J62521O3850K85095J78964J77538p3842J91565M47792N07226O88144
4166A2286998N22432M55149M77332M33024N28251J92002M3957j91814j01126p6914
4156A4569291k72991m42761k91601m64883l71220n89306n40625l77527l8357Q1787
4146A1261807L0290q7069R0133K74094j06820K80300n7074k44923k6046K37162
4136A1651854r7997l37675R6401j02742n4332K08218M8202K43576Q789P5370J08326
$$ y = [9178318, 8836076, 8784454, 8926686, 8637738, 8922227, 8890506, 8853758, 8865906, 8777765, 8525252, 8645391, 8814065, 9023903, 9233876, 9337101, 9117523, 9122351, 9402640, 9582831, 9680156, 9936839, 10234243, 10214645, 10091814, 10093561, 10340927, 10260397, 9952985, 9944557, 9891113, 9658145, 9820666, 9884516, 10169611, 10348575, 10526113, 10452271, 10643836, 11091628, 11598854, 12286998, 12809430, 13264579, 13741911, 14174935, 14703186, 14895188, 14939145, 14747331, 14646205, 14569291, 14296300, 13853539, 13561938, 13097055, 12725835, 12136529, 11595904, 11218377, 11180020, 11261807, 11292097, 11205028, 11295161, 11569255, 11462435, 11742735, 11685661, 11440738, 11414692, 11651854, 11553857, 11216182, 11312583, 11209841, 11155509, 11363727, 11411929, 11655505, 11664294, 11739664, 11847990]
4125A1847990o035K1188j15184l00425l26853J34619p5928o0151m49740j28223
4115A0541258J28282k12634q2470l14760K667j57652P2496Q8967P7583p6110j06789
4104I960838P4746J19944r3873j59554k19869j32996l94660j12684j18992k22855
4094H700045k47009l14076l30694j17174L65252O7699K00999j15822l47238j2459
4084G849523j57941K3725m2868J1096J13313L8947K4734o0780J28813P8933J7305
4073H024800R3088Q6822n2189K01609P4281J16755l46209l6385R8741k04096m16715
4062G640502k92721l36158m3090j63833j46322L3942J65440k50694k05737J7993
4052F419322N2703O8382j55323J70442o119m4543n0579R3483N5828O4424O4049
$$ y = [11847990, 11841955, 11863143, 11747959, 11447534, 11120681, 11255300, 11179372, 11119221, 10669481, 10541258, 10669540, 10456906, 10374436, 10059676, 10062343, 9904691, 9977187, 10066154, 10143737, 10067627, 9960838, 10035584, 10155528, 10061655, 9902101, 9682232, 9549236, 9154576, 9041892, 8922900, 8700045, 8453036, 8138960, 7808266, 7691092, 8056344, 8124043, 8325042, 8209220, 7861982, 7849523, 7691582, 7715307, 7672439, 7683535, 7796848, 7835795, 7860529, 7799749, 7928562, 8007495, 8024800, 8117888, 8204710, 8152521, 8354130, 8428411, 8545166, 8198957, 8162572, 8261313, 8057217, 7640502, 7347781, 7011623, 6968533, 6804700, 6658378, 6692320, 6857760, 6607066, 6401329, 6419322, 6472025, 6540407, 6385084, 6555526, 6549407, 6504864, 6454285, 6547768, 6603596, 6668020, 6732069]
4041F732069M86156J78896L7861k15990n4284j46019n7325L528j97346J98514
4031F966060J05496j08863P1800K54004J93430k06895j22833L39321Q9883K1170
4021G602573J12373q0462O4011J84203k8396k0478n3998M45293J94294K07905
4011H627318Q7959M42004K10263N984q1813j77052k97246l59526j76664l90794
4001G890433K87722j77270n2341j44207o5813J02209j53787k79466Q8332Q2153
3991G577965M902k45299p3934r3527k49495l402k43069j73696J76364R8918K1714
3980F797441k59882Q1723m7986k11791J69825m3043k23683L0890Q9929j73956
3970F209467j94202k78994m937O8050k40644l488J79551j88289P9341o5797j17379
$$ y = [6732069, 7218225, 7397121, 7434982, 7218992, 7164708, 7018689, 6961364, 6964892, 6767546, 6966060, 7071556, 6962693, 7034493, 7288497, 7481927, 7275032, 7152199, 7491520, 7581403, 7602573, 7714946, 7634484, 7698495, 7882698, 7854302, 7833824, 7779826, 8225119, 8419413, 8627318, 8715277, 9157281, 9367544, 9373528, 9291715, 9114663, 8817417, 8457891, 8281227, 7890433, 8178155, 8000885, 7948544, 7804337, 7738524, 7840733, 7686946, 7407480, 7495812, 7577965, 7582867, 7337568, 7263634, 7170107, 6920612, 6917210, 6674141, 6500445, 6676809, 6775727, 6797441, 6537559, 6619282, 6571296, 6359505, 6529330, 6486287, 6262604, 6293494, 6383423, 6209467, 6015265, 5736271, 5731334, 5799384, 5558740, 5555252, 5734803, 5546514, 5625855, 5560058, 5442679]
3959E442679j64133K84468Q6220k20512r0015o4007k1875J09375q0711q560j18164
3948E154765J83971J03766k29647J54048J16125k03242L2433r373M531J56366
3938E463743k29300o1832J13098J56078j721j8263K92067l0521l19920R4844j9098
3927E439175O4100o8874k18232N25522L5027l12685J95496J64993m1675j8694
3917E764153Q4623O2366J00980p1603r7565K5872J587J54060J06530O7277L6587
3906F234867j82132k8104O9968k0904L93070K75375k37311l14783K16791J96816
3896F603653j20224J63183j24175j03548p9174J87913J44869J64988j55056m2735
3886F639694r2605Q6276l4600J57972K8236L1781R0970K2767o8820j68607J31255
$$ y = [5442679, 5278546, 5563014, 5649234, 5428722, 5338707, 5274700, 5252825, 5362200, 5281489, 5272929, 5154765, 5338736, 5442502, 5212855, 5366903, 5483028, 5279786, 5312219, 5302846, 5307377, 5463743, 5234443, 5172611, 5285709, 5441787, 5440066, 5421803, 5713870, 5683349, 5363429, 5458273, 5439175, 5503275, 5434401, 5216169, 5741691, 5776718, 5464033, 5659529, 5824522, 5782847, 5764153, 5848776, 5911142, 6012122, 5940519, 5842954, 5868826, 5870413, 6024473, 6131003, 6198280, 6234867, 6052735, 6024631, 6094599, 6073695, 6466765, 6742140, 6504829, 6190046, 6406837, 6603653, 6483429, 6646612, 6522437, 6418889, 6339715, 6527628, 6672497, 6837485, 6682429, 6639694, 6547089, 6633365, 6598765, 6756737, 6784973, 6816754, 6907724, 6930491, 6861671, 6693064, 6824319]
3875F824319O4541J31435k12095k869j57058P5783J76664n5583p002K63908j60311
3864F941732j98262l7521J02181J83516q785n3536l4217M1290J19367J09301j16346
3853G048720J35033Q5989M7770O4659k98070m1332J22377R1621J91060L0565k0738
3842G457654Q2505j06347j18851j07259p5632K62474P9614j24451j26104R2219
3832G315822r7353K1581M1353j08943j73297n0806J05296j51805P0621J19982
3822G092451j11260j15131K10352l317O7733M4544J5432j16287j20979j0205j02874
3811F850459r0687J22687K6185k33809k522J14322n0526o434P9913k41760J08289
3800F676117j26805O2912J09038j59393j68352m2432L2850Q4637m0579n8477J59413
$$ y = [6824319, 6888860, 7020295, 6808200, 6805331, 6648273, 6724056, 6900720, 6845137, 6838135, 7102043, 6941732, 6743470, 6705949, 6808130, 6991646, 6982861, 6929325, 6895108, 6936398, 7055765, 7165066, 7048720, 7183753, 7269742, 7317512, 7382171, 7084101, 7042769, 7165146, 7256767, 7447827, 7478392, 7457654, 7540159, 7433812, 7314961, 7207702, 7132070, 7394544, 7474158, 7349707, 7223603, 7315822, 7218469, 7240050, 7281403, 7172460, 6999163, 6948357, 7053653, 6901848, 6972469, 7092451, 6981191, 6866060, 7076412, 7073095, 7140828, 7185372, 7200804, 7084517, 6963538, 6953333, 6850459, 6759772, 6882459, 6908644, 6674835, 6672313, 6786635, 6736109, 6729675, 6809588, 6567828, 6676117, 6549312, 6612224, 6721262, 6561869, 6393517, 6351085, 6383935, 6468572, 6427993, 6369516, 6528929]
3789F528929P3562K9286O6457j85971P9780K48233k13680j7554K4629R1087Q0090
3778F804848k22742K9741N5830j38553j01089J07497O1517l0822L20713k76530
3768F610410M0632J12000M9501l7421N7734q1583k4907M5071k85195J66969L02157
3757F955368K05065l31161j68058M792o0480K88709j3759L6177K6781P0350L0188
3746G043972K76450j90257J18398J05553j77790J82773k6086j75183j50995K21574
3736G228409j07799K53268J77816l2915J4366m2958j45690Q5472l8120l1309J55970
3725G516510N9508O5510m640r3580O6501n9637j65642K34305j5818j09371Q3792
3714G577438j82474k66472K30396J03606j80112J13784J81295J40053O1515K702
$$ y = [6528929, 6602491, 6631777, 6698234, 6512263, 6592043, 6840276, 6626596, 6609042, 6633671, 6724758, 6804848, 6582106, 6611847, 6667677, 6529124, 6428035, 6535532, 6597049, 6566227, 6886940, 6610410, 6651042, 6763042, 6812543, 6775122, 6832856, 6751273, 6726366, 6771437, 6486242, 6653211, 6955368, 7160433, 6829272, 6661214, 6666006, 6605526, 6894235, 6880476, 6916653, 6943434, 7013784, 7043972, 7320422, 7130165, 7248563, 7354116, 7176326, 7359099, 7333013, 7157830, 7006835, 7228409, 7120610, 7373878, 7551694, 7518779, 7533145, 7490187, 7344497, 7429969, 7391849, 7360540, 7516510, 7576018, 7641528, 7636888, 7543308, 7609809, 7550172, 7384530, 7618835, 7603017, 7493646, 7577438, 7394964, 7128492, 7358888, 7462494, 7282382, 7396166, 7577461, 7717514, 7779029, 7781731]
3704G781731M1722r0499K302j11742j394J94369j49473J72535k23938j56603q464
3693G450546q9995J37834K4855J90742j19861M2485j73973k19740P5640K25775
3683G544308K1990R0958o8391j1200K25171n3047j35271J8526J21869j41064P4705
3672G688554l6956j58452P09J16296r8917j998P9331R7315J6899n1812k27308
3661G423661K12939J19819j83797L5853m3608K7779l8818K59976n2344L8718K85801
3650H085979l90389J03923P3141J8139p5273R6271J11469J28749L3369J65824
3640H351202j85688o5935N937K495K9469K35454o4899R0468J8459j14750J57155
3629H459367n7621l6916m7965J36921L75999j21880j23436m1715j76307M16136
$$ y = [7781731, 7823453, 7732954, 7735256, 7623514, 7622120, 7816489, 7667016, 7839551, 7615613, 7459010, 7450546, 7360551, 7498385, 7523240, 7713982, 7594121, 7636606, 7462633, 7242893, 7318533, 7544308, 7566298, 7657256, 7588865, 7577665, 7802836, 7749789, 7614518, 7633044, 7754913, 7613849, 7688554, 7651598, 7493146, 7493855, 7610151, 7511234, 7509236, 7588567, 7685882, 7702781, 7650969, 7423661, 7636600, 7756419, 7572622, 7608475, 7564867, 7592646, 7553828, 7813804, 7761460, 7800178, 8085979, 7695590, 7799513, 7872654, 7890793, 7815520, 7911791, 8023260, 8152009, 8185378, 8351202, 8165514, 8099579, 8105516, 8108011, 8137480, 8372934, 8308035, 8398503, 8416962, 8302212, 8459367, 8401746, 8364830, 8316865, 8453786, 8829785, 8707905, 8584469, 8542754, 8366447, 8782583]
3619H782583p1589k5700N5495Q1783r8867J48423J72424J94775l5355J08677l8150
3608I274499R8546j68745J55289J8980Q1845K51735O8424Q0068J44853j71864
3598I833630N5063L36834k7612p9475K55735n3396O977J43343k2499j7225N9021
3587A0490396J47195J94555J23487k1939K19660L04835l04j24832Q8136L05159
3577A1726348N1366j2648R2178R4391L05225J37976M8682K00465o8134j28252
3567A2447597O1282j38611M52666K44265Q3176L86774J16743K63293M56934K23148
3557A4597267N0113N873L02765K89286L22430J16784K81751J31766J02594L02932
3547A6503561M29883J95126L80510K71603K63436N57265L66619N29788M53085
$$ y = [8782583, 8710994, 8685294, 8740789, 8822572, 8723705, 8872128, 9044552, 9239327, 9203972, 9312649, 9274499, 9373045, 9204300, 9359589, 9378569, 9460414, 9712149, 9780573, 9860641, 10005494, 9833630, 9888693, 10225527, 10197915, 10118440, 10374175, 10320779, 10327756, 10471099, 10448600, 10431375, 10490396, 10637591, 10832146, 10955633, 10933694, 11153354, 11458189, 11457885, 11333053, 11421189, 11726348, 11777714, 11765066, 11857244, 11951635, 12256860, 12394836, 12443518, 12643983, 12575849, 12447597, 12508879, 12370268, 12822934, 13067199, 13150375, 13537149, 13653892, 13917185, 14374119, 14597267, 14647380, 14653253, 14956018, 15245304, 15567734, 15684518, 15966269, 16098035, 16200629, 16503561, 16933444, 17128570, 17509080, 17780683, 18044119, 18601384, 18968003, 19497791, 19950876]
3538A9950876O21680N36602L83572Q7928M25907K52866j09603N03728M71697K46591
3528B3371844O1477K01339N29595L92130N18281M49769N57178M51718K73148N42468
3518B7348947N36491M38030P95815J008847M99319N92153R05461J158734Q75185
3509C4158982J060732J143890R07320R22071J391088J120198Q80619R15546N37626
3500D3038072R37756P52373Q09535Q21389J002510J313967J314496J275576J892253
3491E3157927J987523K199401K283607K600030K497524K687333L488826L601597
3483G4503768M161281M605082M557910M668538N544917N404267N634521N641210
3475A14721494N450883M967716M311175K919635J624362M46470q28856j790435
$$ y = [19950876, 20572556, 21109158, 21492730, 21580658, 22006565, 22259431, 22149828, 22653556, 23125253, 23371844, 23433321, 23634660, 24164255, 24556385, 25074666, 25524435, 26081613, 26533331, 26806479, 27348947, 27885438, 28323468, 29119283, 30128130, 30627449, 31219602, 32125063, 33283797, 34158982, 35219714, 36363604, 37270924, 38192995, 39584083, 40704281, 41584900, 42500446, 43038072, 43975828, 44728201, 45537736, 46359125, 47361635, 48675602, 49990098, 51265674, 53157927, 55145450, 57344851, 59628458, 62228488, 64726012, 67413345, 70902171, 74503768, 78665049, 83270131, 87828041, 92496579, 98041496, 103445763, 109080284, 114721494, 120172377, 125140093, 129451268, 132370903, 133995265, 134441735, 133612879, 131822444]
3467A31822444k845241l239188l402389k990480k822940k767052k949509k794140
3459A08011505k677857k906662k991795l699217k844867k987165k556813k154252
3451H5192877k242488k175858k014317j790612j662780j570497j545785j258420
3443G0932120j202100j133169j072652p81509q02820r85072j077001o51205n72390
3434F2654202m49704l93830l6765j60564l32042M2870n3653p85075j574713j781022
3424E7129704j990308j787519j340402j513164j489068j371629j018122j110996
3416D5508496r84748r30733o09897q20490p16695o25914q11193o30812n17706
3407C8860308m34510n55893m66894l83255k53442O3522j39549j15768J10785K17392
$$ y = [131822444, 128977203, 125738015, 122335626, 119345146, 116522206, 113755154, 110805645, 108011505, 105333648, 102426986, 99435191, 95735974, 92891107, 89903942, 87347129, 85192877, 82950389, 80774531, 78760214, 76969602, 75306822, 73736325, 72190540, 70932120, 69730020, 68596851, 67524199, 66742690, 65939870, 64954798, 63877797, 63226592, 62654202, 62204498, 61810668, 61773903, 61613339, 61281297, 61324167, 61270514, 60485439, 58910726, 57129704, 55139396, 53351877, 52011475, 50498311, 49009243, 47637614, 46619492, 45508496, 44523748, 43593015, 42983118, 42162628, 41445933, 40820019, 40008826, 39378014, 38860308, 38425798, 37869905, 37403011, 37019756, 36766314, 36829836, 36690287, 36574519, 36685304, 36902696]
3397C6902696p8092k3969j85949q20203q04067q33841m77701o81976o39762o08052
3387C1749084n11232m49194n43034n34519l69502n27678l86542j17781n43974
3378B7765628l22143j48252k58310n03515j90068l00265j60827o5800k53891j62411
3368B5400146j64955n72955n04126M752N8271k20839k87180k59733l64711j78887
3358B2909783j86952M5993l32245N2707l95599l29376j244j73625k79863n48594
3348B0760985j03893j9570k8992j26332j34954j90173Q9241k50056l87392q2759
3338A9526105l34759J86761p1299l00036m4260j36872q4712k04238p4136q5158
3328A8377396k054l10603l6964j83642L2809k43308J1157p4300l23740l6591p4765
$$ y = [36902696, 36824604, 36800635, 36614686, 35794483, 34990416, 34156575, 33678874, 32996898, 32357136, 31749084, 31237852, 30788658, 30245624, 29711105, 29341603, 28813925, 28427383, 28309602, 27765628, 27443485, 27295233, 27036923, 26533408, 26343340, 26043075, 25882248, 25816448, 25562557, 25400146, 25235191, 24662236, 24158110, 24162862, 24221133, 24000294, 23713114, 23453381, 23088670, 22909783, 22722831, 22768824, 22436579, 22489286, 22093687, 21764311, 21763067, 21589442, 21309579, 20760985, 20657092, 20637522, 20608530, 20482198, 20347244, 20157071, 20246312, 19996256, 19608864, 19526105, 19191346, 19378107, 19306808, 19006772, 18962512, 18825640, 18740928, 18536690, 18462554, 18377396, 18375342, 18064739, 18027775, 17844133, 17876942, 17633634, 17644791, 17570491, 17246751, 17210160, 17135395]
3317A7135395N1599J35885j81828j07974j00151j19873k260j4879J32973j14495
3307A6814392Q6977j40307k42616J36712o735r0074O1183k09755j99979j7464
3297A6192334J97576m0821P9902p7359j56736j61926k77412l44222k38637p1940
3287A5100759o510o0955o7369j73194J46280J04349r531l19963j20013j2159r4565
3276A4487129J22084n4229l35612k2548Q8430R4125k0508M1019O4083L0061J78446
3265A4672480k65427K06277j11367n22377m1461j38732n23668k07202j82758k67287
3255A2618478K10884l10701k88995k15366J40436L8786n6006J00893J30536m10802
3245A1958143P9980J473l53670J45829P6908j38434Q3770Q1930j60618J29317
$$ y = [17135395, 17186994, 17322879, 17141051, 17033077, 16932926, 16813053, 16810793, 16795914, 16928887, 16814392, 16901369, 16761062, 16518446, 16655158, 16648423, 16558349, 16619532, 16409777, 16209798, 16192334, 16389910, 16349089, 16428991, 16351632, 16194896, 16032970, 15755558, 15411336, 15172699, 15100759, 15094249, 15033294, 14965925, 14792731, 14939011, 15043360, 15033829, 14713866, 14593853, 14581694, 14487129, 14609213, 14554984, 14219372, 14196824, 14285254, 14379379, 14358871, 14399890, 14463973, 14494034, 14672480, 14407053, 14613330, 14501963, 13979586, 13938125, 13799393, 13275725, 13068523, 12885765, 12618478, 12829362, 12518661, 12229666, 12014300, 12154736, 12193522, 12137516, 12238409, 12368945, 11958143, 12038123, 12039596, 11685926, 11831755, 11908663, 11770229, 11853999, 11935929, 11775311, 11904628]
3235A1904628J7629K95110k2439m1498J11672m57626N2882L2955k17066p8637
3225A1597610p6348R4044K9059K28797j22425P9771p3738k19983K8262K97710
3215A1862759n5279K30375M7646k39941M28253J38968k25310K05468n4712O4115
3205A2402342O2009K82339Q2818R3345O1411j49703J0986J81959J28469L9415
3195A3195390k35519J57780K04153K30887K37040j6032k9144o1116J36929J75016
3185A3995384L57335L81893P1116j21740K96133L23476J06277L32175K39831N77505
3175A6559385K85293K61795L14270M30048L10926M92270O03831L38948O68938
3166B0265704L59124P32762O93515N59928O42778P74605N52789L27316M92949
$$ y = [11904628, 11922257, 12217367, 12194928, 12153430, 12265102, 11807476, 11860358, 11893313, 11676247, 11597610, 11521262, 11615306, 11644365, 11873162, 11750737, 11830508, 11756770, 11536787, 11565049, 11862759, 11807480, 12037855, 12085501, 11845560, 12273813, 12412781, 12187471, 12392939, 12338227, 12402342, 12464351, 12746690, 12829508, 12922853, 12984264, 12834561, 12845547, 13027506, 13155975, 13195390, 12959871, 13117651, 13321804, 13552691, 13789731, 13773699, 13744555, 13683439, 13820368, 13995384, 14352719, 14734612, 14805728, 14683988, 14980121, 15303597, 15409874, 15742049, 15981880, 16559385, 16844678, 17106473, 17420743, 17850791, 18161717, 18653987, 19257818, 19596766, 20265704, 20624828, 21357590, 22051105, 22611033, 23253811, 24028416, 24581205, 24908521, 25401470]
3157B5401470P36424K79831P48581L83522M14064O03392N49919O12811M90400
3148C0220414L89484M35735N03304P07704P83686Q60429R75616J111448J343994
3139C7331814J507010J361978J619434J687181J610089J624479J511746J849835
3131E0103566J460968Q90682R13002M25892l12304n07271q95125j031261o96979
3122E0351170q82455k52122J88937m18454J69044L26605K58256L87848N05647
3113E0634476O89615J037141J068922Q40543J126382Q66274P06554O99124O37065
3104E8306096O17351N96790J39033j34720m84003o18896q45294j111413j134526
3095E5330418j377361j288976j321321r23669r54331p55599q17474n69732m08504
$$ y = [25401470, 26137894, 26417725, 27166306, 27549828, 27963892, 28567284, 29117203, 29730014, 30220414, 30609898, 31045633, 31548937, 32256641, 33040327, 33900756, 34876372, 35987820, 37331814, 38838824, 40200802, 41820236, 43507417, 45117506, 46741985, 48253731, 50103566, 51564534, 52455216, 53368218, 53794110, 53481806, 52974535, 52079410, 51048149, 50351170, 49468715, 49216593, 49405530, 48987076, 49156120, 49482725, 49740981, 50128829, 50634476, 51324091, 52361232, 53430154, 54270697, 55397079, 56263353, 56969907, 57669031, 58306096, 58923447, 59520237, 59659270, 59524550, 59040547, 58421651, 57576357, 56464944, 55330418, 53953057, 52664081, 51342760, 50419091, 49464760, 48709161, 47891687, 47321955, 46913451]
3086D6913451k78188o9803l83593k19464l00022l19846q8738n82971p22647l23967
3076D3624212q13770j166180j228846j046078j043139j203197j322926j244276
3068C4555800p54206r57692j125234r01038r83727j052571p23742p80737o77868
3059B6598985n52244p58769o36708j66071p12482l40642l80931p73309m51773
3050B1826056m81696n10069l45090m66473o33226l94249l77948k82722o58915
3041A7675668o08347m47137j28668m61231l29478k38644k72905k31480j84573
3032A4773205l25606n79026k24722k18874j51374k45379l65869l06187j52496
3023A2203672k07786L5578k70528j33921l07846k38615k2971J64429n1085l07957
$$ y = [46913451, 46635263, 46565460, 46181867, 45962403, 45662381, 45342535, 45253797, 44670826, 43948179, 43624212, 42810442, 41644262, 40415416, 39369338, 38326199, 37123002, 35800076, 34555800, 33801594, 32843902, 31718668, 30817630, 29833903, 28781332, 28057590, 27276853, 26598985, 26046741, 25287972, 24651264, 24485193, 23772711, 23432069, 23051138, 22277829, 21826056, 21344360, 20834291, 20489201, 20022728, 19389502, 18995253, 18617305, 18334583, 17675668, 17067321, 16620184, 16491516, 16030285, 15700807, 15462163, 15189258, 14957778, 14773205, 14447599, 13868573, 13643851, 13424977, 13273603, 13028224, 12662355, 12356168, 12203672, 11995886, 12031464, 11760936, 11627015, 11319169, 11080554, 11057583, 11222012, 11170927, 10862970]
3013A0862970j54441o270k58847m01284N0459j2421M6570j35443m56659l75223
3003I159411J39822l43557l91533J14273o9842j59995P5660m6467k18572j40291
2993H118909j64617J58296n4082k94263k07952m5245o5525O1869k31293n3403
2983G222694K41561k93974j71902p7682N0124l0932p92j67062n35226l1488j28299
2972F077022j51231N088j21480L42332N2259p6280k53023k92701j10405k37038
2962E234543j1538j10388L1438J85430k53377J0756K1564L0550k06433n8402k45130
2951D629013J79699l14733J2123J20203n9276m6538N2903k1917j33159p7901O3494
2940D403911R2465j22321j45185R7503R0967p5461M5121l90359n5238j5752n8759
$$ y = [10862970, 10708529, 10702259, 10443412, 10042128, 10092587, 10080166, 10126736, 9991293, 9534634, 9159411, 9299233, 8955676, 8564143, 8678416, 8608574, 8448579, 8524239, 8477772, 8259200, 8118909, 7954292, 8112588, 8058506, 7764243, 7556291, 7511046, 7445521, 7507390, 7276097, 7222694, 7464255, 7170281, 6998379, 6920697, 6970821, 6939889, 6939097, 6772035, 6236809, 6205321, 6077022, 5925791, 5930879, 5809399, 6151731, 6203990, 6127710, 5874687, 5581986, 5471581, 5234543, 5223005, 5112617, 5144055, 5329485, 5076108, 5086864, 5108428, 5138978, 4932545, 4874143, 4629013, 4808712, 4493979, 4506102, 4626305, 4567029, 4520491, 4573394, 4551477, 4418318, 4340417, 4403911, 4496376, 4374055, 4228870, 4326373, 4417340, 4341879, 4387000, 3996641, 3941403, 3925651, 3866892]
2929C866892Q0145j11623N6103N9110j15270P9389r0380O5745j93577J72796J5664
2918C884994k6539N9123M2521l31865j14070l6857K53440N193J29636r0169j60029
2907C615378l43018k00350K02379j08241R0764r3957N5939J15241j712M3008J40037
2896C515468r0892o9650j51131j27375J5454J15797j68876P6307p5076J921k4040
2885C017907p8712n5289n1784q202j8633Q4335j26116R2492N7749j98047J13572
2874B829272l4595L8525J63965j47538n8961j21880K97718j92528j11232r9347
2864B563399j54347K98186o1294j83159J51350j7837P0205j57639m4214J72962
2854B637612J54611j10863p9310j66062K14789K01518j9633j82513j29896j10154
$$ y = [3866892, 3947037, 3835414, 3891517, 3950627, 3835357, 3914746, 3824366, 3890111, 3696534, 3869330, 3884994, 3858455, 3917578, 3960099, 3628234, 3514164, 3477307, 3730747, 3735940, 3865576, 3775407, 3615378, 3272360, 3072010, 3274389, 3166148, 3256912, 3162955, 3218894, 3334135, 3332423, 3375431, 3515468, 3424576, 3354926, 3203795, 3076420, 3091874, 3207671, 3038795, 3115102, 3040026, 3041947, 3017907, 2939195, 2883906, 2832122, 2823920, 2805287, 2889622, 2763506, 2855998, 2913747, 2715700, 2829272, 2794677, 2833202, 2997167, 2849629, 2790668, 2668788, 2966506, 2773978, 2662746, 2563399, 2409052, 2707238, 2645944, 2462785, 2614135, 2596298, 2666503, 2508864, 2464650, 2637612, 2792223, 2681360, 2602050, 2435988, 2650777, 2852295, 2832662, 2650149, 2520253, 2410099]
2844B410099j39296J01025j0686l2924J20121L69533q5446l9368j311k44701j15988
2833B331058j2401L8075K45210J7367r6536J00243K42126l05164k47207n9701
2823B253070J21652q1298j68140L51850O211k56481k18197P8296J73196j22771
2813B137388K7141K6809j51596L7508N8037j18021m666n2741M0900J15348P1771
2802B187878j05240Q3558k03356L32596J86522k32977l60798j21582Q2608K07625
2792B056834l73748j04138K18312K52965K12868j85532j29603R1146L8893m39429
2782A638568K90684n8535o1744Q2292L3741j86424k58343O9525R8375J37184P6823
2771A862146j7010l574n0680m86195n0139M3119J78744j07234J23128K52467j20374
$$ y = [2410099, 2270803, 2371828, 2361142, 2328218, 2448339, 2817872, 2732426, 2693058, 2691747, 2447046, 2331058, 2318657, 2356732, 2601942, 2619309, 2522773, 2623016, 2865142, 2559978, 2312771, 2253070, 2374722, 2293424, 2125284, 2477134, 2483345, 2226864, 2008667, 2086963, 2260159, 2137388, 2164529, 2191338, 2039742, 2077250, 2135287, 2017266, 2012600, 1959859, 2000759, 2116107, 2187878, 2082638, 2166196, 1962840, 2295436, 2481958, 2248981, 1888183, 1766601, 1849209, 2056834, 1683086, 1578948, 1797260, 2050225, 2263093, 2077561, 1947958, 2039104, 2077997, 1638568, 1929252, 1870717, 1808973, 1891265, 1925006, 1738582, 1480239, 1549764, 1648139, 1785323, 1862146, 1845136, 1841562, 1790882, 1304687, 1254548, 1297667, 1476411, 1369177, 1492305, 1744772, 1624398]
2760A624398j21628m2658K21550j26353O5371k26075M3371l4005R9782J68589
2750A672342P8624J7707k35359R2343J6104k76081k16263K88766J48525M2174
2740A628882j01650k70748J40862M0458L1016l3721M0789j0147n025k36255R3766
2729A318227J48633m21237Q6745J49791j06141k43161J20975J21497J42524j9917
2719A297936q1261k15873L0845J84807r5499J23824o6021o894R8376j92878J30810
2708A208172K02236j85307q0806j24271p0052K2098K26306K35511j25406j48660
2698A159821o9419J93621J78010j34562R553j11117q2412R7815J02173l389J02059
2687A442153l22546l1624p3993k88742K55507P8761k4562J14900J18566r5180
$$ y = [1624398, 1502770, 1460112, 1681662, 1555309, 1620680, 1394605, 1437976, 1403971, 1503753, 1672342, 1750966, 1768673, 1533314, 1625657, 1641761, 1365680, 1149417, 1438183, 1586708, 1628882, 1527232, 1256484, 1397346, 1437804, 1468820, 1435099, 1475888, 1465741, 1460716, 1224461, 1318227, 1466860, 1045623, 1132368, 1282159, 1176018, 932857, 1053832, 1175329, 1317853, 1297936, 1216675, 1000802, 1031647, 1216454, 1120955, 1244779, 1178758, 1171864, 1270240, 1077362, 1208172, 1410408, 1225101, 1144295, 1020024, 949972, 972070, 1198376, 1433887, 1308481, 1159821, 1090402, 1284023, 1462033, 1327471, 1337024, 1225907, 1143495, 1241310, 1343483, 1340094, 1442153, 1119607, 1087983, 1013990, 725248, 980755, 1059516, 1034954, 1149854, 1268420, 1173240]
2677A173240k38975p2777k09936J40613R6698J06382o2420J82814J18753m11526
2667H22866N3838M0852j33309j25970J87820J70493j71760r6404o2913O3929R459
2656G58901O5917J77062k31907q4083J44641N4197L02996M518j61433j40679j24605
2645G65525q6614k21345N8469j77637q767K55343P852K00168j77323p9678K2006
2634E57999l2177P1764l4506J48338J12179J30876k0679l08960l6499K47542q5740
2623G50137k49988K260P2675J08382R9121j07814J05635J12514L3101O0482k85396
2612G01109Q2622R9167n4379K10853J7943m5174j86899n6038j91021J39923R954
2601G28060K45672L02185J00402p2969J73709J8069n34379l25739K64700j67799
$$ y = [1173240, 934265, 861488, 651552, 792165, 888863, 995245, 932825, 1115639, 1234392, 822866, 876704, 917556, 784247, 658277, 846097, 1016590, 844830, 748426, 685513, 749442, 758901, 824818, 1001880, 769973, 685890, 830531, 884728, 1187724, 1192242, 1030809, 890130, 765525, 678911, 457566, 516035, 338398, 329631, 584974, 592826, 792994, 615671, 535993, 557999, 525822, 597586, 563080, 711418, 823597, 954473, 933794, 624834, 588335, 835877, 750137, 500149, 502409, 575084, 683466, 782587, 674773, 780408, 892922, 926023, 986505, 701109, 783731, 882898, 828519, 1039372, 1057315, 1012141, 825242, 769204, 578183, 718106, 728060, 973732, 1275917, 1376319, 1303350, 1477059, 1495128, 960749, 635010, 899710, 731911]
2591G31911O5423q5262j31669M7475j47184j11451q8188O1994J09665J0220j36465
2580C26469j17615J42722M4527J58287Q6551k69506P4090J35652o3516k96174
2570B21487M1475j02971M1110J01504j13303M9427N01196q0504j75028m5351L12374
2559G51416p4714m3269p0644k56587o0266J26722N8918k03387K16319J525p2130
2548C73903L1631J70464n0447J41748k58921J43563K5595k16752r5046j19439
2538A46299J37693j03508p1896P8798L91032m4228j04788J15877J561K0951k50669
2527C17122M7749J8436r6611R9819m2801j97612J85235K03183k46759j47000J12242
2516B53003J95553m45835K22158Q9662K0908R4052l4426O8104J36637J0370j29452
$$ y = [731911, 797334, 712072, 580403, 627878, 480694, 369243, 281055, 343049, 452714, 462934, 326469, 208854, 351576, 396103, 554390, 640941, 371435, 445525, 581177, 517661, 221487, 262962, 159991, 201101, 302605, 189302, 238729, 739925, 659421, 484393, 439042, 751416, 676702, 633433, 562789, 306202, 245936, 372658, 431576, 228189, 444508, 446033, 373903, 405534, 575998, 525551, 667299, 408378, 551941, 577536, 360784, 265738, 146299, 283992, 180484, 108588, 187386, 578418, 534190, 429402, 545279, 546840, 567791, 317122, 364871, 383307, 286696, 386515, 343714, 146102, 331337, 534520, 287761, 140761, 253003, 448556, 2721, 224879, 314541, 335449, 429501, 395075, 463179, 599816, 610186, 480734]
2505D80734J13592M6181j12927j59021L8504J96214j4414k06747j87109L71484
2495E66491l0848p1522j20906J23395l6373k58570K35005j69546j95653o775Q7912
2484A22610L25721j42404r833P4298p3744J25284Q6751m4933J01613l26299o9385
2473A69679K19630l4865K89174M0920j30532q5894K3853Q2013q2254q4022J73064
2462E80766j54784m7985j16203j462j25748J75431P9693K31991q5511r0109j05101
2451C40978q8156k55424J84750K21223K61500l10416k64442R844j80134K87248
2441B06971K06726j59284j12483J24747k19303L2454l0624M4412K10491M4998
2431C49105k6815J17045l16925N2271L56671l5263n5726J7427Q6099r902p9476
$$ y = [480734, 594326, 640507, 527580, 368559, 407063, 603277, 588863, 382116, 195007, 566491, 535643, 464121, 343215, 466610, 430237, 171667, 406672, 237126, 41473, 34698, 122610, 448331, 305927, 296094, 370392, 296648, 421932, 508683, 463750, 565363, 239064, 169679, 389309, 354444, 643618, 684538, 554006, 468112, 491965, 573978, 491724, 407702, 580766, 425982, 377997, 261794, 260332, 134584, 310015, 389708, 621699, 536188, 446079, 340978, 252822, -2602, 182148, 403371, 664871, 354455, 90013, 99857, -80277, 206971, 413697, 254413, 141930, 266677, 47374, 79828, 49204, 93616, 304107, 349105, 322290, 439335, 122410, 174681, 531352, 496089, 440363, 457790, 543889, 533987, 454511]
2420D54511j92699l892M5489J48551n2542J491K71928M2515K0410j28469R1344
2409F98637m4802j75617K50584k3008J24659r6275j09206j48167o2294j6883K04438
2398F02066l4879l9640M10595J58582J40059k55732m2702P5114j86065j32151
2388F95247J23208J0086K21561p1064J99987k19599J55752K5093j36032K20968
2378A225207J21678J17406o5087J20441j01167j25454j64300J29198K95205M93892
2368B047019K20325P0351J35720J56629P3094M28833L33730M40122J94104L69054
2358D468981O06032K67824N27337L09531L99521P46064J181025O67311J025876
2349A0199502J069627J167581J379756J782703J694383J675292J691880K065129
$$ y = [454511, 261812, 257920, 303409, 451960, 399418, 400909, 672837, 715352, 735762, 607293, 698637, 653835, 478218, 728802, 705794, 830453, 734178, 624972, 476805, 414511, 397628, 602066, 567187, 527547, 938142, 1096724, 1236783, 981051, 938349, 1013463, 827398, 695247, 818455, 828541, 1050102, 979038, 1179025, 959426, 1115178, 1140271, 1004239, 1225207, 1346885, 1464291, 1399204, 1519645, 1418478, 1293024, 1128724, 1257922, 1553127, 2047019, 2267344, 2337695, 2473415, 2630044, 2703138, 3131971, 3465701, 3905823, 4099927, 4468981, 5075013, 5342837, 5870174, 6179705, 6579226, 7325290, 8506315, 9173626, 10199502, 11269129, 12436710, 13816466, 15599169, 17293552, 18968844, 20660724, 22725853]
2341B2725853K970382L768228M701628O179128P914654R793202R847525R671585
2333G7572185J1165704J0550322O604589j207295r890506j1734442j0693589q530094
2325F3836874o678187n380387m375909l956791l128500l039361k539242k641876
2317C2096621j872052j718239j787818k067816k004132j826953j500007j180381
2309A8139223j188493r54992j016660q51711p02591n99918o60825p97312k41790
2300A1124931n58643n64372m07074k57207j25770n80341k42337k40251m72494
2291G676442j19789r4740k78936m21779k52400l40863l72164l6193j21538l91640
2281E246400K5780j27145k16200n24895P7161M3935j87930l49706j55379J6753
$$ y = [22725853, 25696235, 29464463, 34166091, 40345219, 48259873, 58053075, 67900600, 77572185, 88737889, 99288211, 105892800, 104685505, 94794999, 83060557, 72366968, 63836874, 57158687, 51778300, 47402391, 43445600, 40317100, 37277739, 34738497, 32096621, 30224569, 28506330, 26718512, 24650696, 22646564, 20819611, 19319604, 18139223, 16950730, 15995738, 14979078, 14127367, 13424776, 12824858, 12164033, 11366721, 11124931, 10566288, 10001916, 9594842, 9337635, 9211865, 8631524, 8389187, 8148936, 7676442, 7556653, 7461913, 7182977, 6761198, 6508798, 6167935, 5795771, 5759578, 5638040, 5246400, 5272180, 5145035, 4928835, 4403940, 4481101, 4525036, 4337106, 3987400, 3832021, 3848774]
2271C848774r5031k08448J2487J3973J04380N6582k68472j40505j05062j21927
2261C096751l89287q0148j86700P8890J36198K28741j22550j84102j45999j89752
2251B242042j10954k09760J37067L19593m8828k53808j6346K72500P6582j79213
2241B228875j57323k10880Q7269q666O1601r2211N1347j54582L22785l08928k44062
2230A575225J58218j70783L5508k7854j46652k6408O046Q5250K52419o7178l0397
2219A643394r459o4837j83124J08290J87617K3059m1359R6600n3737k99545J41316
2208A548215q325l59136J53412j47149J35280J44208j00338m2564r1787J19634
2198A351450k41894l55263l3063L25330o8910N0269J85502J21865p7954j64121
$$ y = [3848774, 3753743, 3545295, 3557782, 3571755, 3676135, 3732717, 3464245, 3323740, 3218678, 3096751, 2707464, 2627316, 2440616, 2519506, 2655704, 2884445, 2761895, 2577793, 2431794, 2242042, 2131088, 1921328, 2058395, 2377988, 2329160, 2075352, 2059006, 2331506, 2408088, 2228875, 2071552, 1860672, 1947941, 1939275, 2000876, 1908665, 1960012, 1805430, 2128215, 1819287, 1575225, 1733443, 1562660, 1598168, 1570314, 1423662, 1397254, 1403300, 1488550, 1740969, 1673791, 1643394, 1633935, 1569098, 1385974, 1494264, 1681881, 1704940, 1663581, 1760181, 1706444, 1406899, 1548215, 1539890, 1180754, 1334166, 1187017, 1322297, 1466505, 1366167, 1323603, 1231816, 1351450, 1109556, 754293, 721230, 1046560, 977650, 1027919, 1213421, 1335286, 1257332, 1093211]
2188A093211K19488j94040n4053j25830k867q2846K15616N877o6211q754J06197
2177A105788k36230k8521n2035k2503M163k17902L3356Q7268j72872j15686L75481
2166G60307Q9176j13423j00672n12905M28849J02194j46154J03837K49815l884
2156H57140r3737q3234k07680K03020j14558K32715K6944o8977j50373n5064l11955
2145B34241K86455J62973l03801K38798k3171j17491k31252L51350n5788j86996
2135C55318K18398n6878j97413l1294M7538K15520l7481N6768J60619J51790m1787
2124H41098J45553q5802j83091J8853k60234j05643L4940K41778R9269J00591
2114H47312j10731l90600J20288J35403Q668p277J43565p3165j04871k4184k69256
$$ y = [1093211, 1312699, 1118659, 1064606, 938776, 935909, 853063, 1068679, 1074556, 1008345, 999591, 1105788, 869558, 841037, 789002, 766499, 770662, 552760, 586116, 673384, 500512, 384826, 760307, 849483, 736060, 635388, 122483, 551332, 653526, 507372, 611209, 861024, 857140, 763403, 680169, 472489, 675509, 560951, 793666, 820610, 751633, 601260, 546196, 234241, 520696, 683669, 379868, 618666, 595495, 478004, 246752, 598102, 542314, 355318, 573716, 516838, 319425, 288131, 335669, 551189, 513708, 570476, 731095, 882885, 841098, 986651, 900849, 717758, 736611, 476377, 370734, 405674, 647452, 746721, 847312, 736581, 345981, 466269, 601672, 610340, 603063, 746628, 673463, 568592, 544408, 275152]
2103B75152J11833o0291K48700j17647o5415J39960k9258l49577J48511J99479
2093E01447k66663q9112K92211Q9670n482j99608O6844j3692J31730j18027j018
2082C88300k07563J78402Q5548O3451l7175l07993j35737J53721L08354k57010
2072B32298N9967K33353L7706n0284k07754K17697K22778j39899j28962K54924
2062G31824K26202p0844m530J5894l07240j24367J67180K8086r7054J29501j65636
2051E29016j23918J30127l7362j21211j60015j7566R0335O863M6363J07456q7606
2040C62482k13312J33762J62066j5767j99784L8574k81996j81099N08224K92621
$$ y = [275152, 386985, 326694, 575394, 457747, 392332, 532292, 503034, 153457, 301968, 501447, 234784, 145672, 437883, 527553, 522071, 322463, 389307, 375615, 507345, 389318, 388300, 180737, 359139, 444687, 508138, 470963, 162970, 27233, 180954, 489308, 232298, 292265, 525618, 563324, 513040, 305286, 522983, 745761, 605862, 476900, 731824, 958026, 887182, 882652, 898546, 591306, 466939, 634119, 662205, 565151, 694652, 529016, 405098, 535225, 497863, 376652, 216637, 199071, 289406, 296269, 342632, 450088, 362482, 149170, 282932, 444998, 429231, 229447, 268021, -13975, -195074, 313150, 605771]
$$ [...]
##END NTUPLES=NMR SPECTRUM
##END=
