##TITLE=1H_DE-80H_X3
 200.13MHz, d2o
 8 sc
 
 19ns.26.2.2025
##JCAMPDX= 6.0         $$ Bruker NMR JCAMP-DX V2.0
##DATA TYPE= NMR SPECTRUM
##DATA CLASS= NTUPLES
##ORIGIN= UXNMR, Bruker Analytische Messtechnik GmbH
##OWNER= pz
$$ XWIN-NMR		Version 3.5
$$ Wed Oct 15 14:54:21 2025 Russian Standard Time (UT+4h)  Yarkov@DPX200
##.OBSERVE FREQUENCY= 200.1313
##.OBSERVE NUCLEUS= ^1H
##.ACQUISITION MODE= SIMULTANEOUS
##.ACQUISITION SCHEME= undefined
##.AVERAGES= 8
##.DIGITISER RES= 18
##SPECTROMETER/DATA SYSTEM= spect
##.PULSE SEQUENCE= zg30
##.SOLVENT NAME= CDCl3
##.SHIFT REFERENCE= (INTERNAL, CDCl3, 0, 15.4891)
##AUDIT TRAIL= $$ (NUMBER, WHEN, WHO, WHERE, WHAT)
$$ ##TITLE= Audit trail, XWIN-NMR		Version 3.5
$$ ##JCAMPDX= 5.01
$$ ##ORIGIN= Bruker BioSpin GmbH
$$ ##OWNER= Yarkov
$$ C:/Bruker/XWIN-NMR/data/yarkov2/nmr/H-C/1/pdata/1/auditp.txt
$$ ##AUDIT TRAIL=  $$ (NUMBER, WHEN, WHO, WHERE, WHAT)
(   1,<2025-10-15 14:53:42.84 +0400>,<Yarkov>,<DPX200>,
      <created by zg, POWCHK disabled, PULCHK disabled
       configuration hash MD5:
       00 E9 B6 7A A2 85 ED C7 34 08 36 98 17 FE 4E 26
       data hash MD5: 16K
       27 30 B2 10 39 BA FE 91 53 E7 1B FB 0D 3D 89 64>)
(   2,<2025-10-15 14:53:46.89 +0400>,<Yarkov>,<DPX200>,
      <Start of raw data processing
       efp BC_mod = 2 LB = 0.25 FT_mod = 6 PKNL = 1 PHC0 = -3350.054 PHC1 = 8.932312 SI = 16K 
       data hash MD5: 16K
       39 80 39 82 45 69 DA 49 E8 9A E9 F7 41 9F 57 EE>)
$$ ##END=
$$ 
$$ hash MD5
$$ AD 4B 3A FD D3 76 C4 E4 BF 2B 7B C6 15 5E 40 FA
##$RELAX= 
##$RELAX= 
##$RELAX= 
##$RELAX= 
##$RELAX= 
##$RELAX= 
$$ Bruker specific parameters
$$ --------------------------
##$DU= <C:/Bruker/XWIN-NMR>
##$EXPNO= 1
##$NAME= <H-C>
##$PROCNO= 1
##$TYPE= <nmr>
##$USER= <yarkov2>
##$AMP= (0..31)
100 100 100 100 100 100 100 100 100 100 100 100 100 100 100 100 100 100 
100 100 100 100 100 100 100 100 100 100 100 100 100 100 
##$AQSEQ= 0
##$AQ_mod= 1
##$AUNM= <au_zg>
##$AUTOPOS= <>
##$BF1= 200.13
##$BF2= 200.13
##$BF3= 200.13
##$BF4= 200.13
##$BF5= 200.13
##$BF6= 200.13
##$BF7= 200.13
##$BF8= 200.13
##$BYTORDA= 1
##$CFDGTYP= 0
##$CFRGTYP= 5
##$CHEMSTR= <none>
##$CNST= (0..31)
1 1 145 1 1 1 1 1 1 1 1 1 1 1 1 1 1 1 1 1 1 1 1 1 1 1 1 1 1 1 1 1 
##$CPDPRG= <>
##$CPDPRG1= <>
##$CPDPRG2= <>
##$CPDPRG3= <>
##$CPDPRG4= <mlev>
##$CPDPRG5= <mlev>
##$CPDPRG6= <mlev>
##$CPDPRG7= <mlev>
##$CPDPRG8= <mlev>
##$CPDPRGB= <>
##$CPDPRGT= <>
##$D= (0..31)
0 0.7 0 0 0 0 0 0 0 0 0 0.03 0 0 0 0 0 0 0 0 0 0 0 0 0 0 0 0 0 0 0 0 
##$DATE= 1760525622
##$DBL= (0..7)
120 120 120 120 120 120 120 120 
##$DBP= (0..7)
150 150 150 150 150 150 150 150 
##$DBP07= 0
##$DBPNAM0= <>
##$DBPNAM1= <>
##$DBPNAM2= <>
##$DBPNAM3= <>
##$DBPNAM4= <>
##$DBPNAM5= <>
##$DBPNAM6= <>
##$DBPNAM7= <>
##$DBPOAL= (0..7)
0.5 0.5 0.5 0.5 0.5 0.5 0.5 0.5 
##$DBPOFFS= (0..7)
0 0 0 0 0 0 0 0 
##$DE= 6
##$DECBNUC= <off>
##$DECIM= 32
##$DECNUC= <off>
##$DECSTAT= 4
##$DIGMOD= 1
##$DIGTYP= 9
##$DL= (0..7)
0 120 120 120 120 120 120 120 
##$DP= (0..7)
$$ [...]
##$SUBNAM2= <"">
##$SUBNAM3= <"">
##$SUBNAM4= <"">
##$SUBNAM5= <"">
##$SUBNAM6= <"">
##$SUBNAM7= <"">
##$SUBNAM8= <"">
##$SUBNAM9= <"">
##$SW= 18.0517328524113
##$SWIBOX= (0..15)
0 0 2 0 0 0 0 0 0 0 0 0 0 0 0 0 
##$SW_h= 3612.71676300578
##$TD= 16384
##$TD0= 1
##$TE= 0
##$TE2= 300
##$TE3= 300
##$TEG= 300
##$TL= (0..7)
0 120 120 120 120 120 120 120 
##$TP= (0..7)
150 150 150 150 150 150 150 150 
##$TP07= 0
##$TPNAME0= <>
##$TPNAME1= <>
##$TPNAME2= <>
##$TPNAME3= <>
##$TPNAME4= <>
##$TPNAME5= <>
##$TPNAME6= <>
##$TPNAME7= <>
##$TPOAL= (0..7)
0.5 0.5 0.5 0.5 0.5 0.5 0.5 0.5 
##$TPOFFS= (0..7)
0 0 0 0 0 0 0 0 
##$TUNHIN= 0
##$TUNHOUT= 0
##$TUNXOUT= 0
##$USERA1= <user>
##$USERA2= <user>
##$USERA3= <user>
##$USERA4= <user>
##$USERA5= <user>
##$V9= 5
##$VALIST= <valist>
##$VCLIST= <CCCCCCCCCCCCCCC>
##$VD= 0
##$VDLIST= <DDDDDDDDDDDDDDD>
##$VPLIST= <PPPPPPPPPPPPPPP>
##$VTLIST= <TTTTTTTTTTTTTTT>
##$WBST= 1024
##$WBSW= 4
##$XGAIN= (0..3)
0 0 0 0 
##$XL= 0
##$YL= 0
##$YMAX_a= 245940
##$YMIN_a= -325926
##$ZGOPTNS= <>
##$ZL1= 120
##$ZL2= 120
##$ZL3= 120
##$ZL4= 120
##$ABSF1= 0
##$ABSF2= 0
##$ABSG= 0
##$ABSL= 0
##$ALPHA= 0
##$AQORDER= 0
##$ASSFAC= 0
##$ASSFACI= 0
##$ASSFACX= 0
##$ASSWID= 0
##$AUNMP= <proc_1d>
##$AZFE= 0.1
##$AZFW= 0.1
##$BCFW= 0
##$BC_mod= 2
##$BYTORDP= 0
##$COROFFS= 0
##$CY= -3
##$DATMOD= 1
##$DC= 0
##$DFILT= <>
##$DTYPP= 0
##$F1P= 0
##$F2P= 0
##$FCOR= 1
##$FTSIZE= 16384
##$FT_mod= 6
##$GAMMA= 0
##$GB= 0
##$INTBC= 1
##$INTSCL= 3.241238e-09
##$ISEN= 128
##$LB= 0.25
##$LEV0= 0
##$LPBIN= 0
##$MAXI= 10000
##$MC2= 0
##$MEAN= 0
##$ME_mod= 0
##$MI= 1.114404
##$NCOEF= 0
##$NC_proc= -6
##$NLEV= 6
##$NOISF1= 3.799351
##$NOISF2= 2.8
##$NSP= 0
##$NTH_PI= 0
##$NZP= 0
##$OFFSET= 15.48907
##$PC= 1
##$PHC0= -3350.054
##$PHC1= 8.932312
##$PH_mod= 1
##$PKNL= yes
##$PPARMOD= 0
##$PSCAL= 0
##$PSIGN= 0
##$REVERSE= no
##$SF= 200.130006530948
##$SI= 16384
##$SIGF1= 3
##$SIGF2= 2
##$SINO= 0.751879
##$SIOLD= 32768
##$SREGLST= <19F.Aceton>
##$SSB= 0
##$STSI= 16384
##$STSR= 0
##$SW_p= 3612.71676300578
##$SYMM= 0
##$S_DEV= 0
##$TDeff= 16384
##$TDoff= 0
##$TI= <>
##$TILT= no
##$TM1= 0
##$TM2= 0
##$TOPLEV= 0
##$USERP1= <user>
##$USERP2= <user>
##$USERP3= <user>
##$USERP4= <user>
##$USERP5= <user>
##$WDW= 1
##$XDIM= 16384
##$YMAX_p= 512778865
##$YMIN_p= -862824
$$ End of Bruker specific parameters
$$ ---------------------------------
##NTUPLES= NMR SPECTRUM
##VAR_NAME=  FREQUENCY,     SPECTRUM/REAL,   SPECTRUM/IMAG
##SYMBOL=    X,             R,               I
##VAR_TYPE=  INDEPENDENT,   DEPENDENT,       DEPENDENT
##VAR_FORM=  AFFN,          ASDF,            ASDF
##VAR_DIM=   16384,         16384,           16384
##UNITS=     HZ,            ARBITRARY UNITS, ARBITRARY UNITS
##FACTOR=    0.220516191357247, 1,           1
##FIRST=     3099.82766798227, 0,            0
##LAST=      -512.88909502351, 0,            0
##MIN=       -512.88909502351, -862824,      0
##MAX=       3099.82766798227, 512778865,    0
$$ Real data points
##PAGE= N=1
##DATA TABLE= (X++(R..R)), XYDATA
$$ [...]
7562A78878r8243Q735M2308J19496m024j45860N5846M8348l4139k3599j41437
$$ 178878 80635 89370 131678 251174 247150 101290 157136 205484 171345 147746 6309
7551F309J11750p5987n0874J09477Q73J28660J050j05838O2632l8481N0428j04525
$$ 6309 118059 42072 -8802 100675 101548 230208 231258 125420 188052 149571 199999 95474
7539I5474m4015L6225J05p6679Q7807j3627O9250R2754j57958L9617l1700P1180
$$ 95474 51459 87684 87789 11110 98917 85290 154540 247294 89336 128953 97253 168433
7527A68433o3463J1301M2075l4440l3095N2213N029O5311q5883J06754n5863j71602
$$ 168433 104970 116271 158346 123906 90811 143024 148053 213364 127481 234235 178372 6770
7515F770K6075M7660K1326J16474r4266l0596j7744j69301J16356N120l0050P5198
$$ 6770 32845 80505 101831 218305 124039 93443 75699 -93602 22754 27874 -2176 73022
7503G3022N3352M2159q2410L0321j129J0197J821N9642j2064m1433L9687J13052
$$ 73022 126374 168533 86123 116444 115315 125512 127333 186975 174911 133478 173165 286217
7491B86217j10024n4553m2556K3140O2657k2929j27153l5897J94062N836j91457
$$ 286217 176193 121640 79084 102224 164881 141952 14799 -21098 172964 178800 -12657
7480a2657N0285J1373P4872J4427P312M4553j9297M9894L9167l0816n5030L1215
$$ -12657 37628 49001 123873 138300 145612 190165 170868 220762 259929 229113 174083 205298
7468B05298K015j10050p8268O4466M5744L4664r9537J7963P7846M8921o4569N7742
$$ 205298 207313 97263 18995 83461 129205 163869 64332 82295 160141 209062 144493 202235
7456B02235r7947p747L718P5256J21194k3035j40809j9173j5230j21469J10886
$$ 202235 104288 96541 100259 175515 296709 273674 132865 113692 98462 -23007 87879
7445H7879q647L4496l2650L4073o8526L7258P9104l3665j78369J2967N4343N9511
$$ 87879 79232 113728 81078 115151 46625 83883 162987 129322 -49047 -36080 18263 77774
7433G7774R9916O8582M2716K3219J231J708K4006r1840q8282n7373K6047J43351
$$ 77774 177690 246272 288988 312207 313438 315146 339152 247312 159030 101657 127704 271055
7421B71055k7910m3396J15152n0515K4200j3943j13481R6152Q9058o2637n0931
$$ 271055 243145 199749 314901 264386 288586 274643 161162 257314 346372 283735 232804
7410B32804r6485J3412r28n9733k5134Q4079L0133m2297L1191P0138L2805p1921
$$ 232804 136319 149731 148803 89070 63936 148015 178148 135851 167042 237180 269985 198064
7398A98064j16769P5242o9056K8149J13902l8345o1711n8642j02362J2578R1455
$$ 198064 81295 156537 87481 115630 229532 191187 129476 70834 -31528 -18950 72505
7387G2505r3179p5741k554M9211J00143L1944J6574p7597n6865J00900j0434J59693
$$ 72505 -20674 -96415 -98969 -49758 50385 82329 98903 21306 -35559 65341 54907 214600
7375B14600o9490r6318N9093P397l4130k4150J27074l6084J2952n6248l7696k7853
$$ 214600 145110 48792 107885 115282 81152 57002 184076 147992 160944 104696 67000 39147
7363C9147K1504r7190o0469J09235R4458L709K0391l0848Q5323m7182q1082R4736
$$ 39147 60651 -36539 -97008 12227 106685 110394 130785 99937 185260 138078 56996 151732
7351A51732r603R6591R8084j13270m7089P8321q7497q552J3995L488l4465L5505
$$ 151732 142129 238720 336804 223534 176445 254766 167269 158717 172712 176200 141735 177240
7339A77240k3778L7624L9515N4551K3119l8674N1602p4676k2420m0445j2173J17634
$$ 177240 153462 191086 230601 285152 308271 269597 321199 246523 224103 183658 171485 289119
7327B89119P3954l8688j45848q5809l7795J425k8188o9724R8351l3206m9903q2379
$$ 289119 363073 324385 178537 92728 54933 56358 28170 -41554 56797 23591 -26312 -108691
7315a08691N7851O1928N5475J4505r7848R675J60100m7088j8555o1797P0457J00182
$$ -108691 -50840 11088 66563 81068 -16780 -7105 152995 105907 87352 25555 96012 196194
7303A96194j39071l1200l3757o2242N6063R7357Q3365l8546m7083p3926J30662
$$ 196194 57123 25923 -7834 -70076 -14013 83344 166709 128163 81080 7154 137816
7292A37816N4142j36535j82896J708J24689l63k4060q5521m8131M0885K0426M2129
$$ 137816 191958 55423 -127473 -125765 -1076 -1439 -25499 -111020 -159151 -118266 -97840 -55711
7280e5711J69793l4297r006p3656m1331l7514J25166K2717n1010n1271q582j7124
$$ -55711 114082 79785 70779 -2877 -44208 -81722 43444 66161 15151 -36120 -44702 -61826
7268f1826o9411N513Q6796k4966P3948K0971K3892j7850k4003K0459K5379N1110
$$ -61826 -131237 -125724 -38928 -63894 10054 31025 54917 37067 13064 33523 58902 110012
7256A10012N0936q9936o2098K1569m6107L823M6040K1862l6574o5163K4192P1908
$$ 110012 160948 71012 8914 30483 -15624 -11801 34239 56101 19527 -45636 -21444 50464
7244E0464k0944r4461k5866Q4354J56777r7762o2948l2770l8786Q7703r2008l9861
$$ 50464 29520 -64941 -90807 -6453 150324 52562 -10386 -43156 -81942 5761 -86247 -126108
7232a26108J33468p3095r1487J36062P7167j31650M8358m0191k03245M2509K02545
$$ -126108 7360 -65735 -157222 -21160 56007 -75643 -27285 -67476 -270721 -228212 -25667
7221b5667O9351l8634K3115j1480l1076j00538j6075J24440J07498j33445P8951
$$ -25667 43684 5050 28165 16685 -14391 -114929 -131004 -6564 100934 -32511 46440
7210D6440L265j31755M0867o7076j823l1518P114R5797j1068R0889n8847m1712
$$ 46440 49705 -82050 -41183 -108259 -110082 -141600 -134486 -38689 -49757 41132 -17715 -59427
7198e9427q0131j32352M6541J39967m612L2839N7940m6174m9237O1791J02258
$$ -59427 -139558 -271910 -225369 -85402 -90014 -57175 765 -45409 -94646 -32855 69403
7187F9403L3217R72k18294p3213J81687m9922p094m0511k2113j994R796O9259
$$ 69403 102620 103592 -114702 -187915 -6228 -56150 -63244 -103755 -125868 -127862 -118066 -48807
7175d8807L129o4316M3171K2534J6261P0087m8191M7634m6615l8534M6499j7087
$$ -48807 -45678 -109994 -66823 -44289 -28028 42059 -6132 41502 -5113 -43647 2852 -14235
7163a4235K7073Q2389q5925J7942M1953l5257O3828P1643r4528M6485O3911K9283
$$ -14235 12838 95227 9302 27244 69197 33940 97768 169411 74883 121368 185279 214562
7151B14562m25o712j49890K05974m9660j17028o1978r343R767l0385P1288L6552
$$ 214562 214137 207425 57535 263509 213849 96821 34843 25500 35267 4882 76170 112722
7139A12722m927j2976J88207j8982o5805q7536K5427j0852l6251K769Q3612n35
$$ 112722 107795 94819 283026 264044 198239 110703 136130 125278 89027 91796 175408 174873
7127A74873l3265j90480j31126N4895J52834J10699k2671j31696N1438Q4885J44302
$$ 174873 141608 -48872 -179998 -125103 27731 138430 115759 -15937 35501 120386 264688
7116B64688n210j2477N9030n3743k4515P8551L8503O2457P2112L6847j9930O6563
$$ 264688 259478 247001 306031 252288 227773 306324 344827 407284 479396 516243 496313 562876
7104E62876K45609J32102k9185R2309J23143P8632l0505m795l814j35941j90419
$$ 562876 808485 940587 911402 1003711 1126854 1205486 1174981 1170186 1166372 1030431 840012
7093H40012Q578j21721j57814Q5057n9896o5616q658m6973l5944m7757r9672j38415
$$ 840012 848590 726869 569055 654112 594216 528600 519942 472969 437025 389268 289596 151181
7081A51181j15393L7387O3041q011k6502P277L0928m3946P5396L026k6601R033
$$ 151181 35788 73175 136216 128205 101703 108980 139908 95962 171358 174384 147783 156816
7069A56816j4653j38990K1863M759J09241L5301o6888K8227r8326q6187J7606
$$ 156816 142163 3173 25036 29795 139036 174337 107449 135676 37350 -48837 -31231
7058c1231L9567Q8972L9283r4618J12165k5555p8885l9689J36270j14987K2385
$$ -31231 8336 97308 136591 41973 154138 128583 49698 10009 146279 31292 53677
7047E3677n422J09485J53235n6731J2668J34713O0480p1699Q049n8891M6272O7657
$$ 53677 48255 157740 310975 254244 266912 401625 462105 390406 398455 339564 385836 453493
7035D53493Q847M9289L4387Q8047P9009J81097M4896J01056N5240l7156j35404
$$ 453493 462340 511629 546016 634063 713072 894169 939065 1040121 1095361 1058205 922801
7024I22801O579n9689r4181m9285j41123q5602r3147j47984L3165J44346P1204
$$ 922801 929380 869691 775510 726225 585102 499500 406353 258369 291534 435880 507084
7013E07084j14516m6724j28641j16039k5507R288O3980Q417L144m4676R6507k7114
$$ 507084 392568 345844 217203 101164 75657 84945 148925 157342 160486 115810 212317 185203
7001A85203r9089O0730l6655o9258j29213J18800J41148k9928N4126k2400k5968
$$ 185203 86114 146844 110189 40931 -88282 30518 171666 141738 195864 173464 147496
6990A47496P5542K9150j25093O179J206J5929j6649N5443j9539j21687j03868
$$ 147496 223038 252188 127095 133274 134480 150409 133760 189203 169664 47977 -55891
6979e5891K49470J18078l711q5119m3644j8961J48192J8599m1912J1825j5460
$$ -55891 193579 311657 307946 222827 179183 160222 308414 327013 285101 296926 281466
6968B81466l7856R2305N615O6663q445m5283Q5430j54305Q5710M2887o0472J010
$$ 281466 243610 335915 341530 408193 399748 354465 439895 285590 371300 414187 353715 354725
6956C54725p1154p6305J48432M4713j48126j6350N8177j2181J2946n0436r725
$$ 354725 283571 207266 355698 400411 252285 235935 294112 281931 294877 244441 234716
6945B34716r8885K1302O55L3759N1621n0542K1850l6132q6047k189m6923J67521
$$ 234716 135831 157133 157788 191547 243168 192626 214476 178344 92297 90108 43185 210706
6933B10706J4578j03624L8623l6848m541K2969K2585M1581J30445r3029l5821
$$ 210706 225284 121660 160283 123435 118894 141863 164448 206029 336474 243445 207624
6922B07624J0036N0003j37467j38864P3367J16050p870q492k0628J16435K0663
$$ 207624 217660 267663 130196 -8668 64699 180749 172879 164387 143759 260194 280857
6911B80857j64051M8579Q1771K7222j00307m5037L6436O9819P2686L219O4341
$$ 280857 116806 165385 247156 274378 174071 129034 165470 235289 307975 311194 375535
6900C75535o8486j85878K0476J9081q071k7091M4206p0700J1258O2401m455O690
$$ 375535 307049 121171 141647 160728 152657 125566 169772 99072 110330 172731 168276 174966
6888A74966n9184N9869J2258j27318k856l63J5271l486J1121l7801Q321L093O315
$$ 174966 115782 175651 187909 60591 57735 57372 72643 69157 80278 42477 50798 53891 60206
6875F0206p571M9730K3758L7454j9105j14258P223O1821K1920J75877o9370q1029
$$ 60206 52635 102365 126123 163577 144472 30214 37437 99258 121178 297055 227685 146656
6863A46656M1283j5036j8086N2972K0156k00684l0017R6272J34728j00677Q1053
$$ 146656 187939 172903 154817 207789 227945 27261 -2756 93516 228244 127567 208620
6852B08620r470m7779k2233k0659Q8565o3282j59616p87J24905J45144q5369K016
$$ 208620 199150 151371 129138 108479 197044 133762 -25854 -26641 98264 243408 158039 160055
6840A60055J49640R6632p0048j5146M0378K7789k2599J43909R3457l6412j780
$$ 160055 309695 406327 336279 321133 361511 389300 366701 510610 604067 567655 565875
6829E65875Q2515l242O4025J6823P9773J11128R3384l4045P8785K64319P5942
$$ 565875 648390 645148 709173 725996 805769 916897 1010281 976236 1055021 1319340 1395282
6818A395282J31279Q590J41626K27962K87259J54964J4253M47550L58506K98239
$$ 1395282 1526561 1535151 1676777 1904739 2191998 2346962 2361215 2808765 3167271 3465510
6808C465510L00730M52470N08008N90232O46648P52303R98126J247748J649956
$$ 3465510 3766240 4218710 4726718 5316950 5963598 6715901 7714027 8961775 10611731
6799A0611731J882728J867119K032084K256176J690451J344754Q87924O9529q52069
$$ 10611731 12494459 14361578 16393662 18649838 20340289 21685043 22572967 22642496 21790427
6790B1790427q05587l59679M30081Q44543R83656J097055P24150M12207j53912
$$ 21790427 20984840 20625161 21055242 21899785 22883441 23980496 24704646 25116853 24962941
6781B4962941j243798k469866k590682k118060j742920j415214j156703j012501
$$ 24962941 23719143 21249277 18658595 16540535 14797615 13382401 12225698 11213197
6773A1213197q68775o96240q89440n22837m52776m12289l58681l97758k35198
$$ 11213197 10344422 9648182 8758742 8235905 7783129 7370840 7012159 6614401 6379203
6764F379203k97075k37254n1920k86236j95688n6341r4299K1290Q3872m7845j01679
$$ 6379203 6082128 5844874 5792954 5506718 5311030 5254689 5160390 5181680 5265552 5217707 5116028
6753E116028J46853J69176K21935L96020K18647J36386K93661L40340L87306L62557
$$ 5116028 5262881 5432057 5653992 6050012 6268659 6405045 6698706 7039046 7426352 7788909
6743G788909K29333N83427O24735R14388J140733J300004J660453J698865J919356
$$ 7788909 8018242 8601669 9226404 10140792 11281525 12581529 14241982 15940847 17860203
6734A7860203J598104J203210R15249N2702p57386r58904l57324J14195O58367
$$ 17860203 19458307 20661517 21576766 21629468 20872082 19913178 19555854 19670049 20328416
6725B0328416P88302J039438J072726N78218K6579r03437j909351k393618k300472
$$ 20328416 21116718 22156156 23228882 23807100 23833679 22930242 21020891 18627273 16326801
6716A6326801j792704j305427j358351r98383p80658p57516o47581p06460n58552
$$ 16326801 14534097 13228670 11870319 10871936 10091278 9333762 8686181 7979721 7421169
6707G421169n25950l25943m10355m08951k79779l23069j89321l55676k48105j98661
$$ 7421169 6895219 6569276 6158921 5749970 5470191 5147122 4957801 4602125 4354020 4155359
6697D155359p3906p92k64355k94584n3150q0573q6528j67484j42146j93144n478
$$ 4155359 4081453 4080661 3816306 3521722 3468572 3387999 3301471 3133987 2991841 2798697 2793219
6686B793219k51607k24200J34005o273j16499n2178r700k6925j54328q4796J8833
$$ 2793219 2541612 2317412 2451417 2445144 2328645 2276467 2266767 2239842 2085514 2000718 2019551
6675B019551r9419j59027L7541k9272K3432N3405P7773j73963Q611r1072n0499
$$ 2019551 1920132 1761105 1798646 1769374 1792806 1846211 1923984 1750021 1758632 1667560 1617061
6664A617061j8738j21086J3006M2050J07804Q4730o3669o8884j18008n8867L1100
$$ 1617061 1598323 1477237 1490243 1532293 1640097 1724827 1661158 1592274 1474266 1415399 1446499
6653A446499N7279L2738j31345P0464o1348Q8522J02877o0094j21466j41737J01371
$$ 1446499 1503778 1536516 1405171 1475635 1414287 1502809 1605686 1545592 1424126 1282389 1383760
6642A383760O5780j1070L2336n5409k9615k9117K9605Q2839R5448N1835P1748
$$ 1383760 1449540 1438470 1470806 1415397 1385782 1356665 1386270 1469109 1564557 1616392 1688140
6631A688140M8974k4328m6688J9458J40627J54365K01925j6239P066J48953P1315
$$ 1688140 1737114 1712786 1666098 1685556 1826183 1980548 2182473 2166234 2173300 2322253 2393568
6620B393568J55294P4997K34582K11021M9577K91147K95857L69413L87994K04903
$$ 2393568 2548862 2623859 2858441 3069462 3119039 3410186 3706043 4075456 4463450 4668353
6610D668353L78338M71714M14434N56182P36575R39929J074009J312179J636147
$$ 4668353 5046691 5518405 5932839 6489021 7225596 8165525 9239534 10551713 12187860
6601A2187860K057894K103156K233175K326014J733015J481087R01411k80827
$$ 12187860 14245754 16348910 18582085 20908099 22641114 24122201 25023612 24742785
6593B4742785j316560r76424k65706K73521O65246Q18330J205447Q89190O09406
$$ 24742785 23426225 22449801 22184095 22457616 23122862 23941192 25146639 26035829 26645235
6584B6645235K24108p57591j764401j655390j218799r38782n34564r1482L09487
$$ 26645235 26869343 26111752 24347351 22691961 21473162 20534380 19999816 19908334 20217821
6575B0217821P82408J164162J127434J576269J560474J194755R04917J31753j067958
$$ 20217821 21000229 22164391 23291825 24868094 26428568 27623323 28528240 28659993 27592035
6566B7592035j856397j409734o27476p4554K60653M69861O98014M85753J76811
$$ 27592035 25735638 24325904 23698428 23623874 23884527 24354388 25052402 25538155 25714966
6557B5714966o41575j555499k169520k228626j979667j634356j116052j015000
$$ 25714966 25073391 23517892 21348372 19119746 17140079 15505723 14389671 13374671
6549A3374671j174470p68633o63302p12120o40066n05328n65984m91438m58579
$$ 13374671 12200201 11431568 10768266 10056146 9416080 8910752 8344768 7853330 7394751
6540G394751m08963k15834l61226m37161k04557j38221l72303j51456k46224k04478
$$ 7394751 6985788 6769954 6408728 5971567 5767010 5628789 5256486 5105030 4858806 4654328
6530D654328j06624k07958j54846k11641r3485j40880j14119p2366j07448j42332
$$ 4654328 4547704 4339746 4184900 3973259 3879774 3738894 3624775 3552409 3444961 3302629
6520C302629j42534p5500l8152l8283N6669j26858J1870j567j71227k19799J502
$$ 3302629 3160095 3084595 3046443 3008160 3064829 2937971 2949841 2948274 2777047 2557248 2558750
6509B558750l9375j8468L868m2254K1039j56338k5464j4273r9393Q6240q8849
$$ 2558750 2519375 2500907 2504775 2462521 2483560 2327222 2301758 2287485 2188092 2274332 2185483
6498B185483K2882M376o9571j36231J3114K5297m3485n9135p6718N4063L1616
$$ 2185483 2208365 2212741 2143170 2006939 2020053 2045350 2001865 1942730 1866012 1920075 1951691
6487A951691m1620o2054o567q1605J44830r447O1770l124k5968m6603N1553j39228
$$ 1951691 1910071 1848017 1841450 1759845 1904675 1895228 1956998 1953874 1927906 1881303 1932856 1793628
6475A793628m8273J08649K7302j57813l3907j7049r4632L6020J53635L4238k9574
$$ 1793628 1745355 1854004 1881306 1723493 1689586 1672537 1577905 1613925 1767560 1801798 1772224
6464A772224n5464M2745j8255L8985O2196l7684r1171l2855M9400l0103n4757
$$ 1772224 1716760 1759505 1741250 1780235 1842431 1804747 1713576 1680721 1730121 1700018 1645261
6453A645261q7576L5289r654m176q821j49019j0919m8142q7826j34415K52840
$$ 1645261 1557685 1592974 1583320 1579144 1570323 1421304 1410385 1362243 1274417 1140002 1392842
6442A392842L3330j70042M8400N7523r4738M1372m0898l5853n530n1695K0391
$$ 1392842 1426172 1256130 1304530 1362053 1267315 1308687 1267789 1231936 1226406 1174711 1195102
6431A195102j81353j8549P5040R6820k38281j41986Q3731j64973j3640N3984Q7148
$$ 1195102 1013749 995200 1070240 1167060 928779 786793 870524 705551 691911 745895 833043
6420H33043r3379l4007L2027R2385R8226j81375j19481k5198L8696L5670n8830
$$ 833043 739664 705657 737684 830069 928295 746920 627439 602241 640937 676607 617777
6409F17777P6333J844q2161m6099p7428K895r0288J00661M7274l2752l5145Q3366
$$ 617777 694110 695954 613793 567694 490266 493161 402873 503534 550808 518056 482911 566277
6397E66277L6781p2951j27843P3733O5746l2989r6311j756J18081K0980j24304
$$ 566277 603058 530107 402264 475997 541743 508754 412443 410687 528768 549748 425444
6386D25444l0046P9617N3897K3507l7226l8751K3358O5927J5783o4929N6443J7708
$$ 425444 395398 475015 528912 552419 515193 476442 499800 565727 581510 516581 573024 590732
6374E90732o300J9610n3858K8293J39611j19360K777J42063K7881j3787N064P5622
$$ 590732 584432 604042 550184 578477 718088 598728 601505 743568 771449 757662 762726 838348
6362H38348K6019j3358p9963k7093J8111L8042j04033q496o6133r3654M1652P2306
$$ 838348 864367 851009 771046 743953 762064 800106 696073 687577 621444 527790 569442 641748
6350F41748N5338j24978o8195n015K8201m174o5746N0285o9394K594M484j08281
$$ 641748 697086 572108 503913 498898 527099 522925 457179 507464 438070 440664 445148 336867
6338C36867M3972K7504R4345O4756j14123m5773N9595j38281P1652P8779q8175
$$ 336867 380839 408343 502688 567444 453321 407548 467143 328862 400514 479293 391118
6327C91118j9433P0642o1662L3252O0135r9443n0730Q4438p0660L1512R8160j0524
$$ 391118 371685 442327 380665 413917 474052 374609 323879 408317 337657 369169 467329 456805
6315D56805R8128o3313J04698j7894J416p1425j42471P9341J47212l4036k3521
$$ 456805 554933 491620 596318 578424 579840 508415 365944 445285 592497 558461 534940
6304E34940j9455p888l7471o116J10579M1562o1215k8730J74569q4281j47516
$$ 534940 515485 507597 470126 464010 574589 616151 554936 526206 700775 616494 468978
6293D68978N7502O3249j3116P7945n9797N9594p7390L5906J4082N0442o4784J19748
$$ 468978 526480 589729 576613 654558 594761 654355 576965 612871 626953 677395 612611 732359
6281G32359k55134r8601K66262O014J31203J00130J5530k8730N3763L7194K054
$$ 732359 477225 378624 644886 650900 782103 882233 897763 869033 922796 959990 962044
6270I62044o8881Q8152Q9412J18475K7850J01614Q8263K47344J08097l3212p9275
$$ 962044 893163 981315 1070727 1189202 1217052 1318666 1406929 1654273 1762370 1729158 1649883
6259A649883l6383q434j82923l4612j2653r5789l5377j21792O6286j78302j3936
$$ 1649883 1613500 1605066 1422143 1387531 1374878 1279089 1243712 1121920 1188206 1009904 995968
6248I95968N5256j39995p3156L6008J54137L1327R268k1967L5257K29399l8449
$$ 995968 1051224 911229 838073 874081 1028218 1059545 1068813 1046846 1082103 1311502 1273053
6237A273053k16524K9644N8541J19679j5986j5319J11083J78120k9958j6343R4234
$$ 1273053 1056529 1086173 1144714 1264393 1248407 1233088 1344171 1522291 1492333 1475990 1570224
6226A570224q8842O8224M8042L6988l797Q1449R413J29123J40187M3377J81984
$$ 1570224 1481382 1549606 1597648 1634636 1630839 1712288 1721701 1850824 1991011 2034388 2216372
6215B216372J34298O5235Q156L1916J26333n9318Q5006K26126J05753O6434r726
$$ 2216372 2350670 2415905 2424061 2455977 2582310 2522992 2607998 2834124 2939877 3006311 2996585
6204B996585m6616J31229J48641R9121L4057L87920Q3085J14539K32387J10577
$$ 2996585 2949969 3081198 3229839 3328960 3363017 3750937 3834022 3948561 4180948 4291525
6194D291525K70927M5970J91178K63185L03797L46462R8467J21138J69992Q4629
$$ 4291525 4562452 4608422 4799600 5062785 5366582 5713044 5811511 5932649 6102641 6187270
6184F187270J61409M22214L65364M60813M84805M72530O47815Q16017Q11928Q54403
$$ 6187270 6348679 6770893 7136257 7597070 8081875 8554405 9202220 10018237 10830165 11684568
6174A1684568R92573J022284J313837J373265J492267J907553J832196J941482
$$ 11684568 12677141 13699425 15013262 16386527 17878794 19786347 21618543 23560025
6166B3560025K149685K238773K208174K452392K353132K242686K416926K062184
$$ 23560025 25709710 27948483 30156657 32609049 34962181 37204867 39621793 41683977
6158D1683977J422950N72867r8353j015905j201933j339993j250868j192753j001579
$$ 41683977 43106927 43679794 43581441 42565536 41363603 40023610 38772742 37579989 36578410
6149C6578410j045549j064276j168190j138391p46607o09374k96869J77085J96771
$$ 36578410 35532861 34468585 33300395 32162004 31415397 30806023 30509154 30686239 30883010
6140C0883010M71879R12396J076493J474129J932781K288571K888363L536419
$$ 30883010 31354889 32267285 33343778 34817907 36750688 39039259 41927622 45464041
6132D5464041M022218M417240N160798N892680P078310Q613850J0748606J3493784
$$ 45464041 49486259 53903499 59064297 64956977 72035287 80649137 91397743 104891527
6124A04891527J6792462K0657856K2403243K2612626K3861864K0284939J3911379
$$ 104891527 121683989 142341845 164745088 187357714 211219578 231504517 245415896
6117B45415896O241513o384007k0818876k6358725k3904440j9855460j6347753
$$ 245415896 251657409 245273402 224454526 198095801 174191361 154335901 137988148
6110A37988148j4026406j1692143j0063820q790559q278039p176265o256054n347105
$$ 137988148 123961742 112269599 102205779 93415220 85137181 77960916 71704862 66357757
6102F6357757m621621m406956l869481l292961l002225k674707k512809k217354
$$ 66357757 61736136 57329180 53459699 50166738 47164513 44489806 41976997 39759643
6094C9759643k125727j725811j758268j754896j507136j396954j316621j127472
$$ 39759643 37633916 35908105 34149837 32394941 30887805 29490851 28174230 27046758
6086B7046758j113641j051496r19070r26941q78063o21920o62217q31293q32984
$$ 27046758 25933117 24881621 23962551 23035610 22157547 21535627 20873410 20042117 19209133
6077A9209133o80215n84397o17933n59632n45313m39675m23705l19540l68308
$$ 19209133 18528918 17944521 17326588 16766956 16221643 15781968 15358263 15038723 14670415
6068A4670415j73632k26197l10017j58613p2849j39910k98524k60560j94643l31132
$$ 14670415 14496783 14270586 13960569 13801956 13729107 13589197 13290673 13030113 12835470 12504338
6058A2504338l29093m12428m47148l23219k85922k98978l10124l56337l14846
$$ 12504338 12175245 11762817 11315669 10992450 10706528 10407550 10097426 9741089 9426243
6049I426243j03895k29466j64777j37520k31793k13258j17194j01642r4820j16058
$$ 9426243 9322348 9092882 8928105 8790585 8558792 8345534 8228340 8126698 8031878 7915820
6039G915820j45261o2893K5098q9443J13636P5314J26093L5117L10715Q9520J0944
$$ 7915820 7770559 7707666 7732764 7643321 7756957 7832271 7958364 7993481 8304196 8393716 8404660
6028H404660j48059j07953k41473l44444k26200k63705j84434j02416j35955j51060
$$ 8404660 8256601 8148648 7907175 7562731 7336531 7072826 6888392 6785976 6650021 6498961
6018F498961l1227j38417j59660j28751j82313j07819k49809r1327j9844n8694
$$ 6498961 6467734 6329317 6169657 6040906 5858593 5750774 5500965 5409638 5389794 5331100
6008E331100j36615j61301j4614k1739k1560j741O4541j57418P3369P3297Q7452
$$ 5331100 5194485 5033184 5018570 4996831 4975271 4973530 5038071 4880653 4954022 5027319 5114771
5997E114771j22536q8282k4110k5775o8217p8922p4364j74434N3088J15423j68022
$$ 5114771 4992235 4903953 4879843 4854068 4785851 4706929 4632565 4458131 4511219 4626642 4458620
5986D458620o4029N4063K6975j93329p6439P7267q3772J1469o1662j81264k82238
$$ 4458620 4394591 4448654 4475629 4282300 4205861 4283128 4199356 4210825 4149163 3967899 3685661
5975C685661j09231J03705o8595J831n7091k16633r6826N4991K6046J2143J50317
$$ 3685661 3576430 3680135 3611540 3613371 3556280 3339647 3242821 3297812 3323858 3336001 3486318
5964C486318O043n8841P87j73783q3541q4153j97689l8494Q9447k16081k5766
$$ 3486318 3492361 3433520 3434307 3260524 3176983 3092830 2895141 2856647 2946094 2730013 2704247
5953B704247J10246K4077j74662n7202Q1902K9987p0482n6737j74344l8854Q7206
$$ 2704247 2814493 2838570 2663908 2606706 2688608 2718595 2648113 2591376 2417032 2378178 2465384
5942B465384o6775n9222M6150M4692j98890Q2622J3054o5871N3730o1763n9422
$$ 2465384 2398609 2339387 2385537 2430229 2231339 2313961 2327015 2261144 2314874 2253111 2193689
5931B193689K1108R7572q7518p2592J3578r640J54559n5475j47795j39799K9952
$$ 2193689 2214797 2312369 2224851 2152259 2165837 2156197 2310756 2255281 2107486 1967687 1997639
5920A997639k7222n2571l0787r9988J6766o196J9033m716q5117K4976J35030l7976
$$ 1997639 1970417 1917846 1887059 1787071 1803837 1797641 1816674 1811958 1726841 1751817 1886847 1848871
5908A848871j6441J1989O8958j0959M5935n3109n2835j8984J42112n8751l8827
$$ 1848871 1832430 1844419 1913377 1902418 1948353 1895244 1842409 1823425 1965537 1906786 1867959
5897A867959O268n9792J79728l3085J8299j52847l479J9616M4158K7841P1406
$$ 1867959 1874227 1814435 1994163 1961078 1979377 1826530 1823051 1842667 1886825 1914666 1986072
5886A986072O6589Q663n9941p8245M7241J1324q30R670M029o543Q9316N4154M0111
$$ 1986072 2052661 2061324 2001383 1923138 1970379 1981703 1980873 1990543 1994572 1988029 2077345 2131499 2171610
5873B171610l903m3449J0659J9012K02271j23237n6501O3630K0602P3882j29664
$$ 2171610 2167707 2124258 2134917 2153929 2356200 2232963 2176462 2240092 2260694 2334576 2204912
5862B204912k6702l131j9882J02700O1263j56149l9022J04679O1829o8157k6284
$$ 2204912 2178210 2175079 2155197 2257897 2319160 2163011 2123989 2228668 2290497 2222340 2196056
5851B196056J32151P4705p0373o6740j29676j4197J9977J21662L9834p1937O188
$$ 2196056 2328207 2402912 2332539 2265799 2136123 2121926 2141903 2263565 2303399 2231462 2237650
5840B237650j07323j20126o3517L1675J0405j8182j8246O4310m5659m7363q0064
$$ 2237650 2130327 2010201 1946684 1978359 1988764 1970582 1952336 2016646 1970987 1923624 1843560
5829A843560j18357o0556J23535L4989j4694j08696j57900J8069N6836J28517
$$ 1843560 1725203 1664647 1788182 1823171 1808477 1699781 1541881 1559950 1616786 1745303
5819A745303J5057j30869M1112L0986r2193j6229M798J52878L1268O9167P9196
$$ 1745303 1760360 1629491 1670603 1701589 1609396 1593167 1597965 1750843 1782111 1851278 1930474
5808A930474j6953j3130O5593K2095j50149p8565Q6132J52393M7444L0979J82808
$$ 1930474 1913521 1900391 1965984 1988079 1837930 1759365 1845497 1997890 2045334 2076313 2259121
5797B259121l433J13512N3753j04637J4008k463n0828k7538P9698L8734j05814
$$ 2259121 2255688 2369200 2422953 2318316 2332324 2329861 2279033 2251495 2331193 2369927 2264113
5786B264113j3399L621O3122M4115J25952J67198j0678p7043l8116J19879J24418
$$ 2264113 2250714 2254335 2317457 2361572 2487524 2654722 2644044 2567001 2528885 2648764 2773182
5775B773182Q8497M0784o6635k5507J34400L9154n2036p1908J17268J72069J27341
$$ 2773182 2861679 2902463 2835828 2810321 2944721 2983875 2931839 2859931 2977199 3149268 3276609
5764C276609p9965j4268J06562J30534K20603K03810P5557K08174Q8489J80435
$$ 3276609 3196644 3182376 3288938 3419472 3640075 3843885 3919442 4127616 4216105 4396540
5754D396540M37327J47543L4477Q4332q219n3351R0390J36153j05640j37826m4685
$$ 4396540 4833867 4981410 5015887 5100219 5092000 5038649 5129039 5265192 5159552 5021726 4977041
5743D977041J46589J01128K1835K04343J80276K32262M0258k3083K29802K61410
$$ 4977041 5123630 5224758 5246593 5450936 5631212 5863474 5903732 5880649 6110451 6371861
5733F371861J23280J44208K47224K66815L19251L18899L69504L22380K94385K98127
$$ 6371861 6495141 6639349 6886573 7153388 7472639 7791538 8161042 8483422 8777807 9075934
5723I075934K17324J50194j59842k88303k94365k82461j98179l33448j71734k67370
$$ 9075934 9293258 9443452 9283610 8995307 8700942 8418481 8220302 7886854 7715120 7447750
5713G447750j78006j03349m6342j62063j42660l14277k29599o2889n8655m7065
$$ 7447750 7269744 7166395 7120053 6957990 6815330 6501053 6271454 6208565 6149910 6102845
5703F102845k1282M2860j28047J0158M6309J1099o2645J08740j39059j4741q0126
$$ 6102845 6081563 6124423 5996376 6006534 6052843 6063942 6001297 6110037 5970978 5956237 5876111
5692E876111j94912j85916j19377k72061l32251l25252l9642j02999k97061j70911
$$ 5876111 5681199 5495283 5375906 5103845 4771594 4446342 4406700 4303701 4006640 3835729
5682C835729k13862n4098n9274k00371k03943m8391j31503r7259J67822L6800
$$ 3835729 3621867 3567769 3508495 3308124 3104181 3055790 2924287 2827028 2994850 3031650
5672C031650j03218J8009L8537M3928n4724n8731o2815j88157j82987m8564n5233
$$ 3031650 2928432 2946441 2984978 3028906 2974182 2915451 2852636 2664479 2481492 2432928 2377695
5661B377695j86873R2107J9820n2280k2036k9973j36642J0745k9727L1707K5301
$$ 2377695 2190822 2282929 2302749 2250469 2228433 2198460 2061818 2072563 2042836 2074543 2099844
5650B099844l7867P8229m0302P8516J4467q2480O5487K0141n3865J2617J71593
$$ 2099844 2061977 2140206 2099904 2178420 2192887 2110407 2175894 2196035 2142170 2154787 2326380
5639B326380J19477n1125l8126l3499o2232n0894Q1736M0875m886K4567o9754
$$ 2326380 2445857 2394732 2356606 2323107 2260875 2209981 2291717 2332592 2327706 2352273 2282519
5628B282519L0838k1206N5702J64990l2587L6388J6812R3914J13770J3241K3474
$$ 2282519 2313357 2292151 2347853 2512843 2480256 2516644 2533456 2627370 2741140 2754381 2777855
5617B777855N8592K4131J89961R3488R1436K52449K57361K16111K44452J11879
$$ 2777855 2836447 2860578 3050539 3144027 3235463 3487912 3745273 3961384 4205836 4317715
5607D317715M3436K34564J85928J47695K80648J09500K37949K06512R3268M8881
$$ 4317715 4361151 4595715 4781643 4929338 5209986 5319486 5557435 5763947 5857215 5906096
5597E906096J94759P0375j527r8520j24035j41155j48627p0204k08724j63628
$$ 5906096 6100855 6171230 6169703 6071183 5947148 5805993 5657366 5587162 5378438 5214810
5587E214810k11701j96686k55136j10064p5762j15263k46493M821R8679j45941
$$ 5214810 5003109 4806423 4551287 4441223 4365461 4250198 4003705 4008526 4107205 3961264
5577C961264k09444J8462P5957L1370J10112p7926L7824l5575N2766J05324J0671
$$ 3961264 3751820 3770282 3846239 3877609 3987721 3909795 3947619 3912044 3964810 4070134 4080805
5566D080805P4035K32726M4703J50477L11684K14329K63887L47860L57559L31258
$$ 4080805 4154840 4387566 4432269 4582746 4894430 5108759 5372646 5720506 6078065 6409323
5556F409323N80161M86117N41652P42877P82574Q66065R87416J244896R94903
$$ 6409323 6989484 7475601 8017253 8760130 9542704 10408769 11396185 12641081 13635984
5547A3635984J151271J260302J104673J099335R31746P95436N36476M76154o9347
$$ 13635984 14787255 16047557 17152230 18251565 19183311 19978747 20515223 20991377 20922030
5538B0922030l78702o77274p66526q35433j103488j057026r42836r85602q53208
$$ 20922030 20543328 19866054 19099528 18264095 17160607 16103581 15160745 14175143 13321935
5529A3321935r12610r03845q92722p41449o66971o20296l93961n03842m32472
$$ 13321935 12409325 11505480 10612758 9871309 9204338 8584042 8190081 7686239 7253767
5520G253767l13492l99009n01366j56622k67335j70848j54368j06859l14372k17068
$$ 7253767 6940275 6541266 6039900 5883278 5615943 5445095 5290727 5183868 4869496 4652428
5510D652428k25338j13730L8259p0265p4348l4629m1482n1507j49855j18256K4688
$$ 4652428 4427090 4313360 4351619 4281354 4207006 4172377 4130895 4079388 3929533 3811277 3835965
5499C835965R971J08737k4272K49863M7965M9542J58111R2860K00130J32345R6147
$$ 3835965 3845936 3954673 3930401 4180264 4228229 4277771 4435882 4528742 4728872 4861217 4957364
5488D957364K76938K69607K56177L70591J02866J06636K68644K44030K76919K38861
$$ 4957364 5234302 5503909 5760086 6130677 6233543 6340179 6608823 6852853 7129772 7368633
5478G368633L01543L1535J82182J23108j12045j86331j73324l38908k63295j17134
$$ 7368633 7670176 7701711 7883893 8007001 7894956 7708625 7535301 7196393 6933098 6815964
5468F815964j09086k33396k91329k62074k57449l48548l45514k58574k78673k53123
$$ 6815964 6706878 6473482 6182153 5920079 5662630 5314082 4968568 4709994 4431321 4178198
5458D178198j37295k89419j83908j46849j34113k34968n7877Q1614j67800q5354
$$ 4178198 4040903 3751484 3567576 3420727 3286614 3051646 2993769 3075383 2907583 2822229
5448B822229j56261o6991j03802j08661j40562r4363M1095k8923O4914J95674
$$ 2822229 2665968 2598977 2495175 2386514 2245952 2151589 2192684 2163761 2228675 2424349
5438B424349p5030r1071j37407r6263M1853q978Q1308k2267j0719o7618o1110
$$ 2424349 2349319 2258248 2120841 2024578 2066431 2057453 2138761 2116494 2105775 2038157 1977047
5427A977047R7432l1565N0135l7336O513n1838k3723J8319Q5705N553r3873j09311
$$ 1977047 2074479 2042914 2093049 2055713 2062226 2010388 1986665 2004984 2090689 2096242 2002369 1893058
5415A893058N4714N0847o6000k9384m4495j38418l3042M2414k1018m6212N3674
$$ 1893058 1947772 1998619 1932619 1903235 1858740 1720322 1687280 1729694 1708676 1662464 1716138
5404A716138j07066j40248M3666N7998N982j0960N223p7204K1091o4386j4949
$$ 1716138 1609072 1468824 1512490 1570488 1576470 1565510 1570733 1493529 1514620 1450234 1435285
5393A435285n8016J15285j1919j24918m1959o6625P1898j1403n0024L1377P5312
$$ 1435285 1377269 1492554 1480635 1355717 1313758 1247133 1319031 1307628 1257604 1288981 1364293
5382A364293j56276M0489M7043p0856n8047j09860Q5628O2668J04915n6871k2744
$$ 1364293 1208017 1248506 1295549 1224693 1166646 1056786 1142414 1205082 1309997 1253126 1230382
5371A230382J03157r1663n6764K1193L1259J9294j38207k8296k5913O1340R8634
$$ 1230382 1333539 1241876 1185112 1206305 1237564 1256858 1118651 1090355 1064442 1125782 1224416
5360A224416j82848K5625L8538l046l7567K9363k6239j0524j32356J9804P0307
$$ 1224416 1041568 1067193 1105731 1102685 1065118 1094481 1068242 1057718 925362 945166 1015473
5349A015473O0889M350N0736P5542j999j25637r4024J75929m0180J8219j19602
$$ 1015473 1076362 1080712 1131448 1206990 1204991 1079354 985330 1161259 1121079 1139298 1019696
5338A019696J26091p001p6464j7623n0944m0621q1259J54087J41147J17656K31279
$$ 1019696 1145787 1138786 1062322 1044699 993755 953134 871875 1025962 1167109 1284765 1516044
5327A516044j00176j10616K95J3054R183j2383p6818M5383J28797o6082r0300
$$ 1516044 1415868 1305252 1305547 1318601 1327784 1315401 1238583 1283966 1412763 1346681 1256381
5316A256381m4582O3074Q6468j50740M4734J23152k3695L0648k64069n6040l6587
$$ 1256381 1211799 1274873 1361341 1210601 1255335 1378487 1354792 1385440 1121371 1065331 1028744
5305A028744k7539R250j8170R675K6189O4081j2137q2249P381n4152L1091P4986
$$ 1028744 1001205 1010455 992285 1001960 1028149 1092230 1080093 997844 1005225 951073 982164 1057150
5293A057150m9739K30327l5757j05960j80532P0389J06345p5846R1151j26107
$$ 1057150 1007411 1237738 1201981 1096021 915489 985878 1092223 1016377 1107528 981421
5283I81421O9271P4442k4905j39740l345n159L0676J2446M6913j6476K2676l0507
$$ 981421 1050692 1125134 1100229 960489 957144 951985 982661 995107 1042020 1025544 1048220 1017713
5271A017713J1190J00598m262M6613j22912M0424M7802O3345m7806M0518L9223
$$ 1017713 1028903 1129501 1125239 1171852 1048940 1089364 1137166 1200511 1152705 1193223 1232446
5260A232446p5216K3774N2857q4926j63966J37204Q3701p0239k3426m3966K4799
$$ 1232446 1157230 1181004 1233861 1148935 984969 1122173 1205874 1135635 1112209 1068243 1093042
5249A093042n3002J07840J3432K4829J1268J4643R4894J7j72192N8782J35710
$$ 1093042 1040040 1147880 1161312 1186141 1197409 1212052 1306946 1306963 1134771 1193553 1329263
5238A329263J05189J9536J26113K65765o129R8459L5758P1032J1592R9105Q7187
$$ 1329263 1434452 1453988 1580101 1845866 1839737 1938196 1973954 2044986 2056578 2155683 2242870
5227B242870o6977P255p4272K8705J88355K3305P479O7562j7215M7656O5343j2879
$$ 2242870 2175893 2183148 2108876 2137581 2325936 2349241 2356720 2424282 2407067 2454723 2520066 2507187
5215B507187O2127J00571M967J24750M6133J00869k30l7868N7836M9815J94033
$$ 2507187 2569314 2669885 2674852 2799602 2845735 2946604 2946374 2908506 2966342 3016157 3210190
5204C210190P0831p8764N5578K27993L1823J57930Q0167J09076J61945J78156
$$ 3210190 3281021 3202257 3257835 3485828 3517651 3675581 3755748 3864824 4026769 4204925
5194D204925q3735r2607R9948J6257n5191j12230j19398p407M7556j1297r1031
$$ 4204925 4121190 4028583 4128531 4144788 4089597 3977367 3857969 3850562 3898118 3886821 3795790
5183C795790k9907l3565q7651m7724p6164j03269J14087j7766j00232r1595p7544
$$ 3795790 3765883 3732318 3644667 3596943 3520779 3417510 3531597 3513831 3413599 3322004 3244460
5172C244460o652N2152R8002m8914j42365k8420J3705k2866j6391j73767q0470
$$ 3244460 3237808 3289960 3387962 3339048 3196683 3168263 3181968 3159102 3142711 2968944 2888474
5161B888474q8523k0079m8444r8179j44045K8708r6088j05789l7261j40314j18896
$$ 2888474 2799951 2779872 2731428 2633249 2489204 2517912 2421824 2316035 2278774 2138460 2019564
5150B019564L8648j08879j22302L0363N5486j0981q9304P0249K7651R455j93482
$$ 2019564 2058212 1949333 1827031 1857394 1912880 1901899 1812595 1882844 1910495 1919950 1726468
5139A726468l9709Q4794M4591J5011j51357r9351q795p1715L912j49637O3202
$$ 1726468 1686759 1771553 1816144 1831155 1679798 1580447 1571652 1499937 1503849 1354212 1417414
5128A417414N4901k1373L4539R8755N0132n5845O6505o5822n9168J4448J26369
$$ 1417414 1472315 1450942 1485481 1584236 1634368 1578523 1645028 1579206 1520038 1534486 1660855
5117A660855j7439L2392r9930j12597l9262J9292j16497n3098J2681R8268j44495
$$ 1660855 1643416 1675808 1575878 1463281 1424019 1443311 1326814 1273716 1286397 1384665 1240170
5106A240170o0751P3454j4371j07500k0897j2643M5260J998K5744J8178j52039
$$ 1240170 1179419 1252873 1238502 1131002 1110105 1097462 1142722 1144720 1170464 1188642 1036603
5095A036603j332m2961J09547M7935k3921n8726n6851M3239J14569k6076N0790
$$ 1036603 1035271 992310 1101857 1149792 1125871 1067145 1010294 1053533 1168102 1142026 1192816
5084A192816k1607j86904O7457K0903n9028J33795Q1913O058K5235j11991m6271
$$ 1192816 1171209 984305 1051762 1072665 1013637 1147432 1229345 1235403 1260638 1148647 1102376
5073A102376P8986k2277R2585O9505N5727r523k2134J40870n761l798n4066j5665
$$ 1102376 1181362 1159085 1251670 1321175 1376902 1367379 1345245 1486115 1480354 1476556 1422490 1406825
5061A406825Q4579J6715P5881q7885j30593q6352L5296J12156J8776j48792j8366
$$ 1406825 1491404 1508119 1584000 1496115 1365522 1279170 1314466 1426622 1445398 1296606 1278240
5050A278240L3115N6568n6305P805o600J52207K7409o3241p3160o2317L6398j4713
$$ 1278240 1311355 1367923 1311618 1319423 1312823 1465030 1492439 1429198 1356038 1293721 1330119 1315406
5038A315406J02429J38864L9216j03183j08306J67933J26664r5417R8844J19259
$$ 1315406 1417835 1556699 1595915 1492732 1384426 1552359 1679023 1583606 1682450 1801709
5028A801709R2430m0926j406J34505M5557n3799O4440N7753O708n945Q2934O5381
$$ 1801709 1894139 1853213 1851807 1986312 2031869 1978070 2042510 2100263 2106971 2101026 2183960 2249341
5016B249341j55407j1548N501o8907N801R7980J1631J1167J72520J21664Q9894
$$ 2249341 2093934 2082386 2087887 2018980 2024781 2122761 2134392 2145559 2318079 2439743 2529637
5005B529637Q4358J67711J09033Q0571m0151j3972L7805j7696l8926J40101O0305
$$ 2529637 2613995 2781706 2890739 2971310 2931159 2917187 2954992 2937296 2898370 3038471 3098776
4994C098776m7277m0764p7898l2412n9346J12682l0511M5090J8877q0827j2023
$$ 3098776 3051499 3010735 2932837 2900425 2841079 2953761 2923250 2968340 2987217 2906390 2894367
4983B894367l8997l3938K7543N051P4995J6288j88509Q708J74882L9557k9509
$$ 2894367 2855370 2821432 2848975 2854026 2929021 2945309 2756800 2765508 2940390 2979947 2950438
4972B950438m9928l8418n9772M2053P1954k9324r8362j05787k8711k36614J130
$$ 2950438 2900510 2862092 2802320 2844373 2916327 2887003 2788641 2682854 2654143 2417529 2418659
4961B418659o1912j75154L6947M1770l3872Q5843j18719j41796l7250J11226M1479
$$ 2418659 2356747 2181593 2218540 2260310 2226438 2312281 2193562 2051766 2014516 2125742 2167221
4950B167221P0999J01665P368M1398K513N4394J74575j8815Q319R6289o294L1202
$$ 2167221 2238220 2339885 2347253 2388651 2391164 2445558 2620133 2601318 2609637 2705926 2699632 2730834
4938B730834L7539l1931K0611k9608j7640J36035j7494P4439K7646J0877P6523
$$ 2730834 2768373 2736442 2757053 2727445 2709805 2845840 2828346 2902785 2930431 2941308 3017831
4927C017831J65978J98350J21009N7081J49837J59995J61338K9798M1284J95667
$$ 3017831 3183809 3382159 3503168 3560249 3710086 3870081 4031419 4061217 4102501 4298168
4917D298168J59185M2185J79518K55142J96524J68817J16690R1515m483p0810
$$ 4298168 4457353 4499538 4679056 4934198 5130722 5299539 5416229 5507744 5503261 5432451
4907E432451q4213j41379m8966p5122j49033j32842j50281M7603m7530K1300Q9155
$$ 5432451 5348238 5206859 5157893 5082771 4933738 4800896 4650615 4698218 4650688 4671988 4761143
4896D761143L3632O2492R311K65238L82001J29032J76943K79178K26033K77903
$$ 4761143 4794775 4857267 4866578 5131816 5513817 5642849 5819792 6098970 6325003 6602906
4886F602906J86953K00000J74651J16464J32906J24911J86406L47883L47276L32296
$$ 6602906 6789859 6989859 7164510 7280974 7413880 7538791 7725197 8073080 8420356 8752652
4876H752652L38029N40988P02251O76036O75138Q31981J003876Q87846R80605
$$ 8752652 9090681 9631669 10333920 11009956 11685094 12517075 13520951 14408797 15389402
4867A5389402J076611J317871J482134J432918J823898K198327K577503K612195
$$ 15389402 16466013 17783884 19266018 20698936 22522834 24721161 27298664 29910859
4859B9910859K637859K990018K866590K787043K461240J709772Q56574m2220p65959
$$ 29910859 32548718 35538736 38405326 41192369 43653609 45363381 46219955 46177735 45411776
4850D5411776j570781j929902k057017k153208j967557j893577j752783j700009
$$ 45411776 43840995 41911093 39854076 37700868 35733311 33839734 32086951 30386942
4842C0386942j627353j466678j636170j565902j412662j513613j261983j223422
$$ 30386942 28759589 27292911 25656741 24090839 22678177 21164564 19902581 18679159
4834A8679159j205247j051394r08711p80917q02552p78126o68880n09234o06889
$$ 18679159 17473912 16422518 15513807 14732890 13930338 13152212 12483332 11974098 11367209
4825A1367209m54538k21580k87529l73275k36332l87149k26132j48407k23191
$$ 11367209 10912671 10691091 10403562 10030287 9793955 9406806 9180674 9032267 8809076
4816H809076j69144j97799l05780l51842m59962l07207l05302l51218r2943j34846
$$ 8809076 8639932 8442133 8136353 7784511 7324549 7017342 6712040 6360822 6267879 6133033
4806F133033j69752k14150k18612j70201p7748k69953j77970j90020j38165L9669
$$ 6133033 5963281 5749131 5530519 5360318 5282570 5012617 4834647 4644627 4506462 4546131
4796D546131k7336j14563j16315j21523j1044r8629j42001j67859O877k1503j1580
$$ 4546131 4518795 4404232 4287917 4166394 4155350 4056721 3914720 3746861 3753738 3732235 3720655
4785C720655P1924n6881j08384o4189j672j78476r2786k3006o1625j05796j10597
$$ 3720655 3792579 3735698 3627314 3563125 3561453 3382977 3290191 3267185 3205560 3099764 2989167
4774B989167L2157k8427j24623k6412p279j00971l89Q7586K2281m4484O5893k927
$$ 2989167 3021324 2992897 2868274 2841862 2834583 2733612 2733223 2820809 2843090 2798606 2864499 2861572
4762B861572J32093K8279r9279q5007q96K67739l5747k9713L4913P5753m3554
$$ 2861572 2993665 3021944 2922665 2837658 2836762 3104501 3068754 3039041 3073954 3149707 3106153
4751C106153O3603r5242m1601J7989j51292j5379j18422n7743L8798L4037o1671
$$ 3106153 3169756 3074514 3032913 3050902 2899610 2884231 2765809 2708066 2746864 2780901 2719230
4740B719230N8101J69754m6455q6792O4554Q7417q3553O629J052n741j9374N9342
$$ 2719230 2777331 2947085 2900630 2813838 2878392 2965809 2882256 2888885 2889937 2884196 2864822 2924164
4728B924164K1415J4813l9421o632R4526l2413Q3189q2732J8986K4172J02348
$$ 2924164 2945579 2960392 2920971 2914339 3008865 2976452 3059641 2976909 2995895 3020067 3122415
4717C122415J51998P8822K1002m5466m3249K9271P39K7349j89655m4278J46606
$$ 3122415 3274413 3353235 3374237 3328771 3285522 3314793 3315532 3342881 3153226 3108948 3255554
4706C255554J16290K3544q404J17555o0844J74141N8029P9506O4501M1942J79503
$$ 3255554 3371844 3395388 3386984 3504539 3443695 3617836 3675865 3755371 3819872 3861814 4041317
4695D041317l0758q9916J56159l412m0700J08995P2760K8401n5132J0401J83920
$$ 4041317 4010559 3920643 4076802 4073390 4032690 4141685 4214445 4242846 4187714 4198115 4382035
4684D382035J8635m132o6997J03644N095J9528J40385r8857J10799Q0782J09968
$$ 4382035 4400670 4396538 4329541 4433185 4438280 4457808 4598193 4499336 4610135 4690917 4800885
4673D800885J32959J38542O6019K60673J06839J24458J75857J36829L71766K27729
$$ 4800885 4933844 5072386 5138405 5399078 5505917 5630375 5806232 5943061 6314827 6542556
4663F542556J82140K91485M68733N56749K99717N06711O09370O44023P99439Q26831
$$ 6542556 6724696 7016181 7484914 8041663 8341380 8848091 9457461 10101484 10900923 11727754
4653A1727754J005937J223985J272037J327607J364954J396980J107238Q35546
$$ 11727754 12733691 13957676 15229713 16557320 17922274 19319254 20426492 21262038
4645B1262038P07448N48260L89678N19426P56835J208523J488826K037002K422571
$$ 21262038 21969486 22517746 22907424 23426850 24183685 25392208 26881034 28918036 31340607
4636C1340607K546987K860350K778144K474317J779975P67048m66181j901492
$$ 31340607 33887594 36747944 39526088 42000405 43780380 44547428 44081247 42179755
4628D2179755k624424k797922k671438k521871k043444j685732j516320j222883
$$ 42179755 39555331 36757409 34085971 31564100 29520656 27834924 26318604 25095721
4620B5095721j239393p58789q76162o45277m16483j86666l37504J9892J72850
$$ 25095721 23856328 23097539 22221377 21576100 21159617 20972951 20635447 20655339 20828189
4611B0828189K28957M34399N59918P88648Q56620Q74063Q50822P95042M64817
$$ 20828189 21057146 21491545 22051463 22840111 23696731 24570794 25421616 26216658 26681475
4602B6681475P7081l95329p98764r92216q96802o42941m52708l27558j03960n2422
$$ 26681475 26758556 26363227 25564463 24572247 23675445 23032504 22579796 22252238 22148278 22095856
4592B2095856J10833J99371K64783N62403N84161Q11847R57759R69458J045481
$$ 22095856 22206689 22406060 22670843 23233246 23817407 24629254 25587013 26556471 27601952
4583B7601952J193558J406034J653064J782302J796068K103207K439144K613184
$$ 27601952 28795510 30201544 31854608 33636910 35432978 37536185 39975329 42588513
4575D2588513L242273L555966M069384M908922N676441O433999P090275Q320417
$$ 42588513 45830786 49386752 53456136 58365058 64041499 70475498 77565773 85886190
4567H5886190R355983J0575537J1924857J3707904J5604917J8532018K2087615
$$ 85886190 95242173 105817710 117742567 131450471 147055388 165587406 187675021
4560A87675021K6383421L1147087L5722611M0052321M2709397M3098233L9996587
$$ 187675021 214058442 245205529 280928140 320980461 363689858 406788091 446784678
4553D46784678L2918981K2759001J0316205l352069j6459914k7128859l4089336
$$ 446784678 479703659 502462660 512778865 509426796 492966882 465838023 431748687
4546D31748687l7333298l7420355l5368949l1540810k7392576k3864907k0732718
$$ 431748687 394415389 356995034 321626085 290085275 262692699 238827792 218095074
4539B18095074j8364182j6328699j4451023j2848442j1667679j0488323r428794
$$ 218095074 199730892 183402193 168951170 156102728 144435049 133946726 124517932
4532A24517932q482440p367514o803219o117768n395831m967267m460739m062757
$$ 124517932 116035492 108667978 101864759 95746991 90351160 85383893 80923154 76860397
4524G6860397l590926l292114l033389k783567k473943k390697k234166j870585
$$ 76860397 73269471 69977357 66943968 64160401 61686458 59295761 57061595 55191010
4516E5191010j773347j792948j697745j805232j687605j479045j468343j485990
$$ 55191010 53417663 51624715 49926970 48121738 46434133 44955088 43486745 42000755
4508D2000755j414986j398368j224698j116466j121159j019380q30548o71991
$$ 42000755 40585769 39187401 37962703 36846237 35725078 34705698 33875150 33203159
4500C3203159p94615p39502p26227p18151p17230p87600p91405n64221n25734
$$ 33203159 32408544 31669042 30942815 30224664 29507434 28719834 27928429 27364208 26838474
4491B6838474m98322m97658m50684l18854n09857l69442m09642m64143m85675
$$ 26838474 26340152 25842494 25391810 25072956 24563099 24193657 23784015 23319872 22834197
4482B2834197l84925k53722l25256l06597j73743j17000l03261j28457r7716K9632
$$ 22834197 22449272 22195550 21870294 21563697 21389954 21272954 20969693 20841236 20743520 20773152
4472B0773152m9089j31038J1192J01698J12710Q9594J10538L33754L27814M96813
$$ 20773152 20724063 20593025 20604217 20705915 20818625 20908219 21018757 21352511 21680325 22177138
4462B2177138O61856Q64007P58841R42998J278674J552115J856068K016671K334544
$$ 22177138 22838994 23703001 24461842 25404840 26683514 28235629 30091697 32108368 34442912
4453C4442912K865182L168162L301977L249686K991480K313192J690427J151742
$$ 34442912 37308094 40476256 43778233 47027919 50019399 52332591 54023018 55174760
4445E5174760O0312p26539j428858j642850j735763j973300j956581j956548k127814
$$ 55174760 55235072 54508533 53079675 51436825 49701062 47727762 45771181 43814633 41686819
4436D1686819j910386k147568j967734j849678j781378j635990j376657j188843
$$ 41686819 39776433 37628865 35661131 33811453 32030075 30394085 29017428 27828585
4428B7828585j085389j042853p65007q51171q18011q46704q29689q07425q15690
$$ 27828585 26743196 25700343 24935336 24084165 23266154 22419450 21589761 20782336 19966646
4419A9966646o02347o07512m46450n54519p04225o41106n28875l86612n72190
$$ 19966646 19364299 18756787 18310337 17755818 17051593 16410487 15881612 15495000 14922810
4410A4922810n35559k79101m26649m72087l15519m17933l44467l12550k52817
$$ 14922810 14387251 14108150 13681501 13209414 12893895 12475962 12131495 11818945 11566128
4401A1566128l17363l00732n9504j99529j49597k55644o4896j19768j81501k83347
$$ 11566128 11248765 10948033 10888529 10689000 10539403 10283759 10218863 10099095 9917594 9634247
4391I634247p0671j30395r6006j6208k13598j80824j35615j59920j16466r6943
$$ 9634247 9563576 9433181 9337175 9320967 9107369 8926545 8790930 8631010 8514544 8417601
4381H417601R3189J00943j55248j30371j41466k57955j01442K4592j78311k68477
$$ 8417601 8510790 8611733 8456485 8326114 8184648 7926693 7825251 7849843 7671532 7403055
4371G403055j4556j92216j64959j7277r4219l1863j33217j22206N7463N8777j03166
$$ 7403055 7388499 7196283 7031324 7014047 6919828 6887965 6754748 6632542 6690005 6748782 6645616
4360F645616j27540l445j45947q0158N6040r7568N8608p1983j85644r9951l7873
$$ 6645616 6518076 6514631 6368684 6288526 6344566 6246998 6305606 6233623 6047979 5948028 5910155
4349E910155k367k07591m164q6240o5400m9844j05728j3347O7427l6971j78194
$$ 5910155 5907788 5700197 5696033 5609793 5544393 5494549 5388821 5375474 5442901 5405930 5227736
4338E227736k5369l1060J35915J36658n8377J0879m6320j25304j05630K1501R9341
$$ 5227736 5202367 5171307 5307222 5443880 5385503 5396382 5350062 5224758 5119128 5140629 5239970
4327E239970O727P9292m6431j10042j47312j56873k1277j24277N3952J55316p3153
$$ 5239970 5246697 5325989 5279558 5169516 5022204 4865331 4844054 4719777 4773729 4929045 4855892
4316D855892j21655K3130m4058n8494o5259J690Q2889j43031j0769n9787q7597
$$ 4855892 4734237 4757367 4713309 4654815 4589556 4591246 4674135 4531104 4520335 4460548 4372951
4305D372951O2427J81655L8547n0363O4144l9397j29771J3202r3736J24741o5911
$$ 4372951 4435378 4617033 4655580 4605217 4669361 4629964 4500193 4513395 4419659 4544400 4478489
4294D478489j08760j07099j8856j4139q108J6410j04432P6809o0993p6262N8739
$$ 4478489 4369729 4262630 4243774 4229635 4221527 4237937 4133505 4210314 4149321 4073059 4131798
4283D131798J08257q6455N7324j71829N5610M4625M8070J12596o6266N6427J66666
$$ 4131798 4240055 4153600 4210924 4039095 4094705 4139330 4187400 4299996 4233730 4290157 4456823
4272D456823J5784R0086J81649j3498J31019J61765L15853K26161K07876J01915
$$ 4456823 4472607 4562693 4744342 4730844 4861863 5023628 5339481 5565642 5773518 5875433
4262E875433J72027J06349k18545q1347n7228j96334k05796j91189j84112l4154
$$ 5875433 6047460 6153809 5935264 5853917 5796689 5600355 5394559 5203370 5019258 4985104
4252D985104k03824k25792l62r4322j73945o2300L7718j87434J4622o4928j69875
$$ 4985104 4781280 4555488 4555126 4460804 4286859 4224559 4262277 4074843 4089465 4024537 3854662
4241C854662j19274j055j10326m250p378r039m6886q0648J32408P0669k22128
$$ 3854662 3735388 3734333 3624007 3619757 3612379 3603340 3556454 3475806 3608214 3678883 3456755
4230C456755m2393o175j34480m3970R4210n661o2375q1320J966R898k5644P5378
$$ 3456755 3414362 3408187 3273707 3229737 3323947 3318286 3255911 3174591 3176557 3186455 3160811 3236189
4218C236189j14338l5664j41303m97M2018J1462p9572p2423L5682j18M4944N4997
$$ 3236189 3121851 3086187 2944884 2944387 2986405 2997867 2918295 2845872 2881554 2881436 2926380 2981377
4206B981377p2160j00214M5365L3647P2835n692j43898k0982Q781J496k3586Q384
$$ 2981377 2909217 2809003 2854368 2888015 2960850 2955158 2811260 2790278 2799059 2800555 2776969 2785353
4194B785353o0428n9933r2520P1145J1109m1523L416M2539k01251j5359K00519
$$ 2785353 2724925 2664992 2572472 2643617 2654726 2613203 2616619 2659158 2457907 2442548 2643067
4183B643067J80600p2429j06083m3499m1720J9314j9970j03450K265K0138P4314
$$ 2643067 2823667 2751238 2645155 2601656 2559936 2579250 2559280 2455830 2458095 2478233 2552547
4172B552547N5020j07244m5146p1593Q633N1964J38928L1310L7341p5962M1776
$$ 2552547 2607567 2500323 2455177 2383584 2392217 2444181 2583109 2614419 2651760 2575798 2617574
4161B617574j31227L0991N5733j1613j8173P6937M8211K4698M0581j50262P7125
$$ 2617574 2486347 2517338 2573071 2561458 2543285 2620222 2668433 2693131 2733712 2583450 2660575
4150B660575k1241M5442k5947r7610P4769n0317M7505n5q1860j2207M2051J23038
$$ 2660575 2639334 2684776 2658829 2561219 2635988 2585671 2633176 2633121 2551261 2539054 2581105 2704143
4138B704143o3284r2984K7829J4363O2346l4296p5279N2300l7047m6249k3520
$$ 2704143 2640859 2547875 2575704 2590067 2652413 2618117 2542838 2595138 2558091 2511842 2488322
4127B488322J68747j12365N7822O5316N3636n993k521M8363k253j28596n7719
$$ 2488322 2657069 2544704 2602526 2667842 2721478 2715485 2712964 2761327 2759074 2630478 2572759
4116B572759m7668Q2569K5809j9590r175k2813p15r5517N3406j5989R0795J11613
$$ 2572759 2525091 2607660 2633469 2613879 2604704 2581891 2581176 2485659 2539065 2523076 2613871 2725484
4104B725484m3350L2617K5406n6974R0188M6958P3804m287N1595N4782K2126k1029
$$ 2725484 2682134 2714751 2740157 2683183 2773371 2820329 2894133 2889846 2941441 2996223 3018349 2997320
4092B997320J4446J6175P2133P3579Q7629L0014r2322p2124J81023L5371r7197
$$ 2997320 3011766 3027941 3100074 3173653 3261282 3291296 3198974 3126850 3307873 3343244 3246047
4081C246047n0626M2562Q1703P718J03568P6356N8896J01756P6891j08976J10239
$$ 3246047 3195421 3237983 3319686 3327404 3430972 3507328 3566224 3667980 3744871 3635895 3746134
4070C746134J19816P721J22309P2099N1820J67116P1815O5659k0667M026J79005
$$ 3746134 3865950 3873671 3995980 4068079 4119899 4287015 4358830 4424489 4403822 4407848 4586853
4059D586853o705N1334n753L5089M852K55777Q3276J22959K80491J08903Q7477
$$ 4586853 4580148 4631482 4625729 4660818 4665670 4921447 5004723 5127682 5408173 5517076 5604553
4048E604553K79168Q4927K03927K52778L15480K46216K06764K86134L16306L30654
$$ 5604553 5883721 5968648 6172575 6425353 6740833 6987049 7193813 7479947 7796253 8126907
4038H126907K35980L55035M03809K81933L17858J48149J19782J62645k2561J03740
$$ 8126907 8362887 8717922 9121731 9403664 9721522 9869671 9989453 10152098 10129537 10233277
4028A0233277K4707L21324K53673Q1912L23921N28166L35802J98524J03632K03993
$$ 10233277 10257984 10579308 10832981 10914893 11238814 11766980 12102782 12301306 12404938 12608931
4018A2608931K07132k5690O5001L5885o06M7407K7267L33164L40229K85736M03549
$$ 12608931 12816063 12790373 12855374 12891259 12890653 12938060 12965327 13298491 13638720 13924456 14328005
4007A4328005M01203K93779K50798k422j90267n11019o10774m81364m46522l43957
$$ 14328005 14729208 15022987 15273785 15271363 15081096 14570077 13959303 13477939 13031417 12687460
3997A2687460k58148k51618k19264m4991k05237j94414k52359j61642M569l37205
$$ 12687460 12429312 12177694 11958430 11913439 11708202 11513788 11261429 11099787 11104356 10767151
3987A0767151l54443k26873k32051j85563l08514l29039j04653l3876j98197L5448
$$ 10767151 10412708 10185835 9953784 9768221 9459707 9130668 9026015 8992139 8793942 8829390
3977H829390j0569p6374k73835j90825j20140k31203j77844l24414j91971l60761
$$ 8829390 8818821 8742447 8468612 8277787 8157647 7926444 7748600 7424186 7232215 6871454
3967F871454j52679k20128k81848r3914k11797j94057k2859j17137k5498k04726
$$ 6871454 6718775 6498647 6216799 6122885 5911088 5717031 5694172 5577035 5551537 5346811
3957E346811k41073m0754P4679k59241p3775j806j04906o8212o2282n5387M137
$$ 5346811 5105738 5064984 5139663 4880422 4806647 4804841 4699935 4631723 4569441 4514054 4518191
3946D518191J79j07443O2747k132j78464j16141R9560j6917M3483j29858j34683
$$ 4518191 4518370 4410927 4473674 4471542 4293078 4176937 4276497 4259580 4303063 4173205 4038522
3935D038522m2174M6424R7726l4330j55392L5727j69293L2796j1086j8517J2136
$$ 4038522 3996348 4042772 4140498 4106168 3950776 3986503 3817210 3850006 3838920 3820403 3832539
3924C832539r2295p1439P9628j9691M2755J16711j41287k509M9311L8034n8970
$$ 3832539 3740244 3668805 3748433 3728742 3771497 3888208 3746921 3744412 3793723 3831757 3772787
3913C772787N286P7515L5086j2444K0366j60502j8568k1614l0992J0060M7882
$$ 3772787 3778073 3855588 3890674 3878230 3898596 3738094 3719526 3697912 3666920 3676980 3724862
3902C724862j4296K89J9034q899o3696J07929P7074n7015L5974o825m992j1470
$$ 3724862 3710566 3710855 3729889 3720990 3657294 3765223 3842297 3785282 3821256 3814431 3809439 3797969
3890C797969Q6779j03580j26673J36984R3091q4025p1324J04768J05994k9303
$$ 3797969 3884748 3781168 3654495 3791479 3884570 3800545 3729221 3833989 3939983 3910680
3880C910680k8262m4601J2826j10069K8092P1992M0228J0540L3690P017k8103
$$ 3910680 3882418 3837817 3850643 3740574 3768666 3840658 3880886 3891426 3925116 3932133 3904030
3869C904030m6079p5792L8112l8928o1859N2011M9691k0200k6334r4644r4649
$$ 3904030 3857951 3782159 3820271 3781343 3719484 3771495 3821186 3800986 3774652 3680008 3585359
3858C585359j2681K10280J25510J06913j2111m6343p8841M347p5232K6465p723
$$ 3585359 3572678 3782958 3908468 4015381 4003270 3956927 3878086 3882433 3807201 3833666 3825943
3847C825943Q4290p737k9961p9187n3413m7340m3839P0890M6011j6768K0290P0645
$$ 3825943 3910233 3902496 3872535 3793348 3739935 3692595 3648756 3719646 3765657 3748889 3769179 3839824
3835C839824Q1975P2729j00346L2629J5385n5348k18486P1526M3842O4045q8720
$$ 3839824 3921799 3994528 3894182 3926811 3942196 3886848 3668362 3739888 3783730 3847775 3759055
3824C759055J20153j2220o6990N8044o4264M8614k7773j61876M3954Q8093K5615
$$ 3759055 3879208 3866988 3799998 3858042 3793778 3842392 3814619 3652743 3696697 3784790 3810405
3813C810405n0917p3752J32651p9533o7120m8640P0973P8476J30625j75685p8911
$$ 3810405 3759488 3685736 3818387 3738854 3671734 3623094 3694067 3772543 3903168 3727483 3648572
3802C648572R5451k7043M0349q6176L8427j01677L7869m3284k823M292J5220J15834
$$ 3648572 3744023 3716980 3757329 3671153 3709580 3607903 3645772 3602488 3599665 3603957 3619177 3735011
3790C735011j5668j73313J31432M873j04759P519J84l449q8323J7239J39101q291
$$ 3735011 3719343 3546030 3677462 3682335 3577576 3585095 3585279 3581830 3493507 3510746 3649847 3641556
3778C641556K9199n5071j72515J38897N3090O326P2173K4842J2514p9628O7027
$$ 3641556 3670755 3615684 3443169 3582066 3635156 3641482 3713655 3738497 3751011 3671383 3738410
3767C738410n8617R5056K8056o8209K8183R6754P6370k13740N651J24439k9158
$$ 3738410 3679793 3774849 3802905 3734696 3762879 3859633 3936003 3722263 3727914 3852353 3823195
3756C823195m7336L2655o2194O6230L207j13499Q9777J99145j8730j22074q3458
$$ 3823195 3775859 3808514 3746320 3812550 3815757 3702258 3792035 3991180 3972450 3850376 3766918
3745C766918R7102K1177m3775l6887O8383O4707M9116p4833P9234J1315l5350
$$ 3766918 3864020 3885197 3841422 3804535 3872918 3937625 3986741 3911908 3991142 4002457 3967107
3734C967107L5899l3914O1538k1784N8285o7997L9928j5003q7964J71989R3307
$$ 3967107 4003006 3969092 4030630 4008846 4067131 3999134 4039062 4024059 3936095 4108084 4201391
3723D201391m4533J3148l2774k1324k6368n5963O4479k5283Q858o1999j0211k7931
$$ 4201391 4156858 4170006 4137232 4115908 4089540 4033577 4098056 4072773 4081631 4019632 4009421 3981490
3711C981490P2323J05182K1097j26459l3518m3802N7637L3888p2966l3495O655
$$ 3981490 4053813 4158995 4180092 4053633 4020115 3976313 4033950 4067838 3994872 3961377 3968032
3700C968032Q2278m4680q6101j48037J03609Q8045Q5658j36651J20152n5871j02900
$$ 3968032 4050310 4005630 3919529 3771492 3875101 3963146 4048804 3912153 4032305 3976434 3873534
3689C873534M0068k0056k6706M2034Q1891o0971K6607m5570J68326r196m7403
$$ 3873534 3913602 3893546 3866840 3908874 3990765 3929794 3956401 3910831 4079157 4069961 4022558
3678D022558o6981P4879N9831j715O694l3693j14637P5070M6688j1522J5469P905
$$ 4022558 3955577 4030456 4090287 4088572 4095266 4061573 3946936 4022006 4068694 4057172 4072641 4080546
3666D080546q3937j5783k00417o663O4670J7392R0549J2678j23672J13122L1079
$$ 4080546 3996609 3980826 3780409 3773746 3838416 3855808 3946357 3959035 3835363 3948485 3979564
3655C979564K7634J8346k5749K7413o1104N8521q8318k4747J7821J16955Q0774
$$ 3979564 4007198 4025544 3999795 4027208 3966104 4024625 3936307 3911560 3929381 4046336 4127110
3644D127110r4394n0943K9553l74J79269n0107j18121o1045J3256P6351k7909
$$ 4127110 4032716 3981773 4011326 4010952 4190221 4140114 4021993 3960948 3974204 4050555 4022646
3633D022646k0561o272O730j7710o2082l843J48164N8933p0962J19961p3764n206
$$ 4022646 4002085 3995813 4002543 3984833 3922751 3918908 4067072 4126005 4055043 4175004 4101240 4096034
3621D096034K4682r0333K2277m8172k3231J30076N0235R7068O5144P8184m7792
$$ 4096034 4120716 4030383 4052660 4004488 3981257 4111333 4161568 4258636 4323780 4401964 4354172
3610D354172N4o0693m3721J9107L2726r492J30082L8016J1334J2014J5351J05327
$$ 4354172 4354226 4293533 4249812 4268919 4301645 4292153 4422235 4460251 4471585 4483599 4498950 4604277
3598D604277J28330n5126L2457j01678r0690J09381J9582J78124P9541j00246
$$ 4604277 4732607 4677481 4709938 4608260 4517570 4626951 4646533 4824657 4904198 4803952
3588D803952M100N8605j5230L5381J74823j6551n8230R7325J34563o3479N981
$$ 4803952 4808052 4866657 4851427 4886808 5061631 5045080 4986850 5084175 5218738 5155259 5161240
3577E161240J1045M6916N4271M5618L5087n9062J16435k6629N8249J86227J47493
$$ 5161240 5172285 5219201 5273472 5319090 5354177 5295115 5411550 5384921 5443170 5629397 5776890
3566E776890j12669j02718J37684P7582K2966M0738O2293K9047Q8221J58247J73261
$$ 5776890 5664221 5561503 5699187 5776769 5799735 5840473 5902766 5931813 6020034 6178281 6351542
3555F351542J3915O9891J03677J41815l909r02K65332J32046J4025O1139Q1421
$$ 6351542 6365457 6435348 6539025 6680840 6676931 6676029 6941361 7073407 7087432 7148571 7229992
3544G229992J47215J96709K13316O4040J08997L43324K76289K19574K84171L74513
$$ 7229992 7377207 7573916 7787232 7851272 7960269 8303593 8579882 8799456 9083627 9458140
3534I458140J49762K48394L72129K08263L06051K21749j63863j6462r255J01676
$$ 9458140 9607902 9856296 10228425 10436688 10742739 10964488 10800625 10784163 10774908 10876584
3524A0876584n4078k5519M0654Q369J03776J50356K30184J33284O4082J73620
$$ 10876584 10822506 10796987 10837641 10846010 10949786 11100142 11330326 11463610 11527692 11701312
3514A1701312J54254L59334K60568L35924M49454L02805L61851L99542M17013
$$ 11701312 11855566 12214900 12475468 12811392 13260846 13563651 13925502 14325044 14742057
3505A4742057M90376M97924P11030O19141N58123P02212O25611P27365M74531
$$ 14742057 15232433 15730357 16441387 17060528 17618651 18320863 18946474 19673839 20148370
3496B0148370K45067p7313j51928O2972j40R3462L22539N61981M90799N60754
$$ 20148370 20393437 20316124 20164196 20227168 20227028 20320490 20643029 21205010 21695809 22256563
3486B2256563N06810P32052R23420R00916R44353J110739J153950J268377J515003
$$ 22256563 22763373 23495425 24418845 25319761 26264114 27374853 28528803 29797180 31312183
3477C1312183J750678J604000J828694J964956J950638K093446J950049J809967
$$ 31312183 33062861 34666861 36495555 38460511 40411149 42504595 44454644 46264611
3469D6264611J618047J228631P46254L79788q8142r35749j417280j764423j641926
$$ 46264611 47882658 49111289 49857543 50237331 50149189 49213440 47796160 46031737 44389811
3460D4389811j480062j629380j447113j418821j281533j115172j143087j015351
$$ 44389811 42909749 41280369 39833256 38414435 37132902 36017730 34874643 33859292
3452C3859292j007636q38137q17001q78390o29522o35277p89351o46279l70085
$$ 33859292 32851656 32013519 31196518 30318128 29688606 29053329 28263978 27617699 27247614
3443B7247614m29199m31813m22352m08590n50141l62994l59912m42170n70821
$$ 27247614 26818415 26386602 25964250 25555660 25005519 24642525 24282613 23840443 23269622
3434B3269622m75971m40912l61765m55867l61110m02339l70244l60841m88561
$$ 23269622 22793651 22352739 21990974 21535107 21173997 20771658 20401414 20040573 19552012
3425A9552012m41246m32847l25486k19084k85155m88950k94422k63528l12864
$$ 19552012 19110766 18677919 18352433 18133349 17848194 17359244 17064822 16801294 16488430
3416A6488430l85849m05618q4637n7933J6203k13141j49530j06112j99231j95980
$$ 16488430 16102581 15696963 15612326 15554393 15570596 15357455 15207925 15101813 14902582 14706602
3406A4706602q4391k22117j17493k53314k37764l11274k95161j45721j35254j09750
$$ 14706602 14622211 14400094 14282601 14029287 13791523 13480249 13185088 13039367 12904113 12794363
3396A2794363j53431j87437j05222j67080j43081m1993p1432j06289j55960j40856
$$ 12794363 12640932 12453495 12348273 12181193 12038112 11996119 11924687 11818398 11662438 11521582
3386A1521582k42847j47058L9225j20876J7849j16427j20806n3749j96059J31252
$$ 11521582 11278735 11131677 11170902 11050026 11067875 10951448 10830642 10776893 10580834 10712086
3376A0712086K6543j13293k7306K5962j23740j23723J5923j77102j28019j38854
$$ 10712086 10738629 10625336 10598030 10623992 10500252 10376529 10392452 10215350 10087331 9948477
3366I948477j00895q1327j26968j26036m2350P5290j20681m7215r4915j13058
$$ 9948477 9847582 9766255 9639287 9513251 9470901 9546191 9425510 9378295 9283380 9170322
3356I170322o9145l7453K9831K0208j13371q2411j57143l731r1913m8516m158
$$ 9170322 9101177 9063724 9093555 9113763 9000392 8917981 8760838 8757107 8665194 8616678 8612520
3345H612520J04411p5770j44737K7209J04675j16402j25493k06217k8626L4599
$$ 8612520 8716931 8641161 8496424 8523633 8628308 8511906 8386413 8180196 8151570 8186169
3335H186169j06893l5650p5292j39942q5781o7630K7143j4193o7568r9652m2808
$$ 8186169 8079276 8043626 7968334 7828392 7742611 7674981 7702124 7687931 7620363 7520711 7477903
3324G477903L1199n4059P352j21704O7294l5292r7371P368r4836j01516M3250
$$ 7477903 7509102 7455043 7462395 7340691 7407985 7372693 7275322 7282690 7187854 7086338 7129588
3313G129588j7511J080J7603O7931l4811m2196J9731n0501l5391j26155k3158
$$ 7129588 7112077 7113157 7130760 7198691 7163880 7121684 7141415 7090914 7055523 6929368 6906210
3302F906210l2557o6168q5034o9400q1353J14201l2444j65778l7791J01711n0732
$$ 6906210 6873653 6807485 6722451 6653051 6571698 6685899 6653455 6487677 6449886 6551597 6500865
3291F500865P7296j44570r6860r5910j55290O2339J18562j3771k14864J612m4448
$$ 6500865 6578161 6433591 6336731 6240821 6085531 6147870 6266432 6252661 6037797 6039409 5994961
3280E994961n2241J13930j29545o2065J23604n5624r2187j49717J26414L6780
$$ 5994961 5942720 6056650 5927105 5865040 5988644 5933020 5840833 5691116 5817530 5854310
3270E854310o6508m9203L779l578o3165p6861l5222K6273j2688j08240j33330
$$ 5854310 5787802 5738599 5742378 5738800 5675635 5598774 5563552 5589825 5577137 5468897 5335567
3259E335567m6315O9170Q151L892r9720j88006j0885k4497j53980O4984R6748
$$ 5335567 5289252 5358422 5366573 5370465 5270745 5082739 5071854 5047357 4893377 4958361 5055109
3248E055109j20591r1897K61539p3738j21182M3840j8948P4097R442q9840J8796
$$ 5055109 4934518 4842621 5104160 5030422 4909240 4953080 4934132 5008229 5017671 4927831 4946627
3237D946627K10952N1396j25841K7476j7464o8493n94l1926P7035q6495j38036
$$ 4946627 5157579 5208975 5083134 5110610 5093146 5024653 5024059 4992133 5069168 4982673 4844637
3226D844637Q1091N0017J00702j13000R0966Q4284j64907J18140J32591k9680
$$ 4844637 4925728 4975745 5076447 4963447 5054413 5138697 4973790 5091930 5224521 5194841
3216E194841m1004J00034J32516K3970j0884O3074p9509r622l7197J25083P0029
$$ 5194841 5153837 5253871 5386387 5410357 5399473 5462547 5383038 5373416 5336219 5461302 5531331
3205E531331J08824Q7382J0531J51170j64576N4310O735l4495J45922K5553MP3311
$$ 5531331 5640155 5727537 5738068 5889238 5724662 5778972 5785707 5751212 5897134 5922687 5922691 5996002
3193E996002L4021m3361J53773Q6904l4391j43302M2061R7550J30445J55203n8224
$$ 5996002 6030023 5986662 6140435 6227339 6192948 6049646 6091707 6189257 6319702 6474905 6416681
3182F416681L6832J6118P1284l4060J29202K73806J00645O5744l1665Q8865J98278
$$ 6416681 6453513 6469631 6540915 6506855 6636057 6909863 7010508 7076252 7044587 7133452 7331730
3171G331730K0976J72187J83927J90634J91907O8116J30958K23402J21435J30737
$$ 7331730 7352706 7524893 7708820 7899454 8091361 8159477 8290435 8513837 8635272 8766009
3161H766009L58647K17432P4236K82349L05787J10462L81923J64689K02797K48048
$$ 8766009 9124656 9342088 9416324 9698673 10004460 10114922 10496845 10661534 10864331 11112379
3151A1112379J27453J63754K00039J09724L9663K58709L18770P7578J63229J79411
$$ 11112379 11239832 11403586 11603625 11713349 11753012 12011721 12330491 12408069 12571298 12750709
3141A2750709K97186L09003K35319K86887K90265M98161M78890L95813L87443
$$ 12750709 13047895 13356898 13592217 13879104 14169369 14667530 15146420 15542233 15929676
3132A5929676N11562N56528O99965O06583P44521N90950N46829M90996K37245
$$ 15929676 16441238 16997766 17697731 18304314 19048835 19639785 20186614 20677610 20914855
3123B0914855K50860O3236j19549k23323l31509k85455k42593l33051j73058k9290
$$ 20914855 21165715 21228951 21109402 20886079 20554570 20269115 20026522 19693471 19520413 19491123
3113A9491123K7672R0766Q951J19345K35665J76767K14177K93605K94052K45267
$$ 19491123 19518795 19609561 19618512 19737857 19973522 20150289 20364466 20658071 20952123 21197390
3103B1197390K62503K70412M27746L06315M854p4566O5371J5273j97853k36765
$$ 21197390 21459893 21730305 22158051 22464366 22469220 22394654 22460025 22475298 22277445 22040680
3093B2040680k39305k53378m37645m85871l69684m78493m04948l52897k78212
$$ 22040680 21801375 21547997 21110352 20624481 20254797 19776304 19371356 19018459 18740247
3084A8740247l97781j94807j60801k20266r6845q4799j58907j15452K5002k25690
$$ 18740247 18342466 18147659 17986858 17766592 17669747 17584948 17426041 17310589 17335591 17109901
3074A7109901k57662l56210k47253l39203m22511m35023l14663l83810n52186
$$ 17109901 16852239 16496029 16248776 15909573 15487062 15052039 14737376 14353566 13801380
3065A3801380l31673l71823l85281l12972m99650j80776l61257k63752k11971
$$ 13801380 13469707 13097884 12712603 12399631 11899981 11719205 11357948 11094196 10882225
3056A0882225m83514k38334j89561k02772k30679k18567r2471j19573l20943k54861
$$ 10882225 10398711 10160377 9970816 9768044 9537365 9318798 9226327 9106754 8785811 8530950
3046H530950j07250m2767k19248j69847j50560k72420k46678o3945r1348j20591
$$ 8530950 8423700 8380933 8161685 7991838 7841278 7568858 7322180 7258235 7166887 7046296
3036G046296j73657k07981n6735j32958r4948o0083j59706j24502k06097p9550
$$ 7046296 6872639 6664658 6607923 6474965 6380017 6319934 6160228 6035726 5829629 5750079
3026E750079P3751k91117j93011r8552l084r406n291L3547j97960j3292R464q2460
$$ 5750079 5823830 5532713 5339702 5241150 5238066 5228660 5223369 5256916 5058956 5045664 5055128 4972668
3014D972668j00275K9142m9781j26795n4451L8645j79622n0330j26969n7574o1787
$$ 4972668 4872393 4901535 4851754 4724959 4670508 4709153 4529531 4479201 4352232 4294658 4232871
3003D232871m9855r6602j09433K5072k5309o3377j53236P7673n1724p6410J5529
$$ 4232871 4183016 4086414 3976981 4002053 3976744 3913367 3760131 3837804 3786080 3709670 3725199
2992C725199O99r6436r1060q170o9452n47j2613l5474R9812n5685l3837j23703
$$ 3725199 3725898 3629462 3538402 3530232 3460780 3460233 3447620 3412146 3511958 3456273 3422436 3298733
2980C298733j02699J07366r6883j26470L2529P2788p1931j19783o2589q9423o8624
$$ 3298733 3196034 3303400 3206517 3080047 3112576 3185364 3113433 2993650 2931061 2841638 2773014
2969B773014J3402n1351P6175N8927j38508o5163j3541O7498J0627j57628j03049
$$ 2773014 2786416 2735065 2811240 2870167 2731659 2666496 2652955 2720453 2731080 2573452 2470403
2958B470403J29184n3265J2919q7222J0520l0314m6784K8135j20298k1561n9300
$$ 2470403 2599587 2546322 2559241 2472019 2482539 2452225 2405441 2433576 2313278 2291717 2232417
2947B232417j089k4579l5913P0187K0632m113j4390l3686l72j6925J4505J9786
$$ 2232417 2231328 2206749 2170836 2241023 2261655 2257542 2243152 2209466 2209094 2192169 2206674 2226460
2935B226460j92339j9228M1080n4640m7772J2305N7794J52486o6271p3948k9283
$$ 2226460 2034121 2014893 2055973 2001333 1953561 1965866 2023660 2176146 2109875 2035927 2006644
2924B006644j14344J05227Q0484j34002j23772J00300Q7048j00083r1897J21412
$$ 2006644 1892300 1997527 2078011 1944009 1820237 1920537 2007585 1907502 1815605 1937017
2914A937017M1712N4300j31205q3150k5687J4523L2006j2371j15006N0623k7138
$$ 1937017 1978729 2033029 1901824 1818674 1792987 1807510 1839516 1827145 1712139 1762762 1735624
2903A735624N8931M2647J4995j17230q8766q8906M1132Q9772n4769p2712k2704
$$ 1735624 1794555 1837202 1852197 1734967 1646201 1557295 1598427 1688199 1633430 1560718 1538014
2892A538014P7709R654Q0178j4827K9279p9442n1897J09840O4357j87479n5050
$$ 1538014 1615723 1625377 1705555 1690728 1720007 1640565 1588668 1698508 1762865 1575386 1520336
2881A520336O7795Q0612N6059l0468j57536q717N0972m3001P3751m6620n176P2092
$$ 1520336 1588131 1668743 1724802 1694334 1536798 1528081 1579053 1536052 1609803 1563183 1558007 1630099
2869A630099J0391j9506p9099P3329n1731j01319o3382K1738O3161o1650p2946
$$ 1630099 1640490 1620984 1541885 1615214 1563483 1462164 1398782 1420520 1483681 1422031 1349085
2858A349085K28667K2975j34171N5134L2850n0102j04241R6765M5444K3652j35065
$$ 1349085 1577752 1600727 1466556 1521690 1554540 1504438 1400197 1496962 1542406 1566058 1430993
2847A430993L7962J2446K2159o554j42711l1540J6306R0543R511n6529R034K123
$$ 1430993 1468955 1481401 1503560 1497006 1354295 1322755 1339061 1429604 1439115 1382586 1391620 1393743
2835A393743M1236O6623p0071k8913K738m6704q2880k4904J16349p4752l6100
$$ 1393743 1434979 1501602 1431531 1402618 1405356 1358652 1275772 1250868 1367217 1292465 1256365
2824A256365Q8639l8258J95791j08380O6968r0279o1785L5351m1679J35497K2464
$$ 1256365 1345004 1306746 1502537 1394157 1461125 1370846 1309061 1344412 1302733 1438230 1460694
2813A460694k10733O1428K7437n9375R2972j44067j2854O586j93219K3717O6282
$$ 1460694 1249961 1311389 1338826 1279451 1372423 1228356 1215502 1222088 1028869 1052586 1118868
2802A118868N0001N8725J1088p5933l8619O3658k0017Q6099o524N840n9898j099
$$ 1118868 1168869 1227594 1238682 1162749 1124130 1187788 1167771 1253870 1247346 1253186 1193288 1192189
2790A192189r1279j00666K5227O0868P6279R1637J4202j4224j00966m1161R8738
$$ 1192189 1100910 1000244 1025471 1086339 1162618 1254255 1268457 1254233 1153267 1112106 1210844
2779A210844Q4654n8171k04567O0297l956n5484k1201p0313J26313J42276N3000
$$ 1210844 1295498 1237327 1032760 1093057 1089101 1033617 1012416 942103 1068416 1210692 1263692
2768A263692j83239p3316L0643J8100j24202N8642J22239p5070L7733M5754r0084
$$ 1263692 1080453 1007137 1037780 1055880 931678 990320 1112559 1037489 1075222 1120976 1030892
2757A030892l8335l4715n0537N909L3634j00303k1663J75464R5442j05901j1145
$$ 1030892 992557 957842 907305 913214 946848 846545 824882 1000346 1095788 989887 978742
2746I78742j03108l5787J40106M9910r4381l8875K3334N4232o950N919L8339L2329
$$ 978742 875634 839847 979953 1029863 935482 896607 919941 974173 967223 973142 1011481 1043810
2734A043810j12232q4935J76604m6997n9670N0067m2627L3711n8718o3575J07767
$$ 1043810 931578 846643 1023247 976250 916580 966647 924020 957731 899013 835438 943205
2723I43205M0800P2555l5058O4786j06426K83N0674j23406j00902j5593N570l808
$$ 943205 984005 1056560 1021502 1086288 979862 980145 1030819 907413 806511 790918 796488 792680
2711G92680J29263l4330j18125J21736k2274p759J31011j09876K8957M9993O1472
$$ 792680 921943 887613 769488 891224 868950 861191 992202 882326 911283 961276 1022748
2700A022748j23967j08658k9193Q9747K8925j5255p2349J33509K6587p6887L480
$$ 1022748 898781 790123 760930 850677 879602 864347 791998 925507 952094 875207 878687
2689H78687J2060R5918r2153O3732m2559J3069q4367q1342J00033J09741j21054
$$ 878687 890747 986665 894512 958244 915685 928754 844387 763045 863078 972819 851765
2678H51765p9721J12492M2541l8193j18951j078L446m1448K3496k0628K18283
$$ 851765 772044 884536 927077 888884 769933 768855 772301 730853 754349 733721 952004
2667I52004j4266r5401j83791Q9341J38951j14438K5552n7154j56408k9530J17362
$$ 952004 937738 842337 658546 747887 886838 772400 797952 740798 584390 554860 672222
2656F72222P7754q2708n1372O9593k4027J2633M5400m0833J1481r1086J58848
$$ 672222 749976 667268 615896 685489 661462 674095 719495 678662 690143 599057 757905
2645G57905J05331j15704K9773O3501j81922K4448m511l1683P0541p5876N3747
$$ 757905 863236 747532 777305 840806 658884 683332 678821 647138 717679 641803 695550
2634F95550L9872k5691p6527J78796j04341q9998P9525m5241o7681J7402n0390
$$ 695550 735422 709731 633204 812000 707659 617661 697186 651945 584264 601666 551276
2623E51276j12750j1502R5898J48650j45175O3035q9n3560O6564K6698q560N2837
$$ 551276 438526 427024 522922 671572 526397 589432 589343 535783 602347 629045 620485 673322
2611F73322M1186j34156o8116j8002P1124M0284P8684k2490Q2770J2898j55400
$$ 673322 714508 580352 512236 494234 565358 605642 684326 661836 744606 757504 602104
2600F02104j24705R2427K62850Q2242K053j16609N1051R6680m5688k4248M4777
$$ 602104 477399 569826 832676 914918 916971 800362 851413 948093 902405 878157 922934
2589I22934K5958j60615j75396R3618J53626r2101m2606n9133o9159M451r5946
$$ 922934 948892 788277 612881 706499 860125 768024 725418 666285 597126 601577 505631
2578E05631K6115J27347q770l3557O9823J67635q0571j14535N518j06837K9047
$$ 505631 531746 659093 650323 616766 686589 854224 773653 659118 664636 557799 586846
2567E86846P0090K8260n9409K8176j22474n5404M0828P0714J15701n9871q7496
$$ 586846 656936 685196 625787 653963 531489 476085 516913 587627 703328 643457 555961
2556E55961M9059J79034j05649n2520M55k1701n6988l7378P3877K3356L1839k5630
$$ 555961 605020 784054 678405 625885 626340 604639 547651 510273 584150 607506 639345 613715
2544F13715o2147J17073j10629l0110L6361N8976j67960J2511n2578N6647M8090
$$ 613715 551568 668641 558012 527902 564263 623239 455279 467790 415212 471859 519949
2533E19949p696M7537Q1520R0391l0707n578k1966j22333r9490J16275N2867l7728
$$ 519949 512253 559790 641310 731701 700994 695416 673450 551117 451627 567902 620769 583041
2521E83041O3472M940j7426K1568j07119q7230K0436j1733l876R413L9038J29594
$$ 583041 646513 651453 634027 655595 548476 461246 481682 469949 466073 475486 514524 644118
2509F44118K9963J04965j95928r2255J48960o3032n4112M1549j091r8651O2683
$$ 644118 674081 779046 583118 490863 639823 576791 522679 564228 563137 464486 527169
2498E27169O1411M0742l8049n6604n1110q3175J56950p565r4734N7225j2409j38778
$$ 527169 588580 629322 591273 534669 483559 400384 557334 549769 455035 512260 499851 361073
2486C61073N7285L3017l0760o4518j6882J42940m415o0996J15582m6608N9712
$$ 361073 418358 451375 420615 356097 339215 482155 477740 416744 532326 485718 545430
2475E45430Q3718n1893Q07O5649j37945Q5011R7182j65340P2615R0781L95j23543
$$ 545430 629148 577255 578062 643711 505766 590777 687959 522619 595234 686015 686410 562867
2463E62867j07269J983J17275J9693j9731M6411j45135R7456N7829K7734J6023
$$ 562867 455598 457581 574856 594549 574818 621229 476094 573550 631379 659113 675136
2452F75136p9307k2432j25006J33815L9425j00965j2713q6198R320M5862N4960
$$ 675136 595829 573397 448391 582206 621631 520666 507953 421755 431075 476937 531897
2441E31897k4852J02847p6774r3324l6852O5548Q9919m5n1710M6195R7923N0852
$$ 531897 507045 609892 533118 439794 402942 468490 558409 558364 506654 552849 650772 701624
2429G01624j68773l5196R100J4462J00600m9269j19348m174r652P9767l053k6203
$$ 701624 532851 497655 506755 521217 621817 572548 453200 449026 439374 519141 516088 489885
2417D89885P7209o5118r673j61310J71348J44023P9490j10655J39711N7736r4859
$$ 489885 567094 501976 492303 330993 502341 646364 725854 615199 754910 812646 717787
2406G17787q2759N9969j6627q3134R4972k8185R2375r2578O9015L9274m1416n2325
$$ 717787 635028 694997 678370 595236 690208 662023 754398 661820 730835 770109 728693 676368
2394F76368r733L1008P0532j30984j05759Q1333P0861n3793J66736M9286j35072
$$ 676368 666635 697643 768175 637191 531432 612765 683626 629833 796569 845855 710783
2383G10783O5871N6810K5896P7382j00418M6099K6562L2559K93860j54789o9822
$$ 710783 776654 833464 859360 936742 836324 882423 908985 941544 1235404 1080615 1010793
2372A010793K11267l6996O7241J53884r7204J34725k7578O5709R8313O7140R4548
$$ 1010793 1222060 1185064 1252305 1406189 1308985 1443710 1416132 1481841 1580154 1647294 1741842
2361A741842R5430P3748J58056J20634J92865J11415K34800P9735J5668K16939
$$ 1741842 1837272 1911020 2069076 2189710 2382575 2493990 2728790 2808525 2824193 3041132
2351C041132K32197J93079K31278M56697M68042M90812N63555M52651P39264P88990
$$ 3041132 3273329 3466408 3697686 4154383 4622425 5113237 5676792 6129443 6868707 7657697
2341G657697Q15972R78847Q46627R60085J064614J240271J571984K024121K722476
$$ 7657697 8473669 9452516 10299143 11259228 12323842 13564113 15136097 17160218 19882694
2332A9882694L192822M028162M837489M707055N268572M779707L138521J915033
$$ 19882694 23075516 27103678 31941167 36648222 41916794 46696501 49835022 51750055
2324E1750055n38365m573783o234329n178659m220873l408230k715650k254040
$$ 51750055 51211690 46637907 40403578 35224919 31004046 27595816 24880166 22626126
2316B2626126k027801j664879j539234j487548j006256q89760q90873q32314q31794
$$ 22626126 20598325 18933446 17394212 15906664 14900408 14010648 13119775 12287461 11455667
2307A1455667p98227q41662p31139m89474n29758m85628k90447m03266l25319
$$ 11455667 10657440 9815778 9084639 8595165 8065407 7579779 7289332 6886066 6560747
2298F560747l89734l05680k29551k11698j63110j63009k00049k87674j40569j45015
$$ 6560747 6171013 5865333 5635782 5424084 5260974 5097965 4897916 4610242 4469673 4324658
2288D324658j08144j85649j60955k02621j78423O2429o8421k12982L0399j01605
$$ 4324658 4216514 4030865 3869910 3667289 3488866 3551295 3482874 3269892 3300291 3198686
2278C198686j15990k42264j79858j3275j3872o4421j13696k54m8741m1769j24647
$$ 3198686 3082696 2840432 2660574 2647299 2633427 2569006 2455310 2455056 2406315 2364546 2239899
2267B239899L8272r0291L428j19824J16291L009o5791n1360q9454j57366k12N81
$$ 2239899 2278171 2187880 2191308 2071484 2187775 2190784 2124993 2073633 1984179 1826813 1826601 1827182
2255A827182Q62M0180j77469k4864o6239M7736M1506j17551m0017N0112M1219
$$ 1827182 1828044 1868224 1690755 1665891 1599652 1647388 1688894 1571343 1531326 1581438 1622657
2244A622657k9924p7776j0463j03274k365Q0568p8633j40533Q2013q7336j6327
$$ 1622657 1592733 1514957 1504494 1401220 1398855 1479423 1400790 1260257 1342270 1254934 1238607
2233A238607j7212J4598M6586N6981l9834O011K8084j33493J6760Q7535N9593
$$ 1238607 1221395 1235993 1282579 1339560 1299726 1305737 1333821 1200328 1217088 1304623 1364216
2222A364216j7483j27306K2078p6896M9926K6403n3838n7034J1101o9261j9763
$$ 1364216 1346733 1219427 1241505 1164609 1214535 1240938 1187100 1130066 1141167 1071906 1052143
2211A052143Q3872n0917L0290O3916p6194P650o2561Q8353Q557j41035m91N9921
$$ 1052143 1136015 1085098 1115388 1179304 1103110 1110760 1048199 1136552 1145109 1004074 1003583 1063504
2199A063504m57M9878r8385P7688N1271r3603r2508l9217j05228M1349O7564K1123
$$ 1063504 1063047 1112925 1014540 1092228 1143499 1049896 957388 918171 812943 854292 921856 942979
2187I42979L2140n4437p9936J6615J04216j8650J01822o4669o3020m1059O1229
$$ 942979 975119 920682 840746 857361 961577 942927 1044749 980080 917060 876001 937230
2176I37230M2795N0715k40771j71902J57225M0747N3961N3422n9531l3111l5204
$$ 937230 980025 1030740 789969 618067 775292 816039 870000 923422 863891 830780 795576
2165G95576O0996m0259P439K0087J8730n3043r6238k4883p818L9563M3330K6818
$$ 795576 856572 816313 823752 843839 862569 809526 713288 688405 680587 720150 763480 790298
2153G90298q406Q0429l8714j76414L8165M1492j0362k7130j29943k3126J14264
$$ 790298 781892 862321 823607 647193 685358 726850 716488 689358 559415 536289 650553
2142F50553r8588k2225J19439j2794k7525n7545l2159M9392N4701L2016N2300
$$ 650553 551965 529740 649179 636385 608860 551315 519156 568548 623249 655265 707565
2131G07565N5508k18072O3938O6546p0387O7568J25947o3123j30979O4438m9792
$$ 707565 763073 545001 608939 675485 605098 672666 798613 735490 604511 668949 619157
2120F19157o3222P4026j10632p7754P0952L2596J24432K4941l0747J1162K4626
$$ 619157 555935 629961 519329 441575 512527 545123 669555 694496 663749 674911 699537
2109F99537L1429l3074K6396l9786r1054M4588k5699k8390j0252J39564r7034
$$ 699537 730966 697892 724288 684502 593448 638036 612337 583947 573695 713259 616225
2098F16225j2521K3124k114J26990k4759j41557l1962K88p9355J38066j2900k664
$$ 616225 603704 626828 624714 751704 726945 585388 553426 553714 474359 612425 599525 596861
2086E96861K1854M6583p4670J24883j44515K2182Q0575m2064p9858m1203N7901
$$ 596861 618715 665298 590628 715511 570996 593178 673753 631689 551831 510628 568529
2075E68529O3119j81749J12685P5733q915O2195l915J9712K3479J0128j42031
$$ 568529 631648 449899 562584 638317 629402 691597 687682 707394 730873 741001 598970
2064E98970m3852J09620R6412j03034l3738J32610K9201q9516J58802r4140k2823
$$ 598970 555118 664738 761150 658116 624378 756988 786189 696673 855475 761335 738512
2053G38512L3692j379r6009k3519r216J5906m2802o40O2508p7707L2338Q9680
$$ 738512 772204 770825 674816 651297 642081 657987 615185 614545 677053 599346 631684 721364
2041G21364j70468K2676N2528n2580O9992n4508o7264O5086j11625M6968Q8633
$$ 721364 550896 573572 626100 573520 643512 589004 521740 586826 475201 522169 610802
2030F10802j8692o147k4630J1901l8944P7088M9491j01627R571J4114J5228j1979
$$ 610802 592110 585963 561333 573234 534290 611378 660869 559242 568813 582927 598155 586176
2018E86176k3193k2558Q5422n9330j15124J02227k9503j02110J08873K7300O3554
$$ 586176 562983 540425 625847 566517 451393 553620 524117 422007 530880 558180 621734
2007F21734M0883j931l8650n3379o1492J29039l5606o8904l5560l8584R641j69026
$$ 621734 662617 660686 622036 568657 507165 636204 600598 531694 496134 457550 467191 298165
1995B98165J23992N2257j21611M4879l960J39448k2437l1050N4286l4856N4339
$$ 298165 422157 474414 352803 397682 393722 533170 510733 479683 533969 499113 553452
1984E53452j11748q3399L2190K1831P7688L3010m1543J0113l5781R6973J3524
$$ 553452 441704 358305 390495 412326 490014 523024 481481 491594 455813 552786 566310
1973E66310j34072K9592R0317Q9851K8435j64760M1161m2728j16106P7502L1826
$$ 566310 432238 461830 552147 641998 670433 505673 546834 504106 388000 465502 497328
1962D97328J10275j55935q6143M1812l1349j1128O8944L8576n9731M5872l2159
$$ 497328 607603 451668 365525 407337 375988 364860 433804 472380 412649 458521 426362
1951D26362n6817k5189q151Q7437j52494Q0919R4016R7065K9491Q3002m0665j46968
$$ 426362 369545 344356 336205 423642 271148 352067 446083 543148 572639 655641 614976 468008
1939D68008J84770k3663p1495j36648o8967k3095K11368K1336n0090j3161J5550
$$ 468008 652778 629115 557620 420972 352005 328910 540278 561614 511524 498363 513913
1928E13913L1794o095r2615j02588R7969n7426J76700J0289j37607R889M4176
$$ 513913 545707 539612 446997 344409 442378 384952 561652 571941 434334 444223 488399
1917D88399j865q3248J0498j7606l0635k679P1194n2616J9889r9196P080J34326
$$ 488399 486534 403286 413784 396178 365543 362864 434058 381442 401331 302135 309215 443541
1905D43541O7453j7598l9506r4203R31k5448J55925J0929n2544K6965p773M909
$$ 443541 510994 493396 453890 359687 360618 335170 491095 502024 449480 476445 468672 473581
1893D73581L7374l2370q3725q5517J3096R077K6116P5900j4264q8546K9702P6741
$$ 473581 510955 478585 394860 309343 322439 331516 357632 433532 419268 330722 360424 437165
1881D37165N1501p6660k0509o97n3950l8962m4738j7186J02021L8801L3452P1290
$$ 437165 488666 412006 391497 390800 336850 297888 253150 235964 337985 376786 410238 481528
1869D81528j2242o6106P226J9555O6006j33697l5902J05303N90M6457p6123J8386
$$ 481528 469286 403180 410406 429961 495967 362270 326368 431671 432261 478718 402595 420981
1857D20981O8488q7449K7787m6980q4500R0870o174J12693m783J6216M672j09732
$$ 420981 489469 402020 429807 382827 298327 389197 383023 495716 490933 507149 511821 402089
1845D02089O5262j5767n2842l0348J3657J35152M0384j36158j3653K7538J2713
$$ 402089 467351 451584 398742 368394 382051 517203 557587 421429 407776 435314 448027
1834D48027O0258j21014q3242J00689M1314L120q8721M6083K966O9126J4285q0201
$$ 448027 508285 387271 304029 404718 446032 449152 360431 406514 409480 478606 492891 412690
1822D12690J64346n9152l0826M3728L2803j31212k9388n4143M2853J2212K5553
$$ 412690 577036 517884 487058 530786 563589 432377 402989 348846 391699 403911 429464
1811D29464j22595N0805k773P751P2818m7182L7659n4794j621O4241j49965O114
$$ 429464 306869 357674 354901 362652 435470 388288 425947 371153 369532 433773 283808 289922
1799B89922K1053L6609n7177K6202l5823J01274m3900M0598k6946O1927j4678
$$ 289922 310975 347584 290407 316609 280786 382060 338160 378758 351812 413739 399061
1788C99061m9062J11118r7182N4231J42251r2587r3695p7474N2106J54150R607
$$ 399061 349999 461117 363935 418166 560417 467830 374135 296661 348767 502917 512524
1777E12524k8062R4248M2180j01792l5493j01655p9283L7418L1615P8309l4890
$$ 512524 484462 578710 620890 519098 483605 381950 302667 340085 371700 450009 415119
1766D15119k3536j08450J6483J24676k1140j44490j19109O3940J11296l062J5735
$$ 415119 391583 283133 299616 424292 403152 258662 139553 203493 314789 311727 327462
1755C27462P0491o8000J27534j47473j01271J0371R2674o5927R7597l153N6686
$$ 327462 397953 329953 457487 310014 208743 219114 311788 245861 343458 340305 396991
1744C96991k6364o4772L4110Q4948r6562K9359J03345q4477p7027O5182r433M4851
$$ 396991 370627 305855 339965 424913 328351 357710 461055 376578 299551 364733 355300 400151
1732D00151j22978Q1624J07732o8029j512r1523Q2919k4478l4427O6269L1521
$$ 400151 277173 358797 466529 398500 396988 305465 388384 363906 329479 395748 427269
1721D27269n691p670J2315J229j12967l0713n5978K896o4277L8942J32827M9223
$$ 427269 421578 413908 426223 427452 314485 283772 227794 230690 166413 205355 338182 387405
1709C87405L883o8696n6567N5996Q8926j5789o8323k8039L400L7971J09530M5135
$$ 387405 391288 322592 266025 322021 410947 395158 326835 298796 302196 340167 449697 494832
1697D94832r5092L244M0790M740j6423o5009j32581m0164J38809O2890k1293j3636
$$ 494832 399740 402984 443774 448514 432091 367082 234501 194337 333146 396036 374743 361107
1685C61107M0791K9978j6585j25211J29911P1637l1919k8848k4130K8504l6421
$$ 361107 401898 431876 415291 290080 419991 491628 459709 430861 406731 435235 398814
1674C98814p5889j9389K4524J54997J24018l5671r3428o2748j20857l7011J01160
$$ 398814 322925 303536 328060 483057 607075 571404 477976 415228 294371 257360 358520
1663C58520O3409N5521N1491l3357n8052K924O5477q8344m26P8238o0726M0079
$$ 358520 421929 477450 528941 495584 437532 440456 505933 417589 417163 495401 434675 474754
1651D74754m6866J4033m4441l3476J44916j45664o9406j1927J384l3366O4885
$$ 474754 427888 441921 397480 364004 508920 363256 293850 281923 283307 249941 314826
1640C14826P1019j7685J13892O6071j65567l9775k0719j37037J8850Q6961L6504
$$ 314826 385845 368160 482052 548123 382556 342781 322062 185025 203875 290836 327340
1629C27340J18009l3146K0734n7480q2223N2508L2447J1611o6158R3313J62K0822
$$ 327340 445349 412203 432937 375457 293234 345742 378189 389800 323642 416955 417117 437939
1617D37939O8077J0564k51313K7089J22397N5551o289L6474k2709P740o6046J2928
$$ 437939 506016 516580 265267 292356 414753 470304 464015 500489 477780 485520 419474 432402
1605D32402K2874m9276j5268N7541J3408m7842j46640K4269j328p2714L1170M8984
$$ 432402 455276 406000 390732 448273 461681 413839 267199 291468 290140 217426 248596 297580
1593B97580n3195j54778L4494J94709q1520k6791J05520O9316n4988m3896L5402
$$ 297580 244385 89607 124101 318810 237290 210499 316019 385335 330347 286451 321853
1582C21853M9185m7302R1879j99720k8625J23889M01j5979k5237j5282o3372P2014
$$ 321853 371038 323736 415615 215895 187270 311159 311560 295581 270344 255062 191690 263704
1570B63704J20326k3410j01865N8393m3061p428p2361R3751P9882j04974l9210
$$ 263704 384030 360620 258755 317148 274087 266659 194298 288049 367931 262957 223747
1559B23747O0060j1559J02773p7404k6879o8193n0483J09485J36084R1435j35405
$$ 223747 283807 272248 375021 297617 270738 202545 152062 261547 397631 489066 353661
1548C53661J19901o059m1092r8495J6333J77272p4936m9931k7541J9090j12493
$$ 353661 473562 467503 426411 327916 344249 521521 446585 396654 369113 388203 275710
1537B75710N6042l4055j6311k2328Q0536j24368M3309M2767M4574P1788L1976
$$ 275710 331752 297697 281386 259058 339594 215226 258535 301302 345876 417664 449640
1526D49640n0263L524P3527q36j62773J0041Q2987j12893N1045M978J04925N1667
$$ 449640 399377 402901 476428 475592 312819 322860 405847 292954 343999 348977 453902 505569
1514E05569n4334j48058k4885R1014J13418m4255k1321N909o4443J4867j274m6501
$$ 505569 451235 303177 278292 369306 482724 438469 417148 423057 358614 373481 372207 325706
1502C25706L5996N2594K3480j24332O5686o3021l346P8320N1668o8747k6822j1435
$$ 325706 361702 414296 437776 313444 379130 316109 312763 391083 442751 374004 347182 335747
$$ [...]
##END NTUPLES=NMR SPECTRUM
##END=
